##TITLE=1H_CG-1112-6
 DMSO, 8 sc, 
 23.10.2019
##JCAMPDX= 6.0         $$ Bruker NMR JCAMP-DX V2.0
##DATA TYPE= NMR FID
##DATA CLASS= NTUPLES
##ORIGIN= UXNMR, Bruker Analytische Messtechnik GmbH
##OWNER= root
$$ XWIN-NMR		Version 3.5
$$ Wed Oct 23 17:03:05 2019 Russian Standard Time (UT+4h)  she@DPX200
##.OBSERVE FREQUENCY= 200.1315
##.OBSERVE NUCLEUS= ^1H
##.DELAY= (6, 6)
##.ACQUISITION MODE= SIMULTANEOUS
##.ACQUISITION SCHEME= undefined
##.AVERAGES= 8
##.DIGITISER RES= 18
##SPECTROMETER/DATA SYSTEM= spect
##.PULSE SEQUENCE= zg30
##.SOLVENT NAME= DMSO
##.SHIFT REFERENCE= (INTERNAL, DMSO, 0, 15.7039)
##AUDIT TRAIL= $$ (NUMBER, WHEN, WHO, WHERE, WHAT)
$$ ##TITLE= Audit trail, XWIN-NMR		Version 3.5
$$ ##JCAMPDX= 5.01
$$ ##ORIGIN= Bruker BioSpin GmbH
$$ ##OWNER= she
$$ F:/spectra/data/she/nmr/H-F/1/audita.txt
$$ ##AUDIT TRAIL=  $$ (NUMBER, WHEN, WHO, WHERE, WHAT)
(   1,<2019-10-23 17:02:13.87 +0400>,<she>,<DPX200>,
      <created by zg, POWCHK disabled, PULCHK disabled
       configuration hash MD5:
       00 E9 B6 7A A2 85 ED C7 34 08 36 98 17 FE 4E 26
       data hash MD5: 16K
       9C D1 C7 77 62 68 DB 1C D2 8B 8E DD E2 83 8F 4E>)
$$ ##END=
$$ 
$$ hash MD5
$$ 47 C2 8A D0 F3 38 B2 97 47 42 C4 13 4A 0F 82 C3
##$RELAX= 
##$RELAX= 
##$RELAX= 
##$RELAX= 
##$RELAX= 
##$RELAX= 
$$ Bruker specific parameters
$$ --------------------------
##$DU= <F:/spectra>
##$EXPNO= 1
##$NAME= <H-F>
##$PROCNO= 1
##$TYPE= <nmr>
##$USER= <she>
##$AMP= (0..31)
100 100 100 100 100 100 100 100 100 100 100 100 100 100 100 100 100 100 
100 100 100 100 100 100 100 100 100 100 100 100 100 100 
##$AQSEQ= 0
##$AQ_mod= 1
##$AUNM= <au_zg>
##$AUTOPOS= <>
##$BF1= 200.13
##$BF2= 200.13
##$BF3= 200.13
##$BF4= 200.13
##$BF5= 200.13
##$BF6= 200.13
##$BF7= 200.13
##$BF8= 200.13
##$BYTORDA= 1
##$CFDGTYP= 0
##$CFRGTYP= 5
##$CHEMSTR= <none>
##$CNST= (0..31)
1 1 145 1 1 1 1 1 1 1 1 1 1 1 1 1 1 1 1 1 1 1 1 1 1 1 1 1 1 1 1 1 
##$CPDPRG= <>
##$CPDPRG1= <>
##$CPDPRG2= <>
##$CPDPRG3= <>
##$CPDPRG4= <mlev>
##$CPDPRG5= <mlev>
##$CPDPRG6= <mlev>
##$CPDPRG7= <mlev>
##$CPDPRG8= <mlev>
##$CPDPRGB= <>
##$CPDPRGT= <>
##$D= (0..31)
0 1.2 0 0 0 0 0 0 0 0.06 0 0.03 0 0 0 0 0.0002 0 0 0 0 0 0 0 0 0 0 0 0 
0 0 0 
##$DATE= 1571835733
##$DBL= (0..7)
120 120 120 120 120 120 120 120 
##$DBP= (0..7)
150 150 150 150 150 150 150 150 
##$DBP07= 0
##$DBPNAM0= <>
##$DBPNAM1= <>
##$DBPNAM2= <>
##$DBPNAM3= <>
##$DBPNAM4= <>
##$DBPNAM5= <>
##$DBPNAM6= <>
##$DBPNAM7= <>
##$DBPOAL= (0..7)
0.5 0.5 0.5 0.5 0.5 0.5 0.5 0.5 
##$DBPOFFS= (0..7)
0 0 0 0 0 0 0 0 
##$DE= 6
##$DECBNUC= <off>
##$DECIM= 24
##$DECNUC= <off>
##$DECSTAT= 4
##$DIGMOD= 1
##$DIGTYP= 9
##$DL= (0..7)
0 120 120 120 120 120 120 120 
##$DP= (0..7)
150 150 150 150 150 150 150 150 
##$DP07= 0
##$DPNAME0= <>
##$DPNAME1= <>
##$DPNAME2= <>
##$DPNAME3= <>
##$DPNAME4= <>
##$DPNAME5= <>
##$DPNAME6= <>
##$DPNAME7= <>
##$DPOAL= (0..7)
0.5 0.5 0.5 0.5 0.5 0.5 0.5 0.5 
##$DPOFFS= (0..7)
0 0 0 0 0 0 0 0 
##$DQDMODE= 0
##$DR= 18
##$DS= 0
##$DSLIST= <SSSSSSSSSSSSSSS>
$$ [...]
##$SUBNAM2= <"">
##$SUBNAM3= <"">
##$SUBNAM4= <"">
##$SUBNAM5= <"">
##$SUBNAM6= <"">
##$SUBNAM7= <"">
##$SUBNAM8= <"">
##$SUBNAM9= <"">
##$SW= 24.0689530833862
##$SWIBOX= (0..15)
0 0 2 0 0 0 0 0 0 0 0 0 0 0 0 0 
##$SW_h= 4816.95568400771
##$TD= 16384
##$TD0= 1
##$TE= 0
##$TE2= 300
##$TE3= 300
##$TEG= 300
##$TL= (0..7)
0 120 120 120 120 120 120 120 
##$TP= (0..7)
150 150 150 150 150 150 150 150 
##$TP07= 0
##$TPNAME0= <>
##$TPNAME1= <>
##$TPNAME2= <>
##$TPNAME3= <>
##$TPNAME4= <>
##$TPNAME5= <>
##$TPNAME6= <>
##$TPNAME7= <>
##$TPOAL= (0..7)
0.5 0.5 0.5 0.5 0.5 0.5 0.5 0.5 
##$TPOFFS= (0..7)
0 0 0 0 0 0 0 0 
##$TUNHIN= 0
##$TUNHOUT= 0
##$TUNXOUT= 0
##$USERA1= <user>
##$USERA2= <user>
##$USERA3= <user>
##$USERA4= <user>
##$USERA5= <user>
##$V9= 5
##$VALIST= <valist>
##$VCLIST= <CCCCCCCCCCCCCCC>
##$VD= 0
##$VDLIST= <DDDDDDDDDDDDDDD>
##$VPLIST= <PPPPPPPPPPPPPPP>
##$VTLIST= <TTTTTTTTTTTTTTT>
##$WBST= 1024
##$WBSW= 4
##$XGAIN= (0..3)
0 0 0 0 
##$XL= 0
##$YL= 0
##$YMAX_a= 78012
##$YMIN_a= -107119
##$ZGOPTNS= <>
##$ZL1= 120
##$ZL2= 120
##$ZL3= 120
##$ZL4= 120
##$ABSF1= 10
##$ABSF2= 0
##$ABSG= 5
##$ABSL= 3
##$ALPHA= 0
##$AQORDER= 0
##$ASSFAC= 0
##$ASSFACI= 0
##$ASSFACX= 0
##$ASSWID= 0
##$AUNMP= <proc_1d>
##$AZFE= 0.1
##$AZFW= 0.1
##$BCFW= 1
##$BC_mod= 2
##$BYTORDP= 1
##$COROFFS= 0
##$CY= 11.3945322036743
##$DATMOD= 1
##$DC= 2
##$DFILT= <>
##$DTYPP= 0
##$F1P= 20.1720416913024
##$F2P= 0.152960286110954
##$FCOR= 0.5
##$FTSIZE= 0
##$FT_mod= 4
##$GAMMA= 1
##$GB= 0.15
##$INTBC= 1
##$INTSCL= 1
##$ISEN= 128
##$LB= 0.24
##$LEV0= 0
##$LPBIN= 0
##$MAXI= 10000
##$MC2= 0
##$MEAN= 0
##$ME_mod= 0
##$MI= 1.114404
##$NCOEF= 0
##$NC_proc= 0
##$NLEV= 6
##$NOISF1= 3.799351
##$NOISF2= 2.8
##$NSP= 1
##$NTH_PI= 0
##$NZP= 0
##$OFFSET= 15.70392
##$PC= 1
##$PHC0= -9581.271
##$PHC1= 25.6008
##$PH_mod= 1
##$PKNL= yes
##$PPARMOD= 0
##$PSCAL= 0
##$PSIGN= 0
##$REVERSE= no
##$SF= 200.130013532006
##$SI= 16384
##$SIGF1= 3
##$SIGF2= 2
##$SINO= 400
##$SIOLD= 16384
##$SREGLST= <1H.CDCl3>
##$SSB= 0
##$STSI= 0
##$STSR= 0
##$SW_p= 3612.71676300578
##$SYMM= 0
##$S_DEV= 0
##$TDeff= 0
##$TDoff= 0
##$TI= <>
##$TILT= no
##$TM1= 0
##$TM2= 0
##$TOPLEV= 0
##$USERP1= <user>
##$USERP2= <user>
##$USERP3= <user>
##$USERP4= <user>
##$USERP5= <user>
##$WDW= 1
##$XDIM= 8192
##$YMAX_p= 0
##$YMIN_p= 0
$$ End of Bruker specific parameters
$$ ---------------------------------
##NTUPLES= NMR FID
##VAR_NAME=  TIME,          FID/REAL,        FID/IMAG
##SYMBOL=    X,             R,               I
##VAR_TYPE=  INDEPENDENT,   DEPENDENT,       DEPENDENT
##VAR_FORM=  AFFN,          ASDF,            ASDF
##VAR_DIM=   8192,          8192,            8192
##UNITS=     SECONDS,       ARBITRARY UNITS, ARBITRARY UNITS
##FACTOR=    0.0002076,     1,               1
##FIRST=     0,             0,               0
##LAST=      1.7004516,     0,               0
##MIN=       0,             -107119,         0
##MAX=       1.7004516,     78012,           0
$$ Real data points
##PAGE= N=1
##DATA TABLE= (X++(R..R)), XYDATA
0@%%%%%%%%%nJ3j6J6j7K5l2L3m1M9n7P1q1R1j06J23j42J64j87K13k43K73l06L41
33A79l82M30m79N32n91O56p27Q06q94R89j094J212j345J493j659J850k072K331
51A235k638L013l479M075m873O002p736J0775j7660O2795j0581j09064J9327O7841
65A9032N8980k9958o3234k8987M9036M7253L020l5258l3264j7435J5002K5358
77I545J9612L924j7762l8236p758L9738L6956j8933n3183l2875L2465P0527K5670
90F9690n3325n7161M191M6326K9590j7888m2852q742L5287K5350q198j3899l819
103D550m079p601p819O324K8101J4236k9786l5253J1715M1682J6346l3184n1665
116d6433o851N2712M5213j7006m5537j7465J8457K8048N008k3459j8861P921J2346
$$ y = [0, 0, 0, 0, 0, 0, 0, 0, 0, 0, -5, 8, -8, 8, -9, 16, -16, 17, -24, 25, -32, 39, -42, 49, -57, 66, -76, 88, -99, 114, -129, 144, -162, 179, -203, 227, -252, 280, -311, 345, -382, 424, -470, 519, -575, 637, -708, 785, -874, 976, -1096, 1235, -1403, 1610, -1869, 2206, -2667, 3335, -4401, 6374, -11286, 51509, 40928, -68136, -48809, 19032, 78012, 48054, -15180, -44167, 4869, 52122, 55142, 19884, -13380, -30815, -15813, 9545, 29157, 33081, 15319, -22917, -30675, 9063, 46019, 27086, -26097, -58972, -26507, 44020, 69690, 16365, -40796, -36605, 9721, 39311, 21423, -21429, -30171, 5116, 30466, 22268, 8369, 4550, 471, -7130, -14949, -8625, 19476, 33712, 3926, -31327, -19612, 22070, 38416, 5232, -46433, -53284, -572, 44641, 27635, -17902, -35367, -16910, 11138, 16146, -7313, -26174, -18253, -5907]
129e907P066J3058P809j5114k7426j2786K0139M1212J1856m2934m0184K1941N7842
142C6572K3390m0156o4747j2561N9010N5475j6042n5110k4478K7213M4145P428
154D0139l9882l6513O663K8161J8194L949r604j7937r836K866J2501J7915k101
167A4515l2842k0332K8177M6404J0141l9111m9517j095N1874L7263k5257m6020
179b5800o446L5562L6582n725m2697k5434J8206K4205J380p304j876J331J01p724
193e639n469J1561R105j7977k3217Q070L1970K0575j3958l8710j8334K6726L1874
206A6577n268k7406j2548J3162K5351J0265j5948j7691K72J325j358J0554J6084
219A3371K560j5520j9467J270L2206K2385k7374m6787n239M3142M4547l252n1886
$$ y = [-5907, 1159, 14217, 22026, 6912, -20514, -33300, -13161, 28051, 39907, -3027, -43211, -21270, 36572, 59962, 19806, -44941, -57502, 1508, 56983, 40941, -14169, -38647, -11434, 32711, 40139, 257, -36256, -29593, -1432, 16762, 20711, 11107, -6830, -16666, -13800, -1299, 16616, 14515, -18327, -38659, -10482, 35922, 46063, 6952, -42565, -43660, 8214, 45477, 20220, -25800, -32246, 3316, 39898, 34173, -8524, -33958, -15752, 8453, 9833, 2529, 653, 1984, 2085, -5639, -11108, 453, 9558, -8419, -31636, -23566, 8404, 28979, 15021, -23689, -42023, -15297, 16577, 11309, -16097, -28645, -15483, 9868, 20133, 4185, -13506, -13234, -11909, -13267, -2713, 13371, 15931, 411, -19056, -17786, 14420, 36805, 9431, -37356, -42595, 547, 45094, 41842, -10044]
232a0044l8267K3387M9654J0245l3615l5611j423L4173L1708n482k6495j7820
244a9590l937Q940K0881J2339j0807k1404j1382J5221L6041J5363l4353m5676
256c8364j074M3989M0078o128m6438k8988K7189M4762M492l5500l2624K709L3418
269G521K4585j0512k2378n344M770N47J886K807j344m802p857j578J8874J9026
283B6201j2245l0852j3027J6575K7718Q302k1928k1489J0537K4572M939j4666
295D637j4777k236R482Q771p33K427P926n463j7517n174J4259J5664k550k3422
309h706j7291J9510L5983L281l3190k9531K646L0732K3421j4807l1457n409K2680
322b138J9483j367j8335j8718Q25J4878J0452M623q95j1801j2234O049J8508Q757
$$ y = [-10044, -48311, -24924, 24730, 34975, 1360, -34251, -35674, -1501, 30207, 24725, -1770, -19590, -23527, -14587, 6294, 18633, 7826, -13578, -24960, -9739, 26302, 41665, 7312, -38364, -39438, 4551, 44629, 38501, -7937, -36925, -9736, 35026, 39518, 4018, -28606, -25897, 7521, 32106, 21594, -784, -6128, -1358, -811, 1075, 3882, 2538, -2264, -10121, -11699, 7175, 26201, 13956, -16896, -29923, -13348, 14370, 22672, 744, -20745, -10208, 14364, 19303, 4637, -10140, -12376, -2894, 5877, 5144, 7571, 15497, 10034, -7483, -12657, 1602, 17266, 14716, -8706, -25997, -6487, 29496, 32777, -413, -29944, -27298, 3434, 26855, 12048, -19409, -24818, -2138, 17345, 15978, -2357, -21075, -20250, -5372, 5080, 9703, 8808, -2993, -15227, -9178, 9330, 18087]
336A8087j1623k4594r834K5735L4505k057l4065k4636J0870L2993J4976k5007
348E350l2662M048L1480J8407j0772k4365j3017J0985J6748o73r514j975J186
361d774J60M794M711o46o029j1311n668J3478J9772j104j7427r907P019J6604
375I672O610j5890j8555O125J9739P494n993r646l032O208L282q015m299R147
389B847N246o469o518L109J0456O148j2932k2299J062K3824J4743r307j9373p687
403a7150J3335J9679k905k0946j0676O730J3583J0389o06j0292p756o83K207Q819
417C728Q747p835j7523k589J7768J9839J619k4503k6185O178L1306J5892j5733
430A0709k5754q074K1271K6040l567k8279j7282Q261J8758J2619n298j5964o087
$$ y = [18087, 6464, -18130, -27964, -2229, 32276, 30219, -3846, -28482, -17612, 15381, 30357, 5350, -27312, -23264, 8216, 26623, 15851, -8514, -21531, -10546, 6202, 5529, -3985, -5960, -4774, -4614, 180, 4891, 4245, -1784, -13095, -18763, -5285, 14487, 13383, -4044, -13951, -6932, 9672, 16282, 392, -18163, -12038, 7701, 15195, 9202, -444, -3476, 2732, 6014, -2001, -6300, 2847, 8093, 1624, -4894, -1785, 8671, 14819, 1887, -20412, -19350, 4474, 19217, 9910, -9463, -17150, -3815, 15864, 12959, -7987, -18663, -11933, 1650, 12039, 11433, 1141, -6615, -7298, -5091, 3728, 12475, 4640, -12883, -15472, 2296, 22135, 23754, -749, -26934, -20756, 10550, 26442, 10709, -15045, -23119, -1848, 24192, 20625, -7654, -24936, -16675, 2083, 14702, 9404, -6560, -12647]
443a2647O904O987L548q98q767r706L114J2346J1459J527j4036j6514M077J9627
457G021Q361j0663j4066k709J4021J6429m072j6848n903O254N963Q16k449j595
471E60L893K096p009l099P817M754p202r996k188R802J5350M80j7383j0891P285
486e731J2220M510o506j2095j731J2022R312n21n269p667o194L970R815N470j624
501I981q465r017M519J7409O224j5075j7872l481J5589K1064o86k3058j4618R809
515g677J8306N715j3284j9174j910J7914J3712m025j1022q388m88P683P130l077
529A415n344l733q65O974J0509J01j2185r505J213J0941J0848l208j4117m105
543a1061J0728Q762j340r585q971K512J1746L308o409l124J623J326q6k726l371
$$ y = [-12647, -5743, 1244, 4792, 3894, -4873, -14579, -11465, 881, 12340, 13867, -169, -16683, -12606, 7021, 15382, 4719, -9347, -12056, 1965, 18394, 14322, -2526, -8429, -2175, 3788, 4604, 2155, 560, 4453, 6549, -460, -3559, 4258, 9012, 1810, -8186, -10374, -572, 14778, 15258, -2125, -13016, -5731, 6489, 10999, 4493, -7602, -9333, 2689, 12001, 11480, 6211, -1456, -7650, -3680, 6135, 11605, 9981, 1516, -7501, -2982, 14427, 20651, 5576, -12296, -15777, -188, 20876, 20190, -2868, -17486, -7677, 10629, 16344, 3060, -16114, -18024, -110, 13602, 9577, -1445, -9833, -10321, -2638, 4492, 1415, -3929, -7662, -8527, -1553, 8956, 9057, -3128, -12633, -11420, -479, 10369, 7161, -6956, -11061, -333, 8429, 7089, -2496, -11467, -8955, 2791, 6099, -310, -3434, -1811, -485, -571, -3297, -6668]
558f668L523L877l732l964M361N529R00m919p530j888Q844P916l658o667r16L133
574a859N362K909n391n985M50K235L626O253J201q523n938J813P035O787l435
589F540j3765o159J2437J4674N08j2513j4527k2J6819J0405q485j4753m074Q679
603d236J3622M371j1749j3724J97R247Q693K123p339j0071J040R788O257r07q565
618a253j1169O10J3699R798l541j0843q302L596J3310N083j1311j1082Q64Q930
632a611Q967m35j0029o578L856M810J47k52j504k196J270J967L07K180O27o399
648d873m539L724N671L722L5n608m822M398O036J71l159l461l257L081Q098K839
664H056l347n309n543K35R566O372m939q858m118N008J2448N359j1469j4920m61
$$ y = [-6668, -3145, 732, -3000, -6964, -2603, 2926, 3826, -1093, -8623, -10511, -1667, 6249, 2591, -4076, -4992, -1859, 3503, 6412, 1021, -4964, -4514, -2279, 1347, 7600, 8801, 278, -5660, -3847, 3188, 9975, 6540, -7225, -13384, -947, 13727, 14235, 1722, -12805, -12827, 3992, 14397, 5912, -8841, -12915, -4236, 9386, 13757, 2008, -11716, -11519, -2272, 6421, 8544, 1205, -8866, -7826, 1962, 8219, 7312, -1253, -12422, -11812, 1887, 11685, 8144, -2699, -11001, -7405, 5905, 10988, -323, -11405, -10541, -1611, 7356, 6921, -3108, -9686, -5830, -1020, -873, -1125, -2629, -4825, -3555, -1588, -1281, 899, 1526, -4873, -9412, -5688, -17, 3705, 3740, -1868, -6690, -2292, 3744, 3915, 756, -2705, -5962, -2881, 5217, 8056, 4709, -600, -6143, -5908, 3658, 10030, 5091, -3767, -7885, -2877, 9571, 14930, 3461, -11459, -11920]
679a1920J1915J2379J103j3902j2340N481J5386N916o800j2768p345Q380J4570
692A0055M121q970j0203l805O607J2556L167j0673j0982k3R679J2190J128j4131
706G16j2043M281J1978P151l874j2243o794Q110J1392J269p596q287l171O020
720c091R048k35o562l872m81L053N206P18n509l597N9K073N035L886l939n757
736c965r88K155L554L734k861o400m75M583L590K280j841p411l279M257N126L321
752E380r29p537o023N445R228K556o100r980m106R499J3005k4j0870r512P22R998
768G52J0449l316j3488o333O322J1769P444n757j4817n496R331J1985L095q001
782C939j2256k583J1832J1984j898j1348j0356M10J2794J1831n022j3295o566
$$ y = [-11920, -5, 12374, 13477, -425, -12765, -7284, 8102, 14018, 7218, -5550, -12895, -4515, 10055, 14176, 5206, -4997, -8802, -2195, 10361, 13528, 2855, -8127, -8150, 1529, 13719, 14847, 716, -11327, -7046, 4932, 12083, 8209, -4034, -10828, -2718, 8674, 9943, 2347, -5940, -9111, -3091, 5957, 5722, -840, -4712, -5193, -2140, 3066, 3784, -1725, -5322, -5263, -3190, 1845, 5731, 1792, -3965, -4953, -2798, 756, 4490, 1629, -4771, -5246, -663, 2927, 5207, 3366, -4045, -7324, -3067, 2059, 5380, 4451, -3086, -9109, -3664, 5564, 8120, 2020, -7960, -12066, -2567, 10438, 10414, -456, -9968, -9246, 752, 11201, 7885, -5603, -11936, -5614, 6155, 13599, 7842, -6975, -12471, -3140, 8845, 11940, 3939, -8317, -10900, 932, 12916, 11018, -330, -10686, -10276, 2518, 14349, 9327, -3968, -10534]
795a0534M476J1841O866p586j3874k282R261R221K726p459j0306j269R206O591
809F878r64n723o716p48P922O800j878o040n050q52O267O776j989o366k755Q77
825c561L936N141j166o235l102O99K515N487J954n485n907N49L948N448J914o484
841c49p889Q14P216O304R23p809r322J350J0441O914k182r464p716L452J2989
856E672O417p616j1542m599O114J2766N599r809j2264j219R259J1069K328j2042
870A33j3102K069J3471R676k170j3119j1136N707J4868O071p121j2132n695P452
884e028J3944L960j0581j1269j643Q098J1526J956j0825r738J965R241P896p47
898H755j0483q090M115R535M312j824p929n882L181Q773L373l869n907m569K701
$$ y = [-10534, -6058, 5783, 12649, 5063, -8811, -11093, -1832, 7389, 10115, 2656, -7650, -8919, 287, 6878, 5914, 191, -6525, -7273, 649, 7449, 5571, -469, -5519, -6371, -104, 6672, 4683, -1683, -4438, -3561, 375, 5516, 4350, -1885, -4987, -4288, -1773, 3714, 5668, 183, -5724, -5175, -1227, 4221, 6135, -349, -8238, -7424, -208, 6096, 7019, -790, -10112, -8762, 1679, 8593, 6411, -3053, -10769, -7317, 5672, 12089, 4473, -7069, -11668, -5554, 7212, 12811, 3002, -9262, -10481, -1222, 9847, 12175, 133, -12969, -10900, 2571, 12247, 10077, -3042, -14178, -8471, 6397, 12468, 5347, -6785, -12480, -5028, 8916, 12876, 2295, -8974, -10617, -2519, 9007, 10963, 138, -9600, -7635, 1606, 9502, 8755, -1728, -9818, -5703, 3832, 8144, 6320, -1609, -7491, -4310, 4463, 7836, 3967, -1940, -6509, -3808]
913c808Q283L105m255n452k472N36O123M472l216n626k669J086N613N909k829
928D800p653m042K907O265N656k642r267m593N070P662M325l808j0153n027P374
943c126J0582K407p030j0319m049R531J1966j55j0601r486j67J0829J1278k432
957I228j3716p892M166J1185Q315m241j4085o608Q240J2080M651p457j3608l862
971a3604J1092J2366J15r755j0802p32J1807J0677l386j1040p200K172J0719Q290
985A0719m238j1662m827N669Q669N313n220j0706k715P250P264J618m264p881
999e011k388O189O988L42l596o137k652N531O857J11n065m341j860L392P139J126
1015F625n351m618j305L158O715K834n927o566r89M428P181K549p085q255o9P432
$$ y = [-3808, 4475, 7580, 3325, -2127, -4599, -4063, 2060, 6532, 3316, -2310, -4979, -3893, 1720, 7629, 4800, -2853, -6895, -3988, 2277, 7933, 5291, -3976, -8569, -3499, 4163, 8488, 4680, -5473, -10500, -3126, 7456, 9863, 2833, -7486, -11535, -2004, 9962, 9807, -794, -10280, -10447, 382, 11660, 9228, -4488, -12380, -8214, 2971, 11286, 7045, -7040, -13648, -5408, 6672, 11323, 3866, -9742, -13604, -2512, 9854, 9969, 214, -10588, -11320, 487, 11164, 7778, -3262, -10462, -8290, 2429, 10719, 6481, -5181, -10008, -4339, 4330, 9643, 4423, -6283, -8998, -1748, 5516, 7134, 2870, -5011, -7399, -1210, 5778, 6120, 2524, -3613, -6265, -734, 6123, 6234, 1169, -3172, -5032, -1640, 5499, 6625, 1274, -3344, -4649, -1491, 5224, 8058, 2131, -4435, -5424, -996, 6185, 8734, 1649, -6606, -6675, 757]
1031G57O256J167p156r719J262R801O458j617q558q763K155J2243O814n589j0738
1046e227n852N228J2553M893q886j1659j951P990J0544K774j0459j1107J046J0229
1060A16R063p88j1243r913L839J2479O349m865j0325o622N611J2074L908p621
1074B062r183k852O201R988K422q357q143K00O699P559J057q707p257K354P641
1089A684M309o60o217n486J933O849L049j514m426m743Q26O810L989k349m256
1104b02m248N89N963M752k549n372k806N28N363N395k110o777l894J665N850O001
1120H148k013q773m105L758O907M385l139r673m152N837R130K625n376r606l740
1135i787Q257J0043M7q493q295m75R255R708k756j1245o169K735R562P256m115
$$ y = [757, 7013, 8180, 1024, -8695, -7433, 2368, 8826, 7209, -1349, -10112, -7957, 4286, 11100, 5511, -5227, -11079, -5851, 6702, 11595, 2709, -8950, -10901, -2911, 7633, 10407, -52, -11159, -10113, 116, 9179, 8391, -2852, -12765, -8926, 3553, 9902, 5037, -5288, -11910, -6299, 5775, 9683, 2062, -7121, -9973, -3772, 6216, 8638, 281, -7862, -7662, -963, 6596, 7653, -1054, -8311, -5957, 1684, 5993, 5333, -884, -6370, -4437, 2412, 5461, 3947, -479, -5222, -4396, 2414, 6403, 4054, -202, -4450, -3861, 2102, 6854, 4305, -1067, -3873, -3345, 2018, 7413, 5303, -1474, -5368, -3703, 2147, 8148, 6135, -2638, -6743, -2985, 3922, 8307, 5168, -4505, -8657, -2820, 6310, 8935, 3559, -6047, -9787, -1530, 8513, 8560, 67, -8228, -8703, 552, 10260, 7504, -3741, -9910, -7175, 2387, 9643, 5528]
1150E528j1459m708O229R195M254n841j1233l461R080R819L47p594r159q84J0227
1165C40Q075k830q767n618J990Q539O184l706q705l294L697O418M400l639p987
1180d903j959M592N269K767l151p010j944M807N249J104k404m813k532M236M971
1195D279N81k876l922k679L295O179J018l746l858k018J938O092K147m427n033
1210c030j394L055O292L264o122p895J7N745O465J246o913p547J079Q142N249
1225G653j715p367p187L125R530N053l820q187n350L850J0006L785p065q668j487
1240g844N938R418K034q824q737R19P612O805j59q902p415L336R632M080l914
1255C979p821n007M680Q625K028n400n667j996L972P246Q89o248m585j46L803
$$ y = [5528, -5931, -10639, -4410, 4785, 9039, 3198, -8035, -11496, -2416, 7403, 7750, 156, -9003, -9887, 340, 8415, 5585, -3182, -8800, -6810, 1729, 7913, 4207, -4498, -7792, -4095, 2323, 6723, 3084, -4903, -6862, -2270, 2999, 5766, 2615, -4395, -6339, -1532, 3717, 4821, 2417, -2396, -4928, -692, 4279, 4860, 1984, -1938, -4617, -1322, 4857, 5875, 2129, -1729, -3747, -1809, 4283, 6430, 2003, -3030, -4424, -1369, 4923, 8187, 2065, -5830, -5813, -68, 6397, 7643, 730, -6817, -5738, 2404, 7653, 5938, -1429, -8616, -5491, 4039, 9092, 5272, -2915, -8265, -4415, 5591, 9376, 2311, -6357, -7844, -1906, 7512, 9546, 722, -8015, -7096, 516, 7321, 7162, -1740, -9155, -5819, 3813, 7893, 3979, -3842, -8849, -4169, 4456, 6484, 1084, -4583, -6579, -2607, 4639, 5528, -720, -5305, -5451, -1648]
1270a648N616J485o058m696J014M300L309L0m149m472K355M453J957l44k968l903
1286c719L63M099J916l06j773l349q87M068L824j285k960l293r46M272N018m32
1302D610n052l426N4M542N325j516p052l121K386N794M480k221p972l326M260
1317b235O381K026l554o821k575N854P431K91n676o821j360P176Q076k130p785
1332a722m836J773P318N479l983r137k601M964O528L349m274p986j834O334N191
1347D563L23m530o219l09O892N335j649n526m216L4O122M871l028n321j873K074
1363b457M327L082k759n375j306L002K903K062j566m168j037K583J808R05n88
1378A416k895k514J922L157J661l44l117l766J153M696J899j373l514k536J471
$$ y = [-1648, 3968, 5453, -605, -5301, -4287, 13, 3322, 3352, -797, -5269, -2914, 1539, 3496, 3152, 184, -3719, -3356, 743, 2659, 2353, 580, -2769, -3656, 412, 4236, 2951, -9, -3302, -4248, 24, 5042, 4610, -442, -3868, -3814, 728, 6053, 4537, -2515, -5636, -3250, 2544, 7024, 4803, -3169, -6495, -2235, 4146, 6172, 2618, -4203, -6778, -924, 6507, 6798, 1122, -5699, -7059, 117, 8193, 6063, -1722, -6558, -4785, 2533, 8012, 4029, -5108, -7709, -2745, 3783, 7132, 2858, -5128, -6962, -628, 4563, 4886, 356, -5863, -6172, 720, 6055, 4406, -1120, -5336, -5302, 820, 5691, 2663, -2658, -4531, -2457, 1870, 4952, 2193, -3182, -4488, -1486, 1417, 3479, 1913, -2255, -3292, -709, 1099, 2004, 1416, -1479, -3993, -2071, 1086, 2747, 2403, -714, -4480, -3327, 1369, 3268, 1895, -1619, -4155, -2684]
1393b684N347K218l271m127k421K155N254L330l462n357j429L124N300K473n280
1408A170p015M33N493N525L24n345o968J083P370M492k449o236m687K549Q253
1423C992L600n127o294k321L360O890K631o223n383K94M835N045M69n698n556
1438e486J244N085M235n31m870m819K272N793K130k959m182k349K295N656J149
1453D663l438k529j154R09K867J667k440k561q1J082K124K129j859l223o39P26
1469a757J352K547J8l604j418J799K043J508r4m061k480K137L624J515r86l560
1485a417l133K617L972J188k692l221k067K567N975R57m478m337j135L706N371
1500C873O57o525m306K535N186L405j732o198l634M024N905J237k486m886k464
$$ y = [-2684, 2663, 4881, 1610, -2517, -4938, -2783, 2471, 5801, 2339, -3018, -4447, -1323, 3977, 6450, 1170, -5845, -5412, 81, 5606, 5930, 585, -6383, -5300, 2070, 6562, 4113, -2123, -6810, -4261, 3992, 7592, 2465, -3829, -6150, -2790, 4100, 6731, 508, -4875, -4581, 254, 5299, 5768, 70, -5486, -4242, 843, 5078, 4547, -323, -5142, -2870, 2923, 5053, 2094, -2088, -4437, -2142, 3514, 4663, 1225, -1304, -2458, -1549, 1318, 2985, 545, -2016, -2097, -1015, 1109, 3238, 1379, -1844, -2483, -1757, -405, 2142, 2160, -1444, -2862, -1063, 980, 2488, 2394, -1667, -4147, -2010, 1614, 3129, 2143, -1417, -4550, -1933, 2039, 3227, 535, -2686, -4753, -2186, 3789, 4746, 268, -4069, -5204, -1498, 3873, 4530, -1995, -6301, -3766, 1420, 4825, 3093, -3105, -6739, -2715, 3190, 4427, 1941, -2945, -5409]
1515e409M474N179R1m355m154l04M428N893j016n895k936J495M054L364j711n920
1531b722j550L400L518J533j699n037j436L959L175l11k178k306o81K898K525
1546C088r44k626q85p78J499K897R0j780j291n76Q43K533J91k449j452O4J273
1563c03K063J189j979l061J17R16J817J800j364l668p35L122K433O21k524m445
1579d001o06M623L437n61l525l493m2N093L892k896m742k373J740N100L956l500
1595B102o031j208L153M889J897m195n598k22N647M020Q7m437n590N38N945L720
1611D717j837m018l519J696O050K937m145n089j518L235M698J701l436m464O3
1626b929K830L036Q13k917l650N7L595K353K16k026l382l34L176K030o76j497
$$ y = [-5409, -935, 4244, 4335, -20, -4174, -4478, -50, 5843, 4827, -1068, -4004, -2509, 1545, 4909, 3198, -2722, -4272, -872, 2646, 4179, 2480, -2557, -3993, -34, 3141, 2830, 652, -1654, -2335, 563, 3088, 2144, -482, -1367, -2145, -646, 2251, 2341, 561, -730, -1306, -463, 2070, 2261, -188, -1640, -1576, -303, 1760, 2949, 970, -2091, -1974, -1058, 759, 2559, 1195, -2473, -3208, -86, 2347, 2968, 444, -4001, -4607, 16, 3453, 2892, -633, -4126, -4168, 925, 4817, 1921, -2821, -5194, -3454, 1646, 5602, 2102, -3929, -5137, -1984, 2905, 4802, 607, -4991, -5213, 434, 4454, 4541, 104, -5486, -4948, 997, 4717, 2880, -1138, -4657, -2961, 3089, 6026, 1881, -3208, -4726, -1491, 3207, 4908, 1472, -2992, -2929, -99, 2937, 3750, 833, -2817, -2760, 835, 3188, 3404, 1378, -2004, -2338, 838, 2868, 2192, 695]
1642F95j668o62K831K064p41j470k076j164J719L109L28k236j804r63J329L464
1658B755N01l121k531m07J967L781J328l948m205L68L245L356J46m062m250J896
1674c181N157K531j604m515m174K201N693K094k601m208k269K708N629J570n232
1689b01m791j70M267M736M28n057m271J697M165K590j118m958l012L158M747J543
1705C753k113m144k061K792M398N78l453k434m92K956L531k91l739k089R18K046
1721A56K156M29l197j451J281J628Q47k69j971j843J288K070M84M88j424j654
1737i82J93J766P07n91k80k448j30K522J914n87j935k045p09K584K868n72l065
1754g90j226J91K905K638j742m047j864K211L112K668j997m892j553L795L772
$$ y = [695, -973, -1635, 1196, 3260, 2519, 1049, -1027, -2191, -472, 2637, 2965, 729, -1075, -2038, -709, 2755, 3256, 135, -2396, -2803, -836, 2945, 4273, 325, -3880, -3512, -267, 3089, 3235, -827, -5077, -3181, 1976, 4507, 2903, -1612, -5786, -3585, 2108, 4202, 1601, -2607, -4876, -2168, 3461, 5031, -201, -4992, -5162, -895, 3841, 4269, -788, -5059, -3362, 803, 3393, 2275, -2683, -5695, -2537, 2210, 3753, 1640, -2504, -4565, -1773, 2625, 3203, -250, -2684, -3176, -220, 3311, 3020, -719, -2808, -1890, 156, 2312, 2741, -456, -1907, -626, 1002, 1849, 1580, -391, -2234, -946, 1124, 1608, 2096, 672, -982, -789, 977, 1684, 1093, 813, -1635, -1765, 757, 2671, 2084, 149, -1896, -2605, -21, 2847, 2275, -790, -2016, -1825, 1080, 3718, 1976, -2071, -3935, -1724, 1388, 4056, 2059, -2833, -4386, -591, 3181]
1769C181K63l110m572o25N065M067j100m219l490M66N005L732k394n502j646K470
1785b409M608K930l596n889r94M138M001R11l497m619K8M838L424p88l812m103
1801d829Q20M984L351j881l750k303J291L759K350k496l686o30J509L210K217
1816C916j815l881j019J843J956J522j229k719r59K192J876R27q03l279j814K147
1832a139K389J695q16k633k342J572L712Q94j583l276j854K081M566J533l561
1847A238l175j440J868M736J240l434m412j71L162M471R01m990m696N56N045L521
1863D420m72n046m149K359N303K185k280m867k988K999N791J711l763m220j094
1878d111K993M788O00m856l870R79L895L397m2m492l444J468L922J501o91l159
$$ y = [3181, 3444, 334, -4238, -4863, 202, 4269, 3169, -1050, -4540, -4074, 931, 4663, 2269, -3233, -4879, -2409, 2199, 5129, 1533, -4356, -5350, -1212, 2789, 3700, 203, -4416, -4388, 450, 3874, 3086, -726, -4829, -4009, 975, 4326, 2445, -1305, -3608, -2317, 1442, 3792, 1296, -2390, -3020, -1511, 1699, 3916, 2101, -1780, -2799, -956, 1000, 2522, 1293, -1426, -2385, -193, 1683, 2610, 1807, -1472, -3286, -1139, 1250, 2945, 2129, -504, -2846, -1274, 2438, 3332, 1749, -1527, -3381, -1300, 3266, 4799, 1238, -1937, -3377, -1509, 3227, 4467, 1033, -3379, -3550, -388, 4083, 4984, -6, -4702, -4146, 899, 4420, 3948, -1098, -5247, -2888, 2415, 4600, 2320, -2547, -5535, -2536, 3255, 4966, 1203, -3017, -4111, -1118, 3670, 4270, -586, -4456, -3477, 418, 3815, 3773, -719, -4163, -2695, 1227, 2728, 2037, -1122]
1894a122k908K029M212J191k210l104j576J696L718O42k360j577m98Q04K648N24
1910B109k057j940j00J316J691J544j628k588L6R76J551J125j570k514p9K233
1926A05J651O10r77l303p98K495K227K29j714k476r65L355K956j114k899k406
1942c024J09L404L276r51m111k094J179L626L023k536n302j038L458M355Q73k917
1958A330m797n98M407L512m00m073k750J52M652L449k076m192k559J192M484K973
1974D706k527m846j386L118L670J336l207m768j28M115L560l79k964l456P2M112
1990A028K205j175k622k495Q30L631J916j605k592j282J87K265K272j012k523
2005i72j177N10K365K103q20l476j741J653K108J906k64l143j837J415K440R98
$$ y = [-1122, -4030, -2001, 2211, 3402, 1192, -1912, -3488, -1792, 1926, 2568, 208, -1369, -1867, -1063, 1585, 2109, 52, -1888, -1988, -672, 1019, 2563, 935, -1653, -1617, -641, 910, 2035, 465, -2049, -2128, 105, 1756, 2366, 1389, -1914, -2712, -217, 2010, 2239, 525, -1951, -2916, 439, 3395, 2281, -618, -3024, -2915, 489, 3765, 2814, -1297, -3391, -2212, 1414, 4437, 1901, -3401, -4439, -981, 3374, 4247, 1330, -3467, -4065, 342, 3854, 3454, -619, -3369, -3217, 1435, 4884, 2808, -1384, -3943, -2751, 1733, 4706, 2179, -2667, -4053, -935, 2735, 4071, 864, -3904, -4032, 83, 3643, 3264, 300, -3156, -3084, 1028, 3233, 2058, -564, -3059, -2229, 1402, 3318, 1713, -879, -2161, -1974, 291, 2563, 1551, -972, -2149, -1639, 726, 2829, 2009, -1467, -3208, -1555, 553, 2459, 2195, -948, -2785, -1370, 1070, 2068]
2021B068n37k700k391J453L504J661o03l737k904J593M762J446k553l448j984
2036d370K877N041J159m106m288k99L355M082P88m386m157J221L963L372q52m870
2052a470l711J934N073K568j498m100l021J817N261J813l247m283j293K901N317
2067D061P95m676l617K44L326L168J75m238k407J608L000J552o03k952k280J051
2083a793K613J530k80j933k301N00L125R87j464k221j640J216K988J345j819k152
2099a299l13L74J729J401j544j773j79M42J552J741q39k733j156R77J627K007
2115B014m62l181j489J905K740J477k032l863j102L586L353k36k705k993J55L258
2131D25K733j523l380j219Q28K797K698j001m122j998J942L292K369k069m545
$$ y = [2068, 1531, -1169, -3560, -2107, 1397, 3058, 2455, -1282, -4186, -2593, 2169, 3615, 1062, -2386, -4370, -1493, 3548, 4707, 601, -3687, -3986, -631, 3451, 4239, -147, -4304, -3083, 880, 4252, 3400, -1470, -5181, -3247, 1826, 4394, 2896, -1204, -4225, -2408, 2853, 4666, 1419, -2864, -4157, -1256, 4061, 4856, 180, -3437, -3193, 133, 3301, 3476, -762, -3169, -1561, 1439, 2991, 2388, -564, -2844, -1793, 820, 2350, 2070, 137, -2164, -1664, 1461, 2448, 984, -1237, -2877, -1661, 1327, 2672, 853, -1299, -1612, -1238, 491, 1892, 348, -1425, -1604, -1162, 390, 2131, 1292, -1441, -2597, -1620, 7, 2014, 1552, -1629, -3118, -1213, 1527, 3004, 972, -2891, -3993, -407, 2946, 2710, 5, -2988, -2833, 425, 3158, 1635, -1745, -2964, -2136, 661, 3359, 2358, -1764, -3762, -1820, 1472, 3841, 1772, -2773]
2146b773j357L851L798n1l367l908K06M475L296j769l828j568J162M304J179k244
2162A406l514l19J565K628J920k042l112o77J795J859J411j807k991q48K973K347
2178B594J53k378k814k39L158K305j183j985j300J0K467J344j173j745m30q0N04
2195g92K039L80j505j591m54Q23K994O70k802l133O46L029K615m58l404k721J522
2212b142L267J577j227k882k026J629L226J295j502l138j674J138M029J876k262
2227A184l550j596K201M655J567m151m295L07L644M093l43m660l587J899M274
2242A642K290k047l735k142K819L702N82k084k360j525J368L471J183j972k854
2257a662j226J937L475J542l407l575O8L217L017m46k984k638J470K690P90j214
$$ y = [-2773, -4130, -279, 3519, 3468, 101, -3807, -3601, 874, 4170, 2401, -1427, -2995, -1833, 2471, 3650, 1406, -2108, -2427, -862, 1766, 3686, 1644, -1468, -2145, -350, 1509, 2920, 1113, -1878, -2726, 247, 2594, 2747, 369, -2445, -2684, 474, 2779, 1596, -389, -1689, -1679, 788, 2132, 959, -786, -1216, -1296, -792, 1247, 1627, 122, -1469, -1923, -1100, 1894, 2564, -238, -3371, -2725, 304, 2919, 2461, -943, -3664, -2142, 1125, 2702, 1475, -1407, -3433, -1804, 1422, 2717, 1215, -1923, -3597, -2459, 1570, 3446, 1184, -2366, -3962, -1761, 2894, 4461, 310, -3985, -3678, -34, 4059, 3716, -944, -4531, -2632, 1642, 3932, 1885, -1850, -3992, -1173, 2529, 3111, 1027, -1333, -2858, -1490, 1981, 3164, 1192, -1662, -2888, -951, 2524, 4066, 659, -2916, -2848, 369, 3386, 2940, -44, -2682, -1212, 1478, 2268, 1054]
2273A054j225j534R66J642M82m15rj483j147J325J682m8l13k415q10J984K669
2290B405j87k813k110N56K439K306j153l216k92J347J467J135r72k273q23J087
2306a097J179J817j53k908k209J421L264J431j461l881j681L573M341j84m336
2321h84k884O46L982K849k368l525j005K490K278J181j809k888p58K335K176M59
2337B275j243k638r90K036K456M28j910k763q15L176L497j136l238k353J191L792
2353A765J775k421l195j75K636J427J36j740j637N71J210L24lO10j254j331M88
2370h14J404J340k42k432j746J351L023N30j898j949m52J889K354q42k368l97
2386a249jP95J627O20j364j463j93J0K154J834j919l072o03K374K923O73l079
$$ y = [1054, -171, -1705, -739, 903, 1385, 970, 961, -522, -1669, -344, 1338, 1290, 977, -1438, -2248, -264, 2405, 2218, -595, -2705, -2149, 290, 2596, 1443, -1773, -2065, -718, 749, 1884, 912, -1361, -2184, -1097, 82, 1899, 1746, -1162, -3371, -1950, 1314, 2745, 1284, -2597, -4278, -705, 3636, 3452, -884, -3768, -3122, 860, 3709, 1341, -2184, -3189, -699, 1579, 2760, 951, -1937, -2695, -360, 1816, 2275, 1032, -1606, -2596, -560, 1896, 2324, 414, -2349, -3164, 12, 3509, 2373, -865, -3218, -2027, 1765, 3540, 1119, -2076, -2251, 385, 1812, 1948, 208, -1429, -858, 352, 676, 673, 1283, 29, -1302, -814, 590, 1930, 1688, -744, -2490, -1139, 1884, 2414, 516, -1433, -1885, 4, 2358, 1516, -852, -1249, -1250, -455, 1172, 1792, 428, -1035, -1228, -1218, 936, 2770, 851, -2221, -2824, -450, 2473, 3146, 67]
2403F7m363J296M225K470j859l683j962K437M067O28l116k692l55J852K982J06
2419B100j601k085p74J456K524J477k389l536m39L115L315L08l845l816J356M549
2435A715J973k055l347j562K356L691j95k787j442K54J271J315M55j516p96l32
2451a002R4J328J375q97j730r78J224J541J863j833k936l31K222J574K1j558j760
2468a783P26K021N06q54m74p29p35J005P20R77j99j474k022Q26L570R86k492k955
2486b380l87L005L463q55m327j651J692L001J430j991k973q62L045J785n79p14
2502G02j941q32J539K069K67p10k337j620J667M075L85l659k618K99K942L808
2518D036j473m433j565K441L294M36k408k952K66L099J107q80j217j055M95P23
$$ y = [67, -4296, -3000, 1225, 3695, 1836, -1847, -3809, -1372, 2695, 3323, 207, -2485, -2840, -988, 1994, 2100, 499, -1586, -2360, -904, 1620, 3097, 708, -2828, -3267, -152, 3163, 3471, -374, -4190, -2834, 1715, 3688, 1633, -1714, -3276, -920, 2771, 2576, -211, -1653, -1399, -128, 1187, 1642, 126, -670, -1002, -908, 420, 1795, 898, -832, -1810, -586, 955, 2818, 985, -1951, -2282, -60, 1514, 1535, -23, -1783, -1057, 964, 1470, 616, 142, -587, -1322, -317, 403, 1380, 1181, -293, -2315, -1489, 2081, 3067, 575, -2380, -2767, 238, 3701, 2846, -1481, -3132, -1440, 1561, 2991, 1000, -1973, -2835, 210, 1995, 1416, 702, -1239, -2071, -532, 1537, 1804, 1094, -1243, -2863, -1196, 2879, 3264, -395, -3013, -2714, 228, 4036, 2563, -1870, -3435, -994, 2300, 2736, 328, -2624, -2358, 741, 1848, 968, -249, -1304, -809, -86]
2534h6J035m87r1r01j120M89K510N82j569j858o52J788K950p36l072j041J527
2551g32J796N30j186j503O6J495J3m23P02n8j287j92N94P25J081o26k482j013
2569b500K681K223j93k603k658J089L682J410k334k591k53J836K016K54k199j667
2585a807O77Q05J425N38r74j668q11J144K001J222j421l836o01L803L084r77l324
2602g20k802J395M467J339l511k822J6K607K644m91k820j370J170J278P84M01
2618A565j562j177m03J385R68J001j236k578k75K796J622n08j831k348R41K959
2634A319J155k537j646j92J437J721L3j349j172R29o8j39J040J97o85q72o06O85
2652g50K472M31k692k046P66K978J239j191l087p52K339J892j9j623j500q8J674
$$ y = [-86, 949, 462, 371, -530, -1650, -1161, 1349, 1931, 362, -1496, -2148, -360, 2590, 1854, -1218, -2259, -732, 1064, 1594, 408, -1095, -1029, 466, 479, 56, 758, 700, -587, -779, -185, 540, 1621, 995, -1487, -2500, 181, 2404, 2211, -392, -3050, -1961, 1721, 3131, 797, -1794, -2047, -211, 1805, 2059, -140, -1807, -1130, -325, 1100, 1638, 664, -1004, -1815, -671, 1330, 2552, 1131, -2705, -3306, 497, 3581, 2604, -720, -3522, -2127, 2340, 3679, 168, -2654, -2638, -31, 2613, 2122, -698, -2068, -898, 380, 1164, 1565, 3, -1174, -1577, -192, 776, 1777, 541, -2037, -2312, 484, 2106, 1598, -233, -2581, -1640, 1319, 2474, -63, -1709, -1901, -464, 1257, 1290, -59, -1231, -302, -370, -509, 531, 728, 43, -829, -1435, -750, 1722, 2153, -539, -2585, -1819, 1159, 2398, 1207, -1880, -2632, -293, 1599, 1580, -43, -1543, -1631, 43]
2669D3J535m07r79n87j162M98K494P99j669j991q09J841K983L17l282k775J115
2686b036L340K215j685l678j318K707L279n48k246j973J45K631J541j254j559
2701d39n63k9Q52J588J20j367j420m30J619K367O5k864k111J161K449J155r14
2718A239k943n63K424K075r04j831o62P6J208Q62j073k67O79p73r60J359R78j08
2736H16r46j312l12K004J812j328k403m58J488J880P21k070k314J164J610M62
2752H14J69j226r00J60R83N54L66m03j751o80J446K515j5j644k905r6L615K512
2770C514j620l510j352J925L236J015k786l101P38K510J382j70j970j697O73J758
2786E45J211j94j474j559n51K467J883o51j955k022K31L129K239k246k469j002
$$ y = [43, 1578, 1171, 192, -395, -1557, -1059, 1435, 2234, 565, -1426, -2235, -394, 2589, 2906, -376, -3151, -2036, 1304, 3519, 1834, -1844, -3162, -455, 2824, 2276, 30, -1943, -1798, 833, 2374, 1120, -439, -1002, -1031, -179, 1409, 1529, 162, -1258, -1688, -69, 2298, 2363, -501, -2612, -1451, 998, 2153, 1239, -1704, -2267, 157, 2232, 1328, -503, -1165, -1089, 119, 981, -92, -359, 320, -453, -1413, -54, 924, 816, -130, -1442, -1754, 250, 2062, 734, -1669, -2127, -639, 1241, 1962, -108, -2422, -1258, 352, 814, 983, -243, -1143, -983, 0, 554, 920, 517, -1234, -1914, -468, 2047, 2032, 388, -2517, -2613, 1002, 3514, 1894, -1616, -2968, -1043, 2193, 3208, 422, -2679, -1941, 569, 1951, 1781, -189, -1886, -1213, 545, 1756, 1562, 88, -1471, -2022, 445, 2328, 1677, -278, -2300, -2069, 1060, 3299, 1053, -1416, -2418]
2802b418J679K507P11k423k517J234J695R10m10j425q51O99Q86p4M66j3j157o64
2820a165Q23R76O80l66j896j217J937J965m73j596j220N8J742J560j175j713j3
2837a093K14N36R84J77p84j166R8K68J545J209j920k368M34J925J755L37k847
2854f96k662J810L303Q57k075k069j080J918L155k37k463j426oJ950J633l65j975
2871d28j032J99J181J706L11j943k215P37J940J638j15k880j933J985K849N26
2887B526k199k129l00K393K164j048k418n00P71J157Q50k04j609l51L71M98R29
2904I01N37j277j493K30J470P52J05j215j736O83J968N20q64j277n40N19J768
2921A051N3j008m83l06j10P73N31R9o20j135m11J383J954l77k164j236N33K074
$$ y = [-2418, -739, 1768, 2479, 56, -2461, -1227, 468, 1378, 968, -457, -1308, -609, 277, 203, 669, 656, -501, -1165, -342, 634, 1314, 948, -948, -2165, -228, 1737, 1264, -332, -1552, -1494, 248, 1808, 633, -1080, -1093, -879, -343, 641, 818, 34, -1132, -1034, -766, 779, 1988, 68, -2300, -1866, 59, 1814, 2151, -696, -3358, -1548, 1755, 2612, 537, -1532, -2612, -694, 2461, 2224, -239, -1665, -1671, 279, 1912, 1547, -428, -1460, -1261, -80, 1626, 1937, -6, -2221, -1484, 456, 2094, 1979, -901, -2834, -849, 2000, 2526, 327, -1802, -2102, 291, 2455, 1407, -1011, -1511, -740, 417, 1267, 1063, -546, -897, -526, -28, 901, 1438, 161, -1332, -1102, 368, 1120, 1225, 10, -1726, -1043, 925, 1445, 581, -696, -1236, -717, 1051, 1104, 96, -387, -693, -803, -30, 501, 600, -20, -1155, -1566, -183, 1771, 1394, -770, -2006, -1473, 601]
2939F01J761j495k585o12K243J652J94j709k253O38K006J356n63j685j153j05
2955a709J962J514l41j884j264j90K352J891r39k629j014R05K568J559j997k876
2971b092m02K576J810o8j842k099L13K813Q60j049j352j031N35J771R16r92j015
2988c48o46K3J174J350n09j640q81L06J812J423j072k252m06J450R25N95p50j393
3006h39q8J313K52J08p6o90j101L21J263L73J57j196j318M37J983R25r57j706
3024h39p81Q28K266M52k112j236j19J786J476Qk180j297N86J471J086J66j905
3041c44j221N37J723Q29l95j581k008R23K982R48j315k554j028J888K691J5k492
3058d02j726N62J944J327l28k280j063J173J289Q02k4j784q80P24J590K91m83
$$ y = [601, 2362, 867, -1718, -2330, -87, 1565, 1759, 50, -2203, -1565, 441, 1797, 1234, -451, -1604, -1709, 253, 1767, 1426, -458, -1722, -1912, 440, 2331, 1392, -1237, -2251, -1346, 1222, 2781, 784, -2092, -2494, 82, 1892, 1824, -18, -2117, -1804, 1009, 1869, 820, -532, -1563, -1028, 743, 1659, 667, -348, -994, -971, 203, 1553, 1044, -596, -1477, -1171, 641, 2064, 992, -1260, -1666, -216, 709, 1304, 554, -839, -927, 386, 638, 746, 670, -20, -1121, -800, 463, 836, 993, -203, -1521, -1084, 899, 1824, 867, -839, -1620, -792, 1474, 1926, -186, -1422, -1541, 245, 1721, 1729, -451, -1748, -1162, 309, 1395, 1561, -344, -1565, -1028, 695, 1524, 1129, -452, -2460, -1537, 1445, 2393, 1078, -1476, -2504, -616, 2075, 2090, -402, -2128, -1566, 378, 1705, 1377, -903, -1966, -793, 496, 1298, 1274, -510, -1390, -666, 924, 1215, 732]
3075G32j272j370Q81K039M30j054j188r61J117K024j70j710p70K69Q69J399j32
3092A133j137j119P01M85N49J17o69p89j09K39R30O44l07j716m59J346J530j3
3110A356r88j700k25K259J001m03j615o12J08J101J502r09j428o42L31Q12J595
3127A543m32j644j122R66J472J320j221k576n79K083J701K95j613k167k29K803
3143F00J495j215j535j256K54K358J448j485j932j58O79J527R50r04k127k49R29
3160f21J626O81j232k034r5J646J387J18j478j320j03K043R17q89j285o38N64
3177g13J112Q45o50j138j94J32N78J230j06j442n64N77J29J302J31j657p42L04
3195h66J138P14Jj402p02L72J089P95k70j014j212O78J570O21r82r30j132P45
$$ y = [732, -540, -1910, -1029, 1010, 1440, 386, -802, -1763, -646, 1378, 1208, -502, -1272, -1003, -134, 1265, 1133, -4, -1123, -422, 63, 612, 729, 60, -729, -838, -599, 331, 975, 668, -1048, -1507, -161, 1369, 1356, 368, -1332, -1557, 702, 1703, 1300, -315, -927, -819, 282, 1784, 875, -553, -1195, -864, -52, 1543, 1111, -533, -1655, -689, 783, 2103, 882, -1694, -2273, -190, 1511, 1806, 193, -1974, -2203, 600, 2095, 880, -655, -1911, -1657, 701, 2149, 664, -1268, -1426, -747, 780, 1730, 826, -1301, -1550, -621, 1005, 1686, 454, -1580, -1675, -29, 1358, 1476, -2, -1322, -1425, 618, 1535, 646, -639, -1277, -713, 399, 1244, 594, -544, -738, -606, -28, 1202, 1096, -346, -910, -333, -204, 1098, 1229, -428, -1170, -866, 272, 986, 987, -415, -1117, -745, 344, 1139, 869, -145, -1357, -679, 891, 1512, 530, -400, -1532, -787]
3213g87J959M70j343j303p13J063K344K08j925j699o2J522K013K77k607j618J406
3230g95J423J204p71j782j267J005K178M46r28j294r88P77K207L94j701j138n52
3247a582J138J810J81j760j570Q00J114R80Nj809r37J108J181M02m45j181j043
3264a608J040J258Q4n74p26l35K38J364K6o44o92j84L2J167L69o03p44k93K47
3283e78J006Q84j106r05j7P03M10R40q15j298m15R51Q81P70o60j474o01J023J501
3302A200j21r19j030m93J475J588m47j391q09j21J523J180q57j724m22O37J319
3319E88J468j314j721m20J200J209M07r02k001k46K030J196r5j350j534K19J625
3336C59J453j051j263n49L40J315J265j353j638p4R01R09N57r88j198k71J480
$$ y = [-787, 1172, 1642, 299, -1004, -1717, -654, 1690, 1898, -27, -1726, -1788, -266, 1747, 2024, -583, -2201, -795, 628, 1832, 1061, -721, -1988, -983, 1195, 1641, 713, -581, -1569, -792, 1415, 1809, 108, -1030, -1582, -444, 1366, 1547, -213, -1783, -983, 131, 1111, 1116, -693, -1630, -522, 659, 1061, 616, -565, -1608, -568, 690, 774, 200, -526, -861, -623, 741, 767, 123, -569, -753, -721, 446, 815, 212, -532, -825, -578, 428, 1312, 206, -699, -716, -13, 397, 1337, 522, -776, -1191, -240, 641, 1411, 751, -723, -1324, -301, 1200, 1079, 160, -870, -1363, 112, 1700, 1253, -138, -947, -1068, 455, 1635, 778, -946, -1368, -731, 588, 2056, 742, -979, -1399, -199, 1010, 1417, 515, -1486, -1732, 298, 1494, 1399, 49, -1485, -1266, 359, 1812, 761, -502, -1051, -711, 604, 1869, 516, -1122, -1196, -295, 614, 1171, 183, -1015, -1286, 194]
3353A94N68j45l02j389k16J388J077k05q21j199j25R89J218q00m03m13m58R01
3371a41J149k55r66n45j43O23J006L36j623m13K80Q52Q71K33j441j140M57R59
3389I9Q19M08j620j182M81J713M64j23j482q19K72J916M64o69j205j120J230J615
3407A261M16j301j261n57J328J633L73j735j833N51J594J116j93j816j507J210
3423g21J677N12o97j334j292J301J675K09q36j443l38P41J810J10j696n34j50
3440a006P19J262m1j001j001n8J263M36L56r59p74L5J004M67j61o56j000M21R69
3459B75N20k63m31n04j43Q84K70j46n00l68p64J298Q95l76j034j61J5N63P64J50
3479I44j078j137P76J010J053p55j139p75M22J436J57l34j360r69J486J484lj199
$$ y = [194, 762, 617, 315, -1074, -1290, 98, 1175, 970, 149, -1050, -1175, -186, 1032, 232, -171, -584, -1042, -141, 1008, 753, -213, -758, -901, -278, 728, 1064, -559, -972, -692, 160, 1031, 1264, -177, -1317, -860, 99, 918, 1326, -294, -1476, -995, 718, 1182, 1059, -423, -1242, -970, 946, 1410, 741, -464, -1584, -354, 1261, 1677, 376, -885, -1442, -114, 1519, 1892, 157, -1676, -1125, 469, 1585, 1392, -424, -1931, -721, 956, 1468, 771, -563, -1855, -554, 1121, 1330, 494, -949, -1287, -546, 1264, 1374, -322, -856, -1006, -287, 975, 934, -67, -1068, -1126, 137, 573, 929, -30, -804, -769, 235, 702, 541, -115, -1115, -694, 275, 795, 532, 101, -403, -546, 338, 608, 462, -38, -406, -1170, 128, 1023, 647, -387, -548, -533, 30, 794, 944, -134, -1271, -495, 515, 1568, 813, -326, -1101, -679, 757, 914, 580, -780, -1749, -263, 1221, 1218, 19]
3497A9r58l90J475J323m68j625m82R4J142J360j59k240l68P34J420N38o74j950
3515a209n15J796J065k90p16q34m96J698P38m47j518m10M25J020R54k91j462j66
3533f58J84O84Q05q36n77m75O67M54M86o6j501k3P49P80n4k30r57l83P23P07N1
3554E30p00l64j94L03J075r1k42m80m77K47R65K59n49j090q4M05J239N15j315
3573d8p15R7L24R54O40j214j434L23Q58J486j64j165j501L93J538P56m41j165
3591d78j064R29J215N58n45j710k70M89J851O06j210j592J07R43J365K56j349
3608A01j233O1J435O57k12j233j193P12J376O76n18q05j103O42J321L07o51r56
3626f16P4J81O34Q90j285l25j35K39N88P92q26n95k60M14N76N33l59r65n38P52
$$ y = [19, -939, -1329, 146, 1469, 1001, -624, -1106, -1012, 130, 1490, 1331, -909, -1277, -543, 877, 1415, 741, -1209, -1724, 72, 1137, 847, 131, -703, -1199, 499, 1237, 790, -728, -1138, -713, 307, 1261, 970, -492, -658, -474, 210, 1015, 179, -398, -873, -206, 248, 734, 668, -833, -856, -107, 673, 619, 389, -568, -951, -228, 479, 530, -170, -534, -728, -425, 650, 559, 317, -163, -640, -393, 572, 831, 282, -808, -892, -487, 752, 1267, -48, -763, -666, -342, 612, 1252, 38, -1396, -1073, -215, 1271, 1107, -58, -1559, -1166, 372, 1128, 687, -478, -1542, -613, 602, 1160, 615, -1095, -1365, -876, 975, 1581, 371, -1221, -1114, -171, 1194, 1450, 101, -1132, -1071, 364, 1021, 809, -424, -1617, -905, 471, 1147, 629, -176, -1279, -637, 684, 991, 340, -616, -542, -361, 273, 1163, -122, -447, -582, -343, 245, 1037, 211, -384, -644, -230, 346, 879, 520, -445, -983, -231]
3646b31N95N10l79q23n20Q03Q01K9n74q28n72Q07J138Ko16o58m67R25Q64j35q10
3667a39q62N22K64J133R7j571o26P72M78Q89k74j360l57Q42J089K48o34j123o53
3686a265J203J114q0j212m48j52P91J340l44j346o24L00J178M90k49j332o30J087
3704a79N12L67m55j025l59R07R33K43l43j329m7P54J017m53o42k50k72P42N54
3723F75j32m73l85j5L72O94J77j218l08L47L65L38P1m85o39N79J41M86O8o55m27
3744d24K9L27Q33k65m48p15K09O61P96n75q02n43J79J635J38r01q90j0M08J203
3764H45J90p66j255N0Q63R87j37n51j779M17J393N67j75q70j014N69J252K60n43
3783C03q18o61N35J443K70q33j172Q5L96J315J04r76j241N63Q99L62L04j034j079
$$ y = [-231, 364, 874, 495, -328, -848, -45, 756, 785, 211, -617, -1189, -382, 756, 758, 142, -516, -983, -58, 806, 671, -139, -1001, -479, -215, 918, 1015, -556, -1182, -410, 68, 957, 683, -677, -1034, -192, 897, 1145, 511, -612, -1265, -62, 1052, 972, -240, -688, -840, -49, 1291, 947, -399, -1023, -723, 455, 945, 696, -636, -1266, -179, 333, 700, 245, -780, -1139, -232, 701, 944, 601, -728, -775, -21, 996, 543, -99, -349, -621, 121, 675, 543, 70, -315, -330, 42, 736, 913, -305, -613, -266, 99, 437, 508, 23, -616, -37, 104, 590, 658, 3, -424, -395, -68, 765, 500, 52, -663, -454, 207, 1003, 428, -374, -917, -738, 897, 1035, 134, -756, -766, -358, 845, 1035, 269, -986, -936, -73, 914, 777, 226, -1553, -1136, 257, 824, 649, -221, -1235, -666, 586, 846, 303, -515, -1176, -641, 802, 1072, 239, -933, -848, -452, 863, 967, -9, -1250, -687, 212, 574, 878, -156, -1235]
3802a235N09R26N69n45m18p49J11J098J80Nm96p60j71J424J47l82n73l01J50N70
3822E9Q93l84p99k37k05Q00O31k62q47k92J74O55M77n4j284j49N19Q81K1J42q60
3843a21r91P99J422m32n04n59n87P83P72O48j557m25j43P65J049J18j104o84J15
3862f36R39Q31m53j265p45O40J108N11m50j079m97O15J282Q8p61r80m16J061J094
3881H87l35p39q80O75M06R27k68j234k96N97O69K96O6j454k08P29N72k1L5r87
3901e63m81Q30Q00Q3k81m10l70J0O23K80l71o48k67N72P53j39m92l94J42J44Q23
3922F44K64r29l74L09O7M30L66p78o88K75M79N29j51k10q48l25J390L13k34m72
3942E7p07l58J605N93r42p17l33N89Q76K91o48j107l25O41J030Q05j184r67QQ13
$$ y = [-1235, -726, 200, 769, 224, -194, -943, -832, 266, 446, 451, -45, -805, -976, 448, 595, 213, -360, -661, -511, 59, 952, 568, -231, -468, -673, 127, 758, 496, -351, -643, -469, 186, 663, 609, -675, -824, -305, 576, 597, 739, -121, -1112, -313, 1109, 677, 173, -386, -973, -190, 582, 1230, -327, -752, -895, -130, 919, 1037, -67, -751, -636, 303, 1134, 681, -584, -1329, -689, 419, 930, 480, -599, -1096, -481, 801, 889, 128, -852, -1268, -207, 887, 552, -187, -1067, -392, 14, 941, 673, -561, -857, -260, 409, 705, 771, -683, -891, -162, 410, 389, 424, -563, -1044, -214, 586, 669, 388, -22, -392, -382, 241, 521, 150, -498, -765, -193, 560, 421, -71, -465, -323, -179, 644, 908, -21, -395, -86, -19, 411, 777, -1, -689, -414, 65, 594, 443, 233, -615, -940, 450, 763, 529, 57, -650, -1008, 597, 1190, 248, -469, -802, -213, 663, 954, 306, -801, -1126, -485, 545, 1350, 166, -801, -793, 20]
3962B0J100j60o85j340L7J642K55k46j029m67R0J409M72r88n98n62L42J284M88
3981A064j162q36L87M54P69K7o50q32K75M46N64J20m96j042M99R65q3l5j87j078
4001h31K32R28J57J92p72l09j78O94P12k80m21o37R0L37R10j32q67o03L55O17
4021A94M59J79j316k70L88N66M00j34p49m43L24N58O24p34k13j000P03R50P9l24
4041B41q13m87Q95J064n9r39n47N1P95Q94k03j306n01N04P97M00j35r47q81Q92
4061b85J081k13l29r60l11O45J126k12k75o82k38N81J109n81q55l11K00L77Q03
4080F70j45p88k76K33O50J81n7o82m00J65P49K52k3n68n17K37O13J4L1m40m44
4101e45o0J175K13n93j30o18J09O81P17j131o4k74J32O78M59n16r62r0O35L71
$$ y = [20, 1120, 960, 275, -1065, -1028, 614, 869, 623, -406, -873, -783, 626, 1098, 110, -488, -1050, -708, 576, 1064, -98, -934, -547, -93, 676, 703, 53, -779, -504, -58, 506, 626, 130, -912, -413, 552, 469, 434, 247, -831, -599, 329, 486, 678, -94, -403, -581, 113, 825, 545, 124, -513, -423, -86, 824, 692, -175, -778, -423, 194, 653, 832, -484, -754, -366, 200, 600, 466, -283, -726, -402, 156, 780, 46, -167, -1167, -464, 486, 565, 241, -572, -1059, -164, 900, 841, -98, -645, -594, 201, 1095, 892, -414, -915, -411, 386, 786, 651, -296, -1177, -285, 796, 583, 254, -706, -1017, -372, 754, 542, 267, -415, -653, -72, 1037, 456, -399, -710, -510, -133, 670, 525, -263, -539, -306, 344, 525, 468, -214, -614, -449, 300, 552, 529, -39, -556, -319, 294, 308, 339, -101, -545, -605, 570, 783, 190, 60, -558, -449, 232, 949, -182, -246, -520, -388, 290, 749, 233, -729, -819, -184, 187]
4121A87N53m26r67q7R75M01m9l23j284K50Q59P23k45n91r17O54P93N37o81q20
4141d58k91j2J284O24r55j222L08P57O16j3p58q63O5J162L69j69m97j007M83R24
4161C47O1k08n82k81J71J074J03m41n06r4R5O36M73o18q60J25L57K11L62j12o17
4182c04n43P83L13J62k70n78k71O04L98N1j97o37j32K55P95Q8k50n92m86O69R44
4203H02r8p34l40m07Q89Q83l6r81q84K93O54O33n2q57p86N60O20N50j74j079o26
4224a170N86J245K08n00q48l95N38J480m08q25p98L90L53P26J22r12l39nO90Q00
4244I38o45p50k01K36R97j7l20n75l67O56N44K29l16l87o01M44P17j41l79n49
4264d87J22K34N43K15r58J13J4J58M58L7n11n28L27J31N23K45o43m13j08N09L92
$$ y = [187, 740, 314, -653, -740, 235, 636, 587, 264, -1020, -770, 89, 812, 567, -24, -941, -287, 506, 1043, 362, -458, -749, -761, 523, 1147, 192, -1030, -722, 35, 651, 638, -120, -983, -918, 244, 613, 444, -53, -1060, -577, 347, 408, 200, -382, -663, -492, 582, 685, 244, -262, -356, -261, 375, 848, 230, -630, -505, -148, 63, 425, 313, -304, -847, -64, 249, 411, 141, -437, -708, -104, 294, 345, 148, -489, -621, -366, 429, 517, 267, -325, -811, -142, 802, 704, -30, -370, -777, 112, 995, 959, -22, -906, -613, 41, 674, 622, -235, -1021, -461, 159, 709, 535, -544, -1170, -584, 661, 869, 369, -479, -874, -336, 1144, 736, -89, -887, -497, -144, 582, 704, -208, -547, -552, 138, 938, 293, -457, -658, -422, 575, 558, 238, -337, -704, -48, 496, 725, 409, 22, -579, -135, 582, 441, 62, -487, -365, -131, 412, 627, -331, -218, -204, -46, 412, 449, -62, -590, -263, -132, 391, 636, -7, -420, -528, -19, 373]
4285C73K86o50j37n5K83K71o5m82j79l0M05N75l74k93m05R7N46O23j66r65k60
4306f02J42Q61L91m93j073J44P76L73N15q20j136K40R70M06j13o00p28M37O79
4325C69L93m76o54m99M05J070J40n74n04k43N81M91K92q74o23j69R40J97J84n77
4345a31o45L3P42Q02l71n41k88j53Q73L76r21K22n30K62L08O10l23m88l25J07
4365c81M26P10m11n75j83M42K0O10j40r18l10L80L91M02K12o13q30O08O43J40
4385F23m38n13l85N05R38j31n67m83M5J39Q01L15q38r26M38K42J022k84o17n92
4405g06J36O85L73K86j262j50J99R65L24m50p34o55O09R75J05o75l95k72L97R04
4425F59K11j153n96K05N52O14K56j062l56L04M47N60l09p13o4PR32k49j43j92
$$ y = [373, 659, 9, -128, -183, 100, 371, 306, -176, -355, -385, 20, 595, 221, -72, -477, -380, 166, 789, 623, -342, -602, -460, 401, 792, 299, -774, -630, 146, 519, 1034, 214, -922, -682, 288, 694, 581, -19, -747, -310, 369, 762, 286, -368, -867, -462, 608, 748, 174, -330, -573, 8, 499, 791, -83, -706, -875, 65, 262, 446, -131, -776, -743, -1, 801, 430, -111, -399, -552, 321, 697, -224, -2, -532, -270, 38, 648, 325, -163, -488, -381, 45, 755, 344, -231, -414, 28, 48, 658, 518, -400, -710, -330, 61, 463, 675, 62, -768, -160, 483, 623, 185, -328, -713, -208, 730, 599, 32, -451, -406, -267, 534, 849, 11, -915, -477, -235, 787, 503, -114, -706, -570, 115, 488, 774, -488, -638, -439, 526, 850, 400, -334, -989, -380, 595, 700, 25, -370, -642, -245, 659, 870, -283, -879, -674, -122, 492, 748, -314, -670, -366, 81, 641, 332, -381, -445, -438, 494, 245, 102, -90]
4445i0l60O4Q90m6l45l87j22L57M02op3m49k14q5O09J49n10J40k21J0M16L53k08
4468B74o45J24K58J71K22l02n06j50N01L41J10l25k87k44L88P74m08k87k10j59
4488c60K91P35m33o02j70m8J007K41l30q06J6L01M22L31n73o96J93N50P55n32
4508B92l19m67j44P59M46l96l77n08L74N08L93k48o95k37N32N01L25m11q55p6
4528f03O77L55J20k70p90M0M60K98L56n25o17p3N07L23J45l39l06p5J53M39p3
4549B02m9m52j91N01O54J15q63q8k22L37N40L0o46o9n7P22j2R4p12l28K17M44
4571A67J81j67m28m30M46P71K0l86n42l58O33M99K07p37j90k02K89P78J1n19q64
4592h21K11P01L37J67r44j86J93R30k03J15p03m24M24O43Q6j16q26m66L33J032
$$ y = [-90, -450, -386, 504, 458, 113, -274, -396, -39, 363, 357, 284, -165, -379, -464, 145, 294, -216, -76, -297, -287, 129, 482, 274, -371, -247, 11, 182, 404, 102, -404, -554, -53, 288, 398, 73, -214, -458, -70, 704, 296, 9, -201, -360, -69, 666, 233, -369, -539, -587, 420, 661, 331, -475, -459, -158, 264, 595, 22, -674, -481, 69, 824, 292, -27, -494, -638, 121, 567, 171, -206, -714, -340, 168, 561, 313, -382, -619, -87, 414, 739, 328, -527, -603, 74, 429, 549, 279, -511, -471, -11, 287, 643, 118, -499, -572, -65, 258, 403, 64, -242, -317, -164, 275, 202, 153, -299, -490, 11, 665, 780, -83, -171, -393, -56, 484, 514, -132, -201, -258, 464, 452, 546, -166, -494, -277, 167, 348, 181, -247, -677, -231, 540, 560, 174, -368, -726, -93, 406, 613, -124, -314, -516, -227, 551, 562, 43, -821, -610, 91, 428, 595, -349, -535, -342, 588, 385, 500, -203, -627, -203, 440, 526, 410, -416, -882, -549, 483]
4612D83J64p01m01j50N95O70k9p76lj3K44K91J32o77k75L18O4N69k36m97O1j41
4634c08O38J03m11On09p4P78L53m96k77j37K53J71K43K03o22j78m9K50L06J16
4655C59p80p2R8K19J003n16p05J01J35O32M66p34l21n13O46M03rj12o67l08N39
4676a36O96k99k47p11N3R37L37l68o38j47M46N58J85k79q66J27M12L28L35m11
4696C12n97k96N73O50l91k51k45KM08J97k96l63J17K71J35J63m13j27k29K98p
4717h9M44j5m84l17N24k8L82j29p03P6M03L2l7Q1k70o5L0K97K69l61J61n08J64
4740a43P78k14m39k25k08K50L96N77q84m02J95K7O77K60o99o52M98J04L83K35
4760E14p08l01K97L75K63r4m35p84K12P81L20l91j06o99M44J101Q2q23n48J17
$$ y = [483, 647, -54, -455, -605, -10, 660, 631, -145, -148, -161, 83, 374, 506, -171, -446, -128, -64, 505, 269, -228, -167, -308, 330, 433, 22, 28, -481, -555, 223, 576, 80, -197, -334, -81, 90, 333, 536, -86, -264, -313, -63, 243, 359, -421, -493, -395, -176, 827, 311, -394, -293, -158, 474, 940, 206, -115, -628, 18, 421, 412, 300, -367, -675, -136, 560, 261, 14, -697, -644, 293, 630, 262, -376, -523, -77, 481, 666, 387, -479, -352, 60, 388, 723, 312, -285, -581, -8, 642, 251, 0, -245, -243, 165, 362, 66, -297, -180, 91, 226, 389, -24, -151, -380, -82, -89, 355, 340, -144, -461, 63, 35, 417, 288, -415, -339, 64, 96, 59, 140, -130, -195, -165, 132, 401, 40, 201, -307, -143, 635, 421, -18, -243, -451, -201, 195, 772, -112, -514, -319, -292, 385, 645, -54, -706, -208, -104, 279, 514, -194, -495, -198, 177, 440, 346, -89, -873, -661, 120, 440, 49, -57, -756, -312, 789, 871, 48, -500, -383]
4780c83M48K85M04j012l22J66M46K78K88p99m34K75N53J24n8m32l76N52K14Q6
4800C03P7o31l82J86O38K56n22l00K42k17O61L24p60L1j16o4K65N35n26l50K15
4821a35KM89J17k83o29RM58K86q9k03j80l39K67Q48l75j87m18K77K45L79K3o94
4843a32j16l7M16L60q0l54n02K26L64L24l79l12l30J7R79l9k71m71k88M48Q74
4864F97k04o04m61J02L05P71m03l74j85L0K03P35l66p52K88j36L65N30k82m43
4884a84n75Q84J92J03L2r92J05K11R22k54q39M4J00M83K39n4k97j88k06P22j06
4905C42n73J78q4J07k21M25J80l86n52O18Q3K33N6p47l29L65Q56l97j50j00o10
4926g06M04M54O6j09p3n40K35O20k60j98J8l46L79J52O08n27m00J2K7P85%m48
$$ y = [-383, 65, 350, 754, -258, -580, -414, 32, 310, 598, -201, -635, -360, 193, 317, 259, -173, -549, 3, 217, 303, 380, -251, -633, -447, 191, 447, -75, -375, -133, -350, 311, 635, -125, -94, -210, -274, -9, 526, 0, -350, -135, -133, 356, 473, 190, -439, -430, 28, 314, 225, 22, -158, -497, -230, 618, 243, 56, -362, -85, 160, 539, 562, -132, -248, -285, 131, 491, 411, 57, -445, -219, 145, 469, 90, -222, -552, -535, 444, 405, 134, -337, -625, -177, 697, 493, -111, -572, -470, -165, 606, 203, -171, -356, -326, -123, 612, 246, -506, -218, -354, 11, 541, 259, -184, -759, 125, 317, 420, 452, -540, -435, -224, 698, 444, -395, -351, -251, 232, 471, 417, 120, -68, -274, 448, 342, -231, -53, -137, -30, -251, 174, 354, -32, -584, 34, 117, 350, 406, -341, -670, -305, 551, 154, 4, -96, -706, -302, 152, 218, 109, 36, -504, -269, 351, 91, -107, -89, -435, -56, 96, 704, 177, -223, -211, -184, 601, 601, 153]
4948A53q38K98Q75j53K11q40k90L21O68J08l39k77k94J43L97M91n43l92p2J25
4968b48L95O34p01m74j48N90M81J60p13n33L55M05M64l66l83m90M75K97r9K54
4988C55m90j9L3J39M49m79J15j41K32r7O4O4m52J42n3k0O41n73l21J05L92k38
5010a52M09j10m81J75j05O62r3k03l96k54M99L83OR9p54l23N15M97J09n28l99
5031d44m14R31L61p2o74l26N91K01L15q7m92m59M64N63Nm00l62j71J76M14L24
5052D44k89p34J45J88P83k48l61o77K47N40L66Q3o94k87K52N43L84o07l8r6j84
5073b40N94J6j35j85k54L85K28j19J44m96m48J36O27j64q7m02K56j74P85j67n28
5094b28J01l38N37K76l5l12k10J24O5J27K32k70l82Q5O1L11L70l93p55L74K22
$$ y = [153, -685, -387, 488, 335, 546, -294, -584, -263, 405, 513, 174, -103, -397, -254, 143, 634, 91, -301, -373, -248, 147, 781, 80, -394, -542, 48, 529, 689, -24, -557, -202, 203, 667, 301, -82, -572, -97, 200, 101, 355, -135, -154, -121, 18, 467, -12, 103, -38, 194, 97, 161, 225, -227, -85, -138, -158, 483, -90, -411, -306, 86, -152, 257, 147, -334, -159, -264, 398, 305, 102, -294, -548, -49, 334, 340, 439, -315, -638, -123, 374, 483, -45, -444, -858, 73, 434, 362, -312, -638, -47, 154, 469, 382, -110, -569, -105, 458, 463, 63, -299, -470, -294, 120, 444, 155, -579, -434, -246, 537, 289, -72, -749, -502, 38, 404, 487, -207, -494, -242, 301, 685, 78, 40, -56, -240, 354, 370, 235, 50, -204, 181, 409, 290, 434, -62, -510, -374, 253, 89, 2, -400, -144, -318, 467, 300, -228, -127, -465, 72, 348, 313, 1, -209, -85, -20, 107, 339, 69, -313, -228, -167, 144, 514, 121, -634, -260, -38]
5115c8N09l69l44l97K83R21L0j108K18k78J63P09j11J63o78Q5j04N83J31l9o89
5136c60j22L74N94K6n81m61R5O69J79j85k33m14K30M53J13m13k77L8L4M25K70
5157D54l34l21j97L39M69o1l55n47M59J37L26l4n67m31M33K88R8K00l56m88O5
5178d23N60K97m10q5L1jj83M30j27k85j19j95M11L74j22k06J26l71M20Q7J9n62
5200c34J86k16L33K87j53j32l06L68J1N53n63j58j57L94K14j16P2m11k83K30L70
5221A89L97n68m56M3M33O78k48r17Q0L85K87M24n25o23j21M53M70K9k92m21q8
5242c91Q08k27Q1m4l64j27J27L44K52m13k27k51L31N48j17l43m56L66K13K67l31
5263D6k73J05j12M97J59j76j67k22m1N10q2j92k19k45K33P71l47o4k36m00K95
$$ y = [-38, 471, 102, -242, -639, -356, 565, 595, -513, -295, -573, -410, 299, 188, 351, -327, -242, -346, 237, 368, 329, -360, -482, -108, 486, 512, -69, -530, -435, 234, 413, 228, -5, -419, -189, 264, 377, -36, -313, -275, -241, 184, 454, 120, -201, -398, -59, 410, 349, -6, -553, -94, 43, 369, 335, -232, -663, -230, 58, 156, 356, 0, -488, -423, 137, 434, 24, -61, -30, -31, -214, 216, 89, -196, -315, -510, -99, 275, 153, -53, 73, -298, 122, 209, 228, -334, -148, -364, -31, 256, 103, -29, -335, 33, 44, 597, 34, -124, -281, 113, 327, 211, 283, -128, -411, -181, 189, 586, 18, -438, -395, 38, 716, 468, -449, -369, 16, 303, 727, 202, -421, -542, -89, 381, 410, 118, -303, -391, 417, 190, 271, 227, -137, -264, -137, 207, 459, 46, -181, -432, -101, 447, 330, -13, -469, -103, 110, 377, 46, -227, -122, -234, 263, 422, 246, 79, -143, -184, 326, 244, 52, -167, -412, -179, 592, 245, 181, -55, -455, -160]
5284a60J65O1j07j52q3J61M97m5o66k4R8O11j84q3O1n78M30J4L77k89l24k27r9
5307e46P78J2P7m64p98M51Q65K58l80o51N1J17N14L3l55m52K36L86N3O2q27J80
5329d00K14J14L45j27j22j01j78L38J24J21n62k01K19O56j09j74l36j78J67M99
5349C09L1n09J13k5P8K08o5l13J24q6R7l07M55j12m92r3O53m1K25j31m59j77P81
5372B64L68n42j3k77j86M54K02m09M9R8k07J79K18K5l77j30K65K34O1N3o09k48
5394e28K21K55M74j84l96j81K49M19j25J10l46j44J53K52K2m55l2m6K66M85L2
5415E01n19k28J96J25K97Rn27k71K14J63K67j12l71j67L31L54q7j28k59m9L13
5436E2L62r5j77k73j15J3M02j94o9Qk9j68M49Q3j36k11n1K41j35N52l55m39J55
$$ y = [-160, 5, 66, -41, -193, -276, -115, 382, 337, -329, -353, -255, 356, 172, 89, 150, -428, 2, 16, 393, 104, -220, -447, -546, 232, 244, 321, -143, -941, -490, 375, 633, 253, -398, -347, -230, 284, 317, -38, -490, -254, 132, 185, 247, -580, -400, -186, -72, 273, 146, 24, -77, -255, 83, 207, 328, -234, -435, -216, 440, 331, 157, -179, -357, -190, 309, 340, -169, -56, -81, -3, 205, 140, -173, -49, -135, -38, -345, 110, -2, -494, -587, 66, 25, 250, 119, -340, -517, 264, 632, 90, 77, -200, -386, 68, 270, -139, -90, 8, -199, -20, 198, 223, -154, -284, -19, 215, 276, 329, -280, -528, -307, -52, 422, 238, -158, -339, -90, 329, 204, 314, -32, -176, -23, 229, 251, -204, -236, -282, -16, 469, 501, -18, -246, -50, 75, 372, 381, -146, -417, -203, -40, 227, 115, -256, -423, -92, 262, 175, 47, -212, -261, 52, 414, 319, 142, -131, -246, -233, 169, -25, -94, -86, -115, -283, 166, 249, 113, -98, -149, 92, -43, 509, 154, -285, -130]
5459a30Q2L02m1k96m30J68K75K28n7P2n26L45L21P5l91ql72J96O79k1k84m22m3
5482b78J42N97q5l85j61k78P06k6j77Lk54j57N02K68j19M5o63k99Q27J23k51j89
5504a09l72K70M55J69j66o82K8K66L48Q5m25k44K47j50M04K29m98k99L21J62j00
5525f1K81k82r0j02L96j45J5K29n39K40L42k20K3l02k4P6M41K49j90l68n9K7O7
5548DK04J86q13L36j40M69LJ87l33k21L04p6O4k20k26k74O82l6J01l02j01k42
5570d44M15P6N05q13j01j12N87M5N7l93O8M4L77n4N3m45l09L80n1N27k31l13m94
5593f26N88N32J6k91m85k18L30L33J84l83m56K81J75L55p3n41j6K72j4J91K50
5614D04o37k14L15K20K84k03l35K6j42L77J88L1l24m17M09K43l61j1L01l61J33
$$ y = [-130, -48, 254, 213, -83, -513, -345, -70, 158, 101, 173, -353, -8, 313, 388, -3, -11, -383, -187, 492, 471, 187, -235, -278, -136, 461, 376, -9, -170, -448, 258, 232, 55, 58, -196, -353, 149, 417, 298, 343, -320, -619, 208, 331, 80, -109, -481, -211, 244, 413, 247, -435, -407, -141, 207, 292, -133, -377, -130, -280, 124, 353, -145, -444, -123, 39, -61, 220, -62, -152, -254, 142, -3, 12, 241, -298, -58, 284, 64, 87, -215, -239, -163, 278, 527, 337, -31, -90, -63, 4, 208, 394, -419, -83, -223, 246, 249, 436, 103, -118, 186, 110, 174, -46, -272, -546, 136, 100, 201, -101, -202, -444, -29, 47, 552, -261, -362, -474, 113, 158, 215, -178, -110, -66, 311, 257, 310, -135, -444, -64, -115, 412, 181, -132, -626, -38, 494, 510, 219, -266, -484, -154, 179, 363, -20, -476, -195, -20, 335, 262, -279, -295, -23, -37, 154, 404, -233, -447, -132, 88, 372, 169, -166, -140, -282, 95, 283, 314, -10, -427, -18, 225, -136, -147, 154, -207, -74]
5635g4K29K16k62l96M6K94L11K8o75M23l57J50N3M52k72m77m6L28L57k49L46p54
5657c29R1L06K3j57N9l85L22K68L65o94J76l32R1M46J70j86n05J46rM16J54m06
5679C0k90K32j46K69L52m35m13K10K50J92J50n64k6k27M59M47o00k3r7j38N09
5700A41K77n01j16j09J09L45K06k06k66M9J94L80l19j54J39m36L15O3qk09j92
5721b98J16L03j6M2r0j50Q1nM45l18J28m14j74K60M30Ml24j60J04N1P1J86m52
5744a80l3K83R0L8l1l22m57L50M71q3Q4m32q8J45K43n2J58n54L4L98M23l95l66
5767b76M3J29n8O30j51n71J27J02j0L10j36k83j94M2P47k97j66k04k96K88O43
5788D19j42l31r6j13L18P5J2j89r4K26Mj15K09o7k30J72J24m9j07J05j15j20L44
$$ y = [-74, 155, 371, 109, -287, -241, 53, 364, 392, -283, 140, -217, -67, -14, 438, 166, -311, -357, -29, 328, 79, 425, -329, -238, 68, 91, -66, -7, -392, -70, 198, 563, -131, 45, -287, -196, 250, 420, 234, -271, -125, -134, 282, 436, 30, -260, -28, -174, 95, 447, 12, -401, -191, 59, 251, 401, -163, -189, -416, 43, 490, -110, -133, -230, -368, 141, 418, -83, -199, -308, -199, 146, 352, 146, -120, -71, 123, 503, 184, 30, 169, -267, 48, 111, 103, -106, -298, -182, 121, 105, 147, 57, -93, -12, -17, 428, 110, 238, -176, -350, -90, 340, 344, 20, -140, -36, 15, 86, 272, -180, -213, 70, 160, 198, 167, -155, -612, -262, 209, 126, 210, -222, -310, -165, 78, 26, 184, -370, -336, 62, 485, 90, -276, -233, -104, -162, 468, 317, -254, -127, -25, -35, 275, 139, -144, -338, -296, 451, 154, -12, -216, -512, -224, 419, 277, -54, -150, -263, 55, 130, 142, -47, -141, 85, 89, -26, 183, 116, -114, 58, 182, 133, 26, 131, 16, -104, 240]
5811B40k51J55k24o7j4rJ88J36l9l27N2n0L36j70R4k14j32M23K28j9n47R5M2j52
5835b26L93j55l73j82K94L32J63l25l2L1J90N8L68k75l12k99L07K87K8j92k51
5856a71J62j20M18k18l89J38k00N13J54k30k02m37P88q1M86o27m08L50q4K49J34
5877B25j30k85O1K60J77l11M9k19l74Q35j38m21J47J27o7K44%j74k34J42m3J22
5899gL56j92k46j87K29J92j53J50j81k11R9K89p7K22j99n86O30j84k3q1kk3L07
5922A22l6j06L8j42j14K26J88O5m25K52j78L19P6m50m9j81L09J11L07Rl18k05
5944a82J28K82J52m27K7k39J60J84K57n19J51j43L22J0J2k15k36O9K10M70j86
5965B87j41o90J64L18K29P5l97j0M0O40r6l09n4m92J96K86J56K5l8m48m5N04J07
$$ y = [240, -11, 144, -80, -147, -161, -170, 18, 154, 115, -212, -160, -210, 126, -44, 50, -164, -296, 127, 355, 336, -211, -116, -74, -226, 167, 12, -361, -543, -249, 83, 246, -79, -111, -80, 110, 168, 536, 261, -51, -350, -43, 244, 272, 80, -171, -9, -129, 289, 71, -318, -180, -380, 133, 287, 57, -145, -582, 206, 125, 611, -16, -424, -74, -158, 91, 225, 95, -190, -129, 131, 308, -3, 46, -173, -547, 288, 150, -271, -124, 3, -64, 180, 180, 6, -228, -86, -129, -7, 349, 157, -89, -276, -47, 145, -8, 142, -39, -250, -151, 138, 61, 283, 84, -502, 128, -56, -79, -160, -162, -185, 122, 86, -20, 18, -124, -238, -12, 176, 241, -184, 68, -110, 209, 285, -165, -214, -395, -86, 25, 332, 341, 23, -182, -54, 228, 380, -47, -20, -259, -99, 85, 342, -177, -26, -169, 153, 163, 175, -40, -276, -207, 3, 473, 287, 146, -544, -380, -62, 167, 242, -155, -165, -125, 515, 419, 110, 56, -436, -240, 46, 202, 227, 189, -259, -304, 200, 307]
5988C07j85j14k01J10J91J27J92l73n8K64k48M81p46M5J04K11k53J62L84q50J97
6009b53L87J50k85j48j87k7nL87q5J71k04P7L26k0j33l73J3q4L44kp5k18J30K49
6033A35k63M55m13l44Q0M14N4Qp4l77r5J61M40n6k46m6K07N3J73Q0m18k1J0k0
6057a03K91j61n2j87j15P53n34J97q0l46K31L21r2K95p09J30K94L31l39k31nO0
6079e1J4J13p2k31m5J16j44N31j03k67k13J52L18L4j5k91k97L18M34k88J59j72
6101@m99M12K63j37j0p1k06K00J03j42Pk74J27rL72K68j82k38n1J52J11J31q31
6124e04K06J39K75k48N45o56o8N9L55K16j40l75j36K08L62N3k70j78j70K01L82
6145B56rj29m92K79L22n7lpn03K5N82l04K72k78j27mQ5L22k60L8q0n2J57K18j34
$$ y = [307, 122, 8, -193, -83, 108, 235, 427, 54, -4, 260, 12, 493, -253, -208, -104, 107, -146, 16, 400, -450, -253, 134, 284, -1, -149, -336, -363, -368, 19, -66, 105, -99, -22, 304, 284, 151, -222, -209, -293, 51, 49, -26, -244, -114, 135, -128, 327, -86, -430, -350, 64, 118, 126, 52, -325, -420, -259, 181, 125, -121, -167, 40, 93, 266, 346, -72, -93, -83, -103, 188, 27, -25, -212, -327, 426, -108, 89, 9, -337, -106, 215, 123, 418, -291, -161, 133, 464, 125, -106, -111, -51, -37, 76, 4, -227, -272, -156, -300, 231, 128, -139, -352, -200, 118, 152, 137, -154, -451, -133, 301, 13, 172, 0, -499, -87, 176, 39, 29, -42, -248, -48, 55, -87, -80, -354, -227, -236, 136, 404, 222, -16, -67, 85, 196, 327, -504, -298, -159, 116, -132, 413, -243, -311, -252, 103, 319, 179, -196, -332, -124, 238, 291, 21, -157, -327, -126, 256, 247, 118, -374, -95, 227, 170, 167, 160, -343, -318, 264, -40, 232, -46, -173, -177, -92, 230, -30, 8, -72, -124, 33, 251, 117]
6170A17l57J69L36j00j6l5j05o7j0L03J91l13m34L73m38M90L07m94k08M86l03
6191a08RK3L8m20L98q5M01Q5k13n17L11L19N4m9j01k90J61o4K26O2l46L02l12
6214a16k1J49O5j37j88n5M17K20l99K21m96O11k24J93om80j56K41N43j91m32K60
6236A9l94L52M31j22j71l49K66kK30k31R2k83K85mJ72k42m70J99L42K13jl59J9
6259hl91M07QL07m26M7K1n0L89k71k5J3j38K83o9j71j0J10k16J44K70j71k9pq1
6284f4m9K08J14N8m14J72J21K6j24Lm32K65M39k27k10l93K11K09K14N3j81m3j82
6307b26J13L63P3m76j90J89N7L98o4k96j20R9J99K11j76j42j05J10j4N9K60n59
6329b37J34K67k54k0o2l4lK51pK79p58J24R7M26p7k22L4N6OK29q5oJ1k06j68M57
$$ y = [117, -240, -71, 265, 165, 149, 114, 9, -58, -68, 235, 426, 113, -321, 52, -386, 104, 411, -83, -291, 195, -108, -99, -76, -38, -458, -60, -145, 256, 341, 128, -389, -78, 241, 295, 246, 145, -145, 16, -48, 178, 240, -106, 196, -116, -137, 12, 77, -60, -248, -303, 114, 334, -65, 156, -340, 271, 47, 240, 234, -246, -402, -161, 382, 191, -241, 19, -375, -23, 408, 286, 115, -234, 32, 30, 260, 29, 121, -162, 123, 119, 291, 49, -421, -222, 120, 333, 332, -27, -8, -399, 8, 16, 323, -103, -56, -35, -85, 304, 33, 8, 21, -117, 166, 97, -74, -84, 26, -190, -46, 224, 53, 24, 17, -64, -113, 95, 209, 267, -147, 25, 146, 172, 48, 51, -381, -116, 323, 96, -114, -507, -296, -87, 127, 180, -1, -44, -226, -113, 250, 323, -153, -343, -154, -97, 301, 237, -59, -179, -80, 119, 330, 154, 12, -93, 17, 3, 62, 322, -237, -103, 164, -90, -110, -172, -206, -209, 42, 35, 314, -444, -320, -223, 203, 126, -96, -62, -6, 0, 229, 144, 138, 149, -57, -225, 232]
6355B32j62m1J36l52%K11K18m38J61j21J13K70L94k87l08m17K99J73j8j96J08
6376b5j36r9M64J29m35j15L05m39L09K60j72l01K73J38k72K85j69l30J03J67M64
6397D04m03k7l27J18L43R1j24j62k29J1L70J94n3j66k37L58l3L70k72k67R6j80
6419a25J16P5L1l82K25N7l2J92K44m57L9j23M13k64R0l93L91J03J74l66m87N16
6441C7m5R2K01K57l62k12k01J02L73l35J45m11J99J86k23L05j13j13q4K25o2n1
6463i0P9l4j04K10K62P2n93K21j64K29p1j49p6K23J82o4M6q3n39K50K10J74K45
6486D36n14r9j34L45J93m7k50p2J29L21j49k43r3o3K37J37J96m40j39L07j83J96
6508G1J94m91n5J45K10R2k04R6j57P5M0j30R4J97j09o1J66m5q9l5Q1l0R7K06m40
$$ y = [232, 70, 29, 165, -187, -187, 24, 242, -196, -35, -156, -43, 227, 621, 334, 26, -391, -92, 81, 63, -133, -25, -161, -260, 204, 333, -102, -217, 88, -351, -42, 218, 46, -255, 18, 156, -116, 169, 0, -330, -227, -60, 404, 1, -26, -353, -235, 108, 199, 75, -87, -316, -305, 65, 259, 206, 40, -197, 161, 128, 498, 226, -41, 55, -125, -9, 66, 97, -285, -60, -3, -35, 157, 401, -56, -17, -140, 273, 9, 99, -294, 97, 200, 374, 8, -479, 37, -8, 84, 285, 542, 180, -32, -233, -131, 242, -93, 52, -359, -160, 26, -197, 108, -5, -118, -202, 23, -39, -90, -11, -45, -149, 61, 323, 395, -198, 23, -141, 88, 17, -132, -208, 15, 197, 133, 179, 96, -443, -193, 17, 191, 436, -78, -177, -311, 34, 227, 180, -70, -142, -13, 308, 159, -84, -177, -240, -3, 134, 330, -110, -249, 58, -125, 71, 265, -226, -281, -136, 74, 166, -38, 58, -99, -24, 16, -114, -20, 177, 68, 7, 173, 128, 39, 4, 85, 55, 152, 358, -82]
6533h2m1J52J91k1L4m12J93m36L34J97k18L92n96k3M73M6q6L17m79m4m6K40q7
6556bn8j90K16k41O45l86k74J07K13k9L58k72k24p8O6M7K94j16j70L3lJ78K48
6579C62j69m23lM45r5K23k07k44j15j67P04j86k51j50J6M60k3l32J75l5j9J72
6601A38Jl5m47K98K01k03J98J16k66l41L22K96M9n82j52L42K38j1n4l14K44l11
6623b73L55K20l80J55l06J98J58j44J67j69Mk51L76PO7j26l21O16K4l20J78k34
6645Ak40J54M29l37k07OJ37l9J08M91m17j05r6j87L87M1l54J85p0J69Q7k53k02
6668c12N2N73k81K26J72m26j22k7N24k68j43j8k98J73OM20l43k95L81J97k0m37
6690b66J51r7K82k17N31k14k12j84N1J83j9K64n36q8J19P6K24J07k79j04l41O60
$$ y = [-82, -123, 29, 220, 199, 233, -179, 14, -422, -88, 109, -109, 283, -313, -336, 137, 183, 97, 414, -65, -109, -155, 85, -2, -60, -250, -34, -275, 370, -16, -290, -183, 30, 1, 359, 87, -137, -215, -149, -102, 192, 76, -94, -61, -64, 114, 362, 193, -230, -233, 212, 117, 340, 133, -111, -226, -393, 311, 125, -126, -276, -260, 200, 177, -155, 20, -15, -34, 138, 139, 104, -343, -45, 156, -47, 151, 267, 1, -340, -18, 278, 327, -255, -407, -65, 173, 162, 108, -206, 38, -273, 82, 302, -78, 77, -229, -31, 127, -17, 150, -19, -15, -266, 110, 117, 184, 58, -263, 353, 377, 57, 235, 1, -239, -85, 344, 7, -200, -194, -57, -96, 12, 503, 86, -19, -115, -302, 85, 126, -228, -43, -113, 56, 143, -110, -312, -260, 313, 32, 258, 430, 4, -118, -145, 379, 111, -32, -50, -348, -175, -169, 251, -92, -387, -6, 191, 171, -266, -115, -212, 70, -147, 384, 170, -42, -226, -175, 8, -11, 253, -283, -371, -252, -176, 48, 155, -124, -228, -569, 91]
6712I1%m9LN2j92J4J45J35l84K23k25L44Q8k3m13P6M8M1K6K42k96o3J51j11K82
6737B05J92m81j12M49k54K79l83L16l67m1L20J13j80r3k46k0O61k84k46JQ8K33
6759A50k4J6j85l68L48K51k27j52j08j18L48M14k36J02l71JK33K51j05l01L4j11
6781a58J41M10m04J44k27j3J63r0L09n82K02J33k0K05k81k92L06J96J0K39l74
6802A7L7M4j4o0o2o2n7QM1J66j12J85r2j68Q4L37ql31j31j30J00J28M80o3p27
6827c90J58J37m0R8K55j07j15R9j75J72k7j20L8P3J41k06l1j62L42j8K91k34n55
6850c76K28o0K81K4rk10K6K27N2J2j96K7j90m6M71k44J17n17J68M59k14k7j43
6873a40j38K22J20k12Q9j22J14K25N1j96j51j11q9K55N1P0r0l46J40J13J98J55
$$ y = [91, 91, 42, 45, 97, -95, -81, 64, 199, -185, 38, -187, 157, 245, 222, -191, -115, -67, -26, 0, 242, -54, -117, 34, -77, 205, 397, -84, -196, 253, -1, 278, -105, 211, -156, -197, 123, 236, 56, -37, -283, -303, 358, 74, -172, -171, -83, 150, 126, 142, -43, -411, -63, 188, -39, -191, -299, -417, -69, 345, 109, 211, -160, -159, 74, 325, 220, -81, -47, -158, -17, 393, -11, 133, -94, -107, 56, -34, 275, -307, -105, 28, 8, 213, -68, -360, -54, 142, 152, 391, 17, 54, 98, 84, 24, -38, -100, -157, -149, -108, 58, -54, 131, 39, -129, -45, 292, 284, -47, -178, -308, -208, -80, 400, 337, -390, -232, -95, -135, -37, 218, 111, -4, 95, -80, 92, 65, -55, -17, 56, 197, -9, -40, -202, 140, 122, 413, 179, -376, -148, -208, 73, 97, 88, -122, -96, 131, 183, 195, -1, 26, -164, -210, 261, 17, 134, -383, -215, 244, 30, 3, -140, -278, -56, 64, -148, -59, -181, -67, 158, 209, 13, -138, -249, -338, -83, -32, 38, -52, -398, -258, -145, 53, 208]
6895B08l31Mk32K63L2j41L09k09j95M83J02l12N0j83K53J35j43J74lk66j76L21
6917A43Q0L70m92k09K11j04N18n74J22j37j29N5M06m13J08j29j66O59l62Kj40
6938a81J19j39M68l62o9q4L92j39NJ7nk69QK74J99jn10K86j00M6K06j53Pj96K16
6963C5j0J15J40l36k1J28K06j21j91j18Q0j59O49j87j75k82j49P17k4k56j63O8
6985e4l08M65k04J96L8k70L61l32J65j83L44l84J22L79q0n5j91m6p8j31O24l33
7007D5n2R6l41J61J12K98j25j68k85P5M00J4m33K10P5o3L7j3l42J72J19J97m8
7030A41N4k86K18J50j28m4k52J40j17K38O3l9P2k00j72J67L94n15N0J46J15l4
7052A61o3j54J20k25L56M4K1l25j76J14K49K58m11J39k32j66M31pj96q2K65J07
$$ y = [208, -123, -119, -351, -88, -56, -197, 112, -97, -292, 191, 293, -19, 31, -152, 101, 236, 93, 267, 264, -2, -178, 143, 223, 593, 101, -108, 103, -1, 517, -57, 65, -72, -201, -146, 260, -153, -45, -174, -340, 319, -43, -41, -181, -62, -201, 267, -95, -164, -248, 144, 5, 10, 27, 22, -247, -239, 35, 234, 233, -277, 9, -91, -45, 161, 8, 15, -181, 35, 25, 140, 280, -56, -77, 51, 257, 136, -55, -173, -93, -252, 397, 210, 35, -247, -396, 321, 297, 41, -122, -54, -362, 103, -101, 95, 133, -137, 224, -108, 57, -126, 218, -166, -44, 335, 255, 200, 9, -37, -115, -246, 378, 45, -7, 89, -252, -91, 21, 319, 194, 26, -259, -184, 216, 230, -203, 7, 82, 19, 56, 43, -299, -127, -8, 189, 141, 195, -91, 127, 277, 149, 105, -147, -7, -124, 114, 177, 138, 210, 10, -162, 5, 399, -116, -66, 80, 195, 161, 98, -56, 64, -161, 195, 239, 260, -65, -241, -127, 122, 380, -31, 108, -124, -290, 141, 134, -62, -144, 121, 228]
7074B28l56J70j35J04n5K97m02K98J7m75O1L15Jk95l0J34o7L03O9j73j3j19j28
7097b51M97m3k25K51l80j56K74P9j46j13K74k38J90J76o8j73j03K37J71l67K89
7118A75m15J25N6L01%%l93J4J50J12K56l76k46J03j13N40J8l76J2J8p0J51J17
7141A59k68j68k9L39j31K84l39J53j83L49No8N3J67j16j57l2k43qJ27k70L80Q1
7164H5j80M7j75M36l20K17k66M6J75j06N0q3J59m76M40k81L94Q4j98j98j32O16
7186C34l06J6KO3K5L35k46K7l15J64m49N19k2k85L13l43k6K15L28m69l3J84RK43
7210B83j42M5k53j24J49K61lJ08o08K21J6J39j51J35m07L49J48k0j41m3O1j16
7232i3L24k36K07l77j56L60o4Q2p2j34o3K85J02L2l47j86K72K8K81l21J6k06N2
$$ y = [228, -128, 42, -93, 11, -44, 253, -149, 149, 166, -309, -248, 67, 68, -227, -257, -123, -190, 113, 182, 9, -4, -123, -251, 246, 203, -22, 229, -151, -307, -33, 46, -100, -213, 61, -177, 13, 189, 121, -52, -155, 82, 253, -114, 175, -240, -115, -59, 242, 242, 242, -151, -137, 13, 125, 381, 5, -241, -138, -251, 289, 307, -69, -57, -39, -109, 42, 159, -109, -277, -306, 33, -98, 186, -153, 0, -183, 166, 171, 103, 156, 323, 207, 50, 18, -225, -233, -106, -376, 4, 85, -95, -48, -223, 213, -107, 110, -156, -110, 65, -41, 9, -74, 85, -391, 49, -232, 162, 246, 48, -150, -282, 334, 28, 44, 46, 109, 134, 469, 223, 250, -65, 99, -350, 169, 147, -138, 175, -168, -194, 21, 349, -120, -153, 31, 40, 283, 141, 186, -67, -191, -42, 219, 216, 324, -284, -63, -47, 92, -59, 76, -331, 18, 166, 146, 5, -38, 23, -93, 231, -5, 202, -175, -331, 29, -35, 47, -25, -159, -222, 63, 165, 197, -150, -336, -64, -36, 245, -76, -60, -266, -214]
7255b14M36J03l83N7m5j58J53J93j50p2J44l3J64k45K43j64m0o1P8P3J82k61k75
7278b75N33j94J41n6n01K83K69k73M54k84P6l96P3O62l19k29m9L24l61M50o16
7299b88K69k57r7K90L30l54M3j05Q9J09j00J86k03O5n5J54l1P7k17p8K84J53p5
7322A89l11Q5J25j83P1r5L1k23L49j04J11L69m90L1k89L22J17L1k36j20o1L88
7344A07j76J44p3j29K48K24k86r6j02j97L66r8J24K09n19M02l05K62J36j04l67
7365b30R3J70j51K20Q3j06j32K21J99j26k82J6k44M03k4p8K8p1l3J05L30l69j74
7388a52J73k61L53J59pj30p9j02J07Q9j51O6k50M93o43K80M05l52j80K83P6j38
7410C9j6k78L38l5J30k00J55k31k9m5J74m4n0n2L34n4k6m21N8K89K60j25o9j48
$$ y = [-214, 222, 325, -58, -1, -46, -204, -51, 142, -8, -80, 64, 31, 195, -50, 193, 29, -11, -72, 6, 79, 261, 0, -275, 258, 64, 205, 149, -352, -69, 200, -73, 381, 97, 173, -223, -150, 512, 193, -36, -85, 239, -122, 328, -288, -19, -276, -373, -83, 247, -107, -64, -169, -80, 29, -71, 115, -88, -23, -78, 76, 45, 122, -95, -173, 111, 264, 189, -122, -37, 88, -95, -24, -119, -88, -311, 38, -66, 45, 414, -76, -45, -334, -12, 105, 136, -100, -220, -281, 107, -69, 75, 2, -127, 121, 345, 59, -37, -139, -336, 30, -68, 56, 265, -254, 148, -157, 105, 241, 137, -230, -137, 33, -118, 102, 185, 79, -53, 168, 367, 241, -41, -25, -269, 134, 110, 32, 60, -11, -44, 61, 391, 22, -152, 21, -240, 113, 272, 265, 135, 56, -46, 61, 150, -1, 65, -185, 308, -335, -55, 350, -2, -182, 101, 177, 39, 23, -255, 83, 48, 178, -22, 133, -98, -127, -172, 2, -42, -92, -144, 190, 136, 110, -311, -253, 36, 296, 171, 102, -46]
7434d6n7L52k11N6J43l1l64j46O5J83N1Q0O2m39J34L86L4m44K71k11Q3jK16k90
7458a24J94j28K56k62J53j87K0J02k0J71k66O4n8l4L82j48k29J18o3MK21k58j32
7481b24P9Q7J23J66k74p2K64l94L05J75l26q7L10O7j41j03p0K9JN6L4l0kq0Q7
7506b0m9J2j99L59j1j66k06M72l32N3J67k57L1R7L22l26K12K0j01J7N3p1j31L25
7530B71j71j99K36M1m13J75p2q7J21O7l0N7j08Q7O7K16k39J87Ok62j28K01j43
7553a20j40K8L14Lj27K25j76K67l48O5O9j79O1K6j05J98qrk12J20K60m27q0L18
7577B3k11K66M5m4j57K55N2J4k16k11O3K57j92K45Rj52r7O9J3L0j04p8p0K75L45
7602D29m36P1j34L19k6l82M9j55L2j6M02J18n21J92j10J48r0O8J81l65Q1K24j82
$$ y = [-46, -103, 249, 38, 94, 237, 206, -158, -304, -239, -56, -5, 75, 137, -302, -168, 218, 252, -192, 79, -132, -49, -50, 166, -124, 70, -58, 198, -64, 89, -98, -78, 24, 4, 175, -91, -27, -85, -119, 263, 115, -114, 4, -59, -55, 166, -92, -224, -145, -58, 65, 231, -43, -115, 149, -245, 60, 235, -91, -178, 132, 199, 58, -45, -115, -86, -85, -29, 5, -25, -27, -107, -20, -69, -57, -256, 103, 92, -74, -280, 192, -140, -87, 80, -177, -146, -49, 273, -53, 159, 179, 78, 95, 148, 77, -54, 271, 100, -99, 137, 178, -235, -60, -132, -219, -98, -31, -61, -4, -112, -25, 42, 258, 19, 206, 212, -50, -178, 23, -120, -260, -232, 82, 85, -42, 183, 7, 274, -74, -9, 60, -119, -58, -32, -137, 61, 53, 44, -168, -48, 212, -215, -295, 23, -188, 78, 123, 79, -78, 177, 229, 243, 27, -184, -121, 136, -56, 189, 198, 46, -51, 18, 31, 61, -43, -121, -191, 84, 429, -7, 64, -70, 249, 223, -159, -110, -265, -233, -249, 153, 271, -250, -58, -168, -20, -110, -42, 139, -226, -145, 79, -103]
7625a03k1K54j59RJ31J37m29J26L6P2p6J17j05l1L4j85K69r3j58l5J91j00J62
7648D3K79k82q5Q8L0r0l6R9k95L00k7k13J29m1j05kL14k22J80Q9l10K21q1j1q8
7673a16j61J10L21j93J97j33M2r2J0p8K40l60R0n4k18N25j61l2q7L14l02N83m92
7696d7R4k37J00K12k60J77J6j97J25J48J54p8l47M02k35o5K1J95j54L3m02O00
7718B55l88J9J29J60j97J97k27J05R0k44j67K95m3O4o2j73L8K18K3P7k81J39l0
7741ck99L26j14KL7n9M37l44Q3k3j63p2K28O7K95k16k19r6m0K14R8j74N5K11m72
7766b41K65j74J36k8j83J89k41K35k79L22K05k91K50m61L69j41o5K49l09n7L52
7787A02J54k69J62r6j29k5J3L57l74K15k88K4Q5J56M9l53L52k77K06k08J68j52
$$ y = [-103, -124, 130, -29, -20, 111, 248, -181, -55, -19, 53, -23, 94, -11, -42, -8, -193, 76, -17, -175, -210, -19, -119, 43, 322, 40, -45, 43, 73, -17, -53, 46, -249, 51, 24, -189, -60, -101, -206, -208, 106, -116, 64, 153, -157, 64, -17, -28, -116, -277, -167, 154, -39, 158, 25, 67, -25, -15, -93, 147, -213, -123, -177, -395, 130, -31, -63, -150, 164, -138, 445, -47, 47, -190, -90, 122, -138, 39, 55, -142, -17, 131, 285, 207, -140, 262, 27, -38, -17, 178, 24, 57, -345, 255, -133, -114, 15, 175, -22, 175, -52, 53, 143, -101, -268, 27, -16, 48, -14, -187, -149, 69, 92, 169, -112, 27, -3, -302, 24, -90, -88, -51, -110, 327, -17, 66, 43, -120, -192, 36, 103, 398, 182, -37, -133, -173, 41, 139, -35, 20, 231, -241, 24, -150, -14, -42, -225, -36, -277, -42, -321, 1, 206, -85, 165, -296, 73, -68, -133, 116, -193, -250, 102, 256, -13, 149, 53, -76, -101, -88, 269, -105, 110, -178, -154, -69, 87, 136, -217, 135, -142, 64, -144, 24, -128]
7809a28L51m34j35K83k13L75p9J65p5j49k93K16j24M42n34K90N04n51K41j39K43
7830B56l52m3j70n2M62J8k61P9k47K0M16j21K7n2O3L4k22K56o1O7k22k12M50M3
7854A76l39q7J21j05M28K2n2l98j04N83k02o1j71L53mK69m23J74l32J12J59j97
7876g8N1L0r5m6L2K43J23J23m31k78L28m2q1L3J91j10n9L31k34l1m6m6J54k51
7900a89J02J27l2k24J87J64O7j48J8o7L7J18Q7k05k39l1L16N4k26N8K02k79J71
7923F8l1j7J06m90K54j3L58k7k03n3o0o9L32P1j23l70K14J51q1O7L5o9J7R5O4
7948B26j22k96J75k34L02k58M80l04rK11k48K88j49n8j39J97OJ50l57K36j47L08
7970B58j85rj25L8J48m01L45j13J29j19o0M8j34K06K3q3P0K03K9k36J60j91l50
$$ y = [-128, 223, -211, -346, -63, -276, 99, 20, 185, 110, -39, -332, -116, -240, 202, -332, -42, 462, -89, 152, 13, 256, -96, -139, -309, -361, 101, 119, -142, -63, -310, -290, 126, 5, 32, -20, 43, 77, -145, 111, 50, 117, -105, -317, 133, 176, -163, -250, -129, -234, 194, 216, 164, -234, -338, 245, 43, -18, -189, 164, 160, 429, 6, 180, -152, -40, 119, -78, -27, 3, -92, -138, -106, 137, 260, 383, -48, -326, 2, -40, -121, -88, 103, -7, -66, 265, 31, 0, -46, -92, 62, -189, -87, 40, 8, -216, -29, 135, 202, 54, 72, 5, 42, 160, 247, 42, -197, -228, 88, 142, -84, -26, 176, -103, 68, 37, 20, 126, -364, -110, -123, 235, 208, 5, -48, -108, -177, 155, 226, 103, -267, -53, 98, 17, 84, 119, 50, 67, 162, 226, 104, -192, -17, -251, 51, -207, 273, -31, -40, 171, -77, 211, 62, 4, -135, 62, 68, 218, -139, 97, -50, 258, 73, 64, -61, -23, 125, -276, 69, -44, 85, -34, -94, -46, -180, 26, 49, -34, 36, 239, 268, 32, 192, 1, -349]
7993c49O31j11m0j77k68NK47P5j63K44qQ6J52M0m56O1j13J26k23J89PK3J5%P9
8018G2Rj07J37M7nj83J07k07j69K97K05L6k45M7j06O6J07J30k13m0j92j7K38J21
8042A35k05l1K52L4k35j00J91J31l39l4K00Ro3J02j15M2K38k49k36K81R7k54K17
8065F8n3L7N2k06J95O6n1j38M1j55l1K89l62J59k15J29O4o9R7M5r0j71M21n4j63
8090i5L43j81j41j76P15l95k7l35J84K66j68M7k91M10j9J66k97k55J75m8J93M3
8112A14o4J29K9l81K47K56k71n3l05K35R7K39j52k36N0n0n3L84k52K72j85l16
8134b66M43q7k59M1R9q8K21o6k2l4j19MM60n19J49k23M43o6k40Q0j69K38K48k48
8158B0o8j4j89K86K94m02J66o5K39l30K65k70K5l82K97O5M19m38K25n6k49K98
$$ y = [-349, 282, 171, 131, -46, -314, -309, -62, 13, -150, 94, 86, 172, 324, 364, -92, -31, -144, -18, -241, -52, -45, -22, -7, -7, 72, 81, -26, 111, 158, 153, -30, 77, -130, -299, -2, 203, 239, -6, 41, -65, 1, 108, 238, 25, -15, -207, -224, 14, 135, -70, -101, 151, 185, -50, -150, 41, 172, -167, -201, -1, 8, -55, 47, -68, -26, 212, -37, -273, 8, 105, -149, 68, 15, 52, 104, -102, 93, 159, 108, -30, 11, -144, -175, 114, -248, -89, -304, -175, -111, -180, -83, -38, -128, -299, 122, 68, -95, 248, 67, -74, -250, 465, 70, 43, -292, -108, 158, -10, 37, -254, 156, 137, 303, 6, -249, -74, -122, 71, 114, 50, 179, 208, -173, 74, 330, 59, 6, -299, -64, 33, 272, 120, -116, -66, -116, -169, 215, -37, 235, 50, -266, 177, 90, -169, -128, -29, -117, 104, 38, 16, -18, -137, -133, 327, -192, -43, -266, 177, 111, -129, -49, -218, 20, 268, 20, -48, -62, -251, 35, 329, -73, 93, 28, 267, -63, 202, -68, -43, -425, -128, -63, 356, -82, 143, 87, -162, 136]
8180A36j85M53k21k26j6p4L61j71j03l0j86
$$ y = [136, -49, 404, 183, -43, -59, -133, 228, 57, -46, -76, -262]
8191b62
$$ Imaginary data points
##PAGE= N=2
##DATA TABLE= (X++(I..I)), XYDATA
0@%%%%%%%%%%%%jRj6J6j6J6j6K1k9L2l6M4m9N5o3P1q2R2j03J17j31J47j64J81
36I5k02K24k48K76l05L37l73M14m60N12n68O32p07P94q95J018j169J357j608J949
56A073k446L252m760Q528l3096p9670N6379Q9041L1794n2604o2333j976O3086
69A6268M2204k2029m8800k2082Q261L0546K7904N311j4206k3510k4380N673M0826
82B1986K2708l4229m8091n812M9117N6759n515o9189m7488K8175N6412J5542l2227
95H148l8114M611M2830K0647k1915k2657j097L852p42K389J1066J9886K810l1139
109E75k6581K2551L9909M65m0709l6054J5793N7666K8578l7989n1901m076L1968
122A95K4612o314k8410j4011J6566J7417J835k31l236j9383k0072L977K7894K9375
$$ y = [0, 0, 0, 0, 0, 0, 0, 0, 0, 0, 0, 0, 0, -1, 8, -8, 8, -8, 8, -8, 13, -16, 16, -20, 24, -25, 30, -33, 38, -44, 48, -55, 62, -69, 78, -86, 95, -107, 117, -131, 145, -160, 177, -196, 218, -242, 270, -298, 334, -373, 421, -474, 544, -625, 732, -876, 1073, -1373, 1879, -2881, 5647, -27449, -107119, -50740, 38301, 70095, 17491, -44842, -46818, 16268, 58472, 36443, -12357, -34439, -26178, 4368, 32272, 37583, 23377, -133, -24513, -18840, 21986, 44694, 10465, -37626, -43438, 5679, 62438, 56923, -12266, -59754, -31579, 24833, 40375, 8148, -29966, -25355, 17475, 38122, 16207, -6450, -7547, -3695, -4437, -2048, 9018, 28904, 31714, 575, -26006, -3455, 36454, 36919, -3790, -39844, -24051, 33615, 62193, 24204, -27697, -31773, 195, 24807, 18493, -9917, -23928, -7362, 10055, 11890, 11659, 8423, -10960, -31032, -27055, 839, 30214]
136C0214m804m4548k6774L5978N2531j221n4021m7000J6709O9260L9653l9090
148B6887o0159n861M3702L6614j0190m5407k5120K5149L7566R393j2768j7861
160A945j5353k188J2030J3185P521r612k6368p725L3909L4821j2133m8493l2892
173e1353K0887N6067K2665l9955m3636J0060M3762K3031k2471m3715j1211L2450
185c419K9421m770j4885l105K523J14m967k160Q944O844j5653j5413J5585K9860
199B8919M621k7505l4362l343L5049K7827j6925l1954m435K1028K0294k235k3819
212f840j7439O226J1595K089P263R368n471j8114j1369J0086K7695R522l2417
225g806l5319J4731N0362K7365k6175n3475j9830M0407M7778o146m4598k5250
$$ y = [30214, 25410, -19138, -45912, -9934, 42597, 41376, -12645, -59645, -42936, 26324, 65977, 26887, -33272, -39133, 4569, 41183, 30993, -14414, -39534, -14385, 23181, 32574, 19806, 1945, -13408, -15596, -3566, 9619, 17140, 7528, -18840, -26565, 7344, 42165, 30032, -18461, -51353, -30466, 25601, 48266, 8311, -35325, -25265, 18497, 41528, 19057, -24658, -35869, -3419, 26002, 21232, 6347, 3242, 5765, 5879, 912, -1248, 7696, 14540, -1113, -16526, -941, 28919, 33540, 6035, -28327, -31670, 3379, 31206, 14281, -17673, -22108, -1080, 19214, 16979, -6840, -24279, -18053, -6458, -4369, 2894, 12262, 6791, -11323, -22692, -12606, 15089, 24611, -7806, -43125, -28394, 21968, 49333, 23158, -30317, -50147, -9740, 38038, 31892, -12706, -37956]
237c7956J7519L8968J8953k2422l5014r738J1293J6461J5095J791j8684j9719
249b3453R29K0866K4263k079l9549l3183K0328N0412K3644k6437m7270j2841L9441
262d929M0503j1458m3066j9718K1605L7557J4460k2159k7122P72J2953M381N49
275D328J417k570m023k489K658J3950R043j9470k8251O1K6805K2039l763k6399
289f664j7485J6241K4632l723k1211j1025O159J3979R025l333l764K957n454j3638
303a3304J284J8279J1199q962j9377o328K4094K7766j0156l8400j7879J9680L3571
316B1467J1996k3915l0197L902K8791J2672j3527k2189j0794J0156J9339P363
328A5064n557q283j0243o996J0318J6706J2j6701j6604K538K8786K4180j5426
$$ y = [-37956, -20437, 18531, 37484, 15062, -19952, -29690, -18397, -1936, 13159, 14950, -3734, -23453, -22524, -1658, 22605, 20526, -19023, -52206, -31878, 18534, 42178, 15741, -31529, -44370, -4929, 35574, 24116, -18950, -38668, -17063, 20494, 34954, 12795, -14327, -13555, -602, 3779, 4328, 5745, 3175, -848, -3337, -679, 13271, 22314, 2844, -25407, -25346, 1459, 23498, 19735, -6664, -24149, -7908, 16724, 13001, -8210, -19235, -13076, 903, 9928, 6595, 2831, 5788, 334, -13304, -12020, 6259, 17458, 8496, -10881, -17209, 6885, 34651, 24495, -13905, -31784, -12104, 21467, 33463, 9548, -20649, -16747, 12044, 24716, 11189, -11000, -21794, -11638, 7701, 15064, 9507, 1224, -9019, -16015, -5697, 11009, 11021, -5680, -22284, -19746, 9040, 33220, 17794]
341A7794l8331j2257K4310L1867L123l0198k5023J5502L5418Q354k3187k4305
353a6933k671J8365J7821n018j4095j672M699J208K072J423m647p231n876J120
367a1435J4761J3547q704k0663n482J3095J3766m69j7059j3205J2710K1207K256
380A4325j4113r872P36P950M482o454l096R509N069p553n603N500P889N53j3190
395c868j4639Q484K5936P097j8065j8515l34J6798J4310r159k2246m410J5629
408b982J3953K697p876j2558n636M602O383O197L462r381j3444M200J9471J1873
422B0961r657k5225j4477J7483L2446N582k5188k2223M049K5275J8184j3808l0007
435a6605q205K0368K0569L495j3427j6702j914J2015P364k641n010p126m754P282
$$ y = [17794, -20537, -32794, -8484, 23383, 26506, -3692, -28715, -13213, 22205, 30559, 7372, -16933, -19604, -1239, 16582, 11564, -2531, -4203, 496, 1704, 3776, 5199, 552, -6679, -12555, -11435, 3326, 16873, 8169, -12494, -17976, -4881, 8885, 8416, -8643, -21848, -9138, 12069, 14325, 212, -9660, -8924, -974, 3508, -2946, -6042, 3467, 8536, 983, -4620, 880, 8769, 9322, -3868, -18507, -10023, 15913, 23010, 4945, -13570, -13904, 2894, 17204, 8045, -14201, -18611, -2982, 10971, 13668, 5792, -6766, -12402, -7800, -1417, 4780, 8242, -1139, -14583, -10383, 9088, 20961, 11304, -13921, -28398, -10915, 21531, 27113, 1925, -20298, -16249, 9026, 27210, 13402, -16605, -24810, -4442, 16127, 19622, 6195, -10507, -12421, -406, 6958, 4317, -693, -7819, -12573, -5291]
449e291J2581M425p597j4858j0166R937K0129K310j5357j2144M377J5606J0696
462A4648r841j8382j595J2663P299j502l439j484L349J305n651k515P877L725
476F457q378p301L394J0983R357n771j8381o736J2681J2714p41r874r300K471
490h425J3191O908p527q758m484q04P617J0522Q29o194p695l275P599J4881j77
505A4208j7576j2284O873J9807J3960q924k4201p790J7708J7683j992j6719j4118
518a3365O253K0379R025j1892j4577m031N014Q980M369n751p185q76L039N502
532D884N965m894j3379n137Q000J1434N608p350j3827j93J3469O771o747j0381
546e777l626P099J1561J284r832m122L614K113j005j911j915K966L890l367m514
$$ y = [-5291, 7290, 11715, 4118, -10740, -20906, -10969, 9160, 11470, -3887, -16031, -11654, 3952, 14648, 4807, -13575, -15170, -2507, 4792, 3290, -149, -1633, 1716, 3021, -2630, -5145, 2732, 6457, -1921, -9222, -5828, 5155, 14512, 8741, -9640, -16376, -3695, 9019, 8278, -1596, -10896, -8425, 4766, 11674, 4147, -4611, -9095, -9899, -2282, 8240, 9069, 2875, -4820, -8095, -496, 14385, 14208, -3368, -15652, -8779, 11028, 24988, 16064, -8137, -15927, 1781, 19464, 17472, 753, -13365, -7112, 13267, 22292, 10400, -4177, -8208, -3194, 5786, 10155, 4404, -2781, -3657, -618, 4884, 10849, 5955, -7424, -12561, -4561, 6873, 12481, 5131, -8696, -8889, 4580, 11351, 4604, -5777, -9403, -2304, 9257, 10541, 709, -3413, 201, 2314, 1309, -602, -2517, 449, 4339, 972, -3542]
561c542M357M143k656o089m809R98R745N237o623p997J112M782L328k65n756m795
577h830L254N452K562K540j769q596l497O087P452K556n971j0507m95J4831J1255
592A6324o743j5443q195O785J7387O125j3549j3972K079J3032J0031k605j4738
605c482j0798O728J3250N145l683r320o801M551J0895K732o203q776n329N937
619e154J4028N434r637j1793k536P534J2033P66j3329q795P129J1302M397m866
633F513j0845m419O901O553j646k567j416j686J667K208p79o83p96m491l036N555
649b967O088P2l677n258k554M901N877k015n245k164N38M106O985o09o670m759
665g351j317L908Q741L500q030q393Q78Q065Q980l74j3032j1489O200J5549P109
$$ y = [-3542, 815, 4958, 2302, -3787, -8596, -7598, 2147, 7384, 761, -7236, -6124, -1342, 1986, 1721, -4035, -8830, -5576, -124, 2438, 4978, 3209, -5387, -8884, -2797, 4655, 7211, 1240, -9267, -9762, 5069, 16324, 9581, -5862, -14057, -7272, 10115, 16240, 2691, -11281, -9202, 3830, 13861, 11256, -3482, -14280, -7552, 5698, 10843, 7160, -2160, -8961, -4410, 6485, 9217, 3014, -5762, -11091, -5154, 8874, 14308, 4671, -7122, -9658, -2124, 9909, 10675, -2654, -11449, -4320, 6982, 11379, 6513, -4332, -8751, -1850, 4703, 3057, 490, -926, -2612, -945, 1263, 484, -199, -995, -5486, -8522, -2967, 3121, 3193, -484, -5742, -8296, -3395, 2482, 467, -4778, -6942, -6404, -2298, 4687, 4078, -2592, -7351, -8668, -4760, 3981, 7481, -549, -8942, -8064, 1, 8981, 8607, -4425, -15914, -9714, 5835, 12944]
680A2944o093j4544p441J0367J5422J20j2166j1136O6J1992J2881k231j3583q197
694a1599K505R903R393j556j3111p773O974J1371O998m945j4922p145J0614J3550
708A0257K025q570j0540j580J1378J0168l659j0890n683K546Q038P012l389q623
722a510k403K564L734L471j520o554k286K597L239L658L14n505n785J327M480
737a79K981J162l923n712J887O259K151j246l801n036p43O483N048l3l670o187
753d559k851P078Q466j952q953o443J531J0905R528n884j3756n245O364J0890
767E119N300p625j3158j556J1532R928R59j0230j2674J62J3152J0285l226j0602
781b634q666K833J3821Q171p435j3356n141P302J2845O788r658j3890j433R939
$$ y = [12944, 6851, -7693, -15134, -4767, 10655, 10775, -1391, -12527, -12461, -469, 12412, 10181, -3402, -11599, -9094, 809, 10202, 8646, -4465, -12238, -5264, 6107, 13105, 8160, -6762, -13907, -3293, 10257, 12282, 3712, -6828, -8408, 2970, 13138, 9479, -1411, -7094, -4548, 3490, 10502, 7113, -1510, -3913, -1349, 2385, 5856, 4336, -2218, -4504, -1907, 1332, 4990, 5304, -201, -5986, -4659, -179, 2802, 3964, 41, -5671, -3784, 2475, 4626, 3380, -421, -5457, -6200, 283, 5331, 5298, 1628, -4559, -7410, -332, 8134, 6182, -2771, -9214, -7683, 3222, 12750, 6866, -6890, -12135, -5771, 5119, 10419, 2794, -10364, -11920, -388, 9540, 10499, 269, -12405, -12243, 909, 11194, 7968, -2634, -11300, -8467, 5354, 13525, 6090, -7266, -12407, -5105, 7740, 14528, 4870, -9020, -10453, -514]
795e14J0081J529j0774j1649K713J3045P098l447r974p827L721J0685M213n267
809C633p144l200K410Q615M396n731p260k038K969O843M023m656o625m77L414
824h28L958K475k738o749j330M123L702L198o54o479m662L265N811K572j307o486
840b129n778L964Q799K914m060p971n794N089J1414K987p360r134k978P243J1628
855H834J394j1741r782J747J0039J0012o54j2682r687M599J2379O859m264j2933
869e880q400Q193J4938M105q706j2904m926J0257J4309O55j2402j0042L97J1271
883H65J1076k198j4024q573M971J0844P737l469j2933o316P400J0745L031n180
897C976j0873l993P935J0157Q32o790o754k793O379Q420N3o817m971o41N054P323
$$ y = [-514, 9567, 11096, 322, -11327, -8614, 4431, 11529, 8082, -1892, -9719, -5998, 4687, 8900, 3633, -3511, -6711, -4301, 4314, 8710, 2979, -4281, -6319, -3350, 3493, 7516, 2860, -3765, -4242, -828, 3130, 5605, 2867, -3882, -5212, -1089, 2613, 5811, 5157, -1322, -5984, -2719, 3092, 5664, 4357, -2129, -7907, -3943, 4856, 7770, 3710, -4261, -10055, -4966, 6448, 9435, 2075, -7059, -10037, -2794, 8834, 10228, -1513, -11295, -9548, 491, 10503, 9849, -2833, -12520, -7921, 4458, 11317, 7053, -5880, -14280, -6087, 8851, 12956, 4250, -8654, -13580, -3323, 10986, 11641, -761, -10803, -10406, 865, 11941, 9743, -4281, -12854, -7883, 2961, 10698, 7229, -5704, -12020, -4620, 6125, 9156, 3976, -6897, -10890, -2955, 7202, 8034, 1244, -5510, -8303, -1924, 6496, 6549, -268, -5239, -5880, -826, 6497]
913F497M89p132n305R11L555N313K015n046o102K29M313M484K562m405q098o92
929f412O304N931J447n397q267j291Q460P230r89o488p940p98J0249Q739l055
944G723r519p578J915J0861R276n402j2621n471O002J1567O465q059j3534l123
958a1498R649J1040K458r299j2828j033J2629J0986k360j1175j0707K227J3890
971C979R010n975j2886o106N011J2263O462q219j2203k425P454J0201L836q318
985B084j1676j98R196Q007j01p921q872Q99J0131N902k801o779n810J428Q145
1000A634N108l311o087l780P46O868N152k745o552k546J034N277N237j849o619
1015b433l497K658M422M544k40p285n288K922O629M338j130p740o245M242R021
$$ y = [6497, 6986, -146, -5451, -4540, -985, 4328, 6343, 1297, -4805, -4576, -263, 4221, 6783, 2378, -5720, -6412, -108, 5823, 7270, 1873, -6394, -7685, 775, 8005, 7016, 528, -7412, -8210, 2039, 10778, 7723, -1796, -9374, -7459, 3402, 12678, 7276, -5345, -10816, -4814, 6753, 13218, 5159, -8375, -11498, -1849, 9191, 11649, 2350, -10478, -11511, 1118, 12104, 9744, -1431, -12138, -9911, 3979, 12989, 7014, -5872, -11978, -6967, 5296, 11758, 3539, -8664, -11089, -3635, 6566, 10402, 2084, -9592, -9790, -594, 7413, 7312, -609, -9481, -8582, 1549, 7451, 4650, -2129, -7939, -6511, 1634, 6742, 3431, -2656, -6436, -5690, 1178, 6330, 3585, -2967, -5513, -4479, 798, 6035, 4186, -2433, -5930, -3272, 1150, 5694, 5454, -1831, -7119, -4197, 2432, 6770, 5640, -2100, -8345, -4103, 4918]
1030D918L731l785p995n725N254J0632L144o479q586l899O254J1590K645j0303
1044A396r519q2Q666J0457r3j2113r359L903J0835P492l405j2187p267O473J1821
1059G018M511o568j1111n358Q415J2235J588r900r667q71Q988J0342j112j1202
1073b692p313K847Q285P481k236j0666n901M893Q217M012l360q883m412O099Q273
1088D644J247m762n947k886M806P368L54m794m381k206L482O731J587m898m715
1103d370j183K935O174K274n008n514l06L416M649K904m413o746o81M597N793
1118D521K696m634q169j501P160O636K78n882p887o10R380P500k721p564o608
1133g405J038R456Q012m439j0697m324M726J0022N423p247j1323k520P984R461
$$ y = [4918, 8649, 4864, -3131, -8856, -3602, 7030, 10174, 3695, -4891, -8790, -2536, 9054, 11699, 1396, -8123, -8205, 461, 10918, 10825, -1288, -10647, -6744, 4091, 11583, 8178, -4009, -11276, -4803, 7018, 11529, 4961, -6150, -11508, -3093, 9142, 10730, 830, -8837, -9708, -720, 9622, 8510, -2692, -10005, -7158, 1127, 8608, 6372, -4294, -10195, -5302, 2915, 6927, 3567, -5316, -9728, -3629, 4644, 5891, 1129, -4818, -7704, -2898, 4470, 4824, 30, -4351, -6557, -3075, 3656, 5243, 345, -4370, -5553, -2618, 3556, 5830, 822, -4692, -4998, -1582, 3067, 5971, 1558, -5188, -5869, -1272, 4521, 7217, 2583, -5586, -7087, 73, 6709, 6987, 1105, -6782, -7392, 1988, 9488, 6767, -797, -7405, -6367, 3089, 11101, 6662, -4035, -8359, -3633, 6389, 11812, 4565, -6758, -9278, -1294, 8167]
1147H167K457q233j0532k73R900P744r03q979q737J358J1332P707m687j0223n565
1162i467L696J0607N170p302r493j638O170P809K506o951q543j6O686N835N05
1177E574n748p054R68O956M253j665m643n225N82O230M364k073m512k995l67N112
1193b43M525k028m527k730M02M413M789j133n685k581O66L960M038M89n802l684
1209e131J357M759M666k79p260o105L830P365L639k012p482n315M937Q849K133
1224G951n725p120k980O136R256J447p893p536m07O332Q651J77r603p085L220
1239e179Q262O361k557r914o072N058R545L127m182q921m188P267R381J75p266
1254H97o900q96P135P840j165q369m542J855N446N263j954p193l720L287N100
$$ y = [8167, 10624, 2391, -8141, -8414, 1486, 9230, 8327, -652, -9389, -8031, 3301, 11008, 6321, -3902, -9467, -5771, 4836, 10006, 2704, -6789, -8427, -2257, 5552, 8058, 1107, -7436, -7452, -766, 5069, 5574, -174, -7228, -6260, 696, 4949, 3284, -1359, -6584, -6002, 228, 4592, 2519, -1993, -4988, -5355, -243, 4282, 2254, -2273, -5003, -4601, -188, 4601, 3468, -2217, -4798, -4132, -172, 3866, 4355, -1447, -5131, -3774, 985, 5651, 5372, -1888, -7993, -4163, 3202, 6841, 4829, -2653, -7968, -3031, 5818, 7951, 2226, -4894, -7874, -1738, 7518, 8965, 1072, -6464, -6871, -539, 8112, 8289, -1314, -8399, -5179, 3083, 9444, 6887, -3027, -9099, -4041, 5504, 8631, 4449, -4472, -8660, -1393, 7988, 8163, 897, -6003, -6899, 236, 8076, 6911, -1458, -6000, -4145, 1301, 6564, 4610, -2583, -6303, -3016, 2084]
1269B084L269j654o389l675L721N179J359k614m187k591L875N062k13k800k783
1284b357k088K019M494R80k329k348j619P74M269K523l119l980j228J478M142
1299A611L900l073n889j425K761M574K963l786o545q58N306N170P69m297p040
1314e859n31O749N508j017n345n145K7P847N691l277p454m222K781Q101N063n083
1330C834q799j846N693O830J931o643p923R41P791N417j343o151o062J437P559
1345B666L838k874n730l591J991P589L071m588o418j427K748O153K248m719n399
1360d442L80M250L112Q95m221m628O39M826K441K19l094k974l60L833J812j253
1376A435j407k063j014K819K960j26j926k630k360K386M866J54l320k924m86K607
$$ y = [2084, 5353, 3699, -2690, -6365, -2644, 2535, 3894, 1280, -2907, -5498, -1623, 3439, 3226, 426, -2357, -4445, -2426, 2068, 3048, 719, -1629, -3248, -2474, 1795, 4318, 1199, -2781, -4009, -2531, 1611, 5511, 2438, -3451, -4876, -2115, 2459, 5422, 1636, -4909, -5767, -461, 4709, 5478, 1181, -5859, -6390, 359, 5867, 4850, -495, -5640, -5613, 2234, 7925, 4648, -2806, -7028, -4247, 3854, 8917, 3834, -4965, -6811, -1118, 5712, 7643, 1000, -6923, -5982, 1809, 7226, 5883, -268, -6330, -4893, 2666, 6504, 3630, -2100, -5691, -3700, 3889, 6960, 2372, -4046, -5473, -2725, 3428, 5676, 957, -4442, -4062, 188, 3300, 4195, -26, -4654, -4015, 811, 3252, 3471, 377, -2597, -2957, 876, 2688, 1435, 28, -2035, -3049, -230, 2730, 2604, 678, -1952, -4312, -1926, 2940, 3094, -226, -3150, -3636, -1029]
1392a029M833k78m893l340N25L614M651P30n222m820J250M816L806q57n744n048
1408g006L066P345K716k523o682m077L840Q140J528n175n834j391M805P581M87
1423F820p670n738J185N784N202l63p041m614L280O023K637k147o375l653M007
1438b663O149J777l075m932k660L879O139k60m714l332p1M016M742m98n193k670
1454c366J681J987K733kl000k489J539J961J336K61k411k835M84K108J486Q11
1470B284j202k809o41K666J781J1j517l057n41L088L540p12k408l003j030L367
1486a83M007n88l647k935K74L711M406r28o115l141J828M918L452j748o442k674
1502e805M743M805N55l659n401j203N723N421j811m072l678n60N416M454k296
$$ y = [-1029, 3804, 3526, -1367, -4707, -4182, -568, 4083, 4813, -409, -5229, -3979, 837, 4643, 3786, -1958, -7006, -3940, 3405, 6121, 3598, -3084, -7161, -3321, 4819, 6347, 1172, -4662, -6053, -1248, 6333, 6820, -850, -6588, -5403, 381, 5583, 5220, -1821, -6435, -3155, 2868, 5505, 3358, -3017, -6670, -2663, 3486, 5263, 2188, -2744, -5404, -1525, 4614, 4354, -360, -3692, -3763, 253, 4995, 4497, -696, -3366, -1685, 302, 3035, 3033, 33, -2456, -917, 1044, 2380, 2641, 230, -2605, -2121, -13, 1473, 2284, 1082, -1727, -2368, 298, 2079, 2090, 573, -2484, -3025, 63, 3603, 2891, 483, -2520, -3550, -183, 3824, 3236, -411, -3346, -3072, 639, 5045, 4117, -1998, -5139, -3311, 1607, 5059, 3311, -3131, -5805, -1062, 3743, 4298, 639, -4762, -5965, -242, 5179, 3368, -704, -4382, -4942, 474, 4928, 2632]
1517B632n895k042K345M897L625l474o416r59L983M069R50l132m897l2N048L026
1533C728n22l380l824M00M809K882k401k949j221R80K873J969k282k913k99Q71
1549a279K009J922q12k770o79R21P64J793k77k797j194J687J881J019m2k420k186
1566b460J006K164J268R7j120l417O53L660J695j287l282k689J105N286K163l057
1582A785l775j826J984M580K436m693m884J78L732M795Q94n031n834J233N134
1597G08L325o30m951m252K176O536K217l534m975k572K526O736J973m673m577
1612c967p05L418N468J26n649m145J381M045L946j70m805l802J855M021J861j172
1628A706l178k592J579M553R42j649k482k442J252L652J340k222j477r40O41K495
$$ y = [2632, -3263, -5305, -2960, 1937, 5562, 2088, -4328, -5287, -1304, 2765, 3715, 583, -4314, -4346, 702, 3728, 3206, -174, -3998, -3598, 1211, 4093, 1692, -1257, -2478, -1498, 1375, 3344, 1062, -1851, -2150, -1279, 730, 2652, 1840, -930, -1609, -688, 76, 1869, 1592, -1205, -2399, -712, 1169, 2188, 2146, -274, -2460, -1454, 710, 1978, 2075, 955, -2462, -1809, 1851, 3546, 2259, -1023, -3712, -2607, 2679, 4842, 1785, -1990, -3816, -1832, 2748, 5184, 491, -4393, -4215, -483, 4312, 5206, 175, -5659, -4426, 708, 4033, 3403, -1548, -5800, -3624, 2912, 5129, 1595, -3380, -5952, -3426, 3310, 5283, 610, -3967, -4672, -1254, 4214, 4340, -1309, -5454, -4073, -28, 3918, 3748, -1057, -4859, -3004, 1017, 2878, 1706, -1472, -4064, -2485, 2068, 3010, 1361, -1121, -3563, -2311, 1341, 2681, 459, -1018, -1958, -1317, 1178]
1644A178J700j242k808n29rK156K982n31l149j292K64K053K774o37l631j994J687
1661a028K605K518n52m236l327K211M236J873j750m111k710L650M903M42l511
1676A213m171j670L939N151K46m713l607M64L822M277q78o028l226K690M987K699
1692E195j887n842k811L804M840L81k934m404r03M437M324p40m116k970j26L476
1708b76M147j351m808j489J796K968K347j964m350q53K394K558Q21q24k836j208
1724b928K256K025j73j454j365j270K507K297k8j436j080r81L57K319P27j579
1740A94q83n97M16K219J338j887k314n85P32K731J857j851k900o58J770K684J142
1757C408k549l916J8L612K989j26k907m045N53M738K373j620l741k776J733N533
$$ y = [1178, 2878, 1636, -1172, -1701, -1710, 446, 3428, 2897, -252, -1544, -1280, 773, 3547, 2910, -721, -2715, -1028, 1577, 4095, 3543, -693, -4020, -1809, 2427, 4300, 2550, -1561, -4271, -621, 4282, 4724, 1213, -2958, -4628, -689, 4462, 4708, -5, -3612, -3148, 674, 4951, 4073, -1955, -5181, -2491, 2496, 5195, 3308, -2534, -5345, -1541, 3299, 3680, 746, -3658, -4561, -124, 4200, 3460, -656, -3626, -3752, -276, 3871, 2520, -2288, -3777, -1981, 987, 3334, 1370, -2980, -3833, -1439, 1119, 1940, 1116, -1720, -2928, -672, 1353, 1180, -274, -1639, -2909, -402, 1895, 1867, 431, -649, -1630, -1273, 1046, 1773, 194, -689, -1286, -870, 1349, 2687, 800, -1514, -2099, -1367, 1364, 3221, 1370, -1530, -2188, -418, 2266, 3408, 859, -3057, -3039, 573, 3562, 3436, 529, -3516, -2963, 1775, 4148, 2528, -1213, -3989, -2256, 3277]
1773C277K230l424m615j471K628M601J632l976m930J84M066L976P6m844m453Q41
1789d202O207K140j496l960l422J658N546J690l243l861j640K290N047J783m088
1804D49l710n19K361L616R68l592l090N43L092K119N24k624l674L32L177J936
1820A908n6j735k731K39K852J665l97k069k286p02L163K926n58j976k158j345
1836c260K703L357j90l074k553J04L167L408j3m513k802Q50L220L547m88m486
1852a023l306K169M593J926j350n115k998K895N864J583l247m637k049L744N456
1867D505n7m384m257J98M108M860o00n534l482J512M251L397j427n389k327L069
1883a557M161J472j873m884j763L259M195M28k667k994j043K593M049n71l369
$$ y = [3277, 5507, 2083, -2532, -4003, -1375, 3226, 4858, 882, -4048, -3864, 202, 4178, 4254, -590, -5043, -4202, 2005, 4145, 2649, -1311, -4733, -3075, 2471, 4161, 918, -2943, -4583, -2293, 2754, 4537, 449, -3261, -3780, -1419, 2197, 3165, -427, -3517, -2974, 118, 2237, 2761, 137, -3537, -3205, -28, 1908, 1852, 117, -2614, -2375, 477, 2142, 1745, -324, -2610, -3312, -149, 2777, 2219, 243, -1915, -3260, -557, 2800, 2610, -464, -3017, -2913, 254, 3662, 3649, -864, -3666, -2816, 404, 3951, 3463, -1023, -4329, -2160, 2433, 4359, 3009, -2106, -5104, -2209, 3655, 5238, 1991, -2646, -4695, -951, 4505, 4448, 64, -4193, -3995, 113, 4973, 4373, -1161, -4643, -3131, 1120, 4517, 3090, -2299, -4626, -1557, 2604, 4076, 2203, -2681, -4444, -1185, 3010, 3438, 771, -2223, -3266, -673, 3376, 2805, -564]
1898e64k387J25K402L194k35l466j453J110J617J330N1k851j348J241J813R93
1914A572K87k198j975N35K294Q47j79j226k286P39K665J072r77j454k146oL238
1931H02K061j412k129j747M41L154K279k193l525j088J781L529K073k573m358
1946b905o53K903L137N86k964m206L16M963L035j197l988l492J325N147K392k900
1962A499l768j348K142M384J406l532m239k67L183L764J173l955m399O29M455
$$ y = [-564, -2951, -2826, -424, 2770, 2535, -931, -2384, -1274, 343, 1673, 1724, -1127, -2475, -1234, 579, 1572, 1859, -339, -2314, -1779, 515, 1362, 1183, -43, -2329, -1590, 1075, 2147, 1170, -284, -2430, -2436, 802, 2863, 1451, -678, -2425, -1984, 1170, 3449, 1256, -2269, -3357, -1576, 1953, 4026, 1453, -2905, -3558, -655, 2482, 3068, 104, -4102, -3786, 1177, 4212, 3015, -973, -4465, -3140, 2007, 4399, 1499, -2269, -3617, -1475, 2909, 4315, 783, -3456, -3723, -540, 3224, 4397, 442, -3957, -3328, 1127]
$$ [...]
8191A57
##END NTUPLES=NMR FID
##END=
