##TITLE=1H_CG-1112-5
 DMSO, 8 sc, 
 22.10.2019
##JCAMPDX= 6.0         $$ Bruker NMR JCAMP-DX V2.0
##DATA TYPE= NMR FID
##DATA CLASS= NTUPLES
##ORIGIN= UXNMR, Bruker Analytische Messtechnik GmbH
##OWNER= root
$$ XWIN-NMR		Version 3.5
$$ Tue Oct 22 14:44:11 2019 Russian Standard Time (UT+4h)  she@DPX200
##.OBSERVE FREQUENCY= 200.1315
##.OBSERVE NUCLEUS= ^1H
##.DELAY= (6, 6)
##.ACQUISITION MODE= SIMULTANEOUS
##.ACQUISITION SCHEME= undefined
##.AVERAGES= 8
##.DIGITISER RES= 18
##SPECTROMETER/DATA SYSTEM= spect
##.PULSE SEQUENCE= zg30
##.SOLVENT NAME= CDCl3
##.SHIFT REFERENCE= (INTERNAL, CDCl3, 0, 15.7039)
##AUDIT TRAIL= $$ (NUMBER, WHEN, WHO, WHERE, WHAT)
$$ ##TITLE= Audit trail, XWIN-NMR		Version 3.5
$$ ##JCAMPDX= 5.01
$$ ##ORIGIN= Bruker BioSpin GmbH
$$ ##OWNER= she
$$ F:/spectra/data/she/nmr/H-F/1/audita.txt
$$ ##AUDIT TRAIL=  $$ (NUMBER, WHEN, WHO, WHERE, WHAT)
(   1,<2019-10-22 14:42:10.43 +0400>,<she>,<DPX200>,
      <created by zg, POWCHK disabled, PULCHK disabled
       configuration hash MD5:
       00 E9 B6 7A A2 85 ED C7 34 08 36 98 17 FE 4E 26
       data hash MD5: 16K
       A7 16 3D F8 5C 0C FD 6F B9 31 1C ED 0C CC FA AC>)
$$ ##END=
$$ 
$$ hash MD5
$$ F0 83 C3 9A 61 54 EA B3 CB A4 6F E9 D6 7F 31 30
##$RELAX= 
##$RELAX= 
##$RELAX= 
##$RELAX= 
##$RELAX= 
##$RELAX= 
$$ Bruker specific parameters
$$ --------------------------
##$DU= <F:/spectra>
##$EXPNO= 1
##$NAME= <H-F>
##$PROCNO= 1
##$TYPE= <nmr>
##$USER= <she>
##$AMP= (0..31)
100 100 100 100 100 100 100 100 100 100 100 100 100 100 100 100 100 100 
100 100 100 100 100 100 100 100 100 100 100 100 100 100 
##$AQSEQ= 0
##$AQ_mod= 1
##$AUNM= <au_zg>
##$AUTOPOS= <>
##$BF1= 200.13
##$BF2= 200.13
##$BF3= 200.13
##$BF4= 200.13
##$BF5= 200.13
##$BF6= 200.13
##$BF7= 200.13
##$BF8= 200.13
##$BYTORDA= 1
##$CFDGTYP= 0
##$CFRGTYP= 5
##$CHEMSTR= <none>
##$CNST= (0..31)
1 1 145 1 1 1 1 1 1 1 1 1 1 1 1 1 1 1 1 1 1 1 1 1 1 1 1 1 1 1 1 1 
##$CPDPRG= <>
##$CPDPRG1= <>
##$CPDPRG2= <>
##$CPDPRG3= <>
##$CPDPRG4= <mlev>
##$CPDPRG5= <mlev>
##$CPDPRG6= <mlev>
##$CPDPRG7= <mlev>
##$CPDPRG8= <mlev>
##$CPDPRGB= <>
##$CPDPRGT= <>
##$D= (0..31)
0 1.2 0 0 0 0 0 0 0 0.06 0 0.03 0 0 0 0 0.0002 0 0 0 0 0 0 0 0 0 0 0 0 
0 0 0 
##$DATE= 1571740929
##$DBL= (0..7)
120 120 120 120 120 120 120 120 
##$DBP= (0..7)
150 150 150 150 150 150 150 150 
##$DBP07= 0
##$DBPNAM0= <>
##$DBPNAM1= <>
##$DBPNAM2= <>
##$DBPNAM3= <>
##$DBPNAM4= <>
##$DBPNAM5= <>
##$DBPNAM6= <>
##$DBPNAM7= <>
##$DBPOAL= (0..7)
0.5 0.5 0.5 0.5 0.5 0.5 0.5 0.5 
##$DBPOFFS= (0..7)
0 0 0 0 0 0 0 0 
##$DE= 6
##$DECBNUC= <off>
##$DECIM= 24
##$DECNUC= <off>
##$DECSTAT= 4
##$DIGMOD= 1
##$DIGTYP= 9
##$DL= (0..7)
0 120 120 120 120 120 120 120 
##$DP= (0..7)
150 150 150 150 150 150 150 150 
##$DP07= 0
##$DPNAME0= <>
##$DPNAME1= <>
##$DPNAME2= <>
##$DPNAME3= <>
##$DPNAME4= <>
##$DPNAME5= <>
##$DPNAME6= <>
##$DPNAME7= <>
##$DPOAL= (0..7)
0.5 0.5 0.5 0.5 0.5 0.5 0.5 0.5 
##$DPOFFS= (0..7)
0 0 0 0 0 0 0 0 
##$DQDMODE= 0
##$DR= 18
##$DS= 0
##$DSLIST= <SSSSSSSSSSSSSSS>
$$ [...]
##$SUBNAM2= <"">
##$SUBNAM3= <"">
##$SUBNAM4= <"">
##$SUBNAM5= <"">
##$SUBNAM6= <"">
##$SUBNAM7= <"">
##$SUBNAM8= <"">
##$SUBNAM9= <"">
##$SW= 24.0689530833862
##$SWIBOX= (0..15)
0 0 2 0 0 0 0 0 0 0 0 0 0 0 0 0 
##$SW_h= 4816.95568400771
##$TD= 16384
##$TD0= 1
##$TE= 0
##$TE2= 300
##$TE3= 300
##$TEG= 300
##$TL= (0..7)
0 120 120 120 120 120 120 120 
##$TP= (0..7)
150 150 150 150 150 150 150 150 
##$TP07= 0
##$TPNAME0= <>
##$TPNAME1= <>
##$TPNAME2= <>
##$TPNAME3= <>
##$TPNAME4= <>
##$TPNAME5= <>
##$TPNAME6= <>
##$TPNAME7= <>
##$TPOAL= (0..7)
0.5 0.5 0.5 0.5 0.5 0.5 0.5 0.5 
##$TPOFFS= (0..7)
0 0 0 0 0 0 0 0 
##$TUNHIN= 0
##$TUNHOUT= 0
##$TUNXOUT= 0
##$USERA1= <user>
##$USERA2= <user>
##$USERA3= <user>
##$USERA4= <user>
##$USERA5= <user>
##$V9= 5
##$VALIST= <valist>
##$VCLIST= <CCCCCCCCCCCCCCC>
##$VD= 0
##$VDLIST= <DDDDDDDDDDDDDDD>
##$VPLIST= <PPPPPPPPPPPPPPP>
##$VTLIST= <TTTTTTTTTTTTTTT>
##$WBST= 1024
##$WBSW= 4
##$XGAIN= (0..3)
0 0 0 0 
##$XL= 0
##$YL= 0
##$YMAX_a= 52460
##$YMIN_a= -79203
##$ZGOPTNS= <>
##$ZL1= 120
##$ZL2= 120
##$ZL3= 120
##$ZL4= 120
##$ABSF1= 10
##$ABSF2= 0
##$ABSG= 5
##$ABSL= 3
##$ALPHA= 0
##$AQORDER= 0
##$ASSFAC= 0
##$ASSFACI= 0
##$ASSFACX= 0
##$ASSWID= 0
##$AUNMP= <proc_1d>
##$AZFE= 0.1
##$AZFW= 0.1
##$BCFW= 1
##$BC_mod= 2
##$BYTORDP= 1
##$COROFFS= 0
##$CY= 11.3945322036743
##$DATMOD= 1
##$DC= 2
##$DFILT= <>
##$DTYPP= 0
##$F1P= 20.1720416913024
##$F2P= 0.152960286110954
##$FCOR= 0.5
##$FTSIZE= 0
##$FT_mod= 4
##$GAMMA= 1
##$GB= 0.15
##$INTBC= 1
##$INTSCL= 1
##$ISEN= 128
##$LB= 0.24
##$LEV0= 0
##$LPBIN= 0
##$MAXI= 10000
##$MC2= 0
##$MEAN= 0
##$ME_mod= 0
##$MI= 1.114404
##$NCOEF= 0
##$NC_proc= 0
##$NLEV= 6
##$NOISF1= 3.799351
##$NOISF2= 2.8
##$NSP= 1
##$NTH_PI= 0
##$NZP= 0
##$OFFSET= 15.70392
##$PC= 1
##$PHC0= -9575.668
##$PHC1= 20.80086
##$PH_mod= 1
##$PKNL= yes
##$PPARMOD= 0
##$PSCAL= 0
##$PSIGN= 0
##$REVERSE= no
##$SF= 200.130013532006
##$SI= 16384
##$SIGF1= 3
##$SIGF2= 2
##$SINO= 400
##$SIOLD= 16384
##$SREGLST= <1H.CDCl3>
##$SSB= 0
##$STSI= 0
##$STSR= 0
##$SW_p= 3612.71676300578
##$SYMM= 0
##$S_DEV= 0
##$TDeff= 0
##$TDoff= 0
##$TI= <>
##$TILT= no
##$TM1= 0
##$TM2= 0
##$TOPLEV= 0
##$USERP1= <user>
##$USERP2= <user>
##$USERP3= <user>
##$USERP4= <user>
##$USERP5= <user>
##$WDW= 1
##$XDIM= 8192
##$YMAX_p= 0
##$YMIN_p= 0
$$ End of Bruker specific parameters
$$ ---------------------------------
##NTUPLES= NMR FID
##VAR_NAME=  TIME,          FID/REAL,        FID/IMAG
##SYMBOL=    X,             R,               I
##VAR_TYPE=  INDEPENDENT,   DEPENDENT,       DEPENDENT
##VAR_FORM=  AFFN,          ASDF,            ASDF
##VAR_DIM=   8192,          8192,            8192
##UNITS=     SECONDS,       ARBITRARY UNITS, ARBITRARY UNITS
##FACTOR=    0.0002076,     1,               1
##FIRST=     0,             0,               0
##LAST=      1.7004516,     0,               0
##MIN=       0,             -79203,          0
##MAX=       1.7004516,     52460,           0
$$ Real data points
##PAGE= N=1
##DATA TABLE= (X++(R..R)), XYDATA
0@%%%%%%%%%%Qj6J6j6J6k3L1l3M0m8N6o6P6q9J04j20J36j54J74j98K24k49K79
33A48l15L53l93M38m88N41n99O64p35Q13r00R98j107J229j367J525j707J920k174
52a156K482k868L361m018M952o392Q931j4746N4663K771p8174M116L4052M2802
66E0776q928l6121k6781K4130L5797J3587k3780l2669k1995Q154J9303J3488p75
79A4186o703j3269k17J4502J0085j3088k1502j0693J1715K5847J4098j3413j7551
92f003Q8J2385M378j0420j3803J595J7575J0059o956q032J328M346k581j0703
106f744r657P811J8651M159j3187r879K569Q815J774j2150j3713K150J5673J1673
120G945O57p657j0176l164M113L924N75q16m712j129J2460J5403M72j6745j7109
$$ y = [0, 0, 0, 0, 0, 0, 0, 0, 0, 0, 0, 8, -8, 8, -8, 8, -15, 16, -17, 23, -25, 31, -35, 41, -48, 56, -64, 72, -82, 92, -106, 118, -131, 148, -167, 186, -207, 231, -257, 284, -315, 349, -386, 427, -473, 525, -582, 647, -720, 805, -902, 1018, -1156, 1326, -1542, 1819, -2199, 2753, -3639, 5292, -9454, 45209, 47980, -30194, -26078, 7974, 50776, 41848, 5727, -21054, 3076, 38873, 52460, 28680, -3989, -25984, -17830, 1473, 14961, 14186, 7483, -5786, -6003, 8499, 18584, 5496, -16006, -26699, -14984, 10863, 24961, 11548, -6003, -5915, 6470, 10848, 428, -13375, -11780, 5795, 15854, 8898, 866, 2194, 6540, 3959, -6744, -16401, -8590, 10061, 14220, 1033, -8846, -6277, 2538, 4312, -7838, -21551, -19401, -3728, 7945, 8602, 945, -9231, -12395, -8282, -4358, -3783, -4599, -9311, -10440, 2020, 17423, 17895, 1150, -15959]
135a5959j693J7960J8121m968j9436n285J6164J8710j390k3549k0888O558K2433
148F778J0374r432j3629k130J0916J0428o669j6107o777N777R580O930M6o552
162d67m448M97L035K639j710p291l925Q200J2476M361p884j2891m323J0884R646
177H799n177j1643j364J1153J2100r61j3571j1263L606R511J620n945m570L528
191d177P808J870p046o663j96J557L29O02J262K320K809p63l789j643O80j067
207f107o86K132K826K412L14m93N62J469k621o463j409O929P261J154n929o203
223d852L268Q419J220j0086q740J714J1460R144l373j1746n121N930P051J88p255
238b779o594J936R510N879j831o207o151n84N528N647p41m767l353K446Q022N142
$$ y = [-15959, -17652, 308, 18429, 13461, -5975, -11260, 4904, 23614, 22224, -1325, -22213, -15655, 6778, 17152, 7720, -5909, -8039, 2877, 13305, 6636, -9471, -16248, -10471, -891, 6039, 6085, -467, -4915, -4418, -1383, 1256, -454, -7745, -11670, -3470, 9006, 13367, 5483, -7408, -11731, -847, 8799, 3622, -8021, -9385, 1768, 13868, 12907, -664, -11927, -8321, 1190, 2810, -3135, -7705, -4177, 3631, 5501, -1545, -8208, -8404, -6847, -6518, -5916, -4654, -2334, 475, -288, -4077, -5720, -5040, -6107, -6793, -4661, -1835, 577, 891, 398, 960, 2429, -192, -6655, -8064, -1135, 6126, 7280, 1351, -4852, -1584, 6835, 8055, -2031, -10771, -9057, 2403, 11547, 8174, -3572, -8693, -2763, 4288, 4476, -2779, -9373, -7437, 2073, 7952, 6121, -86, -6237, -6821, -1293, 4354, 3613, -1154, -4507, -2061, 5961, 11103]
254A1103m467j1037m292O024R579K899o186p223K457P555K910n368p881k974N769
269a132O622j92m039j609J235Q06j281k264j492J164J806N4M72J466J34j139k023
286a412j282Q7J572J095M13J605N73j898j059L74J331k40k235j823K174N393K460
303G128m026n791j461L901M884j742o320k119N046O113K26n731o063l36N432L535
319B676j973l165j033K143L608Q88l003l940j236J669L580L375j335l545p32K186
335A63L064j65m408l688J800N802L186k804m270j683L031L533j524m978j658L209
351a390M428J063l071l835n7L068M57j626j601J19J921K313L91k078j417k86j37
368a738J072J435n55o87M65J372J365n35k767j641J108K738M08q13j423M44K475
$$ y = [11103, 6636, -4401, -8693, -2669, 6910, 9809, 3623, -3600, -1143, 6412, 9322, 3954, -3927, -6901, -1132, 5490, 5298, 1259, -350, 885, 1691, 410, -1854, -3346, -2182, -376, -322, 150, 1616, 1750, 611, -1412, -2694, -2607, -1035, 60, 473, 2078, 2651, 753, -306, 68, 1399, 1159, -1076, -2899, -725, 4668, 7128, 3102, -2689, -4150, -249, 4635, 2893, -3427, -5546, -500, 5613, 5839, 108, -5955, -6291, -859, 2676, 703, -2462, -3495, -1352, 2256, 3144, 141, -3799, -5035, -3366, 214, 3589, 2254, -1291, -2023, 163, 3227, 3062, -1346, -5034, -3234, 2568, 5754, 2950, -1320, -3003, 28, 3561, 2037, -2941, -4599, -1390, 3038, 4101, 1030, -2805, -2862, 206, 663, -963, -2564, -2445, -524, 1789, 2180, 102, -1315, -1601, -1738, -666, 769, 214, -473, -8, 1364, 2729, 2194, -573, -2214, -1106, 1632, 2040, 1227, -196, 248, 2723]
385B723O65k881l327N99K342J697m91k074q41K226J908j810l085j103J812K822
401A182N56j784j615R90J350K78p40j903r16J621K155J535j023j553j590M53K490
418A486P04j910k346m5K130M080l13m199l296J235L298J720j998l116m65L383
434C48K926q35l230k601O14K486J909r09j584n48J539Q10N65j046j506p42J445
451c59J223J144l6j765O6J008K95r01r82m11R72J699K13j311q64O88O30j23j526
470c40r54O49K098O91j786j028N20Q24N33p89k096j02K214J460j40j224j332J07
488f95J093P71n53r76o14M60K139J128j620j981o08O36J787Q33j645j489l3K043
506F76J584j001k611j899J255L072K64j593j712L01J271J689j327j823j037J278
$$ y = [2723, 3388, 507, -2820, -2221, 121, 1818, 1327, -747, -1588, 638, 2546, 736, -2349, -3452, -1640, 1182, 1738, -46, -1661, -671, 679, 957, 217, -1686, -2602, -981, 1174, 2709, 1686, 133, -1457, -1004, 1486, 2190, 280, -2066, -2111, 19, 4099, 3786, -413, -3709, -2474, 824, 2544, 546, -2570, -3035, 348, 3274, 2439, -791, -3392, -2778, -292, 1617, 708, -876, -1424, 115, 925, 1490, 444, -1062, -1804, -359, 864, 2008, 1972, 207, 273, 1281, 1576, 675, -307, -718, 254, 1953, 2166, 855, -9, 679, 1309, 1186, -340, -1294, -645, 1453, 2144, 358, -670, -150, 674, 1207, 418, -1678, -1780, 434, 1894, 1754, 530, -802, -695, 398, 1169, 616, -360, -974, -514, 1625, 2753, 1133, -848, -1456, -820, 967, 1800, 155, -1334, -1367, 676, 2260, 1259, -1352, -3251, -1996, 1076, 1340, -253, -1965, -1664, -393, 1296, -31, -1854, -2891, -1613]
522a613J537P29m62j030o37J110P70n38l07p59J68J114R67k72r54m93J49Q05K02
541D86j425m85Q61J152N42n56j368m44J129P51k90j307l9R04J439Q6j789j181
559a534M94J061P50m26j070K58R61Q60m31q46j188N81P68Q62l27r44J18K59N89
578G95M51n94j814j37J135J358l60q94j027K79J661M40j555j140j01J267J199
595I63p3j354j290Q36J383K27q54j634J0J814R13m9j088j061J29R76O06m15q79
614h40j25P63J037J96r40r38m07J137O38J01q98q60Q95R96M8q23r49L3O46P28
634D38Qj167K57K59J124o53n43k78J98J204k62l62j14L16K08N10n34r23J46M42
654B74N49R5k87n44q9M94N09k03q62n39O79J308P8r25r68n4R15M19J02j252r91
$$ y = [-1613, -76, 653, 191, -839, -1476, -366, 404, -134, -441, -1200, -1032, 82, 1049, 777, -177, -670, -521, 284, 486, -939, -1424, -563, 589, 1131, 575, -793, -1237, -108, 643, 353, -954, -993, -89, 1350, 1436, -353, -1534, -1040, 21, 771, 345, -725, -467, 494, 1354, 923, 77, -1111, -530, 238, 1100, 773, -171, -53, 206, 795, 1246, 652, -1162, -1299, -164, 1194, 834, -60, -1087, -808, 853, 1293, -262, -1402, -1503, -236, 963, 890, -464, -1754, -918, 465, 692, -162, -1796, -1786, 28, 941, 892, -196, -1257, -1128, -152, 454, 39, -840, -965, -202, 835, 1031, 91, -847, -1254, -117, 521, 622, -276, -1136, -241, 755, 803, -20, -969, -936, -290, 438, 446, -721, -464, -205, 919, 266, -277, -555, -357, 847, 585, 223, 109, 425, 633, 1143, 609, -314, -168, 274, 823, 918, 631, 87, -2, 492, 1001, 798, -64, -603, 76, 1384, 1462, 537, -431, -485, 430, 849, 951, -301, -1292]
675a292J042J196M17q02j041r76J042J093L81j249n93J25J125J049r06j069m93
692i51O55P12O97p42j064K32L50J108o50m69p94K52O83Q60n80p54k27J17Q64L2
712C31o31p33N54M32K50K3p17n6J15O76k45n60M23J05M57k69j84n41J75O61J41
733D07l36k68K1N51M26n11n59N5J29M13N6j77o33k71R05R62k92j028r19M21P55
754A07M45q4q94Q1J53J047o0j087n13j46R06J093l80j048j89N91N06l1m16o73
774e92r0O13R57j63m68q85L48P37m1n90n15p4N28N84M32j076o26K53Q67K40j57
795B82j044j56O45N66K42j090j79J23Q26j85j68l55r9N18N57k47m28k82L65P6
815c3K15J22l24j04P3L52J07p50l17N40R3K86k63n10K13N22L0l06k24k89J56Q47
$$ y = [-1292, -250, 946, 1363, 561, -480, -1456, -414, 679, 1060, -189, -782, -657, 468, 1517, 611, -458, -951, -296, 416, 1113, 371, -693, -461, -111, 997, 347, -122, -916, -664, 19, 879, 299, -455, -682, -565, 299, 331, -300, -1033, -479, -47, 203, 226, -491, -547, -432, 244, -1, -561, -138, -33, 424, 155, -29, -570, -395, 266, 407, 71, -197, -176, 375, 801, 290, -269, -214, -85, 328, 384, 207, -426, -697, 208, 1170, 878, -150, -1069, -648, 107, 552, 468, -426, -345, -192, 855, 795, -292, -805, -951, -45, 1048, 668, -380, -569, 22, 528, 497, 81, -592, -682, -69, 888, 725, 257, -628, -280, 457, 416, -174, -689, -763, -235, 349, 781, -295, -921, -668, 199, 439, 282, -762, -918, -273, 293, 535, -555, -734, -611, 215, 30, -138, -493, -592, -74, 483, 236, -192, -474, -109, -33, 182, 304, -20, -124, -51, 301, 408, -342, -659, -119, -26, 260, -3, -513, -300, 222, 252, -54, -278, -567, -411, 436]
837D36K10o00l86M30P2M01j78q11m6P8P58M35k89j234L87O30N08m68l93n89M34
858b15O86N76n30j084j25L47R67P6n39p03P3N77N68n22l54n86K41J036l4k53m89
879b87l11O90N83k03m81q90O33L65M67n01k98j21N27K16K0q5o81K61K41N01m55
900A91l84K36k09K03J10m12M6L63N1J98m70m82K99L87j71L7l78J19K45N58n09
921B8m70j35M56N06k93j98m72K27L88O19l07o38NJ9N19K57l62n59l21O19P42j30
943E00k93q64JP20N01j37m59q33P05P38%p76m90M93j9Q83p2m78n54L07N89J55
965F17l65l26l15K66P57m44k42k15J59J03L43k70l8k8P6L49o3k96l39K04L79M49
987G61p11k05l4M12J56k70m94L14n4J55K25o05L28j51K12K74l20q2m07L19M39
$$ y = [436, 646, 46, -340, 90, 162, 563, 385, -426, -472, -394, 364, 799, 510, -724, -337, 293, 801, 333, -60, -649, -215, 471, 1047, 517, -567, -692, -345, 622, 698, 159, -544, -471, 106, 674, 152, -202, -788, -547, 489, 455, 202, -287, -598, 92, 675, 472, -9, -899, -266, 99, 566, 65, -233, -354, 173, 389, 409, 324, -357, -96, 145, 646, 191, -193, 43, -166, 37, 147, -265, -219, 144, 195, 393, -77, -559, -260, 127, -44, -7, -385, -266, -21, 537, 28, -442, -577, -121, 385, 92, -106, -578, -351, 37, 656, 349, -289, -284, -265, 254, 511, 149, -410, -731, -112, 630, 500, 207, -657, -656, 64, 565, 428, -31, -864, -159, 579, 579, -197, -687, -194, -213, 670, 598, 120, -434, -127, 462, 617, 252, -74, -389, -123, 634, 190, -52, -267, -108, -5, 338, 68, 30, 2, 78, 427, 364, 68, -271, -67, 312, 761, 50, -155, -189, 223, 379, 109, -385, -71, -125, 30, 255, -350, -22, -173, 39, 313, -7, -89, -496, -177, 262]
1008B62k69j75j12q6K40L00n3m19k10O09J37K10m86l37J00L05J43J08m04l35K59
1029b13M87J56m47m29j07O76L54k29n15j82K74L62Q5j19r5l96L68J35R7j38m93
1050c69J59K14Q6K75l56m14N25qM33m44m87k43O24L29k50m03K46j26K61L05r7
1071B60l17k46N50j7o9j04m64K58L73K60l14k50P7KK94k51nl43M22k8J17k82k36
1094c13L22J17K1j24j39l73M34M7k13J47k11K61J03J65l43k97NM82J31N0n56k92
1116e76K26K02L66l12o6j58K71N2r4J15m57J08K39L81l49j01k87O44r0ko8k57
1138b13L61N2m9J22l13l34L45L8M55m72j46j1J46K80j85k8k94O6M41j14m4k11
1160a08J4J21M06m26j78K33k93L6K22k37L30l93M99k29L26l92k7p5K29J10k23
$$ y = [262, -7, -182, -294, -380, -140, 160, 107, -312, -522, 87, 224, 434, -52, -389, -289, 16, 159, 267, -137, -472, -213, 274, 430, -17, -446, -553, 123, 477, 248, -267, -449, -175, 187, 272, 153, 58, -338, 30, 165, 262, 124, -369, -210, 4, 90, 365, 9, -405, 120, 112, 545, 101, -386, -629, -5, 324, 74, -329, -83, -209, 52, 357, 260, -57, -303, 247, 230, 161, 57, -407, -149, 224, 484, 170, -80, -3, -1, 293, 42, 37, -306, 116, 88, 205, -77, -313, 9, 126, 147, 23, -116, -489, -55, -8, -221, -74, -285, -24, 79, 244, -99, -396, -391, 91, 222, 272, -284, -576, -350, -148, 218, -94, -160, -318, -47, 5, -89, 26, -431, -323, -84, 297, -52, -153, -440, 204, 114, 112, 44, -213, 148, 200, 151, 273, -40, -374, -29, 9, 464, -8, -154, -165, -19, 261, 76, 48, -246, -180, 261, 147, 103, -108, -94, 27, 433, 7, -171, 62, -231, -195, 27, -210, 120, -273, 226, -3, 323, -69, -96, -171, 58, 168, -55]
1181e5p1M0J89J5n7o4l50N39j34p3j17q2k16K92L6J78j46k61J37L53K91p18l0
1204c04K02J85p6O4j18p8l7K66m02L95l18j09L39P6k27J18J10K8J56L7k80p2P4
1227B9j2J83J29m30o3L87k47J74P8j99l27K02L09n9j47q4P5L4K66n9l25r9M44
1250B59j96K90k81j18j23l6N86m72L9q9j01M26k88K92j14Lj88K94k9k17J21k8
1272C0J4l1o7k58K73k8J33j33mL2j1J46J37n32K93J50J27j27n7no14O53J17j89
1296D9j98k55N38nQ0J1J1m23N8J98Q7M6j36q8J20K45k69J22l09qJ68L51m85k12
1320c04K43Q1J60J08j72k12j00K85L82k28l67j47K18J47l1J20j64j18L11m67J78
1341g7k14L47k13K92m1J19k69r5M76k92J60n19J22K24N8k75M29p1k29k5L66p1
$$ y = [-55, -126, -86, 103, 118, 61, -3, -353, 186, 52, -21, -138, -220, -436, -144, -108, 70, -76, -337, -200, 153, 444, -274, -304, -102, 83, 7, 71, -47, -125, -162, 104, -298, 97, -221, -330, 9, 85, -142, -24, 86, 114, 270, 307, 27, -45, 29, 17, 200, 329, -101, -164, 223, -24, 150, 228, 29, -298, -96, 213, 154, 7, -77, -2, 32, 298, 239, -86, -185, 259, 63, 353, 72, -46, -169, -205, 381, -91, -52, -141, -242, 184, -104, 188, 74, 77, -111, 183, 154, -63, 58, 30, 44, 13, -54, -312, -39, -67, 66, -67, -71, -39, -50, 96, 233, -299, -6, 144, 271, 144, 87, 82, -532, 121, 238, 49, -149, -404, 134, 129, 209, 220, 231, -192, -134, 64, 151, 197, 61, -27, 93, 338, 69, 191, -118, -126, 42, 393, -92, -304, -61, 20, 180, 288, 116, -96, -196, 89, 471, 243, -124, -271, -53, 94, 63, 183, 19, -99, 212, -255, -77, -291, 56, -157, 135, 94, 213, -56, -151, 325, 33, 193, -326, -204, 20, 78, -197, 232, 161, -68, -93, 273, 202]
1363B02k31o0K86l65J34p5N6K88Q7J0k12k90j43M23J42J6l61N8j50K11R9j54K61
1386B32j80k37L43l76J72o3Q6J30j98j2R4k78J60J24M3m4p1L64n67K23K99k69
1408b5N1Lj90M06l77M0O7L8J59l32n4K74Q8K06R0n20J40J32J3j11m3O1k78J01
1432f1K25n6k14k0r8J12R1J38k69M9J70j3J47N8l02j59N06k87R0k9k98L6J62J31
1456A09q9K6k39k8L28k92j38L35J68j56p3k35K04J8L4P4o2j22L35o3l69N46j3
1479B98m33J23P2j11j63J77oM13o81L01m1k5k28N23m11J5M74k81o6K6J80K5j04
1502G7k29K08J26j17J44k76J35j09K52n92K35O0M04m46Q1Q7j56O7jQO8M2j39r
1526h0P4k05J30p0M05k62K31l3j29J9m17L37l9L5OJ4J90j08K14l11k12J48l7K10
$$ y = [202, -29, -89, 197, -168, -34, -109, -53, 235, 322, 332, 120, -170, -313, 110, 252, 268, -93, -35, -185, 26, 125, -29, 232, 52, -185, 158, -218, -46, -109, -23, 107, -91, -103, -9, -287, -127, -3, 40, -4, -75, 289, -278, -55, 244, -25, 26, 29, -161, 245, -132, -92, -25, 13, 172, -160, -214, 60, 148, 354, 444, -76, 64, 196, 209, 98, 55, 116, -162, -61, 164, 108, -106, -126, -224, -112, -21, 117, -152, -103, 67, 54, 201, 259, -43, -202, 304, 17, 107, 78, -220, -184, -22, 109, 20, 46, -193, -221, 107, -185, -323, 12, 180, 24, -49, -284, -80, -62, -28, 46, -16, -138, 197, 134, -235, 311, 298, -135, -12, 60, -51, -214, -37, -43, 370, -311, -10, -51, -76, -304, 219, -192, -177, 297, 16, -50, -24, 156, 181, 77, -152, 56, 182, 65, 209, -67, 68, -41, 211, -381, -146, -86, 318, -128, -47, 40, -116, -49, -50, -42, 26, 68, -71, -80, -6, -211, -81, -151, 254, -8, 223, 190, 61, 80, -337, 0, -39, -4, 2, 16, 206, 98, 312, 1, -211, -63, -100, 110]
1550A10LJ4j71r1J50M4j09j71L84L2r4P9p2j40J67k36Q0L81l88K8J41o8q6j01
1574a14l0jR0j77M10l2k79K19k58M33k68K71l71l0K49o2PR3j15k58P3K69k08Q9
1598@m1M37l55J11l50J49j92J9j7J45J53j8j72N4j51k7J31k9K73L2j6k41O1P0
1622B6K35k29N6j54J51K96q1O2k14n6nj19l05L42l07L71m2j65J96j29M0RJ76o4
1646I0K02m12N0k79J56J12J33J73l15P8j15N7M5k69K93J96l00Q0k7J5J93M6k06
1669dn8J27j45K63k52m7K40k47K77j21j7K10j24j9k16K16j51K19KPp8k52L60l70
1693a80J95Pj25j13M38k95r6L52o1k04K17K00l63j02N7K18r3j4J46l52K66j37
1715c9Mqj52L93j87j00P9k10K54K98n45J11J68o6n2N8o3K99l44J13r7J06J63j31
$$ y = [110, 113, 127, -44, -135, 15, 59, -50, -221, 163, 195, 101, 180, 108, -32, 135, -101, -21, 360, -28, 0, 141, 73, -13, -114, -144, -145, -55, -232, 178, 146, -133, 86, -172, 261, -7, 264, -107, -137, 112, 50, 57, 150, 35, -223, -150, 119, -89, 0, -41, 396, 41, 152, -198, -49, -241, -222, -239, -94, 59, 41, -131, -77, -228, -255, -124, -153, 120, 152, 136, -105, -44, 26, 261, 32, 88, -66, 85, 381, 300, 362, 148, 92, 87, -32, -337, 5, -302, 69, 27, -138, 58, -71, -31, -22, 154, 90, 292, -120, -70, -349, -193, -81, 52, 225, -90, -12, -127, -70, -25, -294, -1, 195, -105, -25, -52, -37, 156, 202, -4, -62, 65, -80, 183, -69, -116, 124, -123, 154, 33, 16, 226, 102, 83, -133, 83, -68, 151, 153, 160, 82, -170, 190, -180, 15, 22, -103, -216, 222, -73, -169, 183, 122, -82, 135, 335, -28, -130, -73, 145, 52, 38, 184, -168, 98, -39, -35, -43, -195, 198, 11, -89, -10, -220, 34, 332, -213, -102, 66, 0, -52, 6, -57, 242, -102, 11, -86, 20, 183, 52]
1739E2J75j55j95k4K88l81J2K65o3m0L19l51J62l53K68L4q3j69P1K1NLL72k38
1763eN2k16L37j97K01j95k36M02m9k38J50Jj62J34OL49l89J82m85M81M4j04L6
1786I9M6L4l31q1Q4L82n2k73M05m56R8K81k50L0m6j31N15l55P2O6K8k00p9K85
1810A71j08k22K96k57O0k23K37K15j15L14k75M2Kl97M15j48o8M6j71rK48J30k86
1833a03J88qq8P0K2j98J32J00J82p3L5m13j21K44n5Q1k48L12j3j16K36mJ5r0n23
1858d36O25o5j20l27K51K04j98K42k52O8L84m05K06l43R0k4K82p2m32N28k84L22
1880B44j90J54l85J90k66K36J43rl4RP7K3n16N58m57J13K47p0j18j81J16M08l4
1903B58l21O9Q8j21j09K74N5l56J91k03L41j19Q4j73k3J57j50R4R6k20J02j25
$$ y = [52, 227, 72, -123, -147, 141, -240, -228, 37, -26, -66, 253, -98, 64, -289, -21, 13, -70, -239, -168, -147, -142, -139, 233, -5, 47, -169, 168, -29, 172, -23, -259, 143, 94, -144, 6, 7, -155, -21, -15, 334, -55, 127, -358, 123, 167, 63, 99, 145, 179, -152, -233, -149, 233, 181, -92, 313, -143, -45, 236, -14, 16, -30, -161, 354, -1, 71, 137, 165, -35, -114, 171, 63, -159, 137, -120, -60, -283, -46, 169, 54, 368, 93, 135, 137, -260, 155, 7, -61, -15, -186, -195, 53, 183, -103, 85, 77, -11, 59, 81, -117, 15, 115, 297, 224, 259, -154, -275, -31, -86, -5, -253, 59, 46, -70, 166, 162, 177, 87, -436, 189, 124, 4, -323, -72, 132, -66, 176, -76, -8, 376, -29, 177, -166, -76, -100, 182, 110, -322, 206, -78, 244, 54, 208, -177, 13, -253, -17, 126, 117, 83, 92, 169, 192, -324, 234, -223, -110, 137, 67, -51, -232, -116, 292, 258, -63, 6, 94, -27, -136, 138, 193, -163, 28, -175, 166, 47, 131, -42, -65, 92, -58, 36, 132, -88, 14, -111]
1925a11P9J78k64L35k56J56j63M12k88k40J38L28k39o2l5J37L4j01j37O2l21J41
1947b17J39k31P05n51L4J4K59j55J42j49j26QL54l04j31P7n5K35J5j18K23j10
1969E8l19L07k05K93j32l27J04J44j47M41N7j79k4j27k0k9J33J04N6j90l58M44
1991H4qo5J92j61R2J01j62j77l2K13j47K75k57k8K86k27R2J85J59m19LK24k65
2014d2j14K23j5k53J53K46j13qj05L51l93L2J89m62M92j34Q2M0j65j34J53o5q6
2037a28K26OJ9K08j44p5k08J25j42K49k2O3k6j06k2j85J16J02k89K8K20J01j3
2060A03k46L81j33j84m3J68q7N9N4j63K78L1k81K89m19K46k66Q1J05j1Q4j75L72
2083B43k32J07K8J8o7k67J77r4j40L02J03j50L1Mk93K60J80l70K20j09l47J39
$$ y = [-111, -32, 146, -118, 217, -39, 117, -46, 366, 78, -162, -24, 304, 65, 3, -32, 105, 139, 38, -99, -37, -358, -217, -78, -309, 396, -155, -121, -107, 152, -3, 139, -10, -136, -128, 226, -78, -209, -132, -187, 48, 63, -55, 168, 58, -261, 46, -159, 134, 2, -325, -221, -77, -224, 217, 274, 95, 71, -56, -76, -105, 28, 132, 188, -2, -360, 84, 76, 11, 203, 42, 134, 235, 73, -104, -136, 77, -70, 205, -52, -80, 206, -21, 71, 256, 415, -4, -1, 223, -42, -156, 67, 52, -201, -48, 198, 85, 77, -28, 323, -70, -38, 151, -311, 181, 47, 129, 169, 4, -130, 23, -42, -128, 98, 104, 123, 331, 187, 112, -96, 29, -113, 136, 114, 177, 151, 45, 23, -162, -46, 56, -233, -205, 15, 116, 103, -143, 238, 105, -79, -122, 46, -41, 18, 72, -91, 187, 218, -63, 226, -193, 53, -213, -132, -27, -38, 46, -129, 243, 11, 118, 146, 164, 97, -170, 7, -87, -227, 75, 178, 28, 59, 63, -230, 30, 210, -160, 60, -49, -396, -257]
2105b57K58N4K29k08k34J04p6M73k20Nl6j48N4p5k9J19J25j97j6k2K40p3j55J84
2129I9k40K49k21M5j35J88lj6M0q2n0K77l7j06M7O2j50K18l8k46P1P7l0lQ8j93
2155h9qJ8O7J33k09J71k3k0M52l32j70l8K93m43N6K39l12P6J61n24O70j75k70
2178b77J79K35k59K60k94lJ61J10l01L78k57n2j15J44J5%J32k6j12qK22p5N5m8
2202F4n1j17J06o4m9J97k05R7Q7J69j60l67L4N7J22j7J40L4j51N7K01j38j01J67
2226A12j58r6J23L54l79l46L64J61k37J23n1j62K58r4J25l39M71l55K06J10j10
2247H0j1q1J9j11O4p5qL17ONj39n02M96m85O00l07q0L82j83oJ11k9m65L45J42
2272H5j31J82k74m0N8j81K29r8K14l35L88j31j2oKm9K45O4k46r6K4L31l98O2m9
$$ y = [-257, 1, 55, 284, 76, -158, -54, -130, 343, 123, 128, 92, -56, -2, -77, -106, 13, 138, -59, -75, -97, 143, 70, -85, 99, -141, 108, -113, -68, -203, -15, -18, -34, 6, -76, -126, 151, 114, 8, 55, 117, -33, 185, 147, -99, -28, 49, 19, 16, 104, -89, -97, -79, -12, 121, -88, 83, 60, 40, 492, 160, -10, -48, 245, -198, -142, 97, -215, -139, 22, -502, 168, -7, -277, -98, 137, -122, 138, -156, -159, 2, 112, -189, 189, -68, -120, -235, -91, -76, -76, 56, 30, -82, -90, 132, 57, 112, 64, 13, -104, 2, -62, -111, 86, -119, -22, 65, 234, 74, -293, -259, -202, -80, -97, 43, 77, -74, -17, 184, 46, -55, 112, -46, -142, -19, 335, -44, -390, -26, 135, -102, 21, -30, -192, 66, -28, 97, -242, 229, -126, 80, 190, 80, 69, -12, 7, -104, -40, -115, -123, 194, 200, 205, 66, -436, 60, -425, 175, -132, -212, 170, -13, -19, 92, 63, -402, -57, 85, -46, 136, -138, -178, -120, -301, -72, -170, 44, -291, 97, -34, -46, -52, -50, -99, 146, 210, -36, -132, -108, 223, -175, -113, -162]
2297a62J67r2L54j27j62p2mR5J33l15J85j10J37n4J45j33m00L50K25j58j17LR4
2320a8o0R0J84k32j17O4j41L54j42Q8j43n2J43l22J60K2Q9k10J84p9m7M01l33
2343a17K80k4l54P4j07L96l24K14j76P3p4j94K64K99l21J5o0O9J91l06K59j67
2365i0L8J6P0n8l87N45m30M47k00k58K99J11l12L46j95R4o3P0K25l36k67K57P1
2388gJ2k17N87k86K62l17Q0O2m08M00k49l0J91J4k96K88j47M50m14J02J9j95L96
2411B97n42M60j35l34L77k06K79k15m2K74r1l05K95k2j76J93n5L8l1k04J57J99
2433B11k32J3J02k6K2n44N47l84M83j12j66k58K19M31j33j43R9m2k5j82mR6N5
2456B7n1l8J36J34k8k29j81K43k68K45o4K66m54Q9K16K76k67P1o2Q9J10j44j7
$$ y = [-162, 5, -87, 267, 140, -22, -94, -98, -3, 130, -185, 0, -110, 27, -27, 118, -15, -415, -65, 160, 2, -115, -112, -18, -78, 12, 196, -36, -153, -89, -230, 124, -18, 70, -73, -125, 18, -304, -144, -122, -33, -243, -59, -138, -185, 216, -117, 163, 139, -215, -141, -248, 148, -176, 38, -138, -65, -139, -333, -69, 230, -91, -76, -136, -67, 124, -182, 77, -90, -52, -36, 34, -24, -411, 134, -296, 151, -49, -307, -8, 103, -209, 137, -58, 36, -27, 43, 268, -68, -335, -78, -7, 5, -212, 375, 89, 351, 34, 114, 176, -232, 168, -81, -111, 80, 94, -202, 86, -61, 389, -25, 77, 96, -99, 297, -245, 215, 80, -254, 123, -83, 196, -19, -61, 213, 122, -183, 112, 90, -86, 107, 52, 90, 59, -145, 12, 211, -21, -8, 94, 68, 90, -454, 93, -291, 192, 80, -86, -344, -125, 306, 173, 30, 129, 87, 62, -120, -124, -28, 27, -24, -62, 74, 208, 180, -49, -230, 13, -255, -10, -74, 192, -262, -173, 43, 319, 52, 123, 61, 150, 260, 116, 99]
2479I9j60p2J22J15n3k18K39j5J24k51k51L18J28k83Q6J77J45j19k65p5L66n2
2501A05P9m97K87k1j46k4Q1k4J74pJ53j67m8R6p5J05k55J29K63l11j4J41l9j76
2525a91M90k61l31P7N15j38R8l95J56Q0k38J82oo3Q6k05J22j84J81j15K17qk22
2548a53J25P6j97K94l08K80L07m25j10j25N00q4l68M3J90J65k23L6Q9OJ70k3J51
2571D16n96L1P5j5K44m3k19J82l22J88l8K27l03K71l30N4K36J29k16K42m5j66
2593Bl58J06M25k18R4m45L63k15Q7J75l1o1J3K84j8q7r8l15J90J37k04K98j63
2616c9K45k21K90k3k52J21n42M18J60j10J69p1j30k5Q3R1j55k21j1N50m02l9O9
2639d5j13M43k60K38l48k4J57K9K37k66l1L8M4o6m6l1J67K4j11Q4O8l24L49r4
$$ y = [99, -61, -133, -11, 104, 51, -167, 72, 57, 181, -70, -321, -3, 125, -158, -72, 105, 250, 131, -134, -209, 157, 105, 184, -313, -26, -47, -193, -217, -136, -160, 14, 7, 160, -7, -55, 41, -34, 71, -184, -55, 208, -103, -117, 24, -15, -191, 299, 38, -293, -216, 299, 161, 259, -136, 20, 100, -138, 44, 38, -25, 61, -144, -22, -206, -25, -140, 77, 69, -153, -28, 48, -149, 145, -163, 117, 424, -1, -111, -236, 264, 180, -188, -145, 45, 210, -13, 23, 112, 118, 288, 265, 416, -180, -149, -74, -89, 155, 112, -107, 75, -247, -59, -97, 130, -173, 98, -232, -178, 58, 187, -29, 213, 168, 2, -356, -250, 175, -43, 51, -394, -31, -246, -159, 16, -15, -76, -63, 221, 203, 116, 18, -297, -107, 30, -174, 124, -39, 206, -15, 275, 252, 0, 121, -421, -3, 157, 47, 216, 145, 15, -10, 73, 164, 9, -212, -223, 327, -75, -114, -45, -158, 285, 25, 263, -85, -109, 48, 77, 314, 48, 17, 55, 99, 33, -13, -44, 123, 147, 36, 120, 188, -136, 213, 119]
2663A19j93R9j36J95k01J61j99K40O8j89J9J88r7J9o0k27O4K76k74J95Ok18K71
2686A26J04m17r1K27L35k01k14K14R7k02K77k52k46J46P5Q3j45K09o0m71N54o0
2708H8p7J75m50J64K36j25m1k23L52j05j33J83k48r0J24K37p3j74j35L41k58N0
2730a82L61l2m08L46L3k35L31l60J17R5K09j78j78J74p8l2k94L23j73J05j55J11
2752a00J46J2n8k79K47R3L9Q1k64J02k65L03m0l69N10j39R1o4RK15m37J85K7l4
2776A1j25K07O7J11k53j86J03K73k35M6j1j8J72j80J39J20ok02J39p5J3m8m0L32
2800C54l30M0K10m27N8J07J64l55J58j76N99m76K29Qj7L4l31M82p4k41J42k17
2822e9k52J02K19O1p7j74J15PL15j41j70O4R0J03J76n34K35j59J05K03l58M44
$$ y = [119, -74, 25, -111, 84, -117, 44, -155, 85, 153, -36, -17, 171, 74, 93, 33, -194, -130, 146, -128, 67, 73, -145, 126, 230, -187, -278, -51, 284, 83, -131, 83, 180, -22, 255, 3, -243, -97, -22, 61, -84, 125, 65, -406, 148, 88, 11, 186, -264, -100, 136, 11, -30, -253, 99, -6, -139, 44, -204, -294, -170, 67, -6, -180, -315, 26, -232, -182, 179, 147, -261, 85, 118, -117, 214, -146, -29, 66, 275, 97, -81, 93, 15, -17, -311, 12, -161, -56, -211, -100, 46, 58, 0, -279, -32, 61, 100, 181, -83, 19, -246, 57, 17, -352, 158, 19, 110, 46, 55, 270, -167, 18, 45, 11, -114, 93, 160, 271, 18, -168, -65, 208, -27, 19, 8, -10, 162, -18, 121, 241, 235, 33, 172, 97, 110, 62, 22, 354, 24, 64, 274, -153, -95, 12, 176, -179, -21, -197, 402, -74, 155, 163, 146, 180, -151, 331, 257, 16, 158, -59, -311, -209, 10, 71, -6, -180, -65, -58, 257, 116, -54, 10, 100, 203, 379, -155, 80, -79, 26, 229, -129, 315]
2844C15j67l14K20k03Q8R2k64J59r3mk6Q7J51j54J06M4k8j0L07o6k59Jp8K84n2
2869A36p4J13l20J65L67k80j35J36k19Oj75j6M91k90J43P6j95M39l87k39L99r4
2891D7K23r5k39K02K24n56L43j04m9K69j68kk2R7M8l91l4K73ml13J52Q8n4K74
2915B09o2j63J42k66L06k84J59J96p0K8j60J90j19m4n8K26n64K44rM93k74j16
2937Dj3k58L81k51K10j6j43j32J52r4l4J91j25K41L3l20J46k6N2P8M3n7k30P6
2961i2M08j59l55L41k15N6j72K01rj05j44J69M8N7j68K98K9k23J13k64Q8J20k04
2984a82L01j85n5K22k3K24j83r0P3r0n8L16k58K62m42K09J44k99K04n5q9k18O07
3007C35m51L1K20n7j86K85l47J24K32k43J31k25k2J57K39p5j74J77q8n5M0j55
$$ y = [315, 148, -166, 54, -149, -61, 31, -233, -74, -167, -171, -197, -110, 41, -113, -7, 37, 9, -1, 306, 240, -19, -18, -96, 188, 136, 62, 175, -145, 20, 387, 107, -28, 108, -111, -105, -280, -296, 195, -95, 48, 124, -71, 368, -19, -258, 141, 47, 270, 175, -64, 138, 362, -194, 149, 45, -4, 265, 97, 95, 73, 170, 218, -173, -207, 66, 62, -251, -99, -11, -65, 209, 147, -16, 126, -140, 166, -118, 41, 237, 167, 195, 35, 225, 106, 62, 4, 230, -334, -90, -99, 394, 120, 4, -9, -267, 114, -137, 73, 57, -86, -218, -66, -160, -194, -3, -128, 113, 146, -174, -28, -54, -2, 76, 119, 62, -168, -92, 316, 157, -198, 143, -72, -16, -188, 13, 4, -101, -245, -76, -28, 29, -139, 159, 188, -35, 78, -186, -98, 22, -182, 119, -66, -121, 101, 78, 302, 119, 29, 102, 12, -46, 270, 12, 274, -168, 41, 185, -114, 90, 35, -54, -272, 335, -116, -85, 135, 78, -108, 177, -170, -46, 186, -57, 74, -151, -173, -16, 223, 148, -26, 151, 63, 8, 48, -107]
3029a07Q5r8j7L27j48j7n3l88L64J56l44L38k32j5K94J57l76k71N1R2K46m55L30
3052h1K15l96J47P3M3K11k94N58o56J06J0J88j97O4j21j2j47J53K9J74k72L73
3074A68l35L53k09J4n4k4K20Q7m04m8L16k21j61J34L05J10m52K5J40K48k94l5
3096a17j9K55K72j30l28j79L02j74M0J58O8l41J53J76j80J83P6k88J76Pn6q3j68
3119a97M08j01k74L12k02j48L86k24pK23k14k87M50j15r1k64K69J28J4j19K90
3140B37j97k10P6K32o6j04k4L14k60L13k61j1J32l23J50K41k35j20L84l04l6r
3162h1l1M6k60J93J91l00K85k09J76o1pn0j40K70R9k69K31k12J19l1k9K10k88
3185a48K22J8k13L44l04J03J00l86J48j2k95N11l49K98l38K98L1o8J72k25P6j
$$ y = [-107, -22, -120, -137, 190, 42, 25, -28, -416, -52, 104, -240, 98, -134, -149, 145, 302, -74, -345, -294, -202, 44, -411, -81, 134, -262, -115, -42, 1, 212, -82, 476, -180, -74, -64, 124, -73, -9, -130, -142, -289, -136, -107, 67, -205, 168, -167, 186, -23, -9, -63, -87, 133, 220, -184, -232, 84, -137, -298, -164, 141, 251, -201, -176, -36, 212, -82, -117, -136, 119, 391, 261, -67, -246, 56, -118, -78, 80, 148, -193, -40, 136, -44, 139, 215, -73, 103, 110, 54, -29, -197, 211, 110, -164, 148, -54, -202, 184, -40, -47, 176, -38, -325, 125, 10, -81, -345, -76, 52, 66, -53, 237, 40, -170, -94, 138, 72, -32, -56, 258, -2, 311, 50, 39, 171, -152, -2, 239, 4, -116, 268, -36, -72, -81, -112, -66, -326, -133, 58, -242, 43, -166, 10, -51, -58, -108, -248, 22, 121, -148, 83, -129, -10, -41, -70, 140, -148, 74, 92, -121, 223, -81, 22, 122, -264, -116, -128, -423, 88, -261, 37, -301, -3, 28, -40, 132, -93, -17, -18]
3207a8j47K78L9l74J35J91l05O1K87k23M6j99M65n38J72J88l35J17O34o36o8N24
3229B94m39J57J33Kj76l52K82M04j88k69P3K03p9L7K28m40Q4J26J42l93M61k87
3251Cjl01L62o0m1r9j09K40k5j12J83M5L1J56m3l38l8K78m21M00l57L54Q1K8j34
3276H2j02l8q2N8K21k71Mj20L24k79J36l5J78l56N76m83K94J43j44n8k27J74k3
3299b8k8J66m5K6R8m39L89k68K12k53Q21m92k99L42k16P8R4o4k10N9O3J24l19
3322a89J23M3j26K06Q6j51J32m7Q6j8j05j07J30L02k79k22J78p1K86R5n12o6k5
3345b51M21j41n2J8k9j9m5K85l82L74j77Q5%j25J27O0j8k76J23O2j76J41k6R6
3369G5n9j75J25L89m43J57o6K14j25l3k46L58l7k53j10QM60l71j91L05N6J21k55
$$ y = [-18, -165, 113, 152, -222, -87, 104, -201, -140, 147, -76, -30, -229, 236, -302, -130, 58, -277, -160, 474, -162, -230, 294, -145, 12, 145, 147, -29, -381, -99, 305, 117, -152, -79, 124, 45, 82, 310, -130, -46, 80, 222, -171, 290, 3, 2, -299, 63, 3, -38, -137, -246, -6, -31, -143, 40, 85, 116, 272, 229, -109, -147, 131, -290, 110, -247, 107, 188, 216, 82, -20, -58, -140, -82, 139, -132, -128, -248, 76, -203, -67, -102, 76, -280, 296, -187, 107, 250, 106, 48, -179, -5, -28, -56, 110, 65, 91, 189, -250, 139, -129, 83, -170, 651, 159, -140, 202, -14, 64, 158, 94, -116, -57, 6, 130, -189, -66, -23, -149, 57, 143, -8, 124, 77, 163, 145, 40, -67, 63, 365, 86, -136, 42, -29, 257, 352, -160, -226, -251, 170, 29, -23, -5, -34, -53, -98, 187, -195, 179, 2, 87, 87, -38, 89, 149, 131, -145, -22, 40, -136, 5, -21, 75, 16, -159, -34, 355, -88, 69, 3, 217, 92, 59, -187, 171, 134, -119, -229, -221, 239, -132, -323, -18, 38, 159, -96]
3392i6L17n5K94n63OL0p9J45q0J09J29J06l81O1K17O5q4l19K02r0P8k11p1J54
3416a16K97k71K72l3J28m20k45N01l1J0n21L31J52k65K17O3k47K93j80J29j50
3437h6m5J86j21J4JQ5J10j57jl0K26l31J0L97k07J92m51J99o9q4k8R0K81k00l8
3462e7K48j7Q2l88K67k85Q8K16j10j22J43J14j36L2O7L3J2k51K36n2n04L36l8
3485h6K79j70l18K96J23J56j28j87p1r1J43J13j63k3J32j44j26L32p1j0l58O68
3507B96l20l4J91J20k04k6L47l90K19j17j89M1QO1Nj87j2M24l02l5K7l8R7m1o1
3532a20k4K96l1l74K44J03P5j61K3j7l51L29k89L46J45k41mJ91p3l00L77l23L11
3555A32k11O1J32k65J93n3K30k42P2L7J2J72Rk09k1J36j12mm17M17O8j08j46J99
$$ y = [-96, 221, 166, 460, -103, -97, -67, -146, -1, -81, 28, 157, 263, -118, -57, 160, 225, 141, -178, 24, -66, 12, -199, -270, -116, 181, -90, 182, 149, 277, -143, -388, 113, 82, 92, -429, -98, 54, -211, 6, 69, -178, 115, -65, 64, -86, -131, 55, -66, -52, -51, 34, 144, -13, -14, -44, 182, -149, -139, 258, 51, 243, -208, -9, -78, -162, -190, -100, 181, -19, -57, 191, 174, 256, -132, 135, -150, -62, 154, 44, -78, 65, 179, 43, 75, 142, 175, 187, -64, 172, 120, -384, -48, -86, 193, 23, -295, 1, 124, 280, 152, -35, -106, -197, -54, 59, -104, -127, 5, -139, -265, 67, -4, -14, -372, 296, -24, -58, 133, 253, 49, 23, 370, -20, 199, 82, -107, -66, -58, 3, 8, -179, -191, 233, -69, -104, -77, -115, -18, -59, -120, -144, 152, 121, -253, -9, 94, 169, 8, 31, 14, -337, -8, -297, 49, 194, -47, -51, 140, 67, -233, 144, -179, 132, -79, -18, 114, -151, 42, -11, 219, -23, 49, 86, 98, 270, 279, 70, 49, 185, 73, 69, -348, 69, 137, 29, -117, 82]
3579H2l3lM05l91J08j99m4K54l71J03J89k92K69j38L7l19L80L37m70k6j46M69
3601B01J40l26J67j38k0l13P1K81M6L8NQ6l91J1K24j56K48k4j96K91j97k57M00
3624A91J20l88KK24N1o4j53Q7K4J13k22L2M18l71n7j74N6K27j45j54j36J88j07
3647b38k0N9L10j47r6Q1J82P9k25j85P5j21N72k94j21j00K87r1J1Pk3J02m82M68
3671I0m38MJ52J02j34J78j32M23l9M3m93N92m48K28N6l8n5m21L91M1n3j74P1L6
3695a8j80K93n7k67L86o64N41m5J06O0j66m6K37m4p9j28k3p9M5n3N13k19K0r6
3719C7k85J33L7K38k86J00Om8J33j26k38O7L1J93j5k08M60k88j06N10k47n2q6
3742d0J0K47k21n0J25l7n1J20P4q3k04P0K63m27L25k80L16l79J01O1K36k75K00
$$ y = [82, 49, 46, 451, 60, 168, -31, -75, 179, -192, -89, 100, -192, 77, -61, -24, -343, 37, 374, -96, -122, -268, 201, 341, 15, 182, 44, 24, -289, -218, 63, 109, 147, 152, 238, -153, -142, 82, -74, 174, 150, -46, 245, 48, -209, 191, 311, -77, -75, 149, 200, 136, -17, 70, 94, 207, -15, 17, 435, 64, 7, -167, -111, 116, -29, -183, -319, -131, -238, -258, -199, 111, -36, -132, -51, 131, 210, -15, -200, -125, -246, 326, 32, -89, -189, 98, 7, 18, 25, 2, 104, -378, 90, -348, -344, -192, -90, -224, -46, -178, 245, 206, 249, -244, 348, -100, 128, 184, 146, 91, -330, 61, 102, 49, -125, -54, -18, -198, 95, 38, -229, 157, -507, 34, -11, 95, 155, -11, -57, 180, 136, 57, -71, -94, -173, -128, -181, 332, 113, 133, 37, -248, -115, -78, 160, -126, -26, -20, -68, 65, -61, -299, -232, -201, -8, -23, -231, 229, -59, -165, 345, 98, 46, -40, -30, 217, -4, -54, 71, 34, -17, 103, 177, 94, -110, -40, 223, -204, 121, -159, 157, -222, -121, -60, 176, -99, 101]
3765A01j40j38L26k36L01k84P2j33J32j47L9J62k60K20J7K33j66k15m4p6K60j05
3787h1K93j6j05j13k16M18j03l77J56OK09p0j0K30q9NJ3J33k56L1j77q6M39l61
3811a27L00k06P0N4r9R4R6j88q8R0j57j1K39J87l19P0L9j73J14K2J17p8k68K90
3835F8k37R0L24j28k28N1M0J92n1n82M78j17K51j77j22J33m7K45j83l2k2R2n3
3858a5J72j29J39R1k14n4n6K76l56J33K63j87l2k5k19J33q9J93k41M51m30L21
3880A25J35k16j16Q1l63M41j36R6j48Q2k32J59L35p2j60q0o4q9L03k73J65K10
3902A83m38PJ22j70M51k23K12l13J44j28L4J32k44L08N7N0N4m45M94l55lQ6J36
3925A51j05j66K28Q5k27k36M10M6k51J9J26kK2k93M90m27K68m07K57L4J09j76
$$ y = [101, -39, -177, 149, -87, 214, -70, 2, -131, 1, -146, -107, 55, -205, 15, 32, 265, 99, -116, -160, -236, 24, -81, 212, 196, 91, -22, -238, 180, 77, -300, -144, -138, 71, 1, -9, 221, 132, 137, 150, 283, 27, 58, -119, -205, 234, -127, 173, -33, 37, 91, -8, 86, 182, -6, -94, -4, -161, -172, 67, 254, -65, 5, 44, -129, -15, 7, 124, 46, -222, 68, -169, -79, 245, 117, -111, -60, -20, 172, 121, -461, 17, -100, 151, -26, -148, -15, -62, 183, 0, -32, -54, 38, -15, 157, 28, 167, 258, 44, -10, -66, 210, -146, -13, 250, 63, 31, 6, -213, -80, -169, 24, -217, 234, -196, 125, 260, 44, -72, 9, -354, 87, -49, 47, -101, -19, -251, -92, 243, 171, 11, -69, -133, -222, 81, -192, -27, 183, -255, -248, -126, -296, 155, -68, 144, -169, -25, -153, -119, 13, -231, 77, 134, 184, 238, -207, 287, -68, -71, 15, 151, 46, -120, 108, 193, -34, -270, 140, 186, -65, -46, 80, 78, 100, -193, 297, -130, 138, -269, -12, 22, 131, -45]
3947d5N2k8M6J58j7J7k23K00J4k09l1o4JK18j32K39j20J42k09j91n6L27Om4l27
3972b76M92l06J17N1l2j1Q6j3j07J4l8k6Q5K87o4n17L09r6N3k33P5Q4N1P1J04
3997A60k92L11j19J25j71R2k68M7N7K53k32k19L20J1k93L98k2j53j60K19M1R1
4019A96n10L68OL28j76l36lJ00J43j60J39m10L91r2K46k27n5j53L22j14R7Q7J5
4042B02j31K43j27k48m3K20J44k09j5l94J80OL39k5j83m5L1J51P9j10K65l85N2
4065cOJ29l42j5K23L0J43qj16J47k23J54k09O2k60L57J01k77M4J99j30J63R5n22
4089b52J41p1k7L71j72L6j28J71j20R1l68N80j22m2o9j31L21m08j19K64K36p26
4111e44N91J94j37K5m26N33m76J01j14K05P5M0j22L67j33l92K93n7j15k3K81k91
$$ y = [-45, 7, -21, 25, 183, 166, 183, -40, 160, 174, -35, -66, -130, -129, 89, -43, 196, 76, 218, 9, -182, -238, 89, 95, 51, -276, 216, -90, 27, 78, 46, 35, 121, 108, 1, 15, -23, -49, 36, 323, 259, -258, 51, -45, 8, -225, -150, -66, -15, 56, 160, -132, 179, 60, 185, 14, 106, -162, -115, -58, 195, -37, -256, 64, 75, -218, 180, 158, 5, -155, 64, 105, 196, -314, 54, 60, 388, 212, -124, -127, -27, 116, -44, 95, -315, 76, -16, 230, 3, -52, -205, 117, 3, 100, 187, 202, 71, 314, 187, -61, -104, 116, 260, 51, 36, -358, -178, -172, 167, 142, -41, -86, -55, 96, 175, 65, 330, -55, -3, 3, 132, -210, -225, -2, 28, 171, 163, 47, 194, -29, 125, -84, -22, -282, 75, 176, -101, -57, 142, 12, 175, 270, -252, -111, -182, -209, 162, -10, 26, -102, 69, -51, 40, -328, 252, 130, 88, 19, -112, 209, -199, -318, -54, 182, -544, 47, 241, 104, 129, -297, 236, -240, -139, -253, -48, 27, 67, -55, 312, 179, -213, 80, 23, -92, -115, 166, -125]
4133a25P9R8j02K86m58L82k08J65j28K11j85L4k96O14m58K1k05K14J96k16K4J48
4155I1o3k9J6j60R4j00O17o58L10l8j04J99k31j79M65j92j95J78j33r7K12m5r9
4178a41J59k13R1K81j18m17L09K03o8n8j24p3K1k56L10M10m01J24o3J34J89l16
4200a7o4M99o34l23P42n37M53mj74k24R4L40k32r1K40kj28QJ02K8O6j63K89m67
4224a99L23J86m67L3J56j76L39j8p2j37Q4k12N7r1N40m56K09j23K84j93l4l57
4246c24L69R0m12L46j20J1J7l83M93N3p6m29J52L63j13j13L51j87j8k65K35k44
4268b04L14J25k47r6j33K51pK58l63k02M35J05k88K7k60J70J04l9J37l10K48J04
4290A29K1L9l65L37j70J94k49r0L59j31k0n4j83L5L39M2k11j34O43l69l46J11
$$ y = [-125, -46, 52, -50, 236, -222, 160, -48, 117, -11, 200, 15, 49, -247, 367, -91, -70, -275, -61, 135, -81, -57, 91, 28, -1, 15, -145, -51, -151, 466, -192, 118, 80, -24, 175, -56, -235, 230, 38, -157, 21, -112, -209, 3, -42, -141, 18, -195, -104, 177, 59, -358, -49, 154, 86, 28, -96, -169, -148, -404, -94, 316, -85, 39, -24, 110, 299, -17, -81, 418, -216, -539, 203, -334, 119, 115, -59, -283, -189, 151, -81, -172, 68, 66, -62, -54, 48, 76, 142, -21, 268, -199, 124, 310, -157, -124, 32, -144, 195, 177, 105, -32, 52, -160, -103, -194, 346, -110, 99, -24, 260, 67, 33, -324, 45, 135, -277, 69, -51, -40, -23, -406, 87, 140, 64, -365, -213, 150, 37, -76, 275, 88, 70, -195, 40, -204, 110, 235, -12, -108, -241, 10, 3, 261, -102, -304, 131, 236, -52, -25, -285, -115, -11, -50, 87, -223, 25, 129, 150, 189, -176, 161, -9, 185, -64, -154, 205, 74, 54, 0, -183, -148, 191, 233, 22, -112, 531, 162, -184, -73]
4312g3J45o1j93J32M8K38k89K5J41l37J77M5O2L79n71O2o3L84k54K4J9J60m2k47
4336h9K20n0J93k47r2O5J56n34K30L34j03l10L40k39K30j20K71k57M5Oj84p3J81
4359b7r5n6M01m06M56l24n5j20K40K15j25j89qj4J00j82O4O7K65j63j39q3J37
4382d1r4J02K91o13L40j76L28l2N6J5j00n7k37L21k98P6j4PJ73k21j1M15k26J74
4406A78n04K43Q8k69O64m72J82j01K11k0k04k8M9j7J04j87J33j35pJ9K93j03O7
4429A84J96k49l5l8n6k42L44j31J99k80J94O3kK2l83L12k06k25K50J63r9K10p5
4452A16Qj19k04K18L00j76k95K10k96m3L96j96K7j09q6O7K09L7o2k73L72o1l6
4475Dk93R5n3R1KO9J00k41K44j58J85J00l13J82j21q3L21k27J9j31r9k09O95l88
$$ y = [-73, 72, 11, -182, -50, -2, 236, -53, -28, 113, -224, -47, -2, 60, 439, -132, -70, -133, 251, -3, 21, 40, 200, 158, -89, 131, 81, 274, 27, -65, 0, 156, -378, -148, 186, 83, -227, 113, -126, 104, -16, 255, -2, 43, 49, -135, -208, -27, -122, -178, 223, -183, 273, -51, -106, -226, 14, 229, 104, -85, -93, -107, -7, -189, -125, -58, 207, 44, -95, -178, -41, -135, -33, 258, -355, -15, -191, 137, 105, 161, 176, 76, 19, -218, 103, -195, -119, -133, -126, 47, -174, -185, 230, 4, 178, -326, -83, 5, -264, 400, -72, 110, 9, 220, 200, -4, -32, 17, 0, 104, -83, 50, -85, -92, -73, 220, 117, 184, 380, 131, 96, 58, 2, -240, 104, -27, 172, -108, 86, 149, 147, 169, -214, 98, -108, -333, -83, 80, -19, 191, 116, 124, 5, -199, 19, 319, 143, -152, 58, -238, -281, 115, -81, -54, -163, -249, -182, 27, 64, 2, -271, 101, 40, 4, -289, -194, -247, -156, -154, -85, 15, -226, 18, -140, 45, 145, -168, 14, -107, -190, 131, -96, -77, -208, -307, -516, 179, -209]
4499b09L88k02J06J54M8m49k6K36j67R1K89j57l38mj6M07L16n64K40o8k04j9J83
4522C5l80J91K17k4j17PN0K26k21J82M9r8q6n8q9J57j77J2J47j70K24m0O3k30
4546a30O1L7k27L67pj75j85L51j19Q1j45J35J60O8k25J83n4l46L77j63o9j14P9
4569f0J62k50K64j36P3m9J4lr5Q9l1M8k19K95j62j4L46k90k55M36N5l94j24K18
4593h2K86k51J66j24J12m17J82K62q9j69J24KL1l48J46L28k16p8K41p8m07M74
4615I5j1j41K3K26j36k32j00R0K92k18J61J48O4l17K48m57K35J39J71k50p8K12
4637A64l2j53R7l28M3K69R4k08j13J72n6Q1m6l3J59j60K43l17K86pk69J19l4J91
4661A62l57K72k85L09k2k18K90j02k26J65j56M25j85k65J33P6p8N6Q0J13r5ln5
$$ y = [-209, 179, -23, 83, 237, 285, -164, -190, 46, -121, -30, 259, 102, -236, -240, -256, 151, 467, -97, 143, 75, -129, -148, 35, -345, -154, 63, 39, -78, -71, -21, 205, -16, 166, 215, 117, 31, -27, -116, 41, -136, -124, 23, -147, 77, 37, 100, -130, -69, -32, -259, 108, 101, -74, -259, 92, -27, 54, -91, 44, 204, 272, 47, 230, 176, -170, 207, 44, -25, -139, -60, 102, -148, 116, -20, 53, 4, 18, 15, -80, 9, -22, 26, -193, 102, -60, -74, 272, -18, -273, 163, 218, -176, -300, -82, 204, -47, 119, -5, 107, -310, -128, 134, 45, -124, 0, 2, 33, -315, -169, 159, -57, -135, 106, 28, -379, 95, 84, -57, -34, 192, 56, -176, -276, -186, 106, -112, 49, 197, 261, -56, 192, -265, -30, 109, 280, 30, -48, 164, 132, -21, 76, -252, -209, 60, 154, -54, -167, 5, -51, 30, -16, -49, 110, -50, 193, -124, 162, 155, -114, 5, -29, 162, -195, 77, -208, 101, 79, -139, 151, 49, -177, -12, -168, 257, 72, -193, -60, 16, -62, -6, 74, 187, 92, 89, 34]
4684C4k66J92j59J85L77l20j20OL9J57l01J40J37j29J81k47P0j02l3n6J28J45
4706E8O2J45J47m04j48J90j50J43k1P8k46J58K42j70j72J06K23l32J3J04O9k40
4728a45J60k25J01j00K90M3l50K09Mn6J25m9J2k3J96k10o1J45J24k68K64j57l3
4751dJ85j83K93r8k50j07k9L18o9J08j51r6q5K12k71L99o81P29k92n2K00pR4j90
4775b7N5q0J40m9J10K2l22K70q5l02R3Q6J78J58k1k31j98j9L70j94k0J85J57j15
4799A61j11j82J4L9P7nj47L44k81j88K34K64k80k1K35k15j53N84m87%N1q9K63
4822A07j15j90M21M0j41l22K96m6j92j0K61j29K19m02K94m2o5lK32lj52K37j87
4845A08j7O6j34J16Nk64K92j04j56Q5j2j71k18L10L40j15j53R3k77O3L35j70K00
$$ y = [34, -232, -40, -199, -14, 363, 43, -77, -71, -32, 125, -176, -36, 101, -28, 153, -94, -24, -126, -159, -215, -87, 58, 120, 265, 412, 8, -140, 50, -100, 43, 22, 100, -146, 12, 254, 84, -88, 18, 241, -91, -78, 26, 95, -145, 15, -210, -109, -209, 81, 124, -226, -17, -13, -69, 56, 7, 19, -4, 192, -18, -79, 66, 190, -78, 186, 29, -4, 181, -2, 291, 193, -57, -164, -193, 125, 56, 164, 13, -83, -168, 44, -227, 172, -509, 220, -72, -124, 76, 69, 163, -27, 28, -52, 88, 39, 149, 171, -151, 119, 34, -268, -175, -89, 89, 247, 226, -5, -203, -222, 148, -46, -66, 119, 276, 161, 50, -132, -118, -79, -2, -7, -154, 190, -91, -279, -45, 219, -61, -82, 153, -62, -215, 369, -118, -118, -67, -156, 107, -8, -198, 223, 263, 122, -200, 96, 50, -142, -152, 109, -20, 199, -203, 91, 49, -16, -19, 213, 210, 58, 295, 108, 91, 157, 23, 139, 144, -120, 172, 68, -88, -3, -15, -186, -404, -94, 246, 131, -22, 71, -206, -143, 192, 22, 222]
4868B22k45j40J78l0k1n4M7PM6j15j00J75J99j95P5p5j1K8M2N1j49j56K05j01
4892a17j58L48j30q2P8J03n5jJ6P2M4l19K21Jk07J55K4j37J78j86K09k42L03P7
4916A95r3N3n6k0k21K16j7j37n9Q0K05p7l01J89q5J25k03J86J8R1l66M2K77N8
4940A00l77J03K14J63j49K6m1rK7j0K61k87K02k79K18n6n4J55l08K4L15j67j14
4963d3L7j03J07j72K56P6k4mj75R6k1N1o2L4m71L92J38Q0l98L21R4k5j16k50M9
4988a33J70k93R6P0k3P9k06L92k33L49j29J45l14K29J41m26J60L2J30k08qO0k67
5011a87L16k02k00J48L1q1J48L04j96j08L0Q1j63M1j6m0k5Q3j13K28l36J86j1
5034h2M3M8J02j0Jl07L16o6Q2j97l4j8J71M0pj63qj17L60J22n3j48j55m4L72k37
$$ y = [222, -23, -163, 15, -15, -36, -90, -43, -36, 10, -105, -205, -30, 169, -26, 49, -26, -37, -9, 33, 84, -65, -221, -16, -117, -275, 73, -57, -139, -61, 42, -13, -14, 2, 74, 118, -201, 20, 21, -186, -31, -7, -144, 34, -152, 57, -185, 118, 195, 102, 155, 99, 79, -142, 74, 57, -80, -139, -59, 146, 69, -232, -43, -128, -3, -206, -20, -2, 89, -277, -235, 42, 100, -277, -174, 40, 203, 54, 80, 39, 30, 57, 47, 308, 21, 223, -56, 162, 106, 52, 207, -101, -77, 238, 71, -43, -6, -109, -2, -174, 82, 158, 134, 130, -45, 51, 30, 81, 19, 53, -418, -26, 112, 192, -206, 115, 209, 184, 68, -182, -133, 37, -256, -160, -90, -113, -34, -240, 152, -81, 268, 139, 284, -30, 199, 340, -86, 74, 106, 236, 28, 20, 80, -187, 129, -73, -273, -125, -94, -175, -27, 277, 81, -27, 3, 84, -79, -38, -54, -94, -119, -36, -149, 79, -257, -71, -82, -39, 9, 111, 101, 102, -205, 111, 45, 127, -70, -104, -122, 49, 89, 82, -81, -89, -206, 154, 276, 223, 75, -80, -124, 248, 11]
5060A1J51m44L96M1m85L52k72K59K99j5m06P7K0k65J92J64pj1K49m72J27O4K3
5083D8J32j98p6K84k20q5K75k02J64q2q8J95m52M30m9p8J02k67J62j22K40k43
5105a30n8NK39p5J53n6j33N0k2J25j45J69L1L1j78m2J16q5J43O1l97M32k3k07
5129Dm9r0J9M78k06j56J8N1J09k69K21k12K09l18K54k02N02j97j75P4M3k76L97
5152B29m04K95q8J18j26K21j42q7l0n0J97N1J3m39L22j57j03l9J81J58k0j47k30
5175b77K31K97qk05j63M81l10Lm3Q2K4m15R9K80M6j87j12J11J90J5j54m6J03J5
5199E7l2k2J0J76m05K87k79K98k09j48J81K7N3Q2Q7k24Q1JO7j12P9j94O2j57O5
5224a69L59m62N01k71L04k23j00m9J6n4K20j88J04Nj54JJ21J51m4L6JK84k71j02
$$ y = [11, 162, -282, 114, 155, -330, 22, -250, 9, 308, 293, -113, -36, -16, -281, -89, 75, 68, 57, 306, -166, -39, 25, 48, 180, -18, -94, 190, -30, -115, 160, -42, 122, 40, -48, 147, -305, 125, 76, -2, 100, -167, -5, -127, 113, -130, -188, -183, 56, -19, 134, 78, -55, -5, -27, 98, -47, 122, 153, 184, 6, -36, 80, -5, 138, 199, -198, 234, 211, 4, -45, -135, -116, 362, 156, 0, 18, 69, 178, -91, 130, -82, 127, -191, 63, -139, 363, 166, -9, 65, 108, -168, 229, -175, 120, 32, 150, 24, 245, 103, 16, -14, -64, 133, 184, 197, -242, 80, -77, -180, -219, -38, 120, 100, -47, -277, -46, 251, 243, 38, -125, 356, 46, 49, 6, 88, 112, -303, -204, 76, 122, -65, -177, -66, 124, 139, -15, -61, 42, 57, 25, 3, 13, 189, -216, 71, -208, 90, -119, -267, -86, -59, -6, 76, 163, -61, 20, 21, 88, -24, 55, -139, -77, -234, -169, 190, -272, 229, -42, 262, 39, -61, -110, -94, -148, 72, -116, -12, -7, -161, -160, -39, 112, 68, 104, 105, 389, 118, 16]
5248A6l8J5l83N07k15K64q7j27J64N4k40k0J42Q6j53M1K74n50J55K32n1mLk00
5272a15q9K69j30k97M25l94K70O7Qk3j88L64J46l58r8J89O2l24M9K34J48m78J08
5295a55J20L31n15K80l1J97l74M73l93lM19m86R4n6j00K61L89n49j83K27J16Q
5317G0k35J50J62j8k79J46j10J71j45M10k66l33K87k9j73K94N0j97M00m23M6k00
5339b22K99J90j93o9L1q5n4J37L0k43m4K5K43j39Q0L20k61j03J9n9o2L10k07J91
5363A34m58N76J14m54N0J33j24J7J1l17L31j25K31k06r9J53J93j59J72m5R1m99
5385b80L49M7K3k9k03J21k7k32Q8O5N44l97q7o0j03N9K83k72J02O5K19j50k15
5408i0K17k94Q5k3RK13k08M4p9L48j0j73K33k40K02m95K66JpK03j68J52o7J25
$$ y = [16, -22, -7, -390, 117, -98, 166, 79, -48, 116, 170, -70, -90, 52, 138, -15, 26, 300, -250, -95, 137, 86, 82, 85, -115, -204, 65, -65, -362, 63, -331, -61, 6, 14, -9, -197, 167, 313, -45, -143, 46, 108, -216, -167, 67, 215, -263, -155, -35, 296, -219, 61, 30, 227, -147, 326, -67, -70, 349, -137, -43, -99, -199, 62, 451, -98, -281, -54, 62, 70, -165, -15, 147, 129, -150, -4, -114, 57, -88, 322, 56, -277, 10, -19, -192, 102, 152, -45, 355, -68, -22, -222, 77, 267, 74, 5, 36, -49, -103, 34, 64, -179, -223, -198, 45, -94, -14, 306, 45, -58, -39, -98, -160, 150, -57, 134, -324, 252, 366, -88, -38, 95, -29, -12, -1, -318, 13, -112, 119, -87, -186, -33, 160, 1, 173, 128, 219, -280, 69, 116, 139, 110, -93, 28, 1, -231, -143, -78, 466, 69, -18, -78, -181, -122, 161, -111, -9, 56, 275, 125, -90, 127, -167, -82, -105, -96, 117, -91, -47, -126, 222, 212, 39, 272, 32, 234, -261, 5, 6, -1, 202, 34, 186, 119, 244]
5432B44k46j34J63lp1L16l41J84k37R0L43k01J06j90K51l42K10k12J65l8j47k13
5454c03N00k41J87q7l3j54J98J27j58J28m17L85Q4l79P1NK94r9k01R5L1j30M2
5477e5j1J52k46J59j92M9j52N7M9K92r8j99j94K58o8Q6J20j91J20L55j80o4P6
5500A23j46R9R7m08K64Q1k0p0J49k89O3P0j3j1N5L4l9l12L46J13j90o6Qj12J64
5525a0mj74K54J3p8j54Q3L30j37n02N05J56n9j87m3l7j0L4K02m2l72K68N1K8j79
5550f4K65l17n3K8J32J62j02j35J30L01m31J65J89m47J56L11j88j25L03n55J50
5571a25PJ92j85L39m97L47M3J03l82KK57j96n8r8L15j34J75O2o4k37K01l46L80
5594A01Pm9m5J4j91L03j10j13O5J32j09J66j30k58M00k01L26k82L00m27q5l4J58
$$ y = [244, -2, -136, 27, 24, -47, 269, -72, 112, -125, -35, 308, 107, 213, 23, 274, -68, 142, -70, 95, 57, -90, -303, 197, -44, 143, 56, 23, -131, 67, 194, 36, 164, -253, 132, 216, -163, -92, -87, 207, 108, -93, 2, 33, -97, -55, -66, 86, -160, -1, -193, -144, -296, -239, -190, 102, 4, -195, -389, -131, -199, -113, 7, -184, -64, 291, 111, 47, 123, -23, 76, 173, -235, 29, 110, 90, 20, 169, -120, -57, 13, 0, -11, 44, 78, 39, -273, 73, 186, -4, -70, -62, -174, -10, -14, -188, 66, 79, 1, -153, -70, 260, 123, -379, 126, 282, 223, 36, -7, -44, -54, -20, 182, 140, -232, 36, 87, 115, -64, 201, -116, -169, -141, -9, 153, 51, -84, 46, 347, -84, 81, 270, -177, -21, 290, 102, -23, 280, -275, -125, -118, 74, -111, 228, -269, 78, 121, 224, -158, -156, 101, -95, -153, -251, 64, -70, 105, 167, 103, -134, 67, -279, 101, 108, 59, 14, 28, -163, 140, 30, -83, -18, 114, 5, 171, 41, -217, 183, -18, 308, 26, 326, -101, -186, -220, -62]
5617f2J91k36J40q8K95j00l52L65n2l84J21J40n4K20j81J21l17K50j41K59j29
5638FQ2O4K13m73J26J38l22J67M7q0k8J76l56R9L06n13R0L9r2N61m68K34K83j15
5662A84j64p5J30M7Q1l8p8j92L59l97J37J3Pl0K61k25K45n2q2M0M0o60K25Q6K86
5687A48k15K54k20J05L6l0J29j96J97k34p5l9R6l51N76l19J29l30K85j81L32K91
5709C88j84J39j51m24L86k02M4Q7k99K90j9M2m81L80L5j53J21k66K03M09k80j45
5731h0m0K65P3Ok61J65j88K15k21M25p1k56K65l22K04l82K22L2l9jK89l60R0k7
5755CK39k00nj24J45l8K06k38j9N3j09r5J79j13L92k44J66o2k89L09k3R4k59n1
5779h3Q8M5j4k67J87J18J36n0N6l24J89K57k27p6j1p6Q8n1r5K19q6K64j82j17
$$ y = [-62, 129, -107, 33, -55, 240, 140, -212, 153, 101, -283, -162, -22, -76, 144, -37, 84, -233, 17, -124, 135, 6, 88, 152, 365, -108, 18, 156, -166, 1, 48, -32, -60, 116, -240, -141, 165, -348, -258, -219, -311, 250, -218, 16, 299, 184, 20, -55, 75, 122, 203, 165, 87, -105, 254, -143, -6, 7, 14, -16, 245, 20, 265, 213, 131, 171, 211, -449, -224, -138, 148, -67, 187, -33, 72, 108, 78, 207, 11, 208, -26, -101, -140, -44, -395, 181, -138, -9, -339, -54, -235, 97, 388, 204, 343, 192, -232, 154, -48, -4, 83, -216, 74, 55, 97, -384, -4, 31, -122, -1, -267, -64, 345, 65, -80, -120, 145, 218, 224, -37, 128, -60, 155, -66, 359, 288, 32, 297, -25, 179, -203, 19, 51, 12, 11, 300, -60, 30, 3, 242, 42, 37, -87, 58, 20, 226, -12, -31, 22, -87, -182, -3, -116, 276, 32, 198, 136, -153, 156, 133, 227, -32, -83, 5, 50, 36, -231, -44, 74, 210, 160, 216, -108, 81, 338, 111, 35, 24, -52, 36, -15, -110, 109, 23, 287, 105, -12]
5803a2P1k4j81J26J17j25k56M5N33l16j28MK34k6l56K54N4rJ67j20K04q6m50K42
5827c8J60j46N0J5l27K69J07m08L52k94M09P8jk46j19M29k16r8J72k48K64rJ04
5850B59l06k6L99j89l09M1n5K32k61N55m36L4J30p4M1o4r7J89q0J87m72L29k33
5873b06L86r8N3l83J18J47k43J87J01j12K46r0k25J63o7J02j88j13J66j52M1K87
5895A20J8O2k33k9L58j59k5m13L51l18K53l65L90j6L2j90nK69k12J92o5N2l38
5918b71J17K9j68K7K15m8L8O6K3j30R1r6j88L52Q3l6O8l23L74k39K2Q1J42j34
5942I5J33m16K62K5p2K55n1k46j79N7M09k89j75M17j17j95J0j54L39n7j67L52
5964B36k30K6L8k10L07N1N0l04L2j05j31K51O2k46K24l9J22q2l41J74n9L5R9m3
$$ y = [-12, 59, 35, -146, -20, 97, -28, -284, -239, 294, -22, -150, -146, 88, 62, -294, -40, 14, 5, 172, 52, 256, 170, -280, -38, 122, -24, 26, 41, -286, -17, 90, -318, 34, -260, 149, 227, 226, -20, -139, 290, 74, -24, 148, -100, 164, 155, 259, -47, -73, 326, 137, -172, -131, -186, 46, -215, 340, -96, -62, 68, -6, 35, -29, -126, 63, -17, 170, -302, 27, -206, 180, 82, 135, -248, -130, 17, -226, -39, 62, -50, 196, 106, -119, 44, -23, 79, -109, -222, -56, -208, -167, 120, 138, 200, -33, -62, 296, 137, 112, -301, 50, -268, -15, -380, 10, -6, 26, -164, -169, 100, -112, 80, 15, 67, -271, -154, -125, -293, -266, -51, -99, -61, 5, 28, -102, -11, -107, -295, 57, 140, 104, 172, -151, 223, -16, 6, 87, 229, 95, 228, -188, 74, 99, 27, 282, 231, -15, -194, -137, 272, -17, -192, 225, 108, -87, -77, -231, 108, 51, -116, 236, 6, 32, 70, -140, 167, 218, 268, -36, -4, -109, -240, 11, 73, -173, 51, 12, 134, 52, -289, -115, -174, -139, -40, -83]
5988h3J59j93j22M37q6j80J61j04j11j67L43m3j35n7K18m5l0l09L97j6K17n7j02
6011I2K9Q3J5n7k59J12J08p8Q9j17k19K21j34k70P18k98J16m59K92L9j94J91k9
6034ij71M72l48L22k33R2m02M10J32j75j48J94j26P2j03Q8R9k79K99j26K5m0q8
6057d3J12l0K89j61r7m57O46l96K9M58k74R2j56j38K78mn36M02J95m13J50J19
6079F5j02J27j21J47O5k47L08l12J04j37M49k00Pk68lK81r8k66l4K92J3k05K9
6102a06L58n12P5L15j53j11O9J64Kj21J39n8p9k23K71J90j29k11m8L0J87Q8Lp
6126A33Mk59P6o9L6J45J98j38j70p0J62k74MJ32o6J25K93j03k77J33p3Nl0P4j06
6151a15K17j78o4K32m7k26o1K78j72J92K17j73J28m00J69j12K85k48n4KN9K91
$$ y = [-83, 76, -117, -239, 198, 112, -68, 93, -11, -122, -289, 54, 11, -124, -181, 37, -8, -38, -347, 50, 34, 251, 194, 92, 121, 204, 219, 162, -97, 15, 123, 45, 134, 17, -202, 19, -115, -385, 333, 35, 151, -308, -16, 23, -171, 20, -9, -180, 292, -56, 266, 33, 125, -277, 133, 265, 90, -58, 136, 10, 82, -21, 67, 166, -113, 186, 60, 85, 45, -43, 69, 39, 328, 167, 70, -387, 259, -137, -108, 350, 76, 168, 12, -126, 152, 148, -388, 14, 209, -204, -54, 65, -37, 90, -31, 116, 181, -66, 242, -70, 34, -103, 346, 146, 153, -115, -118, 163, 65, -201, -235, 57, 70, -135, -106, 252, -260, -185, 130, -23, -134, -65, 99, 101, -20, 119, 61, -18, -241, 30, 220, 91, -120, -168, -138, 49, 137, 140, 133, 137, -122, -46, -115, -79, 66, 264, 126, -44, -114, 48, -226, -222, -90, -156, -31, 262, 159, -118, 15, -58, -53, -83, -9, -115, 102, -76, -140, 92, 45, -181, -242, 36, -136, 56, 273, 100, 228, -172, -3, -115, 170, -78, -132, -130, -71, 220]
6173B20k57J19N8k55K24O9j93J35l54L62p0m1K27l51K8K47l27M84m09R1n3j31
6195a77O52l09OJ9l38K84l17Q0J08p9M8%n3r6J46n2L1P5r0K13k13K2L7k61J05
6220a59J38o6O5j11K35j96J10p3K01j34J7r9j52K82j89O6P7j73J13J30K5k20J22
6243Ij21k32O5L13j56J43J69n07K80K33k11j00j6Q5r5j93K97kJ13K14l75L9K6
6266b2r7Q5L62l04L7O1j34K47j61K0J39n08L65m03M76r1P8l71L20p7j20M6R3j50
6290a09k5J32j30onJ84j9m4o1K97j03k68J88Q4J83j10r4l8L9J2L12n18n5o2L65
6315A49k44J76J45j55l8l48M57R0m26K52J60l58L50l34L66P5l76k0j1K08l01M3
6337a40L28Pl99K85Q7m37J31L11Ql72J75k51K72k19k8L33J26q7j23J32l71M98
$$ y = [220, -37, 82, 140, -115, 109, 178, -15, 120, -234, 128, 58, 17, 244, -107, -79, 168, -159, 325, -84, 7, -46, -177, 475, 166, 172, 191, -147, 137, -180, -100, 8, -71, -23, -23, -76, -172, -26, -78, -47, 28, -62, 151, -62, -40, -3, -264, -159, -21, -87, -22, -133, 102, -94, 16, -57, 144, 10, 27, -72, -224, 58, -131, -65, 12, -161, -48, 82, 107, -113, 9, -112, -344, -279, 34, -122, 21, 190, -317, -37, 196, -15, -115, -131, -46, -141, -334, -37, -39, 74, 288, -87, -48, -22, -119, -34, 328, 24, 61, 122, -12, 235, 74, 94, 233, -275, 90, -313, 163, 72, 150, -221, 99, 22, -98, -52, 41, -109, -134, -2, -132, -138, -143, 41, 22, -22, -83, 214, 111, -157, 31, 115, 298, 188, 94, 56, 95, 107, 419, -99, -154, -216, 149, -95, 81, 226, 71, 33, -315, 142, 232, -194, 58, 218, -140, 210, -124, 242, 317, -59, -79, -90, 118, -183, -140, 188, 195, -204, 81, 168, -269, -138, 173, 181, -191, -16, -267, 5, -214, -242, 91, 217, 130, 7, 139, -232, 266]
6359B66j39k23R2l81K96J13L8j35L90L6j54l68L27k00K1J70l61l0M21j75k43J79
6381f0j36J51j7Q5k51K22q7l5L02j86n1k52L87R4k83M6N7P8L1j59J19q3r7j6L
6406a38J42m7N4j00Oj5J85N4p9k43O1K08j21J18k52J16l4P9K8Ok6k2L8o3J06j15
6432e4L56l01l02M33j62J15j51k13L50O5q8M0p6K09j57j38K0J68j57J29k90k1
6454b25N89q11M33k63K73L4K1p1j40R7p4j3J09J92l43L26p8n7J65k3k68r1n8L09
6478C3k31M07j75O1Qj8K03k41Lj86R7J18k23L54k55j87J79L39l40jJ38j69N6Q1
6502E1j88M1L54K6l24o1r6J91j53k4J32Q4j73j18M19j93l38O39q2k79L71j29l24
6525a74K07R8j35j31Q2j23K3J33q0k16J59R4O1k74J61M1J92k08K25l8k33L48P3
$$ y = [266, 127, -96, -4, -385, -89, 24, 62, -73, 317, 353, 199, -169, 158, -42, -21, 149, -212, -242, 179, 4, -239, -60, -196, -45, -62, 23, -228, -6, -93, -128, 174, -12, -63, -315, 72, 166, -117, -71, -14, 64, 95, -64, 55, -28, -125, -141, -138, 4, -43, 11, -89, -83, -98, 87, 141, 62, -181, -120, 88, -33, 85, -167, -51, -85, -6, 22, 28, 2, -20, 18, -45, 61, -54, 302, 1, -301, 132, -30, 85, -66, -279, 71, 136, 48, 88, 12, 221, 64, -74, -54, 114, -43, 86, -204, -225, 364, -447, -14, -277, -4, 30, 51, -20, -160, -63, -137, -150, -41, 151, -192, 134, 56, -1, 164, 141, -127, -218, -276, 33, -198, 209, 34, 95, 103, 85, 288, 47, 50, -136, -39, 79, -144, 210, -45, -232, -53, 286, -54, -55, 83, -86, -30, 51, -137, -96, 258, 284, -40, -101, -197, -6, -159, -183, -51, 33, -140, -258, 161, -32, -370, 269, 187, -92, 279, 150, -174, 33, 131, -4, -135, -53, -176, -153, -20, -100, -316, -157, -63, -2, -276, -115, -74, 118, -90, 135, 97, -136, 212, 285]
6548B85l36J3R6L5j88K01L11j70j81k31m0J01J02P2j27K82l17j39L26j09j6M5
6570A5m7n3L0o3K07J20j25k05K0K40k17j1Oj97L34J30m92K56L27k64m0J35m66
6593c60K75R0R3k25j78M26m87L29k3J42j58r7P6r1K34k57J72K39k09K25j85j15
6615h4o1K64j41j80K30j05p7NJ59K56k02P0l8o5J87l97P5M56l87j38K4L84j49
6638H6J05n77N13k66R4o7K78j99j3nKK17k48L88l18J59l43J42J18Kr1K33m0j87
6662a7j08O3R9j67n6j19K2K23P3K43k6l60j2J33J63l01M39m74N1J50K4p5j26J63
6686ERj21L7M05j80l04r3K31KJ49k11mN8K24j90J1J5n5K1M8mm3Q5k33L11M5L1
6713B49J50j61l1j85K52M3m11j32L47k6N8j97j94J86o9L5P3J8L12m51J15k1J02
$$ y = [285, -51, -38, 58, 93, -95, 106, 417, 247, 66, -165, -205, -104, -2, 70, -57, 225, -92, -231, 95, -14, -30, 15, -32, -85, -55, -118, 89, 209, 84, -121, -101, 139, -78, -89, -83, -280, 54, 184, -308, -52, 275, 11, -29, 106, -360, -85, 5, 98, -127, -305, 121, -366, -37, -60, 82, -76, -173, -97, -188, 46, -211, -39, 200, -9, 216, 31, -84, -145, 119, -22, -202, 28, -77, -154, -149, 10, 266, 64, 134, 96, 31, 218, -179, -104, 352, -35, -173, -149, 235, 86, 191, -386, 127, -139, -45, -112, 166, -33, -46, -51, -49, 168, -80, 308, -10, 149, -194, -52, 66, 68, -23, 210, 170, -17, -125, -62, 37, -130, -186, -305, -283, -60, 13, 256, 230, -130, -142, -9, 154, -147, 292, -182, -131, 19, 43, -32, -158, 5, 14, -107, -70, 335, 155, -149, -242, -11, -9, 140, -71, -75, -17, 207, 17, 28, 43, -12, 9, 57, 53, 10, 95, -138, 173, 218, 249, 399, 238, 207, 22, 274, 317, -94, -226, 121, 95, 153, -44, -238, -52, -121, -86, -13, 5, 317, -134, -19, -40, 62]
6736F2R0l32P5J67o7J93k53k39J53K79ok33L3J28L0K3N5l3r2j72k09L65K05Ol09
6761h1p8Q0J16j4j88L00j77J57k50K33j35O5Mk03K7K6O3J0j44K69k77r2J78O9
6785d2j01J76O5K8o2r4O5m4J01k51J1J31K0J50N7q8j31j73k09L88M3j55l7P8J71
6810I7L5l51J01J70jr7P0K73j77j60M6k03J74o0J61r0j98K94p6N5j96j12M25m12
6834b32L01K11n31J78JJ41Q7j94j05J50J88n1K1j15o6k5J36J05o8j74L1K24P0
6857B83j44k52J39J9k87M01k80J34R4o4j76O6m2K40j02K7k02L22M2k50J53K60
6879C81m69J29N9K04m06J45N3j53K52%j44j97M97o24K79l3K73o5pn6k5j91m5K33
6903I0j17K97m97J59K57l12o7L91k57q0k01J91P5j16L90l6m6J64j53j80J22J71
$$ y = [62, 152, -180, -105, 62, -5, 188, -65, -304, -151, 128, 122, -111, -78, 50, 80, 103, 158, 125, 33, -139, -348, 17, 222, 228, -81, -159, -79, 37, 23, -165, 135, -42, 115, -135, 98, -37, 28, 32, -171, -144, -118, -55, -45, -189, 80, -197, -289, -111, -42, -143, 33, 98, 126, 64, -30, 35, -9, 92, -159, -148, -17, 3, 153, 210, 122, -9, -182, -391, -3, 40, -115, -152, -74, 97, 132, -219, -118, 52, 51, -46, 24, 297, 120, -40, 6, -197, -23, -83, 78, -12, -210, 84, 8, 63, -133, -245, 180, -232, 69, 280, -251, -73, -72, 69, 156, -38, -143, 7, 195, 144, 165, 50, -16, -41, 95, 200, 132, -42, -11, 213, 283, 139, -113, 26, 45, -242, 159, -121, 13, 107, 43, -133, -67, -109, 131, 29, 56, -146, 176, 218, -32, 121, 381, -88, 41, 100, 304, -102, 43, 96, -57, 195, 195, 51, -146, 351, -273, 6, -27, 246, 181, 174, 118, 93, -98, -143, 90, -27, 270, -227, -68, 189, -123, -190, 201, -56, -136, -337, -146, -71, -187, 203, 167, 121, 285, 132, -48, 74, 245]
6925B45J0l92K27l4Qj59j9L8m6k9L3j57L62j06J34L9L50k09k07m1J63j89P1m23
6949c31K60J66q2M4J6Q8P0l34M1k04QK86K64m03J73p6k44M97k82J37m17K69k45
6972b99N41o52N91j91Q5m19K36K74k36K17k43K29m2K04j34l56M79m33L36k92J83
6993G8J90k38K09o2k36K94j35j25J28l46J50k8L5N4q2j15K22k57L22k14K22K79
7015C45l08K22o5j64mJ69k52m3K21j26N7j0K10n55O89k67R5n0j16p2N3qj3R3l1
7040G0N7k61K56J60l95J9J83p3o2J37ppJ8k34L26j38j36K12k77K98o6l7J81k69
7064d5L58m84Q3J08J81k82Q2k31M07l11N04j36m6j90K36l20K0J66m5J48k98L23
7086B28L7J58m77j06J34j00n7J83j18J15L2J01k01M2l9J31l8j28K16J02m62J68
$$ y = [245, 255, -137, 90, 56, 64, -95, -114, -76, -122, -151, -118, -275, 87, -19, 115, 154, 504, 295, 88, 47, 210, 21, 92, -331, -71, 95, 13, 57, 73, 161, 231, -103, -62, -266, -258, 28, 292, -111, 62, -14, -258, 239, -43, 94, -323, -54, -299, 242, -410, 181, -10, 75, -344, -108, 166, -70, 147, -96, 133, 91, 295, 161, -195, 284, -149, 187, -105, 78, 268, 30, 239, 177, -59, 235, 100, -25, 103, -243, -93, -121, -86, -32, -114, -229, -7, -264, 58, -156, 66, 345, 37, 259, 194, 30, 26, 195, -57, -100, 121, -5, 52, 42, 252, -303, 386, 119, 214, 164, 48, -24, 29, 21, 8, 101, 70, 127, -134, 122, 282, -113, -94, 89, 16, -46, 91, 84, 77, 95, -139, 187, 49, -87, 125, -152, 146, 80, 43, 224, -45, 313, -171, -88, 20, 201, -81, 1, -230, 177, -134, 370, 234, 188, -2, 234, -86, -66, 100, 55, 203, -95, 228, 265, 423, -54, -160, -26, -126, -183, 0, -118, -3, 29, 130, -71, -29, -68, 63, 25, -103, 113, 215, -247, -79]
7108g9N7J00J43j40P6j77J15j10k12L02M3k08q0L40l73J74j00J27J0K6J5Q2ml32
7132b05M43m78L96k15Q8p5k6J73j98j1K17Q3k38j96K24j62j61O74o73L48K12l07
7154h7K27l58l6L54Q2k27K27K9l80J88L33n2k68j9J17k10L0k2j88L7j19J43L8
7177a61K65j38j54K61o3l27J72K79k14J23j92J2K85J47l43J69j17J59k15R3R7
7198A38m4r9kk49L5J30j28K63N0P4j99j37L87j97J41r1J3n7K2L21k84k17K66l23
7222a87O1J00J07M5R6p5m1k79L15p0R8N6o34M20J47O1k59J05j06K52j18m7J27
7245A74l09J36J15n4k12K74l01K78O1p2l9R1j49L6j54L64q7L0l66M25m28J64P4
7268E1j88L9K81j20j18r2J56n0O2J84l69M02k11K77l52j68L49m8K57l55J88k89
$$ y = [-79, -22, 78, 221, 81, 157, -20, 95, -15, -227, 75, 118, -90, -170, 170, -203, -29, -129, -2, 8, 34, 49, 131, 127, -205, 238, -240, 156, -59, 29, -46, -72, 101, -97, -108, 109, 192, -46, -242, -18, -180, -341, 333, -340, 8, 220, -87, 140, -218, -254, 100, 182, -45, 182, 211, -169, 19, 352, 300, 32, 13, 130, -80, -50, -72, -260, -223, -342, -199, -161, 104, -34, -188, 73, 10, -317, -145, 134, -80, 43, -149, -137, 148, 295, -48, 121, 4, 163, -52, 41, 138, 94, -5, -7, -256, -221, -91, -219, 44, 94, 168, -31, -168, 219, 22, 163, 72, 85, 28, 50, 371, 87, -130, 136, -187, -126, -26, 81, 126, 222, 147, 106, -173, 142, 72, 170, 226, -408, 12, 159, 220, -39, 66, -40, 212, 94, 47, 174, -135, 1, 116, 62, -150, 124, -177, 101, 162, 90, 51, 142, -7, 29, -125, 239, 152, 182, -184, 241, -187, -23, 51, -137, -98, 183, 63, -55, -147, 9, -41, 21, 205, -164, 238, 27, 304, -48, -216, 133, 85, 342, -13, 175, -114]
7290a14J89MK35qq0k21J55Nk02j51J75J62k44J92J3j45j11K92L7n71M57k0l55
7313c06J84k27L40r9J81K24k46n3J12J71k32K35q6k12J30L26o22N4K27J73k57
7334A7j29N4o2r3j2K72Lj74J10M12k97J31r3l66L96n1j59j71K56k11Q1q2K75j75
7358f8R3j46K25j26r7nq2R3P0K4k12K12k3j86J42j6rJ12N9J34k09L38l12K54J33
7383C98m86K14oQ0j58n1M8J75j87l9K20j32j11m7l69L96J89j56J38k21O8M2n2
7406d7l62L84K1m2Kmj18K79p3j09J81n42K64K08P8j94J58j8q1J31O1k07K19l56
7430a67j7K32j73M02k11P9j87K69j26l4J37j05k09N6p5Q7k8K16k18k40K07L80
7452B75m34L5O1K9j0K5R5j06j36J53R4j34O8j16J83j33K07J43n06J64L07l50L18
$$ y = [-114, 75, 79, 314, 306, 226, 5, 160, 165, -37, -188, -13, 149, -95, 97, 110, -35, -146, 146, 183, -388, 69, 49, -306, -122, -349, -9, -108, 73, 297, 51, -2, 110, 281, 49, 284, 198, -14, 116, 442, -180, -126, 101, 274, 17, -112, -58, -120, -213, -225, 47, 50, -124, -14, 398, 101, 232, 139, -227, 169, 118, -41, -212, 44, -167, -86, -168, 107, -68, 25, -121, 104, -22, -119, -124, -206, -113, -43, -19, -231, -19, -42, -228, -86, -102, -111, 1, 60, 194, -15, 323, 11, 265, 398, -88, 126, 120, 200, 42, -9, 39, 214, 27, -12, 208, 76, -35, -82, -451, -55, 134, -22, 116, -105, -37, 5, -47, -409, -25, -4, -46, -44, -48, -166, 113, 40, -69, 112, -430, -166, 42, 120, -74, 84, 66, -15, 116, 177, -30, 189, -167, -184, 48, -125, 277, 66, 145, -42, 227, 101, 67, 204, 99, -110, -54, -129, -42, -70, 146, -72, -312, -105, 275, -159, -124, -63, -34, -44, -19, 76, -30, -166, -13, 81, -53, 15, -101, 82, -51, 156, 299, -207, -43, 264, -86, 232]
7475B32j61k02J60R7k13j58J72o2K15j78q3K61O0oM0j41q1j31l1K54k45j03K26
7498g8K16k03k14N97n8M0n61K05q6L69k00j27j44L96l40j2Q8M3J94j60K01m56
7520b90K47K23j25k57L25J67k66j43K34M9j4k93M29l36k4J66r4J6n4j25M26k48
7542A3J16N6k33J44k9J93o48M26n9l6J57j47J08k60Q8K79l1m9k8m0k93L75m6r2
7566c6J70j60j43J29L2J3j51J39J3m6J39lj56J26l5J28j11j27m2k11J79N7JL34
7590B39j74j35J18m96K15K22L2Nl8m2K09j88P5JJK8j03O4K62j51Njj83J01q9j08
7616a31J20j01j14K73Jk42L18N1j56k92L04K8k5p8N4q8Ln7j19L24m4k09L10k73
7640a43oJ06j09J61j71P7j7k3L31k08J34k7J03r8k50J29R4K4j92n4M7n6O2k0J93
$$ y = [232, 71, -131, 29, 126, -87, -245, -73, -135, 80, -98, -181, 80, 140, 134, 174, 33, -48, -179, -210, 44, -201, -304, -78, 138, -65, -279, 318, 260, 300, -261, -56, -142, 227, 27, -100, -244, 152, -188, -200, -112, -69, 125, -35, 166, -290, -43, 180, 55, -202, 123, 290, 24, -119, 115, 164, 150, -143, 286, -50, -74, 92, -2, 14, -40, -165, 261, 13, 129, 185, -48, 96, 67, 260, -388, 38, -21, -57, 100, -47, 61, -199, -111, 168, 137, 88, 60, 20, -273, 102, 56, -36, 134, -26, -169, -40, -8, 5, -146, -7, 6, -40, 99, 96, -60, 66, 31, 159, 48, -79, -121, -332, -153, -96, -95, 239, 65, -70, 48, -448, -233, -11, 21, 26, -12, -54, 155, -33, 42, 43, 44, 72, -31, 33, 295, 144, 149, 148, -35, 66, -23, -131, -11, -112, -226, 47, 48, -194, 124, 175, 19, -273, 31, 59, 34, -44, 10, -78, -75, -132, -251, 73, 29, -180, 130, -143, -149, -43, -152, 9, -162, -85, -102, -125, 206, -2, 132, 105, 208, 110, -140, -11, 83, 107, -85, -139, -92, -148, -86, -106, 87]
7665H7J78m75J18K52l1p5l31Q5K02k47M6R7P0J62L7k78K33q8J4R1J19n56M40l41
7689a91L26l21K41k4N6N6k00k5N6J0L3J52j9l51J3J50J70q6k22j59M43j19J77
7712A66k32mj53P5K96k39J43J92m91J04n3J86J18j54l4K41QK3k97P6Q1LK81l18
7736A8m1Q5L31l94J39m32L76k78K05J1nN4PK39k64M8j13K00k04k3J02j36O0j56
7760a71J71L9L22m46K82r6k6j07O4j67J00K05P5m85L38j21r5N90l41k11J41q5
7782b4j63o8L57Q4l55K12k43K35k47N21l37K14P3j96l5r5L20j20k56J36j7r5j40
7805b39K35j10N7o6l0K72O0m01K2K01OJ57k35K54j08j30p5r6L36J11j97l80J61
7828a95K9N9K47l92J14J70j6R2l73L16K73j66J0m35L83m00L31J71k01J74l57J30
$$ y = [87, 265, -210, -92, 160, 129, 54, -277, -192, 10, -237, -191, -94, -24, 138, 175, -103, 130, 42, 56, 147, 266, -290, 150, -191, 135, -186, 55, 31, 87, 143, -57, -82, -26, -16, 17, 169, 150, -201, -188, -38, 132, 46, -176, -335, 108, -11, 166, -66, -70, -223, -148, 148, -91, 52, 244, -247, -143, -196, -10, 108, -46, -80, 161, 169, 192, -105, -29, 52, 55, 336, 18, -23, 62, 393, -1, 138, -294, 82, -196, 9, 20, 15, 69, 76, 315, 51, 99, -14, 186, -18, -41, 61, -75, -15, -171, 0, 39, 361, -85, 197, 101, 75, -32, 32, -135, -35, 170, 245, -240, 98, -23, -118, 472, 131, -80, 61, -24, -187, -255, 102, 186, -169, 43, -200, 35, -212, 309, -28, 186, 259, 63, 28, -67, 253, 133, -123, 13, -4, -99, -239, -4, -114, -57, -123, -153, 119, 179, -222, -200, 1, 7, 164, -71, 183, 75, -55, -130, -226, 110, 221, 24, -356, -195, -166, -107, 140, -252, -138, 32, 16, 108, -265, 51, 324, 158, 168, -267, 116, -284, 47, 218, 17, 191, -166, -36]
7850c6J80j46k60n4K61M1l9N1j49Q2k3J53r3J14O9k20K31rq7k39L82l44L85j54
7874I6l5k83M74J4k85P6k1M7q2J97j82j59K95k23N8o9k06L94O7k1k02J66k43K81
7898A54J08j24j75L2K92j47l93O2k69L37K22k7o2k62M61l69K2J63j51M4K08j86
7920f0N3j70P5J54n9j20K77j44J04j76Rj75K71J10j29J88m39K49J29oj66J29r7
7943GJ7L3P5j94J53k52J08K67l26o4J21k74N25j38j6j49K26n8j05K78j42k10L23
7966B05O7k41J65k99J78m4J94n12K45K55k29R9j83P0J87k22N5L17l03l9J56q9
7988C2r6K39l53J71N4J70m57M92k70p5K70r0j37j49K81k49J84K46k36oo2J22J10
8011A91P8j51j44K6m7J11K9k87R5L32k81j83M59L5k97L00m38mJ40p9J54o0R2j69
$$ y = [-36, 144, -2, -262, -316, -55, -14, -53, -2, -151, -69, -92, 61, -32, 82, 151, -69, 162, 153, 66, -173, 209, -135, 250, 96, 61, -222, 252, 266, -19, 57, 36, 83, 1, 198, 16, -143, 152, -71, -13, -82, -288, 106, 173, 152, -50, 116, -127, 154, 262, 138, -37, -5, 287, 140, -253, -191, -460, -123, 99, 72, 10, -252, 209, -160, -138, 25, -126, -82, 126, -60, -7, -177, -102, 52, -7, -127, 150, 6, 110, -66, -57, -232, 39, 149, 20, 208, -231, 18, 147, 141, -25, 104, 7, 24, 57, 132, -62, 91, -161, -53, 214, -112, -176, -55, -329, 196, 58, 42, -107, 119, 61, -44, 234, 92, -118, 205, 272, 31, 196, -103, 75, 31, 225, -287, -42, 213, -16, 83, -100, -30, 157, -65, -10, 307, 4, -35, 121, 32, -64, 175, -178, -7, 47, 217, -240, 252, -18, -93, 177, 87, -50, -199, 82, -167, 17, 263, 27, 21, -41, 81, 191, 269, 118, -26, 0, -47, 64, 93, -194, -99, 233, -48, -231, 228, 263, -34, 266, -172, -176, -36, -115, 39, -21, 71, -98]
8035i8K33j82J31m6J62o55L63J92J10k20J17N0p3K8J13j19n6%j33N5k4K1j70K02
8059Aj67O5L8K9K3L8j55K81N5j96J37n7j07K3K82k70o7K43m03J50K79l09j5J86
8083H4Jq6K16l25K14R6k28L5p1L8l59K60L03J34l04n5L9M8k36M40j73p3J53j01
8107E0k96K81J35o8l60M18j38Q6k76K36j61n7N1K17k24K95j39R2o1j10P7O0K31
8130C39j07l23j84L93j36M0j29M9J57l18M23j77p6L4K23j67K02j51j63M9m9J48
8152G7m8J83l61M79l98M7M6k34J38L32l5l43J83r1k4J32j06J38L0K90l95j93J96
8175D3k27J89k70O1M92m57J47J72m93L13J96J9J5q7l12L2
$$ y = [-98, 135, -47, 84, 38, 200, -455, -92, 100, 210, -10, 107, 157, 84, 112, 225, 106, 50, 50, -83, -28, -52, -31, -201, 1, -166, -101, -63, -34, -11, 27, -128, 153, 208, 12, 149, 92, -15, 8, 290, 20, -47, 196, -207, -57, 222, -87, -102, 84, 85, -1, 215, -110, 104, 200, -28, 7, -64, -26, -385, -125, 178, 312, 8, -47, -8, 40, -196, 244, 71, -2, 151, 50, -246, 35, 170, 102, -258, 160, 22, 108, -168, 68, -93, -150, -99, 118, -106, 189, 50, 142, 81, -29, 48, 108, 339, 232, -91, -275, 118, -18, 22, -107, -58, 99, -219, 204, 27, -49, -15, 208, 41, 243, 92, -71, -22, -71, 77, 29, 212, -149, 330, -68, -21, 25, -209, -71, 261, 226, -117, 66, -25, -49, 83, -23, 115, 145, 435, 40, -153, 43, -184, 5, -265, -204, 288, -169, -22, 150, -343, -30, 166, 185, 200, 113, -199, -167]
8191a67
$$ Imaginary data points
##PAGE= N=2
##DATA TABLE= (X++(I..I)), XYDATA
0@%%%%%%%%%%%%%Lj0J5j6J6j6J6k1K9l2L5m3M8n3O1o9P9q8R9j13J27j42J57j75
37i3J96k17K39k65K94l25L61l99M41m93N49o11O85p72Q78j008J170j380J668k087
57a169K752l986P039k6994n6845L4468N7017L2418k0838l7481r230L5103L4269
70D6523m836l6002k7182j647K4772K5644O047j1181j2741r624K377J2008L481
83A7639j7422j7344K137J9941K1263K046k2442j9424N203J5033K064j1157q253
96a0716P948J8001O149j2655j0541K889M916j570o951j966J1972J5606j694j7528
110C860r063P167Q770j161j1156p882Q476J6991N378j0048j2883q800L63P441
124b547L908k011k439k323R38R022P747q630j8674r625Q882K0956J2622j1201
$$ y = [0, 0, 0, 0, 0, 0, 0, 0, 0, 0, 0, 0, 0, 0, 3, -7, 8, -8, 8, -8, 8, -13, 16, -16, 19, -24, 24, -29, 32, -37, 42, -46, 53, -60, 67, -75, 82, -93, 103, -114, 125, -140, 154, -171, 190, -209, 232, -261, 288, -323, 362, -410, 468, -540, 630, -750, 918, -1169, 1583, -2403, 4636, -22358, -79203, -44735, 12282, 44700, 23862, -13619, -22849, 12254, 46523, 41687, 5685, -21497, -23144, 1628, 27272, 33319, 22138, 9397, -227, 2150, 14158, 17639, 217, -17127, -14990, 4951, 26214, 28260, 5818, -13606, -8403, 6630, 8694, -2463, -10716, -2768, 15233, 21382, 8727, -1814, 1075, 5991, 4421, -2530, -4496, 7476, 23082, 21388, 3860, -5203, 1964, 10734, 9573, -1583, -9465, -989, 16002, 21380, 11332, -1551, -10351, -9988, -2547, 1361, -650, -3089, -5412, -4474, 4548, 12295, 3665, -15009, -24634, -15752, 5204, 17826, 6625]
138F625j9111K23J9502J2225j0144k2513j0541J7569K5423M061j6450j3186K991
151c326J1777O239j0261j4430l80J2297J0533Q60n799q751l674K660L672O04k381
166c60m937n01R486Q887l052j2306r780J820J2661Q369o992j0735L268J2526O725
181A5079o525j4509o352R532J2231K22p626k487M538O145j348r001n447K384N007
196A843K10J17P14O10k26k705m738j761J648L58L3K280K382k32j451k267q88O09
214c464j988m007K515P613N041k320o941m025M457P741j610r703m220P120J1687
229G896L997q217j1879j438R115O483l154p593l586N234Q991K138o560q023l439
244a0035K805O745M009k964n952q21M088N906Q54p247q907O18R937Q207n28q672
$$ y = [6625, -12486, -12263, 7239, 19464, 9320, -13193, -23734, -6165, 19258, 23319, 6869, -6317, -3326, 8451, 14690, 4429, -10001, -10381, 1916, 12449, 13309, 7510, -1241, -4915, -2255, 1417, 2021, -360, -5297, -5798, 3688, 12575, 9523, -2783, -12563, -10743, 1918, 10287, 3295, -7440, -4172, 8354, 15079, 8554, -5955, -12307, -2775, 9456, 9678, 2052, -435, 4103, 10248, 8900, -101, -5548, -3164, 1843, 2053, 2170, 2884, 3494, 3268, 563, -4175, -5936, -4288, -3930, -3897, -1617, 765, 533, -918, -3185, -4073, -3464, -5452, -9459, -6944, 669, 5710, 3390, -3551, -7576, -3119, 4622, 3012, -6691, -10911, -3791, 7896, 11893, 3676, -8203, -9641, -526, 5957, 2803, -4790, -8376, -3142, 5849, 7987, 1427, -6596, -10035, -7230, -485, 3524, 560, -5392, -6213, -2125, 3781, 4635, -2612, -11519, -10901, -964, 7243, 6715, -1957]
260a957n394M397Q262N25p427n574J929P987N506k433n639j486K142R80j440j587
276a209j16K200J899o4j059K54j014k093j514M4O36K292J157p11m6j30j976j056
294b506Q83R24K08r47j94K587M074n1n731m550J576N663L531k578n480n60O562
311C411M487l139o684l785K625O378K403l669m128P50K540K070j324l859l066
326d990R48L573L063O26k563m016Q2L314J549j457l418j552L157O177R98m724
342G67m563L47M307K682k340m414M04M328L710j321m287k842J459L037Q07k717
358f36j353J660J297J310j004k722j242P50N74J188L40l61j156O31J033l6r39
375f66j766r05K243L045r4j560j242P82J867m6k349k384J911L400J037j889j766
$$ y = [-1957, -7351, -2954, 5308, 5833, -1594, -7168, -5239, 2748, 8254, 5821, 182, -1304, 838, 1818, 378, -1209, -1325, 875, 2774, 2710, 1651, 1905, 891, -1202, -2716, -2672, -2036, 256, 1413, 702, 656, 526, -1450, -2506, -1623, -699, -491, -1438, -1632, 955, 5029, 4978, -753, -5303, -3727, 1936, 5467, 2889, -2591, -3151, 3411, 7898, 4759, -1925, -5710, -3085, 3293, 5696, 2027, -2101, -1351, 1189, 3259, 1935, -1924, -4990, -4042, -469, 2594, 3220, 657, -3359, -3277, 37, 1586, 129, -3289, -4841, -1684, 4493, 5491, 767, -3796, -3449, 858, 3540, 1200, -3214, -2810, 1518, 5228, 3907, -380, -3222, -1763, 1274, 2081, -636, -1989, -329, 968, 2278, 1274, -1448, -2690, -1940, -1366, -178, 162, -199, -1355, -724, 309, 273, -666, -2432, -3337, -1094, 1951, 1857, 297, -945, -163, 1704, 1658, -691, -3075, -1164, 2236, 3273, 1384, -382]
392c82k72K359R33k685k757N81L082J637J33l064j146P50J381j36j458j325N32
409a837J563K074L44k348j994l49J065K544L18k206j449R67L285J657j856m166
425b388j457K612L629N21k683k520O97L654J693k760l650j071K344K839Q03j776
441D87k126Q3J580L71k96j480j230M68J458J731m7q33j353l73J094R20j083p92
459a421K64J233J389K05j571j039R37R63m82n77q46J300K062o22j513j177N69
476c26J195K15j600q33O97K500M78j210j779r71Q42J892L68j289l66m45J141J489
494A998l06j430j511R3J692J510J90j564j516R80K012M10j690k002o67K199K800
511C198k54k332j543M59J673O12j383j816k32J893J102l23j167r24J62P28J71
$$ y = [-382, -654, 1705, 2638, -47, -2804, -2223, 859, 2496, 2629, -435, -1581, -831, 550, 414, -1044, -2369, -1837, -274, 1800, 2144, -204, -2198, -2547, -1482, 1062, 1380, -826, -2275, -1308, 1977, 3634, 1778, -2388, -3845, -1233, 2396, 2917, 234, -2286, -1589, 2065, 3758, 998, -2652, -3723, -1379, 1460, 2263, 487, -1639, -1556, 24, 395, 99, -1381, -2611, -2143, -685, 1046, 999, 166, -1187, -1560, -466, 454, -629, -1421, -1157, 76, 1465, 1670, 99, -940, -3, 960, 478, -99, -945, 355, 2417, 1795, 282, -895, -326, 869, 1084, -516, -1349, -652, 1848, 2326, 1116, -663, -1634, -792, 1100, 1468, 179, -187, -632, 509, 1998, 1692, 262, -1249, -1156, 536, 2046, 2236, 672, -844, 136, 2148, 2558, 868, -1134, -1801, 398, 3198, 2944, 612, -931, -472, 1201, 1813, 430, -1386, -1618, 275, 1377, 1054, -113, -1037, -875, -147, 24]
528B4o50k14k21O10J085K60j048p83l62P53N85o0l48q97J361J057P4j401j283
547a458N15J090J136j135j079p2J510P00o62j634q93J025J167L02p82n53m5J203
565C35N56p59j584j30J149O97R22p25r78J55L06P41j69q99r42Q25J338R23o88
584A073j196n72P98J159Jj586q54Q74J409P90j074j659o80J461J038J56j686n71
602a119O39J025R20j261j079m47K01J314N29q04q95L16P00O41q8j440p65N96J303
621B86M35m45q94m21P04J234n95j100m98N51R20N38p91j220N40O39L21o03o29
640a028k91N54P11K97r11J8m4N02J05l92n69J36J007L70l21k73l00k8O06L80p37
661b08j54m8Q19O10k7r35q49k2J261O40o58n42p45J346Q20K0j337j180J75J027
$$ y = [24, -626, -840, -1061, -451, 634, 894, -154, -937, -1299, -546, 39, -21, -369, -1266, 95, 1152, 1226, -175, -1458, -943, 147, 1283, 148, -931, -1003, 507, 1207, 545, -1089, -1982, -957, 210, 512, -270, -823, -868, 335, 891, 132, -1452, -1582, -433, 264, 1186, 461, -517, -362, -56, 685, 516, -383, -1325, -500, 838, 1761, 1073, -123, -695, 103, 1262, 1263, -323, -1177, -303, 1106, 1896, 822, -837, -1517, -56, 982, 1138, -548, -1119, -480, 545, 1465, 204, -875, -1322, -1121, 193, 722, -82, -977, -661, 39, 680, 592, -848, -1613, -1017, 286, 721, 276, -618, -1039, -335, 899, 304, -796, -1294, -743, 177, 715, -76, -1296, -756, -117, 204, -399, -1028, -1319, -765, -54, 243, -668, -650, -694, -192, -87, -479, -1048, -912, 95, 465, 144, -129, -429, -457, 149, 529, -208, -362, -410, 409, 1019, 992, 57, -792, -814, 447, 1087, 429, -113, -858, 488, 1308, 1328, -9, -1189, -1014, 13]
681A3J204l85j111n63O42J302k1p84j179J4J168R81j63q35j102N94R00K51n98
700C28q04m2M12Q49J28l47r82J69K43N22k66n77j29K66R54j67p01j91k0N12J00
721B57m50m3K28m2J41K04o19k06K06L83K96o03j75L49N85r2l17o13l61R00P6L46
743D50m30p35J97P71N12o41o08k64K70J303j54l90j017K36O63O01m46p25l03L07
763d03J256j19l43q94l10Q56M83N0q99m89N85O66P82p21q63j38M77P42j72l30
783B16q07K39P32L23k01o98m15L04O84J14m17m26K9P79K42l47n71n55L58O91J44
804D18m98n36K91O18j98K17p98J67K2M70J08l07l56jP74j51k70l98M7K82N63j93
826B71l95l55J35O23J11o31l36J59P98K43m69l51o23P90M49Jj96q04q5P31M11
$$ y = [13, 1217, 832, -279, -842, -200, 1102, 1081, 297, -882, -868, 300, 1281, 1118, 283, -819, -225, 675, 926, 328, -476, -518, -106, 743, 871, 524, -458, -289, -46, 476, 210, -367, -496, -230, 724, 557, -144, -335, -355, 157, 257, -193, -236, -8, -50, 91, 295, -324, -530, -324, 59, 355, -248, -423, -74, 511, 419, 102, -511, -872, 28, 104, 450, 20, -715, -518, 253, 765, 124, -484, -748, -478, 825, 671, 281, -736, -500, 163, 764, 318, -407, -710, -403, 853, 734, 391, -503, -813, 43, 526, 576, -323, -812, -227, 439, 1221, 500, -363, -501, -24, 718, 546, 216, -591, -352, 380, 703, 502, -196, -611, -307, 377, 491, 74, -352, -323, 456, 698, 351, -220, -775, -417, 274, 418, -80, -616, -325, 293, 95, 312, -486, -319, -297, 173, 281, -26, -382, -383, 391, 240, -30, -428, -381, -99, 464, 271, -124, -479, -344, 279, 390, -241, -577, -418, 380, 623, 154, -197, -820, -30, 419, 420, 224, -580, -665, 66, 477]
847D77j45o69j39l0O19O63n50q37j41L95J011K19n69r76L96O23M30m25r20j55
867g23M39N92K49k74p02j93N78N25J42m34o11J30O79J04o5p08n08Q67O04k13l34
888A44n77J91N56P8j32k91k67L27K48k14k19J11k07N89j33j00j64q2J80M42l44
909A36l85J82J81K2m01N8j80J72M25L32l12m63m62N31O89n47l52K1J03M52K96
930D98k25p45J52L02O37l79l77p42K55N18M02j17k07p38M75Q19O0m54o24Q9L05
951i6O06J76p77n73J29N31K80M8p51j48O71L16L3n04p56L32Q31L27n76m69n3M25
973BL77J34l41n73K11L69K50m07L8m90M95L67j87l96j19M33j45K47m3l86J95L61
995C92k18Nj16l33K25M21j98j31q2n1J35J76r8n52K58N8K99J65m05k95M1M02J45
$$ y = [477, 332, -337, -476, -506, 113, 776, 226, -611, -752, -357, 654, 873, 304, -672, -276, 347, 777, 352, -568, -723, -284, 308, 557, 283, -419, -612, -34, 491, 633, 199, -412, -282, 397, 501, 436, -272, -780, 87, 691, 478, 144, -433, -242, 314, 392, 260, -31, -298, 29, 277, 63, -156, -45, -252, 337, 204, 104, -60, -142, 38, 480, 136, -249, -67, 114, 136, -265, -207, -387, -215, 210, 542, 230, -233, -695, -164, 525, -22, -374, -353, -250, 202, 498, 273, -472, -320, -18, 619, 240, -137, -879, -624, -106, 296, 179, -28, -766, -291, 528, 588, 134, -490, -401, -96, 510, 686, -91, -664, -535, -4, 276, 324, -427, -575, 96, 412, 445, -59, -815, -483, 348, 675, 99, -370, -423, 2, 379, 513, 172, -401, -190, 179, 429, 22, 60, -430, 65, 432, 245, -151, -270, 163, 18, 265, 222, -164, 31, 392, 174, 179, 63, -270, -45, 376, 178, 47, -35, -86, 49, 225, 127, -425, -167, -109, 190, 355, -50, -345, -304, 98, 243]
1018B43j58l32k23J86O72Kj58n75j0J97N65n7o77j08M58N54k76k23j53m10N28
1039D5M02k73j68k00j36L01K64k02l75m2J78M62L01k72o74o4N32J4K94m61k40
1060c14K56K47l3P6k52j26r0M00J93k91o72L85K94L52m1n87q2J62N54l73k46J47
1082d1J62K49j01m32K01j8K33k71L25k00j53j24L03k9m49M32l34N45r6m98K58
1103c8r8K00L41J09n79l42O95j19K29n18l1L8M9L84k92q2J2k56J71O87l64m33
1125b37R2k1J05L71l79m5k53M10L27m28J08k39k49O59Q4l09l68K81J79J56j19
1146A25j93o0l02N18K29k29k41j13M58rM5q1l04%L34p3J9m14L56P8k34M79l54
1169C4m6o1J5K92j46o1K00l90M89j77r6Q6l56O80l94O6l32J46J11j76M08j59k30
$$ y = [243, 85, -247, -470, -284, 388, 390, 232, -343, -353, -156, 409, 352, -325, -433, 25, 579, 303, 80, -73, -483, 45, 447, 174, 6, -194, -330, -29, 235, 33, -342, -384, -206, 256, 557, 285, -389, -453, 79, 93, 387, -74, -314, -58, 189, 156, 232, -20, -146, -236, 164, 357, 66, -606, -221, 73, 425, 384, -203, -285, -123, 431, 58, -188, -41, 121, 370, 269, -163, 38, 20, 253, -18, 307, 107, -46, -170, 133, 104, -345, 87, -247, 298, 202, -296, -38, -136, 64, 405, 514, -65, -407, 288, 169, 398, -120, -151, -113, -64, 320, 28, -54, -42, -298, -127, 560, 196, -237, -145, -166, -61, 310, -69, -114, -367, 43, 370, -58, 50, -189, -438, 221, 305, -4, -372, -91, 88, 244, 125, -68, -128, -430, 88, 317, 88, -153, -266, 192, 183, 228, 147, -157, -157, 177, 104, 123, -291, 65, 143, -91, 388, 34, -12, -73, -58, 234, 88, 27, 227, -163, 326, 149, 53, 139, -217, 463, 69, 135, -197, -51, 60, -116, 292, 133, -97]
1192i7J7M77k11k7M8j72j15K32k07J64l60L93J70q7j85J2k83J15L34k8o7j33j50
1215a60j7L70nm49J15K56K5j5n2j69j93O30m29K60k06K78k92K01K46l24o8k07
1237b05K4M97l61O3N6Jmm30N43m69J2L78QJ78o41L00r2L79r4j67K51l8pr2%m2
1263D8J46l3l1l10n2J90P9j94K43L3J82l05m6M1J8o4J61r8J4J49j71N6J17j22
1287E1J42j06J65j57l08K80Q1p7m44K84O0J48ol73k28L27M54k27Pn0m42N74M2
1310A97j16j28R9j56P9Mm7K03k29j29K28Km2l03K36J05p3L57l96q1J66p5K12M3
1334A56R4n05M1O96o62j50L88o7k1J20k44J96j12L1K21k00j10p3N5L56q1N7m01
1357b15j30L60N96o10N6j4l03L68k94K40j18J54n1P6j15J05k17J67n9J25j33j28
$$ y = [-97, -80, 397, 186, 159, 207, 35, -80, 152, -55, 109, -251, 142, 312, 225, 40, 52, -231, -116, 218, 190, 123, -10, -160, -177, 193, 188, -261, -146, 110, 135, 120, 68, -101, -294, 336, -93, 167, -39, 239, -53, 148, 394, 70, 2, -205, -181, 316, -45, 18, 74, 75, 71, -359, 184, -285, -273, 105, 113, 291, -350, -50, -142, 237, 143, -24, 227, 189, 182, 90, 90, 48, 194, 161, 130, -180, -232, -42, 37, -157, 86, 119, 301, -4, -50, -9, 9, -55, 106, 8, 22, 171, 0, 56, 173, 51, 193, 87, 252, 95, -213, 67, 148, 71, -373, -89, -29, 119, 113, -260, -488, -161, 293, 66, 73, 23, -419, 155, 197, 81, -47, 52, -104, -25, -21, -68, 135, -94, -223, 5, 7, -35, -338, -102, 3, -70, 287, -109, -190, -24, -99, 113, 156, 250, -255, -214, 482, -180, -330, 58, -9, -30, 90, -154, 42, -70, -39, 182, -18, -128, -201, -146, 210, 129, 186, -215, -345, 15, 611, 1, 57, 43, -260, 108, -186, 54, -64, 90, 39, 115, 0, 105, -112, 55, -4, 121, -12, -140]
1379a40RJ27Q7N3Q7k52l02K05J36L43m29j12K11n4K22m07k8L18J10j52K49l49
1401f8m8J47J80j59J04j88l3l0J00M1m25K78J90n7K9j42m7N3M79n15J48J52l01
1424a12j48N15l35k03N80k46K55k83q9J42k77q6L61j3K89m64n3R6j0L30k10j42
1446a03j7QN13n83L54J76l54J39k44M6k37K13J64j54M48m95J86o0j03L72o26L21
1468c6N2J71m7J4j34J53l49K49J11o2n6l98L79Q1l10R8j03K05k5rj4j6j16JR9
1493f2K78l98J39j10N9K59j2l76L51k84M68k69j26J94Q4j00p3l19J63J93j19J38
1515G8K74j58l27K92r1J99k17J35m50K36j05Q4L13j43M3K06k31Q9o8o4J2o0k53
1538b06o1J96j16L8J30N7j29r2M13J43n30K97o2K1m0j79P6J68q8J21J07k66J92
$$ y = [-140, -131, -4, 83, 136, 223, -29, -331, -126, 10, 353, -76, -188, 23, -31, 191, -216, -244, 74, 184, 32, 281, -68, -116, 31, 211, 52, 156, -32, -65, -95, 5, 46, -379, -101, 89, 32, 61, -81, -128, -75, 404, -111, 37, 189, -112, -260, 255, -80, -283, 297, 51, 306, 23, -66, 76, -201, -287, 74, 61, 350, -114, -167, -71, -81, 249, 39, -103, -120, -112, 401, -182, 172, 348, -6, 133, -111, -65, -302, -89, 75, -79, 369, -126, 60, 0, -103, 269, -357, -36, 16, 187, 140, 154, 20, 173, -176, 73, 184, 122, 66, -332, 47, 128, -182, -84, -187, 18, -7, -16, -30, -46, -162, -161, -62, 216, -182, -43, -153, -94, 165, 153, -223, 128, -156, 312, 43, -83, 111, 195, 95, 22, -297, -134, 59, -60, 78, 352, 194, -133, 159, 68, 267, 50, 185, -265, -29, -134, -50, 263, 120, 163, 369, 138, 227, 159, 95, 107, 47, -206, -267, -71, -187, -149, -19, 38, -91, -183, 230, 373, -157, 140, 78, 99, 59, -120, -44, 124, 36, 157, 264, -2, 190]
1561A90k88l73O47k07k72O39k56J5l64L22Kk73J0K25pJ68j94lJ78k71M4N46m98
1584b0r1J26j44J12Mp3J21k8N7k3l27L31K0j16J21l16J33O5j07K0J40k35K51j83
1608a62J01Q2j17K71k75Q0M81l97k10L7k4K0J5k8j53O9L07M0l51K8L30M8l15L16
1632A93l09L43k94J92R2m14M67o74L69jJ37%j43j6r8K96k42m0Q2N0J38j42r1K48
1656A43m6l52J88L08l30O9J33n1R6l60K46j90J82k5m0p7J1n2K25P9J62n33L04
1679I0j79o6q9J59r4j3Q5J92j90K03j67J76q7J7N4P9j13j47J27J53m53L4J96j7
1703e0j2j48L08j02Q9k20K78j2j75NJ14Oj07j35K30KJ35q2J26l91r3N06o7j92
1727A3N6R6j3o5l2N0l12M93j92P6j57k31K58o6k19J40l0l77N89j79o8K58J21j87
$$ y = [190, -98, -471, 176, -31, -303, 336, 80, 95, -269, 53, 55, -218, -208, 17, 10, 178, -16, -19, 159, -112, -68, 478, -20, -111, 15, -129, -17, -13, -86, 35, 7, 64, 41, -286, 45, 65, -51, 70, -246, -113, -48, -155, -135, 5, -230, 21, -162, -61, 21, -96, 175, -100, -20, 461, 64, -146, -109, -133, -113, -98, -126, -279, -210, 97, 137, -214, -186, 144, 192, -123, 193, -116, 227, -67, 125, 217, -197, 270, -404, -35, -36, 101, 101, -42, -58, -156, 140, -102, -142, -60, -10, 128, -14, -105, 143, 97, -255, -67, 241, -89, -20, 113, 62, 158, -202, 44, -146, 36, 11, -29, -106, -95, -147, 78, 157, 319, -214, 90, -89, -155, -244, -85, -179, -192, -107, 85, -105, 98, -69, 107, 20, 37, 91, 170, 57, -90, 37, 190, -263, -229, -33, -50, -62, -210, 98, -4, 85, -135, 143, 131, -44, -39, 75, 81, -26, -161, 69, 71, 206, 124, 250, -141, -234, 272, 205, 13, 69, 165, 152, 87, 55, 105, -207, 286, 94, 170, 13, -218, 40, -26, -245, -105, -135, -512, 77, -102, -170, 88, 209, 22]
1751B2P3k16K45j2j45R4J32j84L17m45Jj06L45j11R6J15j71P7k07P8J59k75J08
1774a0J65q0K06n03J07jK85m79M42j27K09l52J99r1K2j21K14j60J7M8j94K98p3
1797B1m75N94r9j3L1L4j19J61j51L8Q6k33r0Q4Q9J43J72k12j67k9j1L78j61Q6
1821A57l23K55J50l81R1J63J47m84K99o6P4o6j84M9J56j13J86k23K22j95K15k15
1843h6j62L61k99M64k54K41k12O3q5K21M2j49k44K43k93R6l4RJ68l50K68K61j17
1866A52Q4l48Q2J20k86J48J67O0J01n26L90k10j3J15j84M2L20l41J12j5Q9j52
1888i3K37j36j44J54j71O6L48m65J14J5jJ12k09N01k91K1q4ol8j03P6j40nL51
1912A09K8j86r9k16N32K61n21J29j02J0j25J57K55k26n6P7m6l50M32j08q5KL5
$$ y = [22, 95, -121, 124, 112, -33, 61, 193, 9, 326, -119, -118, -224, 121, 10, 106, 221, 50, 127, -80, -2, 157, -118, -10, 155, 75, 281, -222, -115, -116, 169, -310, 132, 5, 214, -138, 61, -30, -8, -129, 85, -75, -58, -10, -204, 94, 21, -454, 140, 41, 28, 59, 93, -26, 135, -16, 22, 108, -125, -215, -131, -42, 101, 273, 61, -106, -135, -146, 232, 71, 157, -166, 89, 239, -142, -51, 112, 259, -225, 74, 8, 82, 16, -168, -119, 37, -76, 110, -113, 109, -86, 129, -86, -248, 113, -186, 278, 24, 265, 53, 116, 31, 252, 294, 145, -99, 144, -149, -53, -87, -78, 90, -260, 8, 269, 152, 236, -112, -30, 90, -196, -48, 119, 179, 280, -246, 144, -66, -79, 36, -148, -106, 214, -127, -15, -30, 59, -93, 144, 8, -136, 18, -153, -87, 261, -204, -90, -75, -76, 36, -173, 328, 37, 58, -26, -32, -70, -173, -97, -237, -242, 109, 137, -49, -148, -364, 168, 429, -92, 37, -65, -55, -180, -23, 232, 6, -50, 27, -19, -369, 63, -45, -130, -128, -93]
1935i3k4k2m9N05n59J57J15M3K1o3K77n09M84k69M2R9r2K35k64R9k04o7K82k43
1959i9N4ml3j72JO4L8P5r0L15J46j78j39L9N0j59j08L62J09k54j0L63l94Ro6J61
1985H0J02p2l41L80p1k08n7K42O8J29l99K1K14l9m58N23j10L02l19j63L21J91
2007C36l68j41J01J2J69J75k84j71L14m77O37m17J28J87l50J04J11l47L18j66
2027a29M48n05J39L32k48k71j3K31j51L24j47j7j24J23j80K80J7j41j44J0O3j5
2049a18K57J19J17m83JO7J51J1j73k54J34J80K63k18K12k83j63l9K77k0l01J81
2071h2M04m54K09Kq8m3r9M67l70j03J29L6J10j00k45J71K9K10k21j83K65j19K5
2094e0M09l18l5k95O2L24M5r6m05M00j37k14N36j53k66J99N6J55j87pl12K61J71
$$ y = [-93, -117, -139, -188, 317, -242, -85, 30, 73, 94, 31, 308, -201, 283, 14, 56, 155, 63, 298, 34, 133, -71, -138, 144, -99, -45, -49, -82, -254, -253, -189, -151, -76, -166, 149, 295, 117, -22, 17, 67, -92, -200, 162, 271, 17, 7, 370, -24, -15, -81, 80, 182, 110, -231, 149, 78, -130, -187, 55, 123, 252, -147, -126, 88, 49, -409, 114, 4, 306, -13, -176, 145, 336, -32, -173, -72, -60, 109, 284, 0, -171, 143, -334, 303, -114, 14, 201, -149, -45, 66, -281, 37, -129, 319, -186, -47, 285, 37, -234, -247, -16, -167, 157, 10, -7, -131, -8, -188, 92, 109, -32, -176, -166, -103, -118, 139, 258, 375, -108, -107, -40, 111, 122, -51, -305, -171, 9, 272, 54, 266, -17, -180, -219, 58, 38, -263, -82, 322, -132, 77, 79, -9, -52, -151, 316, -54, -157, -28, 8, 118, 18, -227, -56, -27, 183, -38, -221, 44, -75, -50, 359, 41, 6, -289, -227, 97, 142, 46, -359, 41, -96, -310, 226, 73, -193, 6, 62, 217, 30, 23, -289, -28, 143]
2117A43j93n0q7L20O3m69K86J74k31RLLl6p9N1r1K32J10j74K66j55j89j17L88
2141A77m53j0M49l73P6J15j29M47n28K28L5O7k58L15k35j30L97k42m7J93k2k12
2163a40N4m4N0N2K01k68j61L8K41J58j59k82Q7J17O6q1k9%KJ82mK3j95jN1l4J34
2190E8j26n6K11l25K86r5J1k94M82k14m9R3j3m9L60j65k11j97J4L90N4q8J03l24
2214a44L1K72j72J91k65j02L35k8j05J14L3k03J28k20J61L31m67j43K93N3l5Q6
2236A44m6L09k51l80R8l9M33j51j51J33qJ62m39K38l4k97M61K52m38J31l00M1
2258a32K72j18j92q7J05L08n8qJ74n4k50o7K17j01J99k39l6l7K49k42j63K84r4
2281g0R1Q7K22m75J61R4j74J48k5o3j0J1j20k9M55l59k9l1K20l33K08j71k06M24
$$ y = [143, -50, -100, -187, 133, 196, -273, 13, 187, -44, -35, -32, -29, -65, -144, -93, -184, 48, 158, -16, 250, 95, -94, -211, 177, -276, -286, 163, -210, -134, -19, -148, 299, -229, -1, 34, 101, -157, 158, -77, -207, 190, -52, -99, 94, 72, -140, -86, -130, -80, -28, 173, -95, -256, -218, 23, 181, 22, -260, -173, -56, 10, -71, -100, -100, -98, 84, 80, 103, -92, -93, -42, -76, 58, -68, -124, 87, -238, 48, -47, -36, -330, 152, -62, -111, -18, -31, -80, 280, 115, -96, -293, -279, 111, 165, 77, 180, -144, -113, 159, -13, 178, -87, -189, 146, 118, 13, 127, 160, -43, 85, -135, 26, 357, -110, -253, 40, 93, 58, 144, 98, 407, 156, -224, -126, -165, 268, 117, -34, 99, 91, 253, -186, 52, 18, -279, 182, 434, -4, 127, -173, -132, 140, 22, -170, -257, -152, 156, 98, 90, 264, 210, -40, -107, 110, 9, 208, -31, -67, -104, 145, -97, -260, 24, -70, 21, 108, 330, -145, 16, 110, -64, 84, 59, -4, -14, -3, -123, -152, 303, -56, -85, -116, 104, -229, -21, -192, -398, 26]
2305B6k1j59R6j04L46k17l26L69R8K10l51k20K74K19j86m3j43P1l9J18k1K59l09
2328e3N3p7q0J80q5Lj7OK23m63K68J64k54K03M15l53q7nm17L77J03m44J14J13
2352a13j0q9J75Ojk70K43K67k96J06R0r5q9n9O8Q1K26j09l03K30J63l26J76j39
2376f8J83k41J0J17j36J76r6J45l46L02R5Q3M9o31M55M0j99M9J61m1o1J46m35
2399b43J31K33l46m3K12k51J32K5K07K6l46K50j21M6N6J95k02j69O05m46K32r5
2421H8k53J9n8J87j21L90n24l2O0L64l24K52m15M15p6lJ71l05K19K34m51L40k68
2444i1J35j01K6J31j54p3j22K18J06K8j08R1l09N34k67J81o07K97n6K48j67j60
2466b20J08j7k95J60P8J90j84oJ87n9N2J28m81L43K3J15j55Q4j22J60n2r6K80
$$ y = [26, 5, -154, -58, -162, 184, -33, -359, 10, 108, 318, -33, -253, 21, 240, 54, 11, -132, -61, -100, 18, -3, 256, -53, 0, -77, -157, 23, -62, -59, -76, -70, 153, -310, -42, 122, -132, 71, 486, 133, 46, 41, -376, 1, 104, -340, -226, -113, -123, -212, -37, -31, -32, -302, -59, 208, -88, 18, 108, 13, -76, -135, -67, 14, 240, 131, -172, 58, 221, -105, 71, -68, 115, -126, -116, 1, -135, 41, -55, 90, -256, 46, 141, 224, 273, -358, 97, 137, -62, -13, 148, 107, 46, 192, -243, -112, 121, -225, -268, -56, -307, -175, -150, 57, 83, -263, -13, -134, -88, -32, 163, -39, -208, 397, -49, 183, 88, -165, -146, -204, -17, -138, 252, -272, -304, -244, 120, -204, 48, -367, 48, -28, -31, 140, -165, 54, 288, -163, 177, -91, 44, -57, -31, 100, -54, -127, -249, -31, 75, 103, -5, 86, -223, 311, 44, 225, -382, -85, -141, 107, -60, -220, -112, -129, -424, -264, -186, 4, -180, -186, 1, -58, -6, 122, -359, -16, 7, 122, -33, 51, -71, 89, 37, -59, 221]
2489B21m42J52L17n3l6j37j19K09l28L1L74m23M45O5k49K04r8j62q0M31j85p00
2511e63O95K34l21K18k97K5k3m5K87m35R2N31j96j86k8j08m3J75J93k0n77N77
2533A85j63jJ58m28K47p2o8L8K51k53K19mM5j45k53K73K18k17k81L64K1k6r8k52
2557b42N31j85k58L86Rq2k39M4J36J19k9k82L52m62Q6K02k23J28K62k68K56l77
2579a36j58J47o1K86m90N16j01R5p0n9n9K94j60j6J48j58n5N1j65k3j57K13K38
2602A20r0J33j06j5J2m01M79k73L3NJ56j75l9J14P8N2j16J72k44J8j07J06J30
2625D2K53l31j46N07m2k52kj00J13J1j97J64N3j14J64j48Q3k09L18k43O9j6j5
2648c8J28j46q7M0K1r9N4K90l83J36L50l47j08J04K70k73M8j12L8m4M54l06o2
$$ y = [221, -221, -69, 248, 195, 159, 22, -97, 112, -216, -185, 189, -234, 211, 276, 27, 231, 133, -29, -109, 322, 137, -563, 132, 366, 45, 263, -34, -9, -32, -77, 210, -225, -133, 398, 202, 16, -12, -120, -163, 12, 205, 185, -392, 185, 22, 21, 179, -249, -2, -74, -142, -104, 147, -106, 113, 109, 154, 9, -244, 29, 247, 30, -251, 113, 134, 108, 10, -242, 289, 104, -154, 232, 241, 159, -80, -36, 100, 219, 190, -92, 260, -202, -116, 86, -137, -9, 253, -15, 241, -136, -294, -147, -208, 78, -412, 104, 3, 98, 28, -31, -90, 204, 44, 28, 176, 18, -37, 14, -151, -174, -331, -118, 120, 30, 163, 57, 42, 54, -347, 132, -141, -108, -103, 53, -122, -161, -47, 31, 83, -33, 139, -105, -87, -194, -88, 42, 295, -36, -182, 325, 283, 31, 29, -71, 42, 53, -144, 20, 73, -41, 123, -25, 58, -151, 167, -76, -7, -23, -38, 90, -56, -143, -103, -82, -181, -127, 163, -220, -84, 266, -81, -189, -85, 185, -88, -40, -152, -114, -158, 296, -10, -72]
2671g2j2J95o6m5J99k20J52j58r0J53n8K34j93n7J94l17R1l0K93L3k99q7J35L13
2695B88l13o0j20J69j01K06L3j46n2p1J92k06J69J81j28j05M27m49K8Q6l9p1n9
2718a41L41j84j10J84n3j30L95j41k33J73J86l07Pj87K14J59o1K46l51r9J26o0
2740b6O9r6K69l67J66j21J15N2j53K74q1Q4j31J47j96p4K23j08q1J57m54O48k02
2763A14j24m7k1k8O45n43r7K3n1M47l39j3j68K03k4J39k18lK82j48J72k24k13
2786b36R9P8j24L65k72K16k09P5k0K58q11L25N88k55n4J2R9j06R1O6l84J77K17
2809A95m00M08k82J22R8l12L86P1l53J16R9j93j7K06k1j7j29J46k36J2N33m63
2831c1P1M66n75J93L9k41L39j22n1k15J65M4j25K59k82K70k01j55N3M99n62L62
$$ y = [-72, -84, 111, 45, 0, 199, -21, 131, -27, -117, 36, -22, 212, 19, -38, 156, -161, -70, -100, 193, 226, -73, -160, -25, 288, -25, -85, -205, -36, -137, 69, 102, -44, -96, -167, 25, -181, -12, 169, 41, -64, 363, -86, -58, 28, -11, -82, -141, 200, 16, -94, 90, 37, -93, 302, 161, -72, 101, 287, -20, -13, -200, 14, 173, 112, 358, 7, -92, 34, -26, 43, -53, 216, -151, 15, -106, 9, 61, -92, 182, 101, 185, 54, 201, 5, -69, 154, 46, -35, 122, -332, 316, 114, -10, -57, -78, -106, 539, -4, -101, -78, -129, 318, -21, -34, -202, 1, -23, 116, -102, -105, 177, 29, 201, -23, -236, -137, -59, -183, 182, -90, 126, -83, -8, -28, 230, -581, -256, 332, 77, 23, 35, 134, 28, 119, 185, -199, -22, 195, -205, 203, -79, 43, 141, -171, 215, 286, -67, 49, 148, -45, -62, 144, 123, 106, -23, 123, -113, -101, 432, -31, 40, 506, -69, 124, 163, -78, 261, 139, 88, -127, 38, 82, -43, 216, -66, 204, 3, -152, -99, 400, -162, 200]
2853B00n4l18J86l08J84q2M37l36N3J14K6J08j70j5OK38j72k46k5K53N1l29L85
2876A86k96J27J25j80l50L49J38l30K32k02O8K00l07L17j79P1L96k33k65J28k1
2897b6o6J7k87O74j76j0N5l60K12M4j43K47M3J09l88M5K16l44K19j92K85k35k52
2920c13L56K67l02NJ05j86j32K00n6n0q7J37L57k75ml27L81J32o7l61L98l63L05
2943A20j51J64j02k82J27K59k94L97k99l0O3K1j48L3j9K82j80K6K21n12M40Q7
2965B23j08j85J25j71J90j09K3M0K09o41N80l25l6K62j40K58j15m4%j36J48q4
2987c6K22k30J62r0M2l53L26K52j36Lj06J59o7k66K13M4j1K14m17K4M4L6JJ49
3011A79l66J69j32J49J48m70L27P2J37l75k6N20j09l04L43l44L3J2o1R6n1J86
$$ y = [200, 146, -172, 14, -294, -110, -192, 245, -91, -38, 76, 102, 210, 40, 25, 31, 269, 97, -149, -174, 79, 130, -199, 186, -110, 17, 142, -38, -388, -39, 99, -231, 1, -201, -133, 67, -240, 77, -102, -31, 365, 132, -133, -5, -26, -92, -75, -362, 312, 136, 126, 181, -179, 33, 77, -66, 181, 224, 333, -55, -10, 206, -138, 81, -111, 174, -61, -313, 43, 310, 8, 13, 118, -68, -200, 0, -56, -106, -193, -56, 301, 26, 22, -305, 76, 208, 141, -220, 178, -185, 120, -31, 133, 31, -251, -124, 135, -159, 238, -61, -91, -28, -7, -155, -122, -141, 141, -39, -13, 208, -304, 136, 223, 115, -70, 55, -116, 74, -35, -12, 28, 237, -404, 176, -149, -185, 77, -63, 195, 80, 36, 36, -100, 48, -36, 186, -44, 118, 28, 70, -283, 43, 295, 159, 162, 56, 215, 148, -118, 95, 139, 128, 342, -75, -51, -7, 29, 30, 179, -187, -18, -150, -1, 147, -323, 4, 76, 213, -162, -188, 332, 223, -81, 262, -82, -49, -37, -98, -2, -53, 133]
3033A33r0j68J22j03n7K41n8Q6M0k28o7J47k29PJ66l1J2j45J18p7L86jm76K94
3057B2o7k6L1P2o0n6RM5q1N2M8j3k16K03J46r3k73L12L0j54Ln1JJ73j9o1j58O
3085a75K15P6l39l0K78j22J83j31L2R2J18k48m6K40j5j56K2J9j49K41m42J78L1
3108a28M25j88L8j50m9Q2j0J15l01J96Q5j26k3J25J1o5q9M12m81Lk04L32k33R0
3132a33K48k32o1K67j12K38l30L4J87j20L4K91l94J05L7j89L20n84M02L6J98l75
3154a33j48NM14j84K39j81J08nj12j17J90j06k71L53j08j59J30j69L23%o1K14
3176B22j14k25J54J67j88k11J36j36q5L09J26k89K8L74l40J03J36lk81j52L38
3197F9N6j63k08n2K46o6J61j05lJ24r2l4k9l5K54P9l11q4P1j88M44J16l24J18
$$ y = [133, 43, -125, -3, -106, -163, 78, 20, 106, 146, -82, -149, -2, -231, -224, -58, -89, -77, -222, -104, -181, 205, 204, -272, 22, -45, -71, -40, 32, -28, -84, -75, -30, -111, -59, -11, -24, -240, -37, 109, 16, -257, 55, 85, -69, -66, -117, -116, 57, 38, -23, -181, -175, 40, 116, -223, -253, 25, -97, 86, -45, -13, 79, 197, -51, -97, 143, 128, -28, -6, 13, -136, 105, -337, -159, -128, 297, 109, 147, -3, -52, 30, 20, 135, -166, 30, 115, -11, -34, 91, 102, 37, -52, 360, -121, -118, -322, 10, -223, -133, 115, -117, -178, 89, -23, 215, -115, -81, 106, -14, 20, 311, -83, 22, 59, -130, 190, -394, 8, 44, 242, -133, -281, -276, 138, -46, 193, 12, 120, 115, 3, -114, 76, -30, -301, 52, -56, -215, -85, -254, 69, 69, 8, 222, 108, -117, 37, 204, 16, -195, -59, -195, -280, 29, 155, -134, -106, 268, -72, 31, 167, 164, -117, -269, 69, 125, -38, -246, -298, -52, -118, 43, -62, -65, 59, -33, -67, -96, -131, 123, 202, -109, -193, -122, -310, 134, 250, -74, 44]
3221D4q0L60l40J31k38J64j13J42k10P1J17j67K70o8j34k9J37Q0j23K30l51K00
3243I3k7j97K08j79J22J2J45l30K10k38J30r4J48K3j35L29l48J53P5R9o0J4R4
3266B47k75K23j01q2k12K15J30Lj66l4J63j95o3J2J70n19O50j7K4j28N4l99K37
3289f3J09p7J19J57k47j27j00K04N6M01j24n78k00N23j11J21JjL6j37M77n48J98
3312H9l18r2K62J26k01K68j21J21l51L58j3j33j02K81j12Q4k46J95m8P4j32k7
3334c8L86m94m6J27o7N4P6o2K1k12K1K41n3l6J71k07K72j26j23n8J65j25pL41
3358B21J1m90L51Q1n8k05O4j51M90k17J4m1j1j33J08qK8R3j84J12L98l45j15k0
3382gJ02Mq1j2pL5K48j13m4j52P0k23L59m7j48k93L75j30j21m8K29k92Q2M03j86
$$ y = [44, -36, 324, -16, 115, -123, 41, -72, 70, -140, -69, 48, -119, 151, 83, -51, -80, 57, 137, 14, 244, -107, 93, 66, -131, 77, -102, 20, 32, 177, -153, 57, -181, -51, -145, 3, 26, -109, 220, -128, 25, 100, 199, 139, 153, 247, -28, 195, 94, 12, -200, 15, 145, 148, -18, -52, 111, -84, -147, -135, 35, -484, 166, 149, 173, 45, 99, -300, -63, 46, -31, 88, 245, -2, -129, -229, -25, 31, 432, 308, -270, -470, 53, -58, 63, 64, 63, 99, -38, 439, -109, 89, -229, -321, -59, 67, -134, 134, 13, 134, -217, 141, 128, -5, -107, 174, 62, 146, -100, 95, 47, 121, -11, -38, 348, -146, -192, -65, -132, -78, -2, -64, -43, -255, -234, 7, -46, -82, 89, -118, 154, 28, -95, -153, 12, -113, -120, 221, 232, -258, 93, 174, 116, -89, -25, -176, 314, 97, 111, 70, 59, -74, 34, 26, 54, 147, -37, 75, 473, 128, 13, -7, 95, 99, 18, 6, -1, 34, 282, 169, 125, -27, 43, -180, 179, 132, -16, -309, 66, -64, -185, -233, -4, -296, -214, 189, 3]
3407CQj63J57J33K3j75K77l80L34o6l11J30L43m34N23n04R6l2k0Q5j89J4K37j07
3431a8l00L52l78L00J82J8k46K8k13L39l7p4K24j56J15r4q1J26m9%j28R7j35J40
3455A2K00k41J96l74J67j00M6M20k31j56L94l37l25J80L4J46k77J85p7K05j40
3476g3q8K37l10J46J87j93K15j91k09M5L13j99L47L13p80N28l02j34L95j62K30
3497C15o6m57L38K19m89K00K15N0m59O5l68M71O6j91J46lj5P3j43j36P1J37j02
3520f3R3L9j31J66k97J00J77l8O3q8j49K59l87L90l39L23j0j23J82k31M58n41
3542a47J11J42j02J70j00o6N7j90K25k85J25n2j12J11K06r2k91K69o6q5K03M50
3564D81o08o1M0N22l77n4J30J65l86L7L7j0Rl00M83l84M96j1j31j29J24l33L20
$$ y = [3, 11, -152, 5, 138, 161, -14, 263, -117, 217, 151, -160, -30, 313, -121, 402, -102, -6, -38, -58, 27, -162, -148, 89, -18, -318, 34, -344, -44, 138, 156, -90, -62, -275, 64, 27, -47, 177, 21, 136, 42, -39, 87, 38, 38, -90, 7, -128, 12, 212, -29, 167, -207, -40, -140, -94, 326, 95, -61, 333, -4, -329, -149, -115, 31, -246, -61, -138, 67, -73, -161, 76, -234, -88, 99, -94, 121, -70, -279, -234, 79, -120, 227, 540, -240, 288, -14, -148, 247, 85, 315, 249, -208, 130, 349, -140, 60, 275, 325, -134, -69, -437, 34, 100, -91, 55, 52, 37, 110, -33, -169, -98, 39, -63, 30, 69, -62, 104, -193, -93, 84, 46, 109, 21, -128, 131, -256, 134, -205, 118, 108, -15, 167, -64, 394, -147, -36, 106, 4, 174, 74, 8, 65, -125, 100, -185, -60, -112, -224, -113, 93, 1, -290, -21, -87, -172, 31, 481, -127, -188, -148, 374, -3, -57, 73, 238, -148, -111, -74, -84, -75, -375, 108, -276, 220, 209, 78, -51, 73, -260, 60]
3587F0j60M2J14m9j8L37k59J08j04k86L17k3k9q1J02M3j47M8K45k32l58P1J20
3610a39J02M34n41J85k03M41l20n0P4o6M6R3L3j46J40K3l6j39P6q9o9Q5K11j07
3634C8O2n5l22J74L16l74L2J95j06K76j72k79J34j96K94J51j31J11J20k84k5j58
3656a99J40J38j55qp3r3K37M2J49o5j25r2M89l50j80L0R5n8k7J44J92n6k45K39
3680A69j8j30J91j73K74j47l90K4J52N0J55j88j92K52J05k13k00P13n58L32m40
3701b32K36J73k97M5J19j90K54l67J2K44M4j06j30Q9M09l71O7pk7l9L8J33j7k9
3725E1j73J53j8J67j77J1j32J42j22L64j35m33P3L95l44j13N17k76R4k18l3J42
3747f5l4J02K47l91K92m06J54L24M6n20K81P1L2J32l89K63l47R9L83j26j68J87
$$ y = [60, -100, -58, 56, 7, -11, 326, 67, 175, 71, -215, 102, 79, 50, -31, 71, 114, -33, 15, 260, 28, -330, -259, -139, -37, 397, -144, 41, -162, 279, -41, -91, -17, -83, -37, 56, 89, -57, 83, 106, 70, -69, 7, -82, -151, -66, 145, 38, 100, 45, -277, -103, 213, -161, -129, 66, -40, 236, 64, -215, -81, -277, 17, 168, 37, 148, 268, -16, -41, -199, -59, 79, -76, -84, -157, -250, -13, 29, 178, 113, -12, -104, 385, 35, -145, -115, -20, -78, -105, 39, 231, 175, -70, 169, 151, 21, 212, 39, 313, 166, -224, -200, -48, 2, 157, -31, -223, 29, 134, -79, -279, 434, -124, 208, -232, 4, 177, -120, -75, 44, -146, 108, -259, -247, -3, 41, -65, -195, -106, 303, -68, -1, -8, -35, -74, -36, 97, 80, 51, -122, 31, 13, 180, 3, 14, -118, 24, -98, 266, 131, -302, -229, 166, -178, -291, 226, -50, 44, -174, -207, -65, -99, 3, 250, -141, 151, -255, -101, 223, 269, -251, 30, 101, 133, 265, -124, 139, -208, -109, 274, 148, -20, 167]
3769A67l63K27P4k49R8j4J27o2l79M06K67m7j14r9J6r4L7J23M3k83Q1L8Qj50J51
3794Il0L49m48J76J08l16K31r1J12P4k27K02j31K19l81j15L65j68J75oj05O2m17
3817c53L59j7l18M33k07J64o9p3J40J5k05J37K94l41k39L1L13n9K54l93Q9k02
3839b47K36m6l5j71J94K52l93J47j53K82j24K71k83k6J99m62K92R2R1O8j2k90
3861a18P2K05R6N2k28j82L10j94j8j12J41J89k38L9J23q9K04j97j28r0J39k01
3883b25J20J89l5j76M20j41k0q7J8r1J54l4R8j98R0N2k15r0K18J63l60K7K61j40
3907bM42l39J35r6L6k58J47k8q0M23k68j62k7J76m3j87MK78K9P2j48J32j66K12
3931B82k91k71J85J69p3Q3K4j9P3k19K53m25K4J51q9J09J04K00l91Q9J7Jk12L46
$$ y = [167, -196, 31, 105, -144, -46, -60, 67, 5, -374, 32, 299, 252, 138, 39, 55, -39, -2, 121, 164, -119, -38, 0, 8, -142, 9, -21, 328, -120, 56, 164, -152, 79, -12, 100, 174, -53, 149, 18, 237, -144, -259, 106, -62, 113, 107, 2, 64, -353, 6, -11, -329, 104, -103, 61, -8, -81, 59, 74, -131, 6, 300, -41, -280, -249, 64, 5, 259, -134, -45, -247, -11, -57, -92, -263, -69, 183, -210, -63, -216, 66, -58, 213, -70, -96, 103, -359, -67, 25, 116, 184, 172, -118, -46, 159, 255, 307, 79, -103, 207, 13, -5, -117, 24, 213, -25, 14, 137, 48, 252, 55, -73, -163, -24, -225, -105, 84, 49, -127, 293, 152, 132, 45, 63, -28, 126, 92, 190, -8, 82, 134, -81, -171, 47, 210, -150, -123, 138, -2, 440, 101, 236, 140, 176, -82, 65, 37, -43, 380, 112, -50, -77, 99, 56, -131, -127, 151, 180, 252, 104, 236, 70, 282, -9, -280, -95, 74, 1, 84, 108, 89, 162, -57, 196, -229, -205, -54, -143, -34, 70, 270, -121, -32, -15, -14, -226, 120]
3955A20J06l37J78j82L2L38k49M3k07K20j20J45j94J32J12QL5j12q3k58K5M05
3977A57k28LR9P4OJ00m1N5m67K78l7j04L05K7l1N8l09j30L19k90M17l53l9J98
4001F7k19j7j7j3N15k35J43l50J89j03j44J71k35J41J10k9j67J64j44L44m2P4
4023B03k97K5J37K33l78K03j16J11po4P6j03L01m92k0oo4N47j54j14Q0n5k77K07
4047b4K4K28k45J00m9K10l83J66J29j56J37j12O8j25l57L75K67m31L44k71j60
4068b65L35j69K02O4j12K18k03L0J02l65J73k3m2l2P7k4j05M77l79L52m52LJ17
4091b1P1JJ25j82m0j26K93M0k20J9P8l05R2K34O3j2k32K31j29J29k43kl8M02l91
4116a63L3M4j9J05J12k6k81O6J01j7J06k06J62L10m0k96RJ66k98Rm3M55j88j69
$$ y = [120, 226, -111, 67, -115, -83, 255, 6, 49, -158, 62, -58, 87, -107, 25, 137, 145, 180, 68, -15, -273, -248, 157, -71, -68, 31, 105, 111, 211, 170, 225, -242, 36, -1, -105, 200, 227, 196, 254, -55, -185, 134, -156, 261, -92, -131, 67, -152, -169, -186, -199, 316, 81, 224, -126, 63, -40, -184, -13, -248, -107, 3, -26, -193, -29, -173, 171, 129, 203, -94, -69, 68, 301, -77, 126, 10, 121, 114, 50, 126, 23, 324, -168, -188, -194, -258, 289, 135, 21, 101, 46, -231, -24, 0, 228, -17, 83, 34, 244, -139, 27, 156, 0, 137, 25, 93, -32, -389, -14, 253, -178, 166, -105, -265, 70, -99, 103, 167, 55, 273, 70, 100, 202, -163, 10, -13, -55, -87, -10, -34, -139, 338, -41, 311, -141, -138, -21, 50, 51, 176, -6, -46, -172, 121, 161, -59, -40, 38, -267, -175, 59, 122, 110, -122, 109, -20, 109, -134, -136, -174, 228, -163, -130, -86, -105, 0, 112, 86, -195, -129, -28, -45, 61, -145, 17, 327, 287, -9, 0, 166, -132, -123, -166, 289, 101, -68]
4140f8K32l28M07j06l65K14R7j6k08K25Oj1j21K6k86K69j31K44m2J75j61l1j42
$$ y = [-68, 164, -164, 243, 137, -228, -14, 83, 67, -141, 84, 90, 79, -42, -16, -302, -33, -164, 80, 38, 213, 52, 21, -121]
$$ [...]
8191E6
##END NTUPLES=NMR FID
##END=
