##TITLE=1H_CG-1112-4
 CDCl3, 8 sc, 
 16.9.2019
##JCAMPDX= 6.0         $$ Bruker NMR JCAMP-DX V2.0
##DATA TYPE= NMR FID
##DATA CLASS= NTUPLES
##ORIGIN= UXNMR, Bruker Analytische Messtechnik GmbH
##OWNER= root
$$ XWIN-NMR		Version 3.5
$$ Mon Sep 16 14:37:59 2019 Russian Standard Time (UT+4h)  she@DPX200
##.OBSERVE FREQUENCY= 200.13155
##.OBSERVE NUCLEUS= ^1H
##.DELAY= (6, 6)
##.ACQUISITION MODE= SIMULTANEOUS
##.ACQUISITION SCHEME= undefined
##.AVERAGES= 8
##.DIGITISER RES= 18
##SPECTROMETER/DATA SYSTEM= spect
##.PULSE SEQUENCE= zg30
##.SOLVENT NAME= CDCl3
##.SHIFT REFERENCE= (INTERNAL, CDCl3, 0, 15.7039)
##AUDIT TRAIL= $$ (NUMBER, WHEN, WHO, WHERE, WHAT)
$$ ##TITLE= Audit trail, XWIN-NMR		Version 3.5
$$ ##JCAMPDX= 5.01
$$ ##ORIGIN= Bruker BioSpin GmbH
$$ ##OWNER= she
$$ F:/spectra/data/she/nmr/H-F/1/audita.txt
$$ ##AUDIT TRAIL=  $$ (NUMBER, WHEN, WHO, WHERE, WHAT)
(   1,<2019-09-16 14:36:56.73 +0400>,<she>,<DPX200>,
      <created by zg, POWCHK disabled, PULCHK disabled
       configuration hash MD5:
       00 E9 B6 7A A2 85 ED C7 34 08 36 98 17 FE 4E 26
       data hash MD5: 16K
       04 66 E6 83 29 10 32 29 F2 85 75 A6 B8 FD A8 55>)
$$ ##END=
$$ 
$$ hash MD5
$$ 64 C5 F0 83 0F 94 A5 D7 48 E9 0E 7C C7 B7 22 BF
##$RELAX= 
##$RELAX= 
##$RELAX= 
##$RELAX= 
##$RELAX= 
##$RELAX= 
$$ Bruker specific parameters
$$ --------------------------
##$DU= <F:/spectra>
##$EXPNO= 1
##$NAME= <H-F>
##$PROCNO= 1
##$TYPE= <nmr>
##$USER= <she>
##$AMP= (0..31)
100 100 100 100 100 100 100 100 100 100 100 100 100 100 100 100 100 100 
100 100 100 100 100 100 100 100 100 100 100 100 100 100 
##$AQSEQ= 0
##$AQ_mod= 1
##$AUNM= <au_zg>
##$AUTOPOS= <>
##$BF1= 200.13
##$BF2= 200.13
##$BF3= 200.13
##$BF4= 200.13
##$BF5= 200.13
##$BF6= 200.13
##$BF7= 200.13
##$BF8= 200.13
##$BYTORDA= 1
##$CFDGTYP= 0
##$CFRGTYP= 5
##$CHEMSTR= <none>
##$CNST= (0..31)
1 1 145 1 1 1 1 1 1 1 1 1 1 1 1 1 1 1 1 1 1 1 1 1 1 1 1 1 1 1 1 1 
##$CPDPRG= <>
##$CPDPRG1= <>
##$CPDPRG2= <>
##$CPDPRG3= <>
##$CPDPRG4= <mlev>
##$CPDPRG5= <mlev>
##$CPDPRG6= <mlev>
##$CPDPRG7= <mlev>
##$CPDPRG8= <mlev>
##$CPDPRGB= <>
##$CPDPRGT= <>
##$D= (0..31)
0 1.2 0 0 0 0 0 0 0 0 0 0.03 0 0 0 0 0 0 0 0 0 0 0 0 0 0 0 0 0 0 0 0 
##$DATE= 1568630216
##$DBL= (0..7)
120 120 120 120 120 120 120 120 
##$DBP= (0..7)
150 150 150 150 150 150 150 150 
##$DBP07= 0
##$DBPNAM0= <>
##$DBPNAM1= <>
##$DBPNAM2= <>
##$DBPNAM3= <>
##$DBPNAM4= <>
##$DBPNAM5= <>
##$DBPNAM6= <>
##$DBPNAM7= <>
##$DBPOAL= (0..7)
0.5 0.5 0.5 0.5 0.5 0.5 0.5 0.5 
##$DBPOFFS= (0..7)
0 0 0 0 0 0 0 0 
##$DE= 6
##$DECBNUC= <off>
##$DECIM= 24
##$DECNUC= <off>
##$DECSTAT= 4
##$DIGMOD= 1
##$DIGTYP= 9
##$DL= (0..7)
0 120 120 120 120 120 120 120 
##$DP= (0..7)
150 150 150 150 150 150 150 150 
##$DP07= 0
##$DPNAME0= <>
##$DPNAME1= <>
##$DPNAME2= <>
##$DPNAME3= <>
##$DPNAME4= <>
##$DPNAME5= <>
##$DPNAME6= <>
##$DPNAME7= <>
##$DPOAL= (0..7)
0.5 0.5 0.5 0.5 0.5 0.5 0.5 0.5 
##$DPOFFS= (0..7)
0 0 0 0 0 0 0 0 
##$DQDMODE= 0
##$DR= 18
##$DS= 0
##$DSLIST= <SSSSSSSSSSSSSSS>
##$DSPFIRM= 0
$$ [...]
##$SUBNAM2= <"">
##$SUBNAM3= <"">
##$SUBNAM4= <"">
##$SUBNAM5= <"">
##$SUBNAM6= <"">
##$SUBNAM7= <"">
##$SUBNAM8= <"">
##$SUBNAM9= <"">
##$SW= 24.9336996594482
##$SWIBOX= (0..15)
0 0 2 0 0 0 0 0 0 0 0 0 0 0 0 0 
##$SW_h= 4990.01996007984
##$TD= 16384
##$TD0= 1
##$TE= 0
##$TE2= 300
##$TE3= 300
##$TEG= 300
##$TL= (0..7)
0 120 120 120 120 120 120 120 
##$TP= (0..7)
150 150 150 150 150 150 150 150 
##$TP07= 0
##$TPNAME0= <>
##$TPNAME1= <>
##$TPNAME2= <>
##$TPNAME3= <>
##$TPNAME4= <>
##$TPNAME5= <>
##$TPNAME6= <>
##$TPNAME7= <>
##$TPOAL= (0..7)
0.5 0.5 0.5 0.5 0.5 0.5 0.5 0.5 
##$TPOFFS= (0..7)
0 0 0 0 0 0 0 0 
##$TUNHIN= 0
##$TUNHOUT= 0
##$TUNXOUT= 0
##$USERA1= <user>
##$USERA2= <user>
##$USERA3= <user>
##$USERA4= <user>
##$USERA5= <user>
##$V9= 5
##$VALIST= <valist>
##$VCLIST= <CCCCCCCCCCCCCCC>
##$VD= 0
##$VDLIST= <DDDDDDDDDDDDDDD>
##$VPLIST= <PPPPPPPPPPPPPPP>
##$VTLIST= <TTTTTTTTTTTTTTT>
##$WBST= 1024
##$WBSW= 4
##$XGAIN= (0..3)
0 0 0 0 
##$XL= 0
##$YL= 0
##$YMAX_a= 45840
##$YMIN_a= -76872
##$ZGOPTNS= <>
##$ZL1= 120
##$ZL2= 120
##$ZL3= 120
##$ZL4= 120
##$ABSF1= 10
##$ABSF2= 0
##$ABSG= 5
##$ABSL= 3
##$ALPHA= 0
##$AQORDER= 0
##$ASSFAC= 0
##$ASSFACI= 0
##$ASSFACX= 0
##$ASSWID= 0
##$AUNMP= <proc_1d>
##$AZFE= 0.1
##$AZFW= 0.1
##$BCFW= 1
##$BC_mod= 2
##$BYTORDP= 1
##$COROFFS= 0
##$CY= 11.3945322036743
##$DATMOD= 1
##$DC= 2
##$DFILT= <>
##$DTYPP= 0
##$F1P= 20.1720416913024
##$F2P= 0.152960286110954
##$FCOR= 0.5
##$FTSIZE= 0
##$FT_mod= 4
##$GAMMA= 1
##$GB= 0.15
##$INTBC= 1
##$INTSCL= 1
##$ISEN= 128
##$LB= 0.24
##$LEV0= 0
##$LPBIN= 0
##$MAXI= 10000
##$MC2= 0
##$MEAN= 0
##$ME_mod= 0
##$MI= 1.114404
##$NCOEF= 0
##$NC_proc= 0
##$NLEV= 6
##$NOISF1= 3.799351
##$NOISF2= 2.8
##$NSP= 1
##$NTH_PI= 0
##$NZP= 0
##$OFFSET= 15.70392
##$PC= 1
##$PHC0= -9576.283
##$PHC1= 17.40096
##$PH_mod= 1
##$PKNL= yes
##$PPARMOD= 0
##$PSCAL= 0
##$PSIGN= 0
##$REVERSE= no
##$SF= 200.130013532006
##$SI= 16384
##$SIGF1= 3
##$SIGF2= 2
##$SINO= 400
##$SIOLD= 16384
##$SREGLST= <1H.CDCl3>
##$SSB= 0
##$STSI= 0
##$STSR= 0
##$SW_p= 3612.71676300578
##$SYMM= 0
##$S_DEV= 0
##$TDeff= 0
##$TDoff= 0
##$TI= <>
##$TILT= no
##$TM1= 0
##$TM2= 0
##$TOPLEV= 0
##$USERP1= <user>
##$USERP2= <user>
##$USERP3= <user>
##$USERP4= <user>
##$USERP5= <user>
##$WDW= 1
##$XDIM= 8192
##$YMAX_p= 0
##$YMIN_p= 0
$$ End of Bruker specific parameters
$$ ---------------------------------
##NTUPLES= NMR FID
##VAR_NAME=  TIME,          FID/REAL,        FID/IMAG
##SYMBOL=    X,             R,               I
##VAR_TYPE=  INDEPENDENT,   DEPENDENT,       DEPENDENT
##VAR_FORM=  AFFN,          ASDF,            ASDF
##VAR_DIM=   8192,          8192,            8192
##UNITS=     SECONDS,       ARBITRARY UNITS, ARBITRARY UNITS
##FACTOR=    0.0002004,     1,               1
##FIRST=     0,             0,               0
##LAST=      1.6414764,     0,               0
##MIN=       0,             -76872,          0
##MAX=       1.6414764,     45840,           0
$$ Real data points
##PAGE= N=1
##DATA TABLE= (X++(R..R)), XYDATA
0 0 0 0 0 0 0 0 0 0 0 0 8 -8 8 -8 8 -13 16 -16 23 -24 31 -33 39 -47 52 -59 68 -78 88 -99 113 -124 141 -157
34 -157 176 -196 219 -244 270 -298 330 -367 405 -449 498 -552 612 -683 762 -854 963 -1094
52 -1094 1252 -1455 1717 -2075 2594 -3422 4954 -8782 41098 38801 -24157 -2102 16664 30959
66 30959 21167 4016 -982 31610 41903 20988 -5350 -23600 -30323 2609 31201 14052 -14048
79 -14048 -12882 -9192 -5909 -4537 -23975 -44119 -23842 8541 16229 3371 -27483 -58547 -40256
92 -40256 1666 -3184 -36058 -35277 -7117 16016 14615 -23922 -59654 -42094 -4805 2772 -1788
105 -1788 -4723 -14844 -9386 11339 3507 -25044 -30278 -14046 8840 31506 23503 -11564 -21186
118 -21186 -3508 4931 8198 8271 -7606 -5789 31938 45840 9211 -27898 -29670 -2369 31810
131 31810 31060 -2366 -6820 22450 29149 9570 -8190 -22229 -18402 16146 37670 21446 2564
144 2564 -4612 -5110 8407 15775 -5722 -17047 5587 25066 25751 17936 -7529 -30459 -11552 22338
158 22338 24837 7491 -3749 -1097 22116 32670 -4156 -38929 -19275 19024 30671 23679 6180
171 6180 -8942 909 14866 2797 -12160 -11487 -5756 12770 34851 20143 -15669 -22468 -7574
184 -7574 1733 8603 5355 -11318 -8698 13521 16071 -3372 -24377 -36408 -16597 25005 28330
197 28330 -9650 -25039 -7170 4455 -432 -17267 -34166 -20785 14945 23764 5342 -9952
209 -9952 -21961 -23783 -3342 6418 -10608 -17402 -1659 9999 13692 6339 -20279 -32824 -10173
222 -10173 12728 15190 9102 -6568 -16194 4293 20960 -2600 -28537 -17347 11319 31856 27767
235 27767 -4201 -23607 -4775 12149 2687 -4292 -2208 596 16214 30575 13301 -13514 -17878
248 -17878 -7876 7826 21835 12532 -5644 1328 16151 12233 2607 -7702 -19072 -3947 30183
261 30183 33039 3954 -14462 -11190 4998 18250 4037 -19647 -6661 26205 29449 10022 -7958
274 -7958 -20629 -13827 9695 15596 2442 -1313 2874 6881 14832 7050 -20124 -25964 -2072 14762
288 14762 16468 10010 -8686 -18472 -1103 10761 -2638 -16376 -15940 -1506 22452 23419 -12749
301 -12749 -35183 -15586 5755 5739 -1447 -9873 -8567 9320 14915 -4678 -20779 -21131 -14466 4672
315 4672 21133 6992 -13105 -8020 2389 1346 -1742 -11318 -19133 -1883 21785 19328 1055
328 1055 -14232 -20870 -4703 18464 9339 -14760 -9466 13816 20750 9654 -12321 -26993 -10350
341 -10350 16303 16817 3889 226 -2959 -798 9916 3777 -16882 -17233 1392 15228 20156 9684
355 9684 -13581 -17843 203 7270 361 -4208 -8045 -2663 18460 21283 -7709 -27016 -15725 5215
369 5215 17764 12052 -8897 -11284 10470 15466 -2684 -13429 -12728 -5558 14221 24902 8766
382 8766 -7825 -6953 -1381 5550 8863 -3578 -10652 7425 23258 16596 3942 -9272 -17364 -1564
396 -1564 20897 15714 -2674 -4434 4562 15276 15760 -7024 -25963 -7825 19377 20050 6667 -3945
410 -3945 -10356 -3270 8497 541 -13318 -10749 -767 8587 16119 3697 -21624 -23005 -4699 3070
424 3070 613 -3988 -12698 -9090 7684 6779 -13393 -25542 -21936 -6408 13916 11718 -15115 -23105
438 -23105 -4293 4714 -4342 -15183 -20492 -10484 11668 15428 -2570 -13850 -14290 -10952 1562
451 1562 8757 -4246 -11386 2216 13017 9790 962 -13024 -17460 2113 19569 14367 3105
464 3105 -1991 -2392 9089 17513 613 -16244 -2983 19585 25851 16680 -1821 -11936 2274
477 2274 17369 8662 -1210 1839 6539 14247 21605 8733 -11660 -10938 3241 12527 15586 7006
491 7006 -6741 -2012 12942 9193 -4758 -10765 -10709 430 19474 16834 -7712 -17898 -7626 3079
505 3079 5450 -4072 -17958 -9864 13134 13962 -4932 -16167 -18420 -12818 2395 6686 -6713 -12536
519 -12536 -5297 32 1943 -3687 -20128 -22670 -2177 10873 4475 -4913 -13052 -15392 -2377 6427
533 6427 -5712 -16302 -9011 3671 13270 10410 -11700 -24707 -7366 10604 6682 -1915 -4845
546 -4845 -2565 8565 14063 -152 -13801 -9794 -118 10560 17747 6809 -9141 -3436 10356
559 10356 9162 1140 -4334 -6367 5587 21398 15478 -3008 -9635 -5613 4796 15932 8869 -8612
573 -8612 -4627 14075 15899 3348 -9309 -14682 -3976 14703 14278 -52 -4320 -1734 986 6026
587 6026 2809 -12748 -13814 3146 12654 9350 189 -12252 -13261 2333 8469 -2173 -8502 -5790
601 -5790 -440 9521 9593 -9546 -21296 -7796 8048 10569 3383 -8305 -10145 4495 10031 -4188
615 -4188 -13556 -9352 -1828 8799 14812 1608 -12462 -8430 1533 3854 1796 -6705 -11770 1721
629 1721 15252 6994 -7042 -11552 -10310 111 12340 5547 -10515 -9151 2250 6916 3660 -8633
643 -8633 -18352 -5630 14327 12047 -2651 -8435 -8457 -2699 6162 1872 -10439 -8273 3423 9823
657 9823 10689 2028 -13408 -12345 5043 10470 2568 -2749 -3662 762 12204 11227 -4968 -11292 -2026
672 -2026 8497 14961 10693 -6000 -10340 5334 13016 3351 -4650 -4632 1512 13798 15623 126
686 126 -10177 -6243 301 5919 8020 -2411 -9506 2057 12214 5368 -5305 -12132 -11808 1069
700 1069 11325 2218 -9632 -8668 -3284 2462 4876 -6434 -17922 -7531 8925 7766 -3109 -11944
714 -11944 -14752 -3941 7796 2068 -9172 -6588 268 4514 7135 -1075 -14926 -11725 3976 9650
728 9650 5856 -607 -6667 -1164 11762 8384 -5373 -8052 -1778 5580 14033 10647 -5375 -9045
742 -9045 3695 11050 7854 725 -6187 -1706 13199 13505 -1976 -9053 -4679 1418 9509 10597 -1454
757 -1454 -7646 675 6785 4205 -2257 -11067 -11382 3997 12863 2943 -6999 -7737 -4731 2631 5844
772 5844 -5098 -14034 -5904 4906 6700 1668 -9620 -15041 -2159 10457 3898 -7052 -7661 -3975
786 -3975 2674 7074 -2021 -13085 -7646 3653 8264 7824 -703 -10830 -5028 8098 5721 -4519
800 -4519 -7220 -3976 4193 13124 7363 -6746 -8357 21 5726 7663 1890 -8936 -5407 9448
814 9448 10973 -508 -6689 -6172 803 11381 9336 -3908 -7535 -699 3462 5468 2659 -7030 -7426
829 -7426 6624 13203 4799 -3718 -7653 -4597 6355 8915 -2005 -7862 -803 5464 8386 6186
843 6186 -5928 -11691 -26 10272 5728 -2395 -7030 -5669 5118 10104 -975 -9958 -4500 2542
857 2542 6164 6446 -3570 -13002 -6104 5315 4326 -1629 -6779 -7836 1569 10144 1652 -10871 -10321
872 -10321 -4076 1809 5778 -321 -10994 -7132 4630 6125 -245 -6997 -10691 -2880 9531 6447
886 6447 -6257 -8146 -2632 2518 7335 3697 -6884 -6251 4582 8764 4824 -1554 -8133 -4510 9181
901 9181 11806 763 -4098 -186 4259 9239 7277 -4473 -8238 2177 9107 8239 3485 -4620 -5548
916 -5548 6541 12164 1665 -6466 -4084 903 7158 7667 -3224 -9833 -2338 5310 5573 2527 -5162
931 -5162 -9288 73 8491 1460 -8092 -8808 -4425 3111 8010 -681 -10277 -6136 1692 2850 927
946 927 -5678 -11621 -3992 7944 5334 -4426 -7427 -5250 1250 7597 1885 -8876 -6862 1615 4363
961 4363 4135 -769 -8460 -4910 7280 8598 338 -4923 -5350 -435 8124 5574 -5959 -7095 1175
976 1175 6032 6847 3126 -6324 -6980 4538 8920 1716 -4248 -5847 -1492 8077 8890 -2916 -7671
991 -7671 -975 4028 5551 3956 -4692 -8305 1209 8514 3958 -2297 -5681 -3865 5699 10127 189
1006 189 -8092 -3965 1877 4964 5323 -2260 -8555 -1240 7920 5928 -315 -5140 -6701 1512 9424
1021 9424 2258 -7606 -5871 609 4279 5611 -728 -8574 -4577 4242 4654 -157 -5086 -8411 -2844
1036 -2844 7295 4570 -6247 -7714 -2500 1822 4840 359 -9361 -7947 1584 4414 1085 -3350
1050 -3350 -8207 -4964 6053 6542 -3723 -8053 -3844 1008 5362 3291 -6208 -7190 1798 6639 4115
1065 4115 461 -5308 -5143 5219 9204 681 -5084 -2673 2093 7878 8149 -1650 -6394 930 7053
1080 7053 5997 2933 -2915 -5566 3666 10480 4044 -3608 -3936 55 6308 8431 -166 -7670 -2627
1095 -2627 4185 4336 2192 -2937 -7359 -836 7802 4378 -4238 -6520 -5004 804 6089 196 -8808
1110 -8808 -6221 1303 2997 1504 -3220 -9501 -5790 4416 4595 -3046 -6855 -6496 -1682 5443 2307
1125 2307 -7914 -7827 13 3691 3082 -849 -7930 -7154 2608 5590 -192 -4138 -4903 -1717 6209 6067
1141 6067 -4466 -8295 -1413 3694 5153 2984 -4231 -6511 2226 7045 2323 -2585 -4657 -2793 5724
1156 5724 9172 -308 -6928 -2532 2976 4884 4492 -2121 -5785 1397 7396 4316 -595 -3961 -4456
1171 -4456 2853 9467 3378 -4676 -2728 2020 4643 5017 -736 -6705 -1473 7072 6222 1491 -2793
1186 -2793 -5350 -365 7745 4116 -4778 -4458 398 4013 5552 349 -7977 -5484 3098 4320 862
1201 862 -2227 -5813 -3111 4483 3775 -5290 -7884 -3763 573 4713 1715 -7592 -8536 -536 2351 -313
1217 -313 -3509 -7138 -5635 3334 5429 -3244 -8470 -6062 -1934 3514 3414 -4835 -7483 20 3975
1232 3975 1486 -1558 -5431 -6222 2229 7872 2160 -3605 -3231 -862 3927 6333 -948 -6000 -61
1247 -61 6306 5959 3262 -2060 -5293 1031 8397 5279 -796 -1612 374 4835 7910 1240 -6655 -2739
1263 -2739 4509 5873 4348 327 -4555 -1448 5670 3794 -2318 -3819 -2628 1518 7189 3438 -5916
1278 -5916 -6281 -25 2707 2429 -612 -5941 -3972 3914 4188 -2264 -6088 -6187 -2308 5097 4746 -4277
1294 -4277 -6925 -1149 1843 1327 -1433 -6693 -5735 2860 5955 814 -3205 -4894 -4260 1762 4483 -2343
1310 -2343 -6085 -1561 2664 3973 2077 -4693 -7651 -247 5637 2965 -1360 -3495 -3597 1991 5945
1325 5945 -851 -6972 -3103 2741 5230 4675 -1394 -6642 -1802 4216 1989 -1100 -2202 -2369 2318
1340 2318 7625 2970 -4690 -4393 -725 2963 5598 1605 -4588 -2016 5320 4899 381 -2664 -4387
1355 -4387 138 7933 6187 -2131 -4553 -1169 2029 4477 1288 -4904 -2888 4971 5937 1359 -2289
1370 -2289 -5750 -4165 2823 4690 -1134 -3517 -1308 845 3609 1922 -6136 -8076 -735 3923 2561
1385 2561 -414 -4712 -5411 1070 4234 -1934 -5831 -3647 21 4034 4230 -3771 -8449 -2351 2663
1400 2663 2111 531 -1959 -3163 2096 5713 442 -4578 -4134 -2010 2752 7092 2421 -3837 -1332
1415 -1332 3518 3449 1765 -1873 -4944 505 8014 5513 -1102 -2959 -2384 1652 6158 2668 -4130 -2061
1431 -2061 3829 4553 1631 -2334 -6324 -2773 4879 4645 12 -1551 -2016 -986 2918 1184 -5545 -5955
1447 -5955 -95 3543 3886 1111 -5214 -5840 1236 3337 -939 -3718 -3540 -1047 4637 4515 -3904 -7278
1463 -7278 -2027 2239 3659 2288 -2851 -4122 1772 4017 -839 -3535 -3143 -1631 3895 7187 1618
1478 1618 -3895 -2458 135 1912 2331 -1758 -4614 963 6711 4190 -619 -3882 -4516 680 6029
1493 6029 2158 -3693 -2253 1564 3097 3105 -1964 -6572 -1482 5634 4648 676 -1425 -3345 -1348 3225
1509 3225 1704 -3470 -2448 1237 3531 5576 2085 -5244 -5441 1114 3436 1626 -164 -2417 -267
1524 -267 5778 4899 -2810 -5443 -2091 1725 5203 3752 -3243 -4290 1688 3330 104 -2097 -3081 -1425
1540 -1425 4207 5220 -701 -4321 -3571 -2446 1162 2792 -1343 -4096 274 3636 1881 -1537 -5666
1555 -5666 -6860 -448 5302 1548 -2809 -2754 -1271 1828 3072 -2777 -7114 -1432 4409 3778 969 -2698
1571 -2698 -4888 -718 4271 1646 -1638 -465 963 2653 4962 1050 -5026 -3738 1519 4216 4705
1586 4705 2462 -2298 -244 5387 3939 -1925 -3622 -1946 2341 7424 5195 -2371 -3341 1169 3141
1601 3141 2350 2 -3208 -850 5180 4716 -944 -3331 -2986 -1591 2849 4233 -661 -2486 -77 1125
1617 1125 1237 -200 -4924 -5830 1186 5646 2640 -1178 -3586 -3581 1031 2846 -2738 -5734 -1302 2886
1633 2886 3948 1933 -3570 -6220 -762 3534 1118 -1276 -1322 -1180 1728 3240 -1144 -5061 -2694 717
1649 717 3047 4570 975 -4342 -2458 1935 1390 -1312 -2636 -2528 1740 7171 3650 -3653 -4484 -1312
1665 -1312 1381 3043 519 -3807 -727 5137 3988 -700 -2898 -3379 -337 4884 4150 -467 -1180 213
1681 213 741 2166 1676 -2708 -2507 3417 5941 3720 505 -3530 -3757 2380 4683 -19 -2182 557
1697 557 3113 5157 3369 -3774 -5946 285 4027 2747 761 -1382 -1621 2294 3229 -1920 -4149 -1836
1713 -1836 146 2645 3662 -661 -5185 -3267 -70 374 131 -1915 -3862 425 4871 764 -4928
1728 -4928 -5804 -3947 315 3988 671 -4393 -1655 2601 1873 -1106 -4064 -5327 -636 5138 3027
1743 3027 -1376 -1576 -1160 -344 2357 1211 -2387 -987 2883 3804 3469 882 -4135 -3145 3291 5416
1759 5416 2203 261 321 1669 4955 3181 -3399 -4470 1348 5007 5278 2782 -1796 -2216 2805 3287
1775 3287 -1409 -2426 -743 1148 4205 3908 -1123 -3808 -1680 -66 1155 2271 -818 -3293 638
1790 638 3256 345 -3158 -4636 -3641 1649 5400 1004 -3852 -2618 163 843 156 -3604 -5331 484
1806 484 5420 2709 -1554 -3019 -3395 -657 2454 321 -2654 -291 1641 1634 1972 -744 -4861 -3174
1822 -3174 2181 3731 2111 48 -2645 -1066 3194 1779 -3691 -3754 195 3611 5324 2118 -4022
1837 -4022 -4071 1566 2493 22 -1370 -1241 1039 4726 3222 -2371 -3776 -1293 146 2397 3205 -248
1853 -248 -1769 1106 2319 884 -735 -2740 -2661 3298 6278 1964 -2350 -2614 -647 2178 2888 -1625
1869 -1625 -3330 1806 5395 3281 -431 -3425 -3813 847 3838 884 -1553 248 1043 1172 1534 -1919
1885 -1919 -4481 -1724 1904 2459 2216 -315 -3999 -2337 1771 766 -2650 -2877 -1048 1955 4411 499
1901 499 -5720 -4838 -161 1799 873 -930 -3012 -348 3630 1102 -3637 -3912 -1809 357 3461 2720
1917 2720 -1234 -1666 249 286 388 229 -2213 -1577 3395 5072 1431 -1724 -3056 -1849 2618 4182
1933 4182 -554 -2111 1531 3987 3220 316 -3831 -3754 2297 5243 1980 -233 -572 49 1887 1842 -1973
1950 -1973 -3283 352 2504 2748 2630 -531 -4047 -1934 1433 886 -291 -1020 -1573 1605 4308 319
1966 319 -5063 -4307 -485 2254 3084 -66 -3555 -924 3036 883 -2658 -3376 -2213 1238 4667 1875
1982 1875 -2530 -2317 -579 -470 711 464 -1907 -807 2697 2813 514 -1717 -4050 -2826 2521 3943
1998 3943 -277 -1991 -250 1470 2335 151 -4815 -4175 2019 4541 2060 -540 -2458 -1968 1690 1809
2014 1809 -2258 -2707 557 1969 2738 1775 -1939 -3724 -893 1422 1608 1572 -42 -1727 1258 3788
2030 3788 316 -3422 -2925 -428 3397 4982 1047 -3161 -1204 2100 1451 -558 -2304 -2060 2386 5492
2046 5492 1797 -2620 -2308 -927 430 2025 398 -1870 114 2135 949 -163 -1716 -4014 -2244
2061 -2244 2584 3259 255 -1641 -2368 -1023 1762 206 -4181 -3550 1370 3551 2123 -779 -4329 -3301
2077 -3301 1178 1730 -1649 -2108 -198 1448 2812 1234 -3079 -3298 -4 1618 1985 2003 -206 -1791
2093 -1791 831 2129 -44 -1481 -1459 -373 3681 5391 680 -3211 -1679 908 1828 1534 -1201 -1877
2109 -1877 2548 4877 1548 -2097 -2950 -1697 1347 3134 548 -1583 295 1285 612 108 -1717 -3508
2125 -3508 -788 2802 2263 507 -1510 -3103 -1733 1707 856 -2743 -2054 876 2580 2537 -1067 -5438
2141 -5438 -3512 1457 2020 -197 -1056 -1089 642 2828 345 -3788 -3326 -89 1448 2499 1494 -1367
2157 -1367 -1690 714 873 -347 -547 -1127 -679 3054 3664 -583 -3215 -2501 -259 2442 2738 -932 -2192
2174 -2192 1534 3205 755 -2032 -3527 -2363 2662 4328 643 -1460 -39 746 980 695 -1729 -2508
2190 -2508 847 2911 2142 1014 -949 -2797 -753 2653 1455 -468 -614 253 2002 2893 -324 -4406
2206 -4406 -2224 2273 3340 2172 -201 -2353 -99 2578 232 -3096 -2651 1 2198 3420 1075
2221 1075 -2662 -2116 -2 -61 -361 -260 -1761 -939 1974 1789 -1389 -2855 -3021 -1405 2266 2551 -1560
2238 -1560 -3229 -422 811 294 -1486 -3879 -2426 2530 3871 126 -1902 -2191 -1200 734 926 -1985
2254 -1985 -1903 1557 2920 1871 718 -1414 -2786 28 2539 1448 612 124 -286 1687 3329 164
2270 164 -2638 -782 2157 3477 3175 -66 -2719 -353 2742 1208 -967 -682 294 2971 4317 694
2286 694 -3137 -1979 115 875 1253 599 -1392 167 2233 1070 -966 -1895 -2735 -999 2667 2286 -1285
2303 -1285 -2263 -990 379 1377 -223 -3099 -2192 2433 2978 -6 -2285 -3375 -1910 1752 1838 -1313
2319 -1313 -1590 689 1484 1310 -209 -3086 -3259 238 1885 1183 520 -624 -1550 740 1749 -1206 -2519
2336 -2519 -1324 406 2530 2606 -1314 -3542 -697 1874 1153 25 -1224 -1237 1825 3145 -463 -3261
2352 -3261 -2034 -87 2117 2609 645 -1603 362 1875 447 -640 -1211 -1589 663 3684 2382 -285
2368 -285 -948 -789 542 2600 964 -2019 -638 2386 2919 1283 -903 -2825 -448 3432 2858 -220
2384 -220 -833 14 1052 1805 27 -3191 -1935 1604 2312 1616 432 -1773 -1990 525 706 -1248 -1509
2401 -1509 -1008 -171 2138 1835 -1898 -3825 -1515 539 1088 200 -2087 -2398 658 1988 -940 -2790
2417 -2790 -2268 -696 2024 2576 -1129 -2589 -865 384 86 -81 -1297 -1361 1340 3137 1150 -730
2433 -730 -1484 -1799 212 2360 1023 -1272 -390 1653 2061 1927 -555 -3112 -312 3298 2469 270 -830
2450 -830 -928 791 2510 665 -2129 -716 1743 2394 1883 -124 -2471 -1631 1238 1096 2 -73 -259
2467 -259 -33 2285 1445 -1818 -2544 -1137 426 1858 1283 -1748 -2003 1121 1768 -58 -1407 -2078 -696
2484 -696 2632 2584 -1027 -2637 -894 164 1065 767 -1345 -1472 1456 2163 -53 -1089 -2091 -2059 514
2501 514 2505 424 -957 -267 -64 915 1141 -1451 -3218 -551 2311 1969 346 -1504 -2235 63 2199
2518 2199 202 -2078 -1082 536 1384 1792 -826 -3074 -1025 1451 1175 460 -50 -1034 128 1943 465
2535 465 -1503 -1555 -621 961 2733 1900 -1483 -1518 791 1236 668 -208 -1811 -256 3080 2770 -564 -1857
2553 -1857 -876 142 2144 1520 -1208 -1333 1292 1604 530 -589 -2154 -1602 1354 2222 414 -991
2569 -991 -986 -883 477 1297 -1402 -2454 -45 1309 1591 603 -2047 -3136 -367 1783 79 -1342 -1149
2586 -1149 -597 1351 1809 -990 -3200 -1003 1090 1199 940 -553 -2085 29 1754 149 -1062 -798
2602 -798 -704 1010 2694 1147 -1681 -1349 173 744 1557 290 -1717 -267 2548 1793 -416 -1264 -1610
2619 -1610 209 2693 1713 -1240 -935 624 978 731 -166 -2368 -1303 1821 1882 56 -869 -1593 -1283
2636 -1283 1026 1150 -1298 -1530 -228 410 1291 619 -2291 -2830 124 1699 666 -585 -1439 -1199 1240
2653 1240 1738 -1286 -2734 -995 609 1561 1503 -1117 -2344 61 1546 217 -376 -923 -711 1276 2365
2670 2365 204 -1827 -1137 -269 763 2021 -27 -2064 -247 1634 993 -55 -1322 -1947 260 2860
2686 2860 1279 -1064 -1176 -167 537 1396 -5 -2330 -725 1733 1424 325 -674 -2030 -721 1615
2702 1615 939 -798 -622 -237 195 1533 798 -2044 -1897 728 1614 1079 392 -1498 -1043 1311 1720 -819
2720 -819 -1509 -494 406 1993 1667 -1578 -2074 24 950 623 207 -1264 -1371 1172 1829 -523 -1609
2737 -1609 -1389 -1009 807 1673 -799 -2186 -497 289 420 63 -1723 -2495 8 1871 420 -1157 -1783
2754 -1783 -1403 281 1702 -431 -2122 -692 861 860 554 -1050 -2361 -464 2196 1293 -268 -348 -612
2771 -612 372 1911 704 -1681 -944 610 1278 1724 644 -1648 -831 1988 1712 22 -634 -880 203
2788 203 2415 1777 -1316 -1545 264 1092 1551 682 -1507 -1419 1192 1379 -334 -1003 -1159 -870 1500 1689
2806 1689 -928 -1455 -673 -164 502 226 -1505 -2201 382 1383 109 -819 -1770 -1802 537 1820 -785
2823 -785 -1995 -851 199 676 834 -1371 -2371 -213 1454 549 -187 -986 -1656 66 1822 52 -1438
2840 -1438 -815 -35 813 1679 19 -2318 -1044 982 848 45 -640 -1551 -234 2198 962 -1429 -1163
2857 -1163 -430 554 1472 643 -1921 -1348 1166 1149 163 -121 -1321 -246 1810 1371 -716 -1164 -632 148
2875 148 1416 1225 -1122 -1185 832 1605 928 241 -1548 -1224 1463 2072 -112 -950 -492 278 1713 1656
2893 1656 -876 -1607 371 1444 874 120 -1230 -1794 646 1702 84 -1026 -1003 -522 651 1268 -811
2910 -811 -2341 -991 455 493 386 -981 -2353 -320 1336 449 -1403 -1666 -1466 105 1482 -44 -2368
2927 -2368 -1045 492 613 573 -586 -2148 -793 1609 648 -616 -955 -982 199 1950 1091 -1226 -1047
2944 -1047 354 700 1053 410 -1686 -803 1500 1930 287 -119 -696 -154 2051 1572 -1243 -1510 247
2961 247 1038 1302 946 -1128 -1072 1229 1759 312 -514 -998 -867 1117 1441 -773 -1379 -115 470 994
2979 994 868 -829 -2005 -33 1214 178 -431 -999 -1435 532 1927 21 -1793 -744 153 754 970
2996 970 -791 -2242 -462 1387 712 -130 -685 -1431 85 1978 230 -1460 -1180 -182 412 1125 371
3013 371 -1749 -793 1194 899 82 -766 -1581 -868 1635 496 -1063 -978 -277 515 1471 568 -1782 -1208
3031 -1208 746 841 -72 -505 -1629 -865 1581 1624 -467 -935 -356 132 1163 1091 -1147 -1589 579 1281
3049 1281 997 620 -609 -1216 1120 1892 161 -853 -524 -146 1173 1808 -456 -1638 308 1401 978
3066 978 733 -897 -1625 315 1596 116 -891 -850 -392 873 1714 -141 -1704 -852 321 271 387 -769
3084 -769 -1991 -524 1478 728 -773 -1084 -1052 -84 1524 46 -2048 -1148 288 741 450 -437 -1741
3101 -1741 -671 1499 1160 -462 -699 -1007 -400 1195 926 -1218 -599 586 894 1083 504 -1244 -1307 1048
3119 1048 1427 180 -149 -553 -251 1610 1569 -759 -1451 -48 846 1270 865 -1005 -1582 646 1624 456
3137 456 -413 -550 -559 1077 1591 -464 -1604 -800 137 526 964 -500 -1596 69 1324 476 -412 -942
3155 -942 -1413 7 1649 249 -1222 -634 -62 607 1222 -104 -1859 -448 1240 809 131 -580 -1211
3172 -1211 23 1816 744 -812 -445 132 454 1043 14 -1617 -1145 844 1051 582 194 -893 -567
3189 -567 1184 1313 -934 -1106 -597 136 1481 884 -1483 -1506 724 934 266 -78 -1275 -856 961 1483
3207 1483 -660 -1109 -599 -332 1198 1399 -474 -1336 294 845 274 7 -981 -1396 844 2002 497
3224 497 -244 -306 -583 804 1406 -257 -1553 -63 997 913 456 -659 -1374 236 1646 587 -379 -338
3242 -338 -439 337 1255 -242 -1647 -558 720 795 673 -176 -1728 -715 720 293 -623 -762 -485 3
3260 3 1380 434 -1605 -1590 92 446 770 -90 -1405 -853 1186 1093 -445 -799 -689 -109 1550 1098 -787
3279 -787 -916 133 495 504 544 -508 -565 1385 1593 419 -21 -970 -729 1004 1528 -67 -750 214 750
3298 750 1109 958 -960 -1564 268 1568 528 -43 -695 -574 577 1269 -434 -1290 -113 469 536 877
3316 877 -703 -1873 -492 672 107 -239 -344 -915 27 1358 8 -1480 -1159 -520 367 1389 168
3333 168 -1482 -728 978 427 -297 -718 -1398 30 1714 909 -957 -775 -253 100 938 450 -1205 -621
3351 -621 966 980 150 -1 -1211 -726 1173 1365 -151 -683 -383 96 1034 616 -1345 -1324 540 1082 789
3370 789 -4 -881 -965 771 1207 -416 -905 -114 369 955 1002 -733 -1386 -26 620 626 629 -399 -785 445
3390 445 1415 141 -780 -428 -128 1035 1935 396 -1284 -321 719 606 293 -543 -1154 209 1853 643
3408 643 -652 -862 -601 204 1081 365 -1103 -166 720 336 205 -477 -1545 -834 962 647 -273 -391 -958
3427 -958 -609 741 484 -1508 -1212 -43 630 732 78 -1637 -1271 635 724 -262 -435 -353 -16 973 919
3446 919 -933 -1338 133 518 831 835 -390 -978 612 1084 -9 -82 -413 -257 1059 1874 141 -1017
3464 -1017 -328 66 789 826 -331 -980 669 1792 523 -498 -1000 -1014 674 1793 233 -763 21 289
3482 289 274 326 -667 -1476 -60 1107 717 184 -508 -1223 -502 778 315 -865 -509 202 520 1142 205
3501 205 -1875 -1361 598 523 114 -152 -776 -90 1278 329 -1150 -841 34 312 1025 735 -988 -859 391
3520 391 344 -122 55 -318 -301 995 1280 -455 -847 -859 -350 718 1046 -423 -1034 329 900 357 -313
3539 -313 -1263 -1287 659 1536 -148 -685 -505 -140 333 456 -520 -1108 599 1033 528 217 -473 -1196 -50
3558 -50 1075 396 -95 162 -24 489 1215 88 -1443 -724 673 975 1114 47 -1048 39 1346 503
3576 503 -701 -601 -211 539 1522 236 -1316 -701 288 172 303 221 -677 -139 856 308 -667 -953 -788
3595 -788 -563 838 979 -678 -1037 -167 255 142 -251 -1423 -1292 973 1331 -23 -663 -877 -638 737
3613 737 739 -756 -870 450 673 526 171 -851 -1049 421 1108 584 308 -61 -392 400 888 -119 -1093
3632 -1093 -337 376 1250 1616 66 -1305 20 915 415 -277 -616 -460 842 1585 52 -1206 -730 73
3650 73 480 611 -101 -889 26 621 147 -451 -376 -912 48 1305 878 -412 -633 -541 -417 552 114 -1097
3670 -1097 -646 1027 1320 257 -599 -1245 -823 991 927 -559 -582 334 422 795 37 -1113 -950 859 890
3689 890 431 172 -441 -690 254 460 -465 -741 -3 298 783 1046 -610 -1364 -446 342 387 248 -550 -786
3709 -786 722 1337 -269 -1315 -873 -247 592 980 -258 -905 29 614 38 -187 -173 -557 360 1423 350
3728 350 -497 -328 -637 -143 1279 675 -660 -139 626 515 539 -257 -1742 -730 1074 1170 -173 -317 -224
3747 -224 497 1001 3 -1311 -773 557 583 576 224 -783 -512 365 428 -388 -85 -191 -197 673 658 -814 -1107
3768 -1107 -250 195 589 699 -673 -809 607 742 -329 -968 -982 -281 1086 1395 -312 -825 45 275
3786 275 220 63 -603 -622 593 906 70 -313 -204 -706 169 1027 367 -326 -104 55 485 645 -571 -1418
3806 -1418 -154 1319 1067 161 -262 -1013 -138 977 -209 -1187 -491 539 799 826 -199 -1138 -506 435
3824 435 139 -141 -17 -471 -48 772 373 -762 -574 -347 -7 991 839 -478 -1015 27 394 -28 -289
3843 -289 -819 -250 1602 1425 -398 -901 -439 170 481 424 -715 -272 1041 941 117 -274 -686 -724 399
3862 399 871 8 -319 14 -371 137 861 -381 -1006 170 845 648 402 -786 -1537 -78 853 69 -664
3881 -664 -264 213 899 734 -479 -1537 -206 420 400 418 68 -406 104 746 108 -550 -357 -232 107 892
3901 892 662 -599 -434 186 294 571 334 -570 -173 1350 944 -451 -924 -854 20 1081 615 -490 -429
3920 -429 870 552 -68 -448 -1103 -672 774 832 -187 -140 -305 -661 82 425 -493 -601 90 196 531 325
3940 325 -699 -1454 -138 820 330 -83 -441 -485 723 887 -667 -1490 -326 617 722 876 -79 -555 149
3959 149 621 -207 -444 -100 -17 503 1204 522 -517 -354 -8 72 751 465 -706 -141 979 740 6 -657
3979 -657 -841 -33 1429 808 -685 -476 -20 240 337 -176 -971 -259 1005 609 229 -261 -650 -516 242
3998 242 227 -457 -171 149 109 568 403 -783 -1323 19 479 474 205 -579 -730 665 662 -566 -983 -351 420
4019 420 852 803 -866 -1016 238 366 -138 -166 -67 -144 651 974 -110 -612 -333 -372 72 788 125 -582 -102
4040 -102 311 308 275 -445 -1130 44 1266 708 -427 -730 -636 91 685 -269 -992 86 969 603 195 -642
4060 -642 -1010 -364 536 173 -112 77 173 -2 584 233 -813 -578 346 393 750 549 -688 -794 581 622
4080 622 -143 -421 -392 94 1305 812 -813 -1006 40 378 407 166 -258 -313 849 541 -591 -394 -609
4099 -609 -472 366 902 126 -581 -83 -34 -142 224 -526 -1006 284 1091 332 -416 -669 -894 76 1042 -106
4119 -106 -848 19 340 493 325 -590 -1077 39 963 420 -282 -110 -180 83 765 -172 -775 -239 294 202
4139 202 807 627 -789 -316 317 509 278 54 -406 -14 1331 570 -727 -788 -275 364 730 364 -685
4158 -685 -388 756 404 -174 -414 -602 -176 790 632 -241 -392 -47 -413 194 446 -401 -522 235 548 359
4178 359 70 -714 -762 380 947 -8 -486 -60 132 575 529 -820 -1006 279 1029 405 74 -228 -873 174
4198 174 679 -247 -506 -82 161 430 875 -82 -859 -308 316 74 374 69 -724 -331 699 460 -754
4217 -754 -607 -422 93 891 539 -1124 -589 231 -10 -149 -344 -794 -230 1034 307 -430 -465 -337 -349 286
4237 286 403 -424 -172 434 237 293 101 -541 -874 466 968 245 8 -213 -183 691 1005 -623 -842 361
4257 361 768 753 430 -421 -663 359 493 -66 -190 -142 17 568 522 -430 -687 -221 -71 126 500 -159 -846
4278 -846 -25 439 -44 -286 -600 -708 295 1048 136 -815 -749 -240 162 267 -206 -828 -46 1039 308 -377
4298 -377 -565 -525 -141 577 322 -430 101 412 67 405 96 -719 -359 475 430 213 104 -472 -533 547 634
4319 634 -515 -574 204 400 704 253 -1129 -967 360 419 -6 77 -342 -257 625 411 -708 -547 -224 -128
4339 -128 240 518 -97 -451 -36 228 -159 -88 -446 -729 352 919 140 -582 -555 -342 461 760 -93 -1031
4359 -1031 19 742 161 -224 -653 -757 214 981 99 -415 -64 -250 -158 281 -9 -723 -269 625 297 496
4379 496 36 -696 -416 597 286 -339 -328 -242 128 580 361 -920 -791 279 403 108 139 -612 -343 631
4399 631 244 -551 -334 -208 157 665 505 -328 -583 -36 -41 288 263 -498 -392 460 725 42 -451 -475 -426 464
4421 464 830 -166 -669 101 303 128 44 -575 -751 290 900 167 -399 -297 -485 22 367 -458 -691 224
4441 224 326 198 350 -330 -874 -363 368 23 -19 -268 -375 95 810 56 -690 -370 6 273 554 -5
4461 -5 -926 -318 491 320 -211 -1 -216 31 1000 517 -538 -272 240 -21 556 370 -340 -312 612 564 27
4482 27 -7 -488 -482 576 714 -192 -537 165 -23 395 481 -766 -701 156 498 -22 -383 -506 -559 238 534 -372
4504 -372 -430 60 -27 118 440 -435 -961 -44 406 104 115 -283 -619 -73 371 -73 -689 -321 -238 323 835
4525 835 83 -738 -193 349 310 288 29 -492 28 939 250 -512 -269 6 265 694 475 -496 48 358 -46
4546 -46 162 83 -616 -293 623 574 -230 -92 -163 -180 446 16 -502 -589 74 219 178 95 -607 -547 659 497 -442
4569 -442 -440 -196 -249 207 372 -651 -504 83 436 503 508 -243 -523 -28 573 -124 -265 52 -298 530 981 42
4591 42 -685 20 309 500 506 -122 -786 169 1007 308 -41 -182 -148 173 856 102 -572 -61 -14 -95 196 -130
4613 -130 -410 -238 388 127 -223 -318 -653 -344 440 61 -772 -436 70 46 265 -140 -802 -558 284 189 -227
4634 -227 -135 -578 -349 540 236 -448 -341 -1 71 365 442 -399 -483 219 268 -46 160 157 -202 380 676 -168
4656 -168 -347 -30 -20 408 697 -175 -693 255 513 362 -124 -154 -539 397 613 -59 -452 39 214 284 697
4677 697 -261 -713 -66 296 56 -141 -290 -622 -190 630 193 -233 -163 -109 189 447 18 -918 -302 386 287
4698 287 132 -191 -485 -311 676 274 -249 -365 -224 -121 443 379 -728 -452 405 175 124 -8 -371 -336 452
4719 452 450 -273 -313 -78 -134 795 722 -390 -416 60 329 109 315 -669 -506 297 629 -110 -250 -84 -197 291
4741 291 349 -219 -680 48 338 226 80 -81 -439 238 673 -243 -73 -266 -323 60 576 -44 -646 -32 335
4762 335 384 516 162 -679 -89 630 176 -184 -171 -341 99 640 281 -586 -288 210 45 345 180 -419 -379
4783 -379 399 28 -240 -10 -477 -78 551 666 -488 -366 -82 -63 261 134 -561 -322 71 499 -96 -138
4803 -138 -432 -513 420 592 -336 -404 -27 -48 407 387 -279 -677 450 447 -10 134 -253 -197 213 764 98 -366
4825 -366 11 -36 355 352 -109 -714 -1 509 86 160 -55 -489 63 809 164 -527 -267 -81 76 370 11
4846 11 -628 -288 387 50 126 -264 -566 -316 422 175 -393 -175 -287 -43 236 261 -514 -372 253 271 283 59
4868 59 -573 -332 640 525 -285 -138 89 28 470 310 -323 -344 373 350 218 271 -203 -424 210 519 -189 -149
4890 -149 -243 -189 261 545 -385 -599 224 348 90 255 -529 -634 197 591 -190 -275 -366 -193 260 287 88 -732
4912 -732 6 155 159 14 -202 -672 -64 288 -10 -276 -44 -383 -305 348 261 -470 -124 146 -83 435 -60
4933 -60 -579 -127 493 393 -167 14 -315 -41 610 411 -410 17 270 210 385 94 -467 -132 383 323 11
4954 11 -71 -237 -500 362 496 -291 -612 31 4 315 280 -355 -821 264 473 1 -6 -339 -342 172 596 -100
4976 -100 -328 -226 69 74 243 -209 -376 158 242 99 26 -339 -296 75 627 64 -491 -299 69 234 544 -19
4998 -19 -673 -162 387 19 218 22 -437 -226 524 249 -260 -45 -162 166 238 13 -548 -112 266 224 -75
5019 -75 -155 -560 -230 337 262 -157 -85 37 -64 339 280 -203 -194 270 268 83 65 -224 -312 297 373 -246 -262 90
5043 90 -163 375 371 -292 -408 182 442 290 262 -276 -336 275 187 -83 -162 -207 -141 169 522 -176 -484 -132 -22
5066 -22 -13 284 12 -725 5 507 -23 -231 -147 -267 182 493 223 -500 -123 25 75 186 -163 -401 30 558
5088 558 176 45 -56 -127 -25 197 -42 -466 -219 84 266 325 126 -488 -161 660 456 145 -150 -111 -202
5109 -202 436 447 -362 -425 72 131 169 173 -496 -338 217 197 -191 -76 -213 -182 385 599 -236 -378 -105 -202 111
5132 111 437 -280 -629 -23 372 -125 92 -354 -414 -91 521 -75 -473 -159 105 236 371 -117 -536 205
5152 205 459 34 43 -59 -477 32 592 70 -204 28 69 173 535 157 -446 -36 464 279 8 55 -285
5173 -285 -109 675 207 -256 -165 -56 90 262 -91 -616 -354 240 71 -35 175 -419 -159 241 164 -355 -372
5194 -372 -194 -212 266 396 -319 -389 65 167 -104 26 -351 -321 454 592 -119 -217 -135 10 294 561 -258 -253
5216 -253 145 423 212 39 -301 -298 117 556 275 42 45 -342 190 437 -100 -496 -176 229 61 296 176
5237 176 -437 -39 528 105 -226 -246 -365 137 282 -20 -470 -254 214 99 36 -330 -610 -210 361 85 -124
5258 -124 -78 -232 -21 551 275 -169 -351 154 -77 107 120 -356 -224 299 238 -42 -112 -320 -176 357 375 -446
5280 -446 -469 59 317 164 155 -214 -273 182 227 5 46 -138 -239 287 316 -222 24 7 117 97 247 -37 -578
5303 -578 46 200 93 -136 -114 -381 93 691 -61 -577 -165 -6 237 314 -116 -482 -118 325 63 7 -234
5324 -234 -220 115 454 -167 -300 -223 -103 143 296 250 -193 -181 345 281 -245 -169 -489 -368 399 507 -49 -313
5346 -313 -114 -81 492 108 -328 -221 210 449 255 -197 -272 -389 393 347 -320 -205 -13 -144 83 255 -296
5367 -296 -511 43 238 167 67 -212 -463 162 485 -257 -271 -121 -35 176 494 -161 -375 -30 279 245 89
5388 89 -228 -390 17 413 78 -416 -109 -179 55 446 229 -251 0 236 -11 108 -174 -485 -258 399 358
5409 358 -21 -105 -326 -205 247 104 -440 -286 264 82 96 -46 -471 -187 378 152 -86 -198 -38 -239 315
5430 315 244 -271 -327 145 188 385 367 -60 -193 189 171 -145 74 -127 46 406 585 -213 -314 -156 -94 201
5452 201 375 -134 -440 427 392 122 -190 -189 -198 277 302 56 -319 -102 -27 -126 145 123 -442 81 351 9 113
5475 113 -291 -542 -207 207 -166 -349 -197 -125 126 341 -171 -392 -204 286 10 -96 58 -43 53 340 16
5496 16 -299 -87 99 -61 213 231 -167 -244 -2 200 -143 -102 -8 -263 309 282 -206 -469 -44 -71 306 181
5518 181 -357 -263 120 65 -78 -84 -258 -197 361 392 -186 -255 -117 -171 -69 113 -146 -348 85 62 152 144 -212 -430
5542 -430 -126 401 165 -48 -129 -107 -93 267 -33 -426 -29 590 216 395 124 -483 97 356 12 -83 -53 -72
5564 -72 87 437 240 -388 -19 190 50 196 32 -403 -177 190 232 -115 -128 -249 -109 308 170 -320 -258
5585 -258 -53 -67 -196 -92 -253 -246 359 396 -88 -23 -412 -156 82 68 -109 -243 112 137 125 333 -219 -346 89
5608 89 417 68 2 12 -126 203 562 -9 -337 65 72 429 351 -155 -502 97 405 60 -106 -177 -7 270
5630 270 443 -45 -615 -58 -12 155 69 16 -172 -100 -17 -11 -62 -124 -320 -229 356 299 -433 -270 -35 -115 278 34
5654 34 -343 -71 266 341 -58 62 -422 -96 377 67 -185 -17 197 9 255 75 -155 -348 179 237 110
5675 110 265 -286 -274 333 283 -81 -225 -18 -105 257 513 -308 -716 55 199 101 129 -222 -259 167 257 -440
5697 -440 -312 -219 -226 175 276 -86 -548 23 -1 -254 -82 -40 -382 -53 434 80 96 -194 -288 132 404 215
5719 215 -160 -67 215 98 265 88 -324 216 459 333 -11 84 213 76 401 31 -495 -62 476 35 148
5740 148 119 -307 -314 156 15 39 27 -197 -120 279 383 -415 -441 32 80 66 211 -248 -149 242 231 -424 -316 -341
5764 -341 -111 168 131 -326 -223 -45 -20 -109 76 10 -178 98 314 71 -76 -195 -253 161 461 -108 -169 102
5786 102 14 97 145 -169 -510 117 372 122 -94 -104 -155 -1 120 -120 -187 135 228 120 -92 -97 -297 -110 107
5809 107 189 122 118 7 -251 278 70 -264 -346 -62 5 491 193 -291 -371 86 78 -108 -142 -125 -111 270 320 -379
5833 -379 -312 -55 -23 53 223 -237 -114 391 217 -13 93 42 -124 84 373 -65 -129 -343 -220 -25 551 -137
5855 -137 -462 170 441 302 103 -504 -297 50 430 -268 -194 96 -30 226 216 34 -379 -47 179 43 4
5876 4 46 -346 -125 52 -26 -167 84 -364 211 349 51 -535 -180 87 268 195 219 -304 -12 637 347 -249
5898 -249 -102 -219 -20 260 -68 -94 -225 289 148 -119 153 -222 -186 247 239 -97 1 -120 -210 42 338 -84
5920 -84 -380 -211 275 59 67 -341 -491 38 139 -133 -169 -185 -226 51 27 -308 -392 127 31 -51 315 128 -317
5943 -317 -18 129 -7 -162 215 -147 91 522 134 -128 -115 -18 215 468 127 -160 -157 351 109 -112 -78 -263
5965 -263 107 497 152 -310 38 101 -120 13 -89 -379 12 290 246 -50 -59 -31 -268 263 227 -81 -118 -27 -84
5988 -84 116 54 -410 -400 332 226 -34 -92 -373 -216 58 350 -361 -89 31 2 263 33 -41 -327 143 224
6010 224 129 116 -38 -158 1 122 91 -208 -75 103 140 504 -101 -434 -66 100 -89 -111 -16 -320 161 519
6032 519 -81 -204 -103 59 103 202 161 -506 -77 442 -79 33 -188 -216 -141 351 45 -76 51 32 63 300
6054 300 -19 -386 -116 246 217 235 242 -380 -328 294 58 -468 -2 92 258 222 157 -222 -320 143 61 150 291 -59
6078 -59 50 253 121 -84 -41 -58 -158 276 382 -3 -311 11 205 141 302 -133 -459 244 347 -142 -256
6099 -256 -330 -190 109 146 -174 -270 -24 279 -4 -86 -262 -325 193 230 -7 -52 72 -176 -193 212 -14 -250 86
6122 86 96 -52 195 97 -416 -13 234 91 60 33 -197 -129 355 98 -403 -225 41 -45 235 171 -135 -259 265
6145 265 107 -54 58 -33 -72 101 161 -185 6 46 -68 98 205 -277 -109 209 374 221 9 -195 -111 353
6167 353 561 32 -193 61 93 115 242 -263 -285 43 203 77 -19 -110 -209 29 400 -199 -120 277 -5 247
6189 247 279 -67 -287 -208 71 -30 201 -90 -475 -24 242 73 -286 -238 -384 53 407 -88 -410 -162 166
6210 166 -16 -89 9 -328 -171 297 24 -113 -98 -236 -268 238 227 -108 40 169 116 206 196 -229 -331 281 318
6233 318 -83 -118 -72 -88 309 256 -85 -262 141 405 73 61 -71 -130 70 99 2 -247 39 -142 125 271 9
6256 9 -396 -235 -177 -53 159 7 -389 -324 58 -37 -186 -166 -311 205 363 -199 -551 -117 -68 41 247 -66
6278 -66 -222 90 164 0 -205 49 14 -36 376 136 91 155 43 -80 221 67 -267 -1 313 212 76 173
6300 173 -29 -182 423 113 -50 -198 196 13 234 70 -312 -95 210 28 87 202 132 -78 105 -201 -294
6321 -294 -356 -103 -237 80 227 -149 -534 42 12 -213 -97 -142 -238 75 287 -282 -399 -272 51 70 59 -214
6343 -214 -227 102 171 17 -270 -161 -276 6 392 -37 -206 -67 136 -78 303 27 -195 -163 226 180 227 -97
6365 -97 -268 -18 346 181 -17 -99 38 -6 398 -77 -419 -61 232 96 61 -122 -313 -153 279 -120 -86 -12
6387 -12 -135 -59 244 165 -56 -174 20 -10 109 252 -292 -118 136 350 -74 -115 -47 -128 85 325 17 -323
6409 -323 125 393 110 71 -46 -72 64 245 98 -156 -24 -122 99 327 48 -117 97 176 -279 -47 -170
6430 -170 -322 -116 160 -43 -31 -90 -237 42 371 -70 -330 -176 46 141 172 -171 -375 -125 149 -55 -180
6451 -180 -78 -53 68 288 10 -108 -184 -88 -142 64 229 -207 -160 223 120 -112 58 -242 -222 199 229 75
6473 75 -31 30 158 75 -11 -228 -156 327 118 -114 113 -129 15 203 55 -58 -4 46 58 -161 283 49 -538
6496 -538 194 141 -52 22 -141 -342 -65 375 -13 -207 -173 39 23 276 275 -214 94 136 -64 -27 -177 -276 100
6519 100 443 -82 -380 -249 22 -103 97 168 22 -27 257 175 196 148 -339 -225 347 180 -302 -66 59 -228
6541 -228 75 182 -317 -249 28 156 41 -163 -226 -155 255 69 -113 -53 -101 -187 147 20 -197 -180 141 -10
6563 -10 29 21 -203 -125 -46 219 -122 -136 102 -55 131 113 -146 -373 71 92 302 212 -150 -92 3 177 209 -116
6587 -116 151 -27 231 275 -52 -218 67 92 -129 278 -117 69 -11 393 86 -113 -93 -58 -153 197 190 -397 41
6610 41 9 -41 -51 -102 -630 -159 145 184 -241 36 -118 -32 183 -72 -288 -262 190 -93 277 90 -268 -251 155
6633 155 285 25 83 -109 -67 321 330 -211 -100 127 149 58 394 -259 -39 383 387 -2 122 -28 -84 174 248
6656 248 -114 -220 11 98 -64 263 264 -161 -12 137 -147 88 -152 -288 -123 132 -111 -261 -41 -99 28
6677 28 104 30 -188 -96 -83 29 18 -79 -49 -139 402 39 -259 4 143 -98 264 121 -459 -141 58 4 46 4
6701 4 -170 -185 394 97 -87 6 -129 -58 235 116 15 -70 105 -30 -50 174 -180 -48 254 321 -78 -85 139
6724 139 126 177 272 -3 -57 113 52 -41 78 37 -365 77 21 -11 33 60 -157 242 186 5 -218 145 322 106
6748 106 140 -121 -327 91 186 42 -26 -193 -210 -71 281 172 -216 35 72 52 249 -188 -231 -285 64 -74 -238
6771 -238 -135 -347 -265 164 123 -269 -226 -30 -213 84 81 -232 -119 183 50 -124 -24 -102 -89 259 -71 -109 -207
6794 -207 -72 -100 -77 182 -271 -22 260 131 120 136 -110 -43 97 -4 -182 -159 -75 -156 314 39 -172 -41 67
6817 67 169 -81 109 129 -216 0 114 -130 -199 27 13 138 152 -100 -280 -66 289 34 205 227 -264 27
6839 27 400 94 -134 17 -24 40 251 17 -373 -108 390 163 -93 -19 -108 70 432 98 -103 -111 144 25
6861 25 217 98 -96 -115 129 141 -23 121 -287 -22 220 107 -50 -92 -80 -204 225 131 -130 -413 42 -6
6883 -6 46 -53 -105 -233 50 246 -137 -60 -21 -202 121 217 -195 -171 255 -71 23 -8 -32 -166 -7 188 13 -182
6907 -182 124 -149 208 452 18 -328 -93 209 17 400 71 -225 5 313 265 -58 174 70 260 296 104
6928 104 -286 -257 173 112 195 102 -114 2 411 164 -24 78 -78 -3 68 135 -379 -74 -64 94 22 -7 -97 -328
6952 -328 141 65 -20 -265 -268 -58 111 64 -213 -185 24 -103 -74 37 -109 -222 92 108 -35 177 -20 -211 74
6975 74 240 -197 -123 126 82 172 300 92 -444 112 329 36 36 -424 -294 -69 8 -139 -303 -30 5 141 15
6998 15 -220 -234 -34 250 -132 51 18 -386 0 440 203 -170 91 -43 44 78 -52 -296 -172 78 247 14
7020 14 -37 8 -5 193 37 -88 103 11 49 89 92 -243 -105 43 134 49 120 5 -170 43 111 60 -191 124 63
7045 63 -33 224 -110 -206 -62 69 14 -138 -363 -288 -5 286 -113 -326 -34 -10 -37 -9 -227 -235 -61 214 74
7068 74 63 -169 -152 18 155 119 -257 79 -108 -46 305 85 -118 69 111 88 7 -85 -370 -83 183 97 -11
7091 -11 -95 157 -40 47 265 -205 -5 132 39 -27 -32 -223 -18 96 147 -33 140 -73 -115 170 167 -216 -62 140
7115 140 -109 145 -63 -283 -310 166 23 -16 -151 -209 -152 210 356 -130 -83 66 -112 55 184 -30 -96 159
7137 159 54 -52 46 227 -63 44 216 57 -14 225 -81 -71 194 -113 -205 21 259 8 128 9 -251
7158 -251 -9 316 -145 -134 121 30 54 82 85 -143 -56 118 60 -30 0 -168 -268 228 78 -174 -160 52 138 287
7182 287 39 -80 -196 26 41 19 -52 -144 -38 413 -37 -348 -195 23 -24 126 198 -191 -175 341 -80 -178 -84
7205 -84 -123 6 117 98 -31 -45 15 -13 87 58 -14 -218 -17 37 -228 98 -90 -348 144 -24 -99 -99 -153 -39
7229 -39 -94 81 -27 -441 -58 182 -77 144 10 12 77 270 -63 82 -29 106 4 172 159 -185 -20 110
7251 110 64 122 119 -8 -5 184 140 -26 28 -21 -200 227 312 -149 -3 -119 119 -27 50 -53 -145 160 31 -223
7275 -223 15 -192 -112 2 -39 -24 -389 3 -126 -90 -290 -192 -359 -9 -4 -165 3 -12 -314 -133 205 -242 -314
7298 -314 16 40 167 100 77 -378 64 39 -202 -85 104 -170 33 186 -43 -176 136 -122 -33 208 -37 -191
7320 -191 101 266 101 -64 -81 -164 -53 265 -14 -15 -21 -32 31 254 -79 -190 -149 261 -99 -98 202 -202 -222 83
7344 83 28 -144 -13 13 -53 38 216 -231 -188 216 177 72 97 -268 -67 87 305 -55 -117 147 160 141 154 -125
7368 -125 -11 -93 155 87 171 156 65 194 194 -182 -214 -65 -33 -15 32 9 -106 -43 164 -32 54 -19 -45 -283 216
7393 216 21 -189 52 87 -161 -61 -138 104 -215 33 63 186 120 -261 -92 142 -28 126 21 -207 -136 93
7415 93 159 -391 143 -20 110 141 126 1 -88 99 197 19 135 -91 -87 381 194 -129 -79 252 234 107 248
7438 248 -78 -116 100 163 163 6 -82 -121 62 107 -141 -260 -97 -75 -153 93 -68 -388 -18 87 -78 -109 -121 -363
7462 -363 13 137 -163 -295 70 117 106 181 9 -247 -218 123 -178 -65 -2 -133 38 42 -18 -290 28 138 -48
7485 -48 240 -31 -273 -140 148 256 115 -58 -214 -137 285 105 -367 -259 -190 -58 77 257 -26 14 301
7506 301 121 130 16 -101 -54 254 25 17 -87 -98 -137 108 219 -136 -35 77 163 165 99 -44 -208 77 177 81
7530 81 -14 53 -74 165 246 -194 -275 93 27 28 71 36 -24 -90 119 -113 120 1 -62 -18 265 30 -211 110 80
7555 80 -61 129 114 -262 -71 90 -71 -306 8 -169 -78 104 -92 -177 6 -86 39 -146 -165 -206 -154 278 -36
7578 -36 -236 -78 -38 55 -39 168 -116 -128 101 -48 19 47 -72 -64 169 118 288 133 -40 -4 273 160 -112 21
7602 21 99 95 8 16 -167 -73 306 101 -39 -119 5 -63 -14 170 -64 -163 79 -64 196 291 -30 -271 -173 207 170
7627 170 -31 120 -281 2 205 -14 -307 -17 -91 38 98 25 -148 19 239 -80 52 56 115 -44 212 61
7649 61 -116 -139 -62 -82 228 119 -30 -144 -28 79 -11 62 -65 -8 121 258 -208 6 16 21 289 -121 -213 -68
7673 -68 94 92 -152 112 -8 -82 214 257 -339 -50 125 -90 -66 313 -299 -105 -9 -130 139 192 -6 -247 32
7696 32 -26 -35 -164 -29 -132 139 494 -85 -145 91 -155 -171 127 -31 -130 -91 326 173 -76 91 -320 1 219
7719 219 -104 -122 32 104 -45 174 211 -274 -50 171 -18 -101 62 -158 -119 -101 -71 -332 -120 98 -17 196
7741 196 27 -4 -107 251 23 -114 -13 -38 -94 26 32 54 -96 35 64 78 157 -115 -34 115 186 -111 66 6
7765 6 95 68 63 -120 -163 230 -39 40 92 26 -119 181 155 -15 21 -2 -132 -71 99 72 173 202 -86 -26 268 217
7791 217 -280 -84 185 -8 68 52 -279 -129 131 76 -210 -126 -71 20 197 -48 -201 -111 76 -190 -151 59 -2
7814 -2 -55 95 -170 -181 -23 -73 161 124 206 90 44 220 257 116 91 -35 -9 292 301 -28 -91 -166 -66 97 41
7839 41 -259 -37 103 185 -154 152 -9 -75 -75 20 -197 -171 51 -57 -80 125 -77 -112 73 32 146 230 32 -161
7863 -161 102 227 10 -13 -65 -112 76 184 -128 -338 -76 188 11 105 -95 -19 138 174 -78 -221 -84 -3
7885 -3 46 144 -124 -88 -54 76 -293 -176 106 -234 -89 127 43 -149 -96 -150 -200 58 155 -294 -102 -56 -28 -8 -3
7910 -3 -263 -123 260 24 -61 -18 -167 85 63 120 -202 -186 37 53 -47 276 45 -16 -15 256 -77 144 -22 -149
7934 -149 95 151 81 -42 -59 0 -28 194 149 -371 157 251 -18 -71 121 -29 23 79 -49 -76 83 28 6 80 119
7959 119 -151 -117 180 21 23 114 -14 -73 130 13 -168 -171 -113 16 56 101 -263 -6 82 194 -128 -41 5 -65 -41
7984 -41 147 -278 -179 -71 57 14 87 -187 -159 7 -12 -252 56 -81 -258 173 194 -24 -138 49 -39 252 108
8007 108 -166 -179 61 278 126 -35 -13 -144 148 116 -88 -149 -40 -136 -51 195 29 -210 32 117 37 165 86
8030 86 -150 -158 -80 -54 90 143 -182 -12 167 -31 -314 -23 135 125 13 253 -116 -148 174 -18 -199 316 29
8053 29 44 66 -33 -178 71 28 -83 25 106 79 -83 124 -24 4 -28 6 -225 -122 54 -198 -154 141 -23 51
8077 51 102 -171 -346 161 275 -146 -106 -227 -72 72 142 -91 -156 63 -52 -45 59 -31 -158 -71 72 -124 52
8100 52 19 -134 -156 305 86 -122 96 110 37 67 -36 -73 65 392 100 -53 66 2 34 373 113 -1 72
8123 72 96 28 102 74 -88 -117 105 32 148 246 52 -121 -4 -29 -56 61 -162 2 -12 -7 -285 -166 -50 28 -22
8148 -22 -81 -168 -99 122 199 -57 -19 -130 -84 -57 83 -83 -93 42 116 181 140 -58 -51 -34 169 42 -69 -40 -226
8173 -226 -128 -2 -24 98 35 286 99 52 -79 64 8 109 -4 -101 127 -39 48 113
8191A13
$$ Imaginary data points
##PAGE= N=2
##DATA TABLE= (X++(I..I)), XYDATA
0 0 0 0 0 0 0 0 0 0 0 0 0 0 0 2 -8 8 -8 8 -8 8 -15 16 -16 19 -24 25 -31 33 -39 43 -49 53 -59 67 -75 83 -92
37 -92 102 -115 124 -139 155 -172 190 -209 233 -260 290 -325 364 -413 471 -541 636 -755 927 -1182
57 -1182 1607 -2446 4723 -22864 -76872 -35793 -227 2899 -13037 -27310 -28002 -2215 1502 -30050
71 -30050 -53134 -50776 -38005 -6517 14312 -12183 -44474 -36335 -21028 -19140 -19075 -28222 -36274 -10905
85 -10905 18951 11195 -15553 -37702 -46715 -17573 25504 17635 -18426 -13025 19046 29242 11654
98 11654 -22163 -40070 -7345 36780 35884 15202 8890 4341 7161 22507 14375 -10959 -6630 20000
112 20000 36841 39674 20680 -13558 -16564 11938 22960 17028 13661 4115 4847 30893 33386 -10036
126 -10036 -37780 -17837 18766 40545 27127 -9541 -14382 15438 18756 -8937 -22188 -17769 -3284
139 -3284 26035 35591 6715 -18096 -16053 -7215 4160 9732 -7186 -15607 8590 24806 11109
152 11109 -6439 -22274 -29856 -3590 29083 21226 -5847 -14238 -5952 9575 11619 -20241 -42810
165 -42810 -10152 31082 28065 3301 -15619 -23791 -10941 4495 -6909 -20866 -12076 1119 11253
178 11253 18108 -2607 -36185 -32912 -4771 6062 4060 -1952 -15012 -12373 6768 4970 -18560
191 -18560 -30381 -23173 1491 31498 23011 -20662 -32859 -5070 8972 -2053 -14458 -18274 194
204 194 30188 27468 -3745 -19595 -17446 -9388 10310 19055 1144 -6552 10977 19982 11778 -371
218 -371 -17014 -18426 10498 31824 21472 4875 -5963 -9383 8769 22352 -83 -21025 -350
231 -350 29589 34205 14879 -15765 -26601 -154 20806 7833 -3154 3858 8974 15461 19395
244 19395 -1218 -25285 -17708 3975 16678 20212 6796 -11844 -5071 11209 4306 -9309 -12099
257 -12099 -11070 4490 28977 20690 -15210 -28287 -11893 6733 13251 -1299 -19390 -4487 24499
270 24499 17627 -12488 -26055 -22962 -8290 13959 15257 -3924 -9911 -2186 254 708 -6900 -25024
284 -25024 -22177 7500 20766 8911 -5200 -17931 -20813 -1556 10706 -4891 -16901 -7662 7784
297 7784 19210 10209 -23372 -36081 -5292 20055 11827 -1969 -6714 -3202 9900 11410 -10145
310 -10145 -21840 -9484 5054 17780 23745 4509 -16552 -7850 7755 4794 -1452 -4575 -5449
323 -5449 10139 27016 14415 -10006 -18011 -11678 6282 23474 11227 -13426 -6189 17881 16899
336 16899 -2927 -18715 -20130 2096 26350 18581 -3243 -7457 -4176 -1888 4937 801 -14777
349 -14777 -9934 12734 20564 12119 -2857 -19841 -17222 5756 13340 1373 -4085 -1803 3350 15238
363 15238 12374 -15473 -27007 -3862 19268 21343 7406 -11211 -10906 10570 13920 -7033 -14941
376 -14941 -3529 7768 19123 20240 -794 -17622 -9260 2517 6316 6341 -2788 -7771 8385 19681
390 19681 4529 -12851 -17464 -14110 3014 20342 9146 -12904 -12165 942 6042 354 -17169
403 -17169 -26556 -3774 22023 12760 -10263 -18175 -16286 -6750 3475 -3521 -16521 -9804 3609
416 3609 6855 4483 -9169 -27611 -21204 3762 10570 742 -5663 -9011 -5161 7597 4536 -15321
430 -15321 -20076 -5312 11319 21247 11396 -14404 -18408 5432 15071 1230 -7661 -4307 7831
443 7831 23114 19394 -3473 -12815 -3378 5825 14313 17262 4237 -3330 10372 18997 8843 -2395
457 -2395 -7945 -4497 14963 27754 14055 -2815 -4020 459 8559 12860 -1606 -14205 2848
470 2848 23862 18881 340 -14471 -16806 629 15026 3690 -9553 -3617 4034 5248 4986 -7272
484 -7272 -23234 -15332 4419 9709 3924 -6345 -16629 -10622 3938 -884 -16124 -16633 -8143 1864
498 1864 12087 3461 -21396 -26268 -7317 4259 1564 -8086 -16040 -6343 12766 7954 -15297 -22035
512 -22035 -12998 -2183 9085 9015 -6061 -11691 -846 4739 1264 -4372 -13116 -10060 11077 20327
526 20327 5909 -6936 -8699 -5073 6908 13858 1322 -8184 3052 15585 15984 6325 -11244
539 -11244 -16423 5369 23217 13293 -908 -535 4483 10791 11739 -2551 -12718 -2197 11807 15926
553 15926 14089 1530 -12177 -4095 11514 7687 -3807 -5429 -2088 7430 16293 5404 -14409
566 -14409 -15268 -2683 6946 11324 2194 -13659 -8375 10150 8025 -9653 -17416 -13002 482 14545
580 14545 8917 -9627 -13013 -4836 -1687 -90 -3015 -13429 -11111 7303 12720 1204 -9631 -15179
594 -15179 -10827 4877 9834 -3617 -10206 -3139 3054 6579 3096 -12713 -18390 438 15921 10307
608 10307 -2197 -10561 -8696 5027 9267 -5727 -13454 -2735 7409 11050 9677 -4225 -16020
621 -16020 -7235 5849 5485 25 -5488 -6630 4937 14279 2009 -13398 -11562 -2670 6145 12651
635 12651 3207 -12094 -8224 6272 7971 176 -8460 -11290 2910 19318 10894 -8170 -11153 -3708
649 -3708 3056 8577 3954 -6816 -2896 10231 12160 5178 -3474 -12732 -7089 11208 14483 1356
663 1356 -4612 -1186 3581 9552 6236 -8733 -11564 2504 11922 10177 1459 -11683 -12272 4655
677 4655 11322 -1896 -10127 -5071 2447 8734 5283 -10715 -18043 -7204 2456 4003 2136 -6775
691 -6775 -11715 -287 8208 -2466 -14011 -13416 -6767 4386 10569 -1179 -13628 -8536 1048 3622
705 3622 2426 -6376 -13189 -709 14086 7907 -6856 -11314 -6512 4811 13685 5415 -6644 -2317
719 -2317 7377 7933 4968 -2174 -10671 -3553 13335 15117 4593 -2328 -4082 1734 11331 6238 -7748
734 -7748 -7232 3926 9623 10503 3579 -9950 -10317 4831 10917 1949 -6031 -8121 -2175 9018 6254
749 6254 -10350 -14671 -3862 3966 6559 3383 -8062 -12649 -1740 4290 -1755 -8498 -11120 -7057
763 -7057 6707 11448 -2173 -12837 -8290 -1501 3140 3918 -5621 -11875 -945 10121 6444 -2536
777 -2536 -9506 -9275 4093 14354 4043 -8390 -5465 2082 6102 6543 -1968 -9491 -1059 11043
791 11043 10740 4067 -3662 -9448 -1804 10741 6611 -5421 -5140 2233 7922 10721 2595 -10460 -8414
806 -8414 3930 8218 4671 -1413 -8203 -3484 10317 8988 -5244 -9435 -3064 4305 9940 4755
820 4755 -8681 -9893 1011 5313 3021 -626 -6563 -5526 7629 10925 -1647 -10486 -8189 -1945
834 -1945 6598 7050 -4691 -9158 394 6667 4094 -1025 -9295 -11241 1828 11073 2095 -7813 -8245
849 -8245 -3236 5104 7194 -4700 -12075 -3168 5374 4478 314 -7309 -12220 -2965 8787 5051 -4119
864 -4119 -6273 -3584 3913 8806 -790 -12507 -7266 3404 6868 6271 199 -8031 -2630 9400 7930
879 7930 -1727 -5905 -4416 3884 12660 7012 -6506 -5607 4220 8138 7668 3058 -5112 -3162 8299
894 8299 9874 1368 -4310 -5416 269 11470 10802 -2734 -7076 263 4964 5427 1399 -7878 -8541
909 -8541 3610 9495 3274 -3472 -7850 -5870 4696 7667 -4646 -11776 -4987 2218 4273 1681
923 1681 -7706 -11450 -1548 6291 2678 -3188 -7717 -8340 569 7699 -1158 -10687 -6733 1182 6106
938 6106 6075 -2659 -10397 -3692 5979 4651 -447 -4621 -6403 1594 11368 6080 -5744 -6031 347 5946
954 5946 8137 1176 -7874 -3441 6791 7512 2785 -1550 -5357 -707 10187 8697 -2842 -6392 -2063
969 -2063 3206 8047 4020 -6539 -5711 5007 8094 3882 -933 -7021 -5315 5874 8668 -1199 -6954
984 -6954 -3843 2034 8109 5898 -5775 -9134 695 6253 3719 -297 -6087 -6795 3436 9218 1441
999 1441 -5750 -4814 -907 5844 7218 -3411 -10312 -2827 5277 4593 1718 -4313 -7569 578 8639
1014 8639 3308 -5111 -6763 -4142 2946 7874 -82 -9742 -4954 3828 5049 2201 -3494 -8590 -2992
1029 -2992 6493 4210 -3295 -5861 -4966 1036 8360 3512 -7336 -6549 1673 5143 4013 -670 -7439
1044 -7439 -4023 6428 7701 571 -3288 -3873 491 9134 7576 -3944 -6395 1504 6394 6828 3003
1059 3003 -4402 -3830 6323 9708 3245 -1755 -3723 -1514 7187 9261 -898 -6369 -435 5096 6872
1074 6872 4188 -4127 -7279 1794 7592 3016 -2279 -4954 -4722 3180 8232 -225 -8404 -5286 1306
1089 1306 4249 3331 -4788 -10347 -3067 4704 2285 -2665 -5541 -6700 -482 6580 1012 -8082 -7548
1104 -7548 -2171 2530 4771 -1458 -9123 -4483 4639 4271 -675 -4153 -6591 -1783 7312 5533 -4087
1119 -4087 -5973 -1627 3156 7050 2860 -6224 -4641 5318 7296 2628 -1190 -4961 -2382 7429 8427
1134 8427 68 -3711 -1061 2734 7291 5428 -4499 -6418 2980 7905 5256 1060 -3861 -3974 4622
1149 4622 8442 1013 -4119 -2452 1230 6794 7260 -2336 -8030 -618 6045 5067 1885 -3103 -4916
1164 -4916 2216 7673 1840 -4462 -4271 -2005 3856 7838 551 -7646 -3449 3308 3688 1280 -3380
1179 -3380 -6902 -766 6889 3902 -3535 -5787 -4827 93 5849 1392 -7558 -5645 1784 3313 1440
1194 1440 -3744 -8912 -4720 4628 3998 -2198 -4749 -5008 -2012 4198 2335 -6725 -7223 59 4023 4314
1210 4314 59 -7242 -6238 3254 5796 186 -2905 -3327 -527 6253 6492 -3124 -6769 -623 4846
1225 4846 6756 4692 -2520 -4091 4227 7722 2562 -1382 -2005 -257 6763 10096 2312 -4192 -1158
1240 -1158 3065 5770 5655 -762 -4798 2336 8248 4613 -573 -3597 -4075 2425 8340 3059 -4446
1255 -4446 -3094 570 3019 3683 -2551 -8503 -2801 5675 4409 -615 -4186 -6168 -2169 4028 1119
1270 1119 -5828 -5529 -1368 1864 4199 -354 -8796 -6954 1701 3564 221 -2654 -5423 -2793 4328
1285 4328 3452 -4503 -6725 -2765 1908 6008 3828 -5514 -6882 1142 4088 1035 -1713 -4163 -1871
1300 -1871 5886 7175 -616 -4803 -3246 -354 4104 5390 -1786 -5126 1193 5514 3520 187 -4256
1315 -4256 -4846 3198 8004 2674 -2936 -2775 -1114 3428 5613 -1109 -6060 -118 6371 5535 1952 -3348
1331 -3348 -6218 41 6414 2752 -1796 -1108 433 3400 6012 581 -6635 -4135 2456 4541 3991
1346 3991 -48 -5018 -1392 5446 3392 -2676 -4074 -2637 1465 6602 3152 -5822 -6500 -214 2669
1361 2669 2433 -696 -5262 -2700 4876 3888 -3270 -5817 -5227 -2146 3730 4103 -2694 -4767 -810 1555
1377 1555 1501 -556 -6128 -5886 2436 6169 1733 -2585 -4193 -3051 2986 5185 -1346 -4940 -331 3680
1393 3680 4678 2614 -4030 -6501 1438 7006 3864 223 -757 -771 3086 5280 -582 -5104 -1667 2512
1409 2512 5216 6354 1177 -5008 -1377 4077 2643 -845 -2396 -2922 2095 7225 2672 -5177 -5116 -1063
1425 -1063 2025 4201 310 -5714 -3028 3835 2640 -2294 -4788 -5241 -1003 5671 3597 -2964 -4115
1440 -4115 -1991 -840 1392 249 -5492 -4607 3070 5333 2238 -1560 -5527 -4477 2898 4651 -1109
1455 -1109 -3443 -784 1964 4638 3057 -4545 -6297 1221 5799 4137 743 -2993 -2924 2863 4470
1470 4470 -1176 -3408 -560 2090 4919 5633 -814 -5922 -2213 1943 2289 1596 -1287 -3146 2419 6888
1486 6888 1689 -4304 -4430 -2410 2299 5868 989 -4982 -2173 2873 2847 518 -3115 -4978 460 6927
1502 6927 3523 -2477 -3599 -2722 -225 3427 1651 -3143 -1578 3040 3598 2432 -1201 -6318 -4557
1517 -4557 3281 4890 555 -1499 -1871 -143 4049 2244 -5108 -6091 100 3563 3732 946 -4992 -5087
1533 -5087 1830 3478 -1365 -3212 -2174 -113 3667 3038 -3478 -6324 -2646 417 2328 3037 -1199
1548 -1199 -3861 928 3871 120 -3370 -4715 -3074 3284 7281 1913 -3485 -1813 1092 2806 2502
1563 2502 -1985 -4766 1565 7252 4238 -868 -2913 -2603 2024 5985 2235 -1734 187 2568 2644 2656
1579 2656 -679 -4886 -2007 4691 5530 2926 -62 -3315 -1354 3657 1678 -4145 -4046 261 3365 5165
1595 5165 1480 -5854 -5575 1019 2562 -250 -2186 -3432 -908 3905 2252 -4312 -5480 -2202 76
1610 76 2679 2859 -2383 -4343 -688 961 -476 -1766 -3671 -3226 3529 6225 1013 -3896 -3919 -2057
1626 -2057 1713 3154 -1918 -4299 1356 5506 3131 -578 -4165 -4536 1625 5792 1448 -2046 -643
1641 -643 539 1645 2565 -1302 -4299 -329 4102 4101 2907 -533 -4779 -1999 3428 2243 -1347 -1106
1657 -1106 283 3501 5933 1281 -5603 -4526 1213 3626 3105 521 -2764 254 5333 2727 -2980
1672 -2980 -3486 -1020 1953 5281 3101 -2340 -2659 584 897 1171 768 -2001 -1444 3820 5083 -15
1688 -15 -3386 -4657 -2896 2911 4507 -1065 -3402 303 2427 1964 -1204 -5985 -6041 1365 5094 1033
1704 1033 -2408 -3125 -2239 854 1614 -3455 -4888 -691 1883 1745 1244 -2731 -5821 -2215 2103 1571
1720 1571 125 -1299 -1949 1579 4286 -162 -5783 -3731 747 4120 5422 1310 -3535 -482 4321
1735 4321 2303 -1507 -2382 -1008 3503 7274 3521 -2187 -1715 826 1706 3091 2224 -1083 253 4225
1751 4225 3680 1032 -1027 -3652 -1474 5023 5595 655 -1890 -726 663 2299 263 -4858 -4103 2738
1767 2738 5300 2366 -1400 -4219 -3374 1524 1813 -2999 -3585 -396 1628 2108 743 -4190 -5722 -1428
1783 -1428 1360 1130 674 -1595 -3470 -31 2653 -1224 -4432 -3355 -544 3682 5296 -292 -5323
1798 -5323 -2457 1580 1495 -431 -2212 -2415 2879 6530 1765 -3607 -3067 -1022 1438 3690 1016 -1683
1814 -1683 447 2961 1468 288 -1008 -3708 -763 4724 4613 726 -1534 -2224 -506 3333 1825
1829 1825 -3036 -2176 2844 4815 3226 -571 -4984 -3338 2844 3557 -314 -1330 90 1705 3578
1844 3578 1088 -4098 -4104 535 2469 2728 2264 -961 -2554 550 2113 -352 -1813 -2006 -437 3859
1860 3859 5072 -823 -5086 -2770 382 2150 1849 -1797 -3149 1931 4602 172 -4199 -4437 -2369
1875 -2369 2076 4197 72 -3226 -747 694 -112 -568 -2434 -3973 -137 3266 2375 -70 -2161 -4156
1891 -4156 -2055 2738 1331 -2621 -1759 1099 2687 2916 -1320 -5872 -3009 3028 4012 1335 -505 -1508
1907 -1508 653 3635 844 -3957 -2444 1566 3385 4099 2033 -1738 -1945 1247 1535 493 618 -410
1923 -410 41 4280 4474 -487 -3572 -2237 206 3652 3975 -1155 -2740 1398 3325 607 -2483 -4037
1939 -4037 -2469 3439 5139 208 -3227 -1677 -524 324 346 -2497 -3081 1142 3246 1038 -432 -2582
1955 -2582 -4533 -1422 2442 1455 -1082 -1483 -662 1123 2584 -1384 -5848 -2838 2475 3801 2114 -1057
1971 -1057 -3371 -748 3086 701 -3194 -2328 589 2965 3955 472 -3889 -2590 687 872 1039 824
1987 824 -958 -84 2771 2000 -1542 -2752 -2508 -467 4030 4014 -963 -2699 -217 1397 1118 -837 -3745
2004 -3745 -2036 3999 5153 595 -2571 -2588 -937 2073 2022 -1783 -1860 2191 3078 1374 -97 -2855 -3313
2021 -3313 724 3377 1882 854 -422 -1523 623 2399 -890 -3821 -1427 2189 3843 3152 -1206
2036 -1206 -4670 -1325 2396 972 -1752 -2005 -429 2491 4027 -532 -4875 -3056 157 1133 1371 -178
2052 -178 -2245 -734 1648 -162 -1906 -2425 -2611 -532 3695 2957 -1634 -3028 -2068 -319 1683 440
2068 440 -3146 -1536 3690 4108 677 -2432 -3969 -1680 3172 3145 -1049 -1162 1387 2550 2051 214
2084 214 -3301 -2313 2166 3389 1824 1151 -671 -1736 869 2077 -350 -1625 -298 1162 3522 3350
2100 3350 -1912 -4977 -1672 2019 1806 312 -1506 -1725 1885 3284 -1436 -4679 -3203 -488 2030
2115 2030 2444 -642 -3114 -648 1172 -776 -1629 -1899 -2421 157 3081 1348 -1871 -2991 -2583 -774
2131 -774 2336 1362 -2367 -1376 1869 2270 479 -2275 -4552 -1439 3810 3592 -183 -1367 -394 989
2147 989 1955 -269 -3652 -1995 2398 3255 1962 424 -1899 -1757 1025 1434 -263 -626 -214 372 2421
2164 2421 2480 -2050 -4039 -1035 1759 2969 2060 -1536 -2216 1238 2591 -1080 -3206 -2538 8 3644
2180 3644 3967 -593 -3046 -800 868 379 -333 -1480 -1529 1596 3106 618 -1362 -1874 -2402 -192 2790
2197 2790 1377 -1738 -1221 202 733 1092 -1727 -4283 -1113 3457 2801 -227 -2244 -3042 -873 1669
2213 1669 -634 -3832 -1910 1496 2343 1652 -1376 -4002 -2621 735 421 -625 -500 -857 -207 1765
2229 1765 898 -2485 -2953 -1178 813 2816 2120 -2047 -2853 315 2204 389 -1249 -1558 130 4263
2245 4263 4150 -860 -2975 -1151 651 2012 1865 -518 -610 2681 3256 772 -812 -1480 -1752 1405 3428
2262 3428 1419 -371 -343 -97 1080 1794 -825 -3049 -208 2920 2471 458 -2287 -3778 -562 2674
2278 2674 382 -2082 -1291 467 1712 1316 -2039 -5032 -2388 1024 915 265 -540 -1873 -537 1242
2294 1242 -439 -2638 -2474 -1398 288 2514 1431 -2588 -3043 -579 721 889 -392 -2332 -1019 3085
2310 3085 2644 -1518 -2920 -2241 238 2832 2228 -1196 -1451 1252 1505 -62 -1319 -2603 -1313 2325
2326 2325 2949 734 -340 -835 -987 590 1488 -985 -2103 24 1769 2332 1194 -1893 -3422 276
2342 276 3268 1525 -511 -1061 -483 1702 2192 -1285 -3500 -700 2244 2841 2132 -274 -1855 27
2358 27 1630 86 -1272 -713 -138 1613 3377 1168 -2059 -1891 -451 668 1809 372 -2244 -832
2374 -832 2062 1837 -846 -2504 -2656 105 3208 1597 -2157 -2532 -515 76 157 -1399 -3096 -1594 2171
2391 2171 2131 -698 -1722 -2537 -2285 184 461 -1352 -1779 -178 504 1173 896 -2720 -3533 -161 2145
2408 2145 1120 -169 -1649 -1534 1570 2614 -1042 -2403 -232 1682 2774 2339 -1267 -2698 276
2423 276 2164 997 316 70 84 2165 3189 270 -1881 -1260 -298 1332 2892 1277 -1539 -140 1896
2440 1896 1289 136 -1540 -2549 453 3515 1696 -1658 -2013 -1020 436 1632 -169 -2824 -669 2034
2456 2034 1283 -279 -1972 -3174 -1345 1593 1236 -957 -773 -425 98 966 135 -2750 -2869 163 1622
2473 1622 1596 338 -2249 -2036 1144 1742 -894 -1874 -1145 543 2442 1680 -2181 -2921 -15 1305 1068
2490 1068 678 -1180 -1039 1312 1770 -775 -1941 -1341 -469 1446 2633 111 -1923 -584 350 456 309
2507 309 -1451 -2309 680 3121 1401 -931 -1721 -1457 707 2388 39 -2052 -513 1483 1588 766
2523 766 -1277 -2714 -86 2719 1823 -16 -397 -831 19 1740 374 -1730 -985 832 1618 2379 771
2540 771 -2305 -1866 1114 1371 -41 -554 -1123 253 2652 1641 -2228 -2514 -567 850 1691 743 -2055
2557 -2055 -1805 1003 1114 -680 -1278 -1812 -604 2008 1932 -768 -2040 -1187 -529 616 824 -1321 -1961
2574 -1961 632 1990 710 -625 -2063 -2261 820 2615 247 -1528 -249 702 1430 1280 -1301 -2782
2590 -2782 343 2540 1776 377 -666 -1377 619 2209 456 -1174 -351 877 1658 2083 305 -2432
2606 -2432 -1341 1229 1224 928 -105 -1500 -109 2451 1060 -1812 -1905 -880 748 2216 672 -2130
2622 -2130 -1682 729 858 5 -942 -1883 -783 1986 1482 -1210 -1689 -1241 -590 976 1088 -1356 -1359 632
2640 632 1023 541 -289 -2076 -1775 1274 2483 448 -1068 -798 -231 1502 1677 -1297 -2169 505 1975
2657 1975 1754 647 -1250 -1993 830 2156 449 -797 -258 -127 1227 2088 -530 -2260 -666 960
2673 960 1296 1270 -331 -2017 -212 1796 699 -910 -1271 -1040 758 2752 515 -2156 -1374 426 637
2690 637 897 -227 -1925 -477 2388 1327 -713 -1208 -1299 33 1916 1191 -1193 -796 307 719 745
2707 745 84 -1931 -1245 1428 1986 322 -483 -1485 -837 1551 1534 -1204 -1816 -50 1024 1362 542 -2099
2725 -2099 -2284 636 1534 28 -734 -1128 -1079 1023 1322 -1271 -1956 -605 192 934 1227 -812 -1896 181
2743 181 1254 505 -265 -998 -1345 1145 2453 247 -1680 -859 64 1304 1837 -77 -1624 262 1905
2760 1905 1199 133 -822 -1214 734 2878 1379 -766 -577 123 764 1638 281 -1681 -803 1496 1543
2777 1543 813 -220 -1881 -763 1697 1386 -852 -1195 -666 392 1854 441 -2295 -1914 429 1261
2793 1261 430 -503 -1770 -1583 894 1168 -1345 -1583 -657 -48 1331 1038 -1598 -2146 -337 503 278 190
2811 190 -1185 -1713 1050 2008 -80 -1333 -1325 -558 1084 1817 -487 -1920 -5 1136 1016 568 -979
2828 -979 -1501 681 2421 570 -711 -952 -710 946 1943 81 -1569 -186 1307 1129 943 -412 -1878
2845 -1878 -330 1870 1266 -261 -617 -687 534 1944 844 -1850 -1065 602 962 1261 58 -1724 -704
2862 -704 1599 1503 -335 -623 -744 -43 2021 1146 -1427 -1358 241 704 1091 658 -1223 -1039 1222 1381
2880 1381 -92 -867 -1433 -779 1492 1648 -827 -1647 -183 350 946 386 -1569 -2194 318 1424 -38
2897 -38 -925 -1385 -1418 810 1526 -747 -1978 -803 -142 601 663 -1141 -2360 -504 1252 564 -246 -844
2915 -844 -1636 313 1970 206 -1605 -1007 71 1018 1843 234 -1768 -522 1555 1293 442 -325 -1177
2932 -1177 169 2266 1353 -782 -449 387 1058 2039 810 -1439 -851 1321 1258 638 49 -1139 -552 2066
2950 2066 1485 -409 -945 -579 186 1327 746 -1639 -1786 573 1197 506 -143 -1409 -1437 1152 1235 -689
2968 -689 -1684 -1107 -386 1030 1156 -981 -1670 4 766 578 80 -1289 -1695 379 1490 66 -1023
2985 -1023 -793 -303 881 1813 -227 -2172 -530 829 427 546 -853 -1860 320 2160 668 -784
3001 -784 -744 -641 362 1759 -103 -1927 -825 737 905 816 -215 -1531 -387 1523 973 -566 -949
3018 -949 -953 -77 1614 951 -1382 -951 453 821 1068 207 -1640 -818 1444 1342 -250 -613 -689 16 1776
3037 1776 1707 -778 -943 187 505 1156 707 -1346 -1143 1099 1823 326 -187 -711 -914 1125 1794 -566
3055 -566 -1697 -565 431 1167 1048 -985 -1853 327 1544 268 -675 -1204 -1587 457 1401 -277 -1494
3072 -1494 -585 77 660 993 -700 -2398 -714 879 458 -289 -624 -1350 80 1857 694 -1168 -846
3089 -846 -195 597 1391 208 -1812 -798 1178 989 224 -317 -1059 89 1970 976 -919 -900 -170 372
3107 372 1528 932 -1115 -797 1317 1396 406 -285 -1197 -884 1265 1680 -348 -480 -412 -104 1317 1101 -1079
3126 -1079 -1772 182 853 599 22 -1335 -1431 917 1657 -167 -902 -797 -205 641 1047 -1014 -2140 -297
3144 -297 857 613 630 -577 -1142 337 1388 -57 -1062 -884 -662 737 1770 223 -1484 -453 689
3161 689 690 803 -379 -1542 3 1767 860 -775 -895 -733 482 1899 557 -1316 -893 528 478 482
3179 482 -411 -1357 -595 1548 1166 10 -478 -820 -560 1224 856 -1154 -1024 119 572 1025 446 -1625
3197 -1625 -1271 1130 1361 -71 -600 -783 -389 1411 1282 -1003 -1243 164 701 1043 863 -753 -1263 342
3215 342 1031 -3 -469 -524 -634 1080 1819 -117 -1262 -732 -102 781 991 -552 -1599 114 1686 433
3233 433 -276 -867 -1334 326 1749 77 -1315 -732 -40 254 580 -511 -1722 -200 1305 841 -75
3250 -75 -814 -1605 -512 1256 586 -798 -409 -20 555 1344 458 -1692 -977 1034 1072 827 116 -865 -256
3269 -256 1451 1067 -833 -762 -278 787 1431 893 -1123 -930 707 809 511 539 -730 -547 1302 1562
3287 1562 -499 -1175 -803 -325 916 1304 -575 -1189 142 870 527 -137 -1166 -1472 598 1519 -201
3304 -201 -1159 -663 -633 227 647 -586 -1482 -314 967 569 133 -915 -1615 -25 1150 390 -425 -486 -451
3323 -451 187 1227 -41 -1721 -644 677 1007 1062 20 -1392 -324 1420 721 -509 -593 -152 497
3340 497 1828 620 -1171 -767 389 767 604 315 -763 -295 1311 857 -510 -566 -757 -309 1434 1343
3358 1343 -510 -943 -205 205 567 350 -1171 -1000 1117 1737 328 -568 -972 -764 872 1262 -599 -1100
3376 -1100 403 665 636 609 -1102 -1363 410 1395 521 -1 -213 -833 275 1253 -98 -1045 -163 289 950
3395 950 1288 -367 -1822 -566 1090 432 -252 -657 -703 248 1500 29 -1468 -1018 -85 390 911 -129
3413 -129 -1382 -469 803 216 -419 -680 -1053 -126 1517 883 -784 -900 -412 -217 817 566 -1150 -762
3431 -762 1071 1241 432 -199 -1336 -630 1499 1465 -179 -452 22 428 987 639 -1021 -751 875 1293
3449 1293 811 660 -364 -691 514 1142 1 -469 -29 110 1132 1451 -469 -1500 -326 605 652 489
3467 489 -521 -1302 499 1394 -238 -1215 -976 -472 819 1371 -406 -1437 -279 404 -16 -22 -590 -1113
3485 -1113 260 1449 490 -633 -669 -839 -285 1115 434 -962 -317 654 611 781 -347 -1504 -555 1449
3503 1449 1253 -84 -379 -423 165 1252 307 -1358 -683 647 1073 599 61 -1120 -792 678 614 -89
3521 -89 -89 46 -122 959 885 -922 -1339 -436 328 910 984 -671 -1032 551 1117 -55 -619 -849 -509 1196
3541 1196 1450 -283 -1347 -345 351 491 572 -474 -781 601 1439 126 -510 -346 -581 230 1400 506
3559 506 -314 -84 5 224 736 -206 -1655 -476 1222 929 506 -381 -1295 -303 1012 81 -1226 -566 267
3578 267 393 798 -249 -1760 -966 635 419 -117 -192 -597 -308 672 73 -1077 -959 -292 310 1013 1061
3597 1061 -727 -1150 34 432 216 -240 -849 -346 1497 1640 -195 -1057 -519 -72 947 903 -646 -699
3615 -699 1052 842 86 -220 -612 -602 903 1406 283 -147 -203 -386 305 718 -407 -1020 22 886 832
3634 832 581 -796 -1539 -359 1075 142 -641 -475 -67 649 1121 -411 -1684 -556 614 504 437 -254
3652 -254 -924 -285 481 87 -842 -257 -181 117 1273 488 -962 -789 -95 97 476 257 -597 -212 1182
3671 1182 1013 -493 -897 -1177 -241 1239 1095 -821 -691 625 468 204 -296 -760 -545 1113 929 -83
3689 -83 -427 -578 -641 391 547 -458 -524 115 327 427 358 -1024 -1770 17 953 466 40 -215 -594 685
3709 685 1004 -591 -1542 -460 591 823 745 -228 -1006 124 883 17 -423 -168 -99 593 1084 182 -959
3728 -959 -586 -189 270 1120 396 -559 -401 663 552 -177 -855 -1286 -201 1364 963 -483 -644 -91 22
3747 22 453 -211 -1621 -563 1057 961 -164 -542 -736 -639 420 392 -618 -249 12 75 356 274 -874 -1190
3767 -1190 167 866 674 387 -599 -988 388 904 -305 -862 -204 511 1431 1093 -646 -1243 58 744
3785 744 108 -141 -130 -433 801 1088 -196 -689 -282 -145 314 992 65 -796 -324 67 -1 95 -435 -1104
3805 -1104 147 1319 670 -459 -1008 -833 -171 854 -209 -1257 -71 1062 547 23 -830 -1333 -213
3822 -213 929 534 -470 -102 -7 -167 568 231 -710 -585 478 666 681 377 -1071 -1043 511 761 -47
3841 -47 -321 -178 309 1143 761 -925 -1324 -123 492 512 197 -468 -274 1033 610 -577 -884 -670 -265
3860 -265 496 914 -262 -673 -161 -97 121 445 -429 -1028 136 1078 385 -316 -964 -1209 118 1224 140
3879 140 -649 -81 675 539 439 -935 -1505 -17 1283 389 -82 -123 -204 336 524 -186 -872 -250 174 258
3899 258 823 233 -1074 -741 369 518 351 -63 -725 -143 759 419 -1022 -1249 -260 470 1160 561 -1034
3918 -1034 -682 529 278 -406 -758 -648 -215 901 642 -620 -505 -178 -325 -2 331 -583 -512 405 585
3937 585 203 145 -877 -776 521 1371 286 -424 -22 -141 746 750 -709 -1176 505 1160 819 318 -420
3956 -420 -797 397 756 -72 -468 249 299 339 829 37 -1035 -364 -6 212 487 91 -811 -423 887 231
3976 231 -620 -738 -536 359 1222 242 -1448 -939 169 79 -56 -458 -728 7 1101 326 -804 -692 -516
3995 -516 -370 313 422 -559 -320 462 257 250 65 -819 -1067 489 938 183 -332 -532 -569 540 733 -506
4015 -506 -944 368 789 861 336 -1000 -898 445 979 57 -188 22 109 410 940 -581 -919 -71 178
4034 178 219 814 114 -650 116 390 -99 -152 -534 -740 419 1420 499 -1026 -737 -66 177 555 24 -939
4054 -939 278 1145 375 -560 -631 -711 23 1059 405 -499 -61 230 -3 205 42 -798 -535 491 710 328
4074 328 40 -812 -668 401 617 -405 -596 -50 276 675 216 -1159 -1073 486 660 121 -265 -597 -486
4093 -486 529 411 -743 -806 -283 88 393 743 -262 -741 -239 137 -106 158 -252 -679 343 1047 182
4112 182 -555 -414 -481 407 899 -12 -865 102 766 274 -95 -664 -726 408 1262 374 -228 -103 -67 -117 301
4133 301 7 -652 308 977 535 488 -53 -971 -509 302 316 -165 -333 -295 103 843 405 -1159 -976 374
4153 374 658 520 170 -783 -710 557 324 -515 -539 -242 267 869 240 -609 -555 66 98 -8 460 -188 -273
4174 -273 472 839 -36 -163 -604 -548 530 1038 113 -657 -92 273 615 129 -658 -867 559 1273 388 -359
4194 -359 -582 -486 242 455 -404 -685 25 430 -118 292 -336 -1012 -348 456 297 60 110 -543 -271 658 69
4215 69 -716 -631 141 430 878 220 -1018 -569 524 382 -175 -357 -247 276 1129 373 -723 -401 173 18
4235 18 659 582 -113 -365 602 102 62 -74 -381 -238 732 1039 -27 -547 -185 94 541 457 -449 -768 606
4256 606 939 213 -345 -802 -908 240 697 -485 -417 103 -24 221 133 -496 -986 -61 324 205 126 -367
4276 -367 -686 -225 624 -200 -497 -281 -48 424 1155 110 -1050 -325 469 464 213 -44 -424 273 1125 205
4296 205 -667 -199 -47 263 841 344 -508 -71 501 30 32 45 -547 -320 742 590 -220 -127 -499 -406 471
4317 471 441 -727 -665 354 413 236 -197 -1190 -682 733 793 -74 -400 -272 -207 226 98 -648 -681 417 475
4338 475 261 354 -209 -551 92 671 -111 -117 -251 -189 421 915 -118 -746 -265 189 519 731 63 -496 221
4359 221 733 176 -538 -468 -375 507 1092 -51 -490 40 43 -79 161 -197 -492 32 637 196 30 -136 -617
4380 -617 -150 524 540 -477 -295 67 301 566 13 -840 -570 674 598 -92 -261 -501 -312 535 278 -603
4400 -603 -146 144 447 359 226 -686 -709 239 302 -32 219 -78 -235 402 567 -372 -633 -157 -340 388 678
4421 678 -252 -755 24 386 96 -139 -501 -629 623 832 -189 -785 -373 -154 31 449 -368 -680 195
4440 195 589 44 -81 -346 -587 -131 669 229 -191 -57 -32 69 897 185 -679 -318 499 448 351 -117 -631
4461 -631 -131 979 556 -190 -139 61 292 552 244 -891 -489 410 317 183 328 -194 -316 362 471 -488
4481 -488 -265 -419 -338 534 464 -392 -846 106 60 276 101 -655 -654 448 386 -282 -632 -451 -279 556 610 -411
4503 -411 -604 161 350 -147 -98 -463 -580 228 989 10 53 -136 -213 28 725 13 -580 95 365 454 454 164
4525 164 -711 32 797 511 -44 -104 -291 121 489 -182 -875 -45 163 273 535 128 -580 -538 351 -211 -355
4546 -355 -350 -293 -159 621 471 -414 -425 -265 -137 270 106 -638 -581 487 543 -204 -202 -353 -200 569 736 -477
4568 -477 -676 111 73 407 370 -314 -329 531 702 205 257 -214 -370 228 563 -120 -370 -44 9 459 590 -198
4590 -198 -563 -259 405 82 321 -4 -339 64 691 -155 -705 -357 -121 168 401 -340 -690 -159 95 -186
4610 -186 -150 27 -497 -269 582 51 -488 -390 -295 -2 539 224 -560 -278 195 238 1 -198 -635 -338 547
4631 547 663 -135 -361 52 156 651 555 -247 -265 500 464 153 155 -434 -262 533 665 -24 2 -42 -106 264 482
4654 482 -457 -678 -13 510 609 426 -365 -470 82 476 -218 -401 -316 -248 169 543 -226 -682 -68 -3 191
4675 191 72 -213 -705 -71 590 -28 -337 -230 -371 35 674 68 -425 -148 106 254 211 -166 -697 -189
4695 -189 590 467 18 -154 -342 -229 624 205 -668 -205 -2 164 460 221 -455 -200 531 417 -16 -124
4715 -124 -352 -214 481 460 -486 -273 251 19 451 329 -430 -687 149 495 137 -80 -227 -346 433 659
4735 659 -352 -448 -96 168 217 327 -429 -654 214 345 -9 -15 -176 -456 165 681 -4 -484 -97 -8 108
4756 108 658 -19 -497 -216 589 311 86 -106 -687 -21 684 -62 -481 -353 174 193 273 -159 -662 -261 232
4777 232 43 -28 64 -450 -109 473 347 -526 -182 -196 -253 397 382 -607 -567 230 65 409 218 -380 -184 552
4799 552 493 -186 -243 -153 1 702 619 -114 -310 146 254 199 10 -378 -470 431 357 -244 -106 -139 -173 155 557
4822 557 -188 -586 -55 174 108 171 -164 -617 135 508 -50 -137 -134 -386 17 558 -49 -705 -229 153 93 374
4844 374 -246 -608 70 465 205 -226 -126 -207 18 686 32 -504 -208 35 269 598 99 -579 -263 577
4864 577 345 -63 -2 -323 21 637 413 -370 -265 186 -37 287 177 -367 -325 427 540 -119 -126 -43 -344 363
4886 363 456 -163 -622 -104 -77 156 279 -316 -619 -51 537 -241 -289 -244 -349 159 615 -235 -504 -108 63
4907 63 313 505 -13 -762 118 458 46 128 -152 -459 29 688 63 -417 75 -76 131 610 30 -422 -83
4928 -83 370 389 164 -14 -372 -12 746 330 -469 -171 -105 39 462 205 -506 -421 271 38 74 -105 -275 -102
4950 -102 423 154 -411 -339 -77 -106 329 166 -369 -507 54 231 31 96 -521 -448 208 505 -47 -401 -246
4971 -246 -237 439 618 -210 -461 86 330 -20 213 -325 -423 25 315 4 -212 -68 -244 138 454 -211 -563
4992 -563 -282 73 182 205 120 -526 -14 524 237 -191 -231 -326 151 531 72 -525 -19 421 175 394 26
5013 26 -508 -145 338 330 -31 -141 10 -113 458 432 -389 -64 121 -156 204 354 -425 -315 148 312 124
5034 124 -228 -382 -86 344 476 -270 -518 -77 132 269 94 -187 -373 111 313 -90 -136 -296 -314 90 384
5055 384 -225 -400 -166 123 358 318 -366 -625 39 416 176 129 -72 -440 51 572 190 -451 -108 150 287
5076 287 363 68 -673 30 535 256 4 -126 -341 328 498 360 -406 -178 17 65 450 261 -593 -330 385
5097 385 232 118 -92 -543 -152 453 225 -134 -380 -141 -74 343 31 -409 -292 201 314 43 -164 -548
5117 -548 -441 279 426 -274 -351 -14 -33 195 279 -430 -350 101 257 -197 171 -31 -472 334 412 -172 -244 -37
5139 -37 -310 206 548 41 -567 134 305 232 263 -55 -252 17 509 -17 -276 -327 -289 272 440 102 -473 -28
5161 -28 -10 22 163 -140 -453 -223 464 188 -113 -27 -520 -87 505 166 -510 -468 -4 203 81 -98 -586 -352
5183 -352 522 399 -132 -19 -58 -299 366 -26 -360 -150 72 307 549 326 -212 -327 254 308 -44 32 -26
5204 -26 -104 359 664 -201 -347 38 -149 364 176 -349 -308 193 419 -142 -84 -101 -295 456 480 -47 -227 -272
5226 -272 15 -4 24 -271 -679 -74 324 -12 -64 -213 -367 -195 337 -37 -502 -205 -178 56 442 -125 -466
5247 -466 -206 262 132 90 24 -306 -34 300 125 -424 11 -29 270 578 184 -248 -551 359 282 159 192 -173
5269 -173 -275 331 462 -280 -181 -46 -208 243 278 -292 -375 48 269 -22 -38 -239 -314 159 502 -322 -271 -187
5291 -187 -17 133 379 28 -395 121 86 126 25 -272 -299 5 418 95 -110 46 -159 -176 539 -134 -633
5312 -633 -162 299 240 107 -161 -550 -72 493 222 -156 -69 108 -58 456 14 -557 -337 208 206 269 140 -455
5334 -455 -115 141 153 -104 -137 -252 -206 481 288 -169 -455 -94 -7 -43 -127 -468 -354 327 269 -163 -81 -225 -100
5357 -100 370 357 -230 -291 172 30 -5 130 -265 -459 219 464 244 110 -32 -189 -40 350 -79 -417 61
5378 61 42 540 321 -69 -515 -47 226 -47 -148 2 -248 -23 498 -220 -600 -50 91 132 181 -85 -555
5399 -555 -293 88 -70 -46 4 -403 -71 400 163 -293 -357 141 -164 190 68 -467 -246 404 340 -10 -189
5420 -189 -453 -227 573 368 -12 -51 108 331 441 148 -243 -153 278 256 129 178 -203 -463 180 267 -172 -66
5442 -66 41 182 316 240 -298 -480 -85 223 207 36 -231 -392 323 364 -208 -348 -171 -139 -44 258 -57 -313
5464 -313 -19 -59 -124 266 -60 -306 78 477 295 -231 -165 -449 73 507 165 -385 -306 291 59 156 -259 -375
5486 -375 48 493 315 -160 -132 58 62 515 39 -225 -138 286 190 78 218 -133 -277 116 199 106 25 -259 -168
5509 -168 238 424 -312 -289 102 84 117 71 -260 -353 247 187 -358 -312 -130 12 498 385 -72 -275 -27 -17 88
5532 88 141 -279 -186 -29 243 -34 -137 -194 -236 174 521 279 -259 -110 -71 47 254 -22 -544 167 392 378
5554 378 -137 -196 -241 16 317 -159 -427 -113 60 -110 14 -110 -496 -117 144 261 7 -76 -338 -279 112
5575 112 -37 -382 -255 -125 -91 367 70 -310 -641 210 24 158 -47 -255 128 587 423 -245 -240 -107 9
5596 9 191 233 -179 -71 191 135 18 83 -15 -213 146 445 -24 -157 -144 -182 113 406 -15 -339 197 334 146
5619 146 213 -263 -439 109 457 -66 -173 -133 -51 97 254 -293 -603 -80 21 29 168 47 -431 -99 277 -33
5641 -33 -107 -30 -1 10 414 68 -223 -116 35 55 139 145 -173 -81 618 268 -150 -125 -86 121 377 198 -345 -75
5665 -75 134 178 119 86 -94 -165 256 468 62 55 -144 -340 26 362 -239 -163 -30 -14 80 62 -484 -487 202 407
5689 407 -17 -81 -210 -124 154 386 -273 -423 166 106 209 127 -30 -369 150 86 35 20 51 -46 -58 363 254
5712 254 -173 80 111 53 418 334 -265 28 413 181 58 -16 -213 48 624 128 -177 -192 -26 -152 -78 146
5734 146 -379 -16 349 -46 -59 3 -337 -393 0 234 -208 -97 -112 -232 89 76 -284 -453 130 224 140 -13
5756 -13 -326 -328 387 205 -149 -307 111 157 47 90 -325 -177 -2 280 -47 1 108 -80 289 197 169 -247 -49
5779 -49 -88 99 626 162 -199 -166 276 229 141 -60 -355 260 588 -57 -71 -227 38 94 352 -368 -325 106 433
5802 433 150 -27 -110 -274 -183 281 153 -120 171 -98 -150 120 54 -320 -36 250 199 266 83 -333 -340 145 35
5825 35 -246 78 -13 -76 395 213 -367 -150 189 146 60 -32 -149 -57 240 69 -167 -75 49 -211 182 535 -63
5848 -63 -194 -117 -24 87 146 -138 -141 190 250 200 -436 -172 -207 77 387 -39 -522 -5 207 38 37 -100 -160 317
5872 317 380 24 0 51 -168 -2 175 247 -141 -16 139 204 457 -52 -331 -233 252 378 173 150 -107 -76 278
5895 278 85 -358 -516 39 109 -1 -7 -416 -89 299 60 -310 -76 -230 -204 240 140 -324 -159 69 -143
5916 -143 213 227 -65 -445 213 147 129 47 -239 -262 356 434 -191 -248 -78 -149 356 333 -301 -299 290 462 125 119
5940 119 98 -128 150 245 -15 15 -14 85 7 279 128 -291 -215 52 71 210 -24 -350 -38 278 -140 -354 -207
5963 -207 -8 145 373 62 -541 -25 33 -127 15 -263 -50 95 258 50 -163 -136 -240 -261 279 -88 -232
5984 -232 -115 -19 22 -47 13 -276 -283 262 425 76 -150 -141 -90 120 167 -264 -290 379 316 266 -8 -247 -253 184 96
6009 96 -210 194 -27 -141 23 244 -241 -322 172 -71 210 281 -91 -463 38 147 102 47 -134 -175 208 262
6031 262 -90 -302 -150 76 -7 68 49 -143 -116 400 -47 -240 88 -163 5 240 36 -100 103 15 8 125
6053 125 201 -335 86 286 85 67 -135 -445 -161 459 258 -123 47 -41 36 137 59 -264 -366 264 -1 29
6075 29 -2 -18 -75 126 79 -266 15 -84 -152 141 251 -119 -199 -74 144 99 202 -156 -336 149 293 -132 -287
6098 -287 -370 -171 192 295 -235 -414 40 144 -151 -262 -60 -302 169 327 -151 -146 185 -133 47 173 -92
6119 -92 -256 -175 129 -14 274 -33 -364 -150 443 106 9 -154 -97 154 286 136 -472 -15 210 130 103 263
6141 263 -287 -138 213 -267 -203 42 85 67 132 341 -90 -264 44 134 -21 91 -90 -261 -10 529 -19 -253
6163 -253 -151 25 341 338 -182 -257 -97 -61 -60 82 -95 -276 153 460 -383 -145 -59 -261 -204 86 -85 -330 140
6186 140 44 128 0 -141 -416 -143 178 239 -92 -76 -165 1 288 -67 -214 82 400 122 122 -28 -629 18
6208 18 296 94 -14 158 50 -96 149 198 -229 -93 206 48 258 256 -64 76 300 199 174 -55 -211 -165
6230 -165 377 371 -70 -139 80 -58 197 66 -381 -246 118 46 35 18 -184 -319 225 256 -300 -192 200 -245
6252 -245 35 96 -230 -287 5 112 18 84 -37 -337 -55 155 -167 -349 -21 -4 230 396 -83 -348 179 401
6274 401 145 108 33 -192 231 302 -52 -87 -149 -42 214 357 154 -301 -47 173 -43 111 243 -324 -62 432
6296 432 350 -166 -202 -52 -100 188 133 -134 -272 50 98 -141 52 -461 -219 265 44 -197 -185 -209 -175 4 -5
6319 -5 -158 -253 132 39 87 20 45 -337 108 258 60 86 -115 -75 192 430 68 -89 -54 93 278 325 -191 -68
6343 -68 192 298 -81 -68 27 92 211 348 42 -152 60 33 -33 223 47 -405 -102 343 -158 -200 -51 -409
6365 -409 -35 248 237 33 -222 92 159 82 -72 -440 -35 90 131 -212 92 -95 -168 380 -137 -238 0 147
6387 147 -38 79 90 -358 -167 170 37 -36 114 -103 -221 192 395 -146 -369 93 19 284 225 -284 -352 -9
6409 -9 375 -103 -8 77 41 157 229 -276 -236 -50 -287 -63 301 -121 -261 82 90 -85 -92 -74 -329 -64 406 -49
6433 -49 -89 -207 -184 -43 238 -94 -398 -25 336 87 36 -48 -365 -127 44 31 -140 115 149 102 168 85 -318
6456 -318 -231 220 100 224 42 -172 -251 117 247 -186 12 -51 -226 219 193 -285 -201 108 107 -160 315 -118
6478 -118 -46 136 47 -285 -86 9 -155 255 231 -37 -196 136 40 -173 170 -83 -273 195 299 113 -134 -73
6500 -73 -72 222 330 109 -340 -65 198 43 255 -257 -276 84 204 -145 -114 -233 -149 -22 178 -259 -358 -103
6522 -103 162 -15 138 73 -175 -287 107 -11 7 21 -310 -156 267 170 -213 -221 -139 -8 204 150 -270 -190 299
6545 299 105 -276 -126 -229 -31 199 69 -245 -47 71 138 143 87 -64 23 212 267 149 164 -88 -164 326 211
6568 211 -75 20 9 -111 147 351 -257 -249 150 406 63 162 -224 -277 158 194 -152 -137 -54 261 11 113 -118
6591 -118 -453 10 55 -183 15 -118 -137 -61 320 -28 -218 54 -249 -276 237 46 -162 -80 183 53 49 -51
6613 -51 -212 99 300 189 -33 23 68 140 177 -21 -135 -33 135 -45 138 115 -204 -61 170 -34 -44 -29 -156
6636 -156 12 283 55 -249 -331 180 180 42 77 -176 -263 16 344 -218 -47 -219 -91 121 180 -222 -264 -57
6658 -57 70 -56 -12 -188 -403 -60 298 8 -120 -175 -190 -53 271 7 -121 42 -52 -8 173 1 -224 -251
6680 -251 426 94 -130 -116 -39 73 407 233 -292 -124 78 210 3 188 -199 -73 262 109 91 9 -173
6701 -173 -148 198 172 -94 -143 -167 85 164 -34 -103 -330 198 204 128 -74 -356 35 173 156 -337 -175 119 -62
6724 -62 30 292 -78 -471 212 210 -139 80 -36 -53 201 285 64 -83 97 -257 -102 267 -154 -357 51 178
6746 178 55 5 43 -441 189 181 2 -207 2 25 -184 89 -81 -99 23 -45 -122 -188 -29 -212 -107 287 40
6769 40 -130 -57 -24 6 255 75 -451 25 59 192 247 12 -86 -124 414 72 -211 -116 204 -186 214 146 -282
6792 -282 65 185 17 -22 242 34 -102 91 252 -220 -18 -53 13 102 182 -6 -245 149 101 -70 51 -279
6814 -279 -275 71 118 -299 -154 -166 -200 182 212 -191 -125 87 92 -19 61 -103 -230 -48 202 141 19 161 -40 -86
6838 -86 138 -73 -335 -79 84 273 118 27 -123 -199 259 313 -127 -26 -126 -111 209 156 -288 -85 65 -75
6860 -75 2 -74 -314 -262 117 142 -266 -72 -81 -33 175 60 -268 -170 -26 -175 60 189 -205 -191 -32 23 -92 86
6884 86 -35 -132 99 174 -104 -71 38 85 51 350 -124 -81 101 194 11 44 211 -62 87 176 111 -5 44 -232
6908 -232 283 223 -2 -273 149 271 104 2 40 -13 76 193 -87 -182 -101 2 -62 143 -118 -478 -263 96
6930 96 0 115 -25 -221 -360 194 16 -247 -106 12 -105 32 63 -245 -148 139 -32 -50 -190 -237 -180 58
6952 58 107 29 -57 -30 312 43 114 -83 -223 57 158 121 23 -90 11 199 357 87 68 166 -22 147 243 39
6976 39 -128 126 -18 -131 424 48 -156 -39 291 8 -335 -101 -92 141 254 -156 -297 -79 29 177 115
6997 115 -100 -290 -160 144 175 4 -46 -6 89 180 136 -173 33 12 42 320 30 -356 -86 189 198 37 173
7020 173 -16 -102 295 80 -138 60 212 76 33 18 -319 -61 177 52 -79 -251 -246 -77 -66 411 -29 -196
7042 -196 120 44 -115 93 -175 -301 29 160 -10 -50 -44 -241 155 116 -16 -245 -70 175 98 61 50 -269 184
7065 184 266 -93 21 142 -178 -56 279 -65 53 -6 -108 -32 466 15 -29 23 27 -3 -59 -26 -229 87 106 101
7089 101 -196 8 -250 -25 150 -134 -270 -42 34 53 -213 73 -198 -84 163 -88 -181 -173 15 -238 50 -19
7111 -19 -239 -198 107 -13 25 163 -69 -186 285 380 -65 -135 107 -108 163 178 -229 -242 157 240 -15 91 -285
7134 -285 -263 70 225 -128 -142 -40 -90 202 111 -33 -101 -72 12 5 -12 -135 -378 -36 347 -37 -258 -197 -20 -1
7158 -1 209 -43 -200 -43 -57 -132 -52 -184 -414 40 160 -97 -17 -127 -162 -173 174 -49 -187 9 -11 99 164
7181 164 94 -175 -37 124 134 -31 22 56 63 291 181 -251 -451 33 136 34 143 -328 -167 137 173 -187
7203 -187 71 -4 -252 238 228 -247 -184 -53 -16 -80 111 -8 -116 19 109 32 32 -80 -200 -17 288 -207 -136
7226 -136 185 58 -14 224 7 -137 -36 267 210 -92 -93 -69 28 362 42 -191 90 97 197 200 11 -234 -51
7249 -51 138 158 -12 54 2 -194 104 33 -73 -85 -14 -70 122 227 -390 -255 133 -13 -182 126 -98 -52 -46 68
7273 68 -197 -115 -37 -136 127 112 -419 -218 204 -75 20 190 -175 -283 -43 249 348 -74 -227 -94 65 201
7295 201 -19 42 253 198 60 185 -10 -76 162 111 -152 6 76 -61 150 183 185 -4 67 114 61 127 -23 -175
7319 -175 -6 341 95 -92 -9 51 -147 193 115 -322 -85 175 -38 134 -22 -366 -69 114 160 -103 106
7340 106 46 29 202 134 -241 -293 -98 36 74 212 -115 -225 145 26 -139 49 -107 -238 143 175 -243 -39
7362 -39 57 -14 -78 -75 -258 -217 162 267 -32 89 -209 -113 43 -71 -275 -134 -95 -148 145 86 -144 -360 -35 -89
7386 -89 -17 -47 25 -134 -67 184 -124 -111 26 158 56 274 -112 -315 108 167 86 31 251 -61 40 313 -4
7409 -4 -13 -44 154 58 166 253 -155 -154 292 169 30 107 -93 -16 184 165 -43 -159 154 -68 64 -41 -324 -197
7433 -197 130 229 -171 -17 -123 -185 76 135 -128 -99 61 -129 146 202 29 -105 49 -187 -67 40 -52 -152
7455 -152 256 303 -274 -121 -224 -42 79 139 51 -153 69 178 67 56 -21 46 75 373 -142 83 33 187 -32
7478 -32 196 110 -126 82 138 -10 108 -41 -176 -71 198 -41 -118 -39 -142 -8 183 -121 -188 62 -27 -6 53
7501 53 63 -418 71 90 118 -188 -170 -35 133 271 153 -53 -44 176 17 20 120 -49 -116 60 65 -235 0 -7 -152
7526 -152 75 143 -45 -114 63 -66 175 157 116 -210 171 117 18 -132 -50 -86 140 167 -85 -42 -32 51 -254 -131
7550 -131 -42 -240 -9 43 114 -41 -201 -214 -198 188 -144 -142 42 21 30 240 156 -186 -38 215 66 -7 -282 -130
7574 -130 18 210 97 -30 116 -55 -36 220 78 19 13 187 164 150 66 25 -93 189 201 -146 -144 -136 -13 11 196
7599 196 -47 69 218 112 65 139 -68 -58 -35 307 -19 -254 -113 -220 37 53 -226 -33 -47 -29 -144 84
7621 84 -34 -445 49 103 -12 -7 81 -179 9 187 -2 -290 -175 -5 184 96 -75 -54 83 400 170 -278
7643 -278 17 93 -146 265 141 -89 87 69 26 123 220 -89 -26 284 -29 114 27 -142 -156 75 118 -80 -362
7666 -362 80 143 320 -122 -92 -232 215 229 25 -101 -98 63 -204 49 76 -63 123 -138 11 -60 -5 -284 69
7689 69 98 -27 -126 -89 -131 56 324 -4 -125 -65 -42 134 254 -99 -137 76 150 -125 -151 -36 -51 -33 422 -130
7713 -130 -212 -30 32 -211 42 -12 -392 178 192 84 -13 -152 -7 -272 76 94 -224 -173 -80 -82 203 107 -329 -241
7737 -241 193 89 39 42 -21 19 113 140 -53 210 224 -27 128 93 67 -180 150 165 -4 40 -97 -156 81 246
7761 246 51 23 -48 -15 169 249 -43 -167 -76 135 -162 78 -52 -49 -32 68 -103 -56 44 -159 -82 -140 -201 -331
7785 -331 2 214 -181 24 -75 -291 -73 142 -142 77 38 -212 -151 178 5 -351 -107 331 2 5 -146 -44
7807 -44 -90 268 32 -146 56 67 -3 159 39 -269 21 5 -112 28 172 12 208 108 -20 95 -67 -62
7829 -62 78 82 242 -108 -62 114 76 0 206 -288 -190 -1 -44 110 -81 -80 -4 234 35 -177 37 154 41 129
7853 129 122 -35 -73 248 232 140 49 -15 -24 -2 110 -5 26 -98 -62 47 236 -194 -250 -202 104 -68 -53 3 -23 130
7879 130 -59 -144 -99 -38 74 -28 147 28 -116 102 -47 -42 -21 -77 -167 -140 108 82 -144 -137 14 172 57 139
7903 139 -28 -124 357 158 -172 -8 -36 -80 111 159 121 -193 -26 84 66 52 -61 -75 65 -80 -1 -60 -66 -37
7927 -37 210 146 234 -89 139 -68 39 277 -46 -148 13 104 -85 103 -104 -411 134 217 294 -280 34 142
7949 142 23 99 -77 -255 -163 162 85 -129 45 -66 -14 85 120 -94 27 -183 -269 241 -128 -161 18 91 52
7972 52 156 -12 -70 28 199 176 78 -173 -82 6 360 187 -111 3 94 40 -60 127 160 158 41 29 -5 24 51
7997 51 -3 -27 350 -173 150 168 27 172 197 -312 -238 -57 78 -110 -230 -31 -56 108 110 -91 -229 155 -95
8020 -95 -263 147 -128 -160 44 148 -267 -67 102 15 74 127 55 -189 100 -52 -217 66 165 -246 0 187
8042 187 -83 -98 26 -125 -146 292 34 -23 193 297 201 116 -14 -285 9 199 2 -24 27 -203 -258 86 91
8065 91 -138 28 -6 -129 -28 176 -63 -325 41 -49 49 138 -142 48 185 123 -151 92 -215 16 181 238
8087 238 75 -72 149 -101 -103 74 -63 -31 64 67 -62 11 26 0 -32 275 57 -20 -49 -22 -63 63 22 -297 -80
8112 -80 222 111 -194 -71 77 37 78 44 -267 -35 191 -14 -106 -29 -6 -131 -15 -103 -247 124 117 -153 120
8135 120 47 -204 -121 -42 59 151 185 -97 -86 124 26 -142 -133 142 -58 213 191 -128 51 125 65 -96 79 -25
8159 -25 -88 219 205 -68 52 -205 -184 154 330 6 -282 144 37 27 8 -19 -217 53 132 -150 8 169 33
8182 33 -8 265 -83 36 105 62 128 75 -97
8191i7
##END NTUPLES=NMR FID
##END=
