##TITLE=1H_CG-1109
 DMSO, 8 sc, 
 7.6.2019
##JCAMPDX= 6.0         $$ Bruker NMR JCAMP-DX V2.0
##DATA TYPE= NMR FID
##DATA CLASS= NTUPLES
##ORIGIN= UXNMR, Bruker Analytische Messtechnik GmbH
##OWNER= root
$$ XWIN-NMR		Version 3.5
$$ Fri Jun  7 14:05:02 2019 Russian Standard Time (UT+4h)  she@DPX200
##.OBSERVE FREQUENCY= 200.13155
##.OBSERVE NUCLEUS= ^1H
##.DELAY= (6, 6)
##.ACQUISITION MODE= SIMULTANEOUS
##.ACQUISITION SCHEME= undefined
##.AVERAGES= 8
##.DIGITISER RES= 18
##SPECTROMETER/DATA SYSTEM= spect
##.PULSE SEQUENCE= zg30
##.SOLVENT NAME= DMSO
##.SHIFT REFERENCE= (INTERNAL, DMSO, 0, 15.7039)
##AUDIT TRAIL= $$ (NUMBER, WHEN, WHO, WHERE, WHAT)
$$ ##TITLE= Audit trail, XWIN-NMR		Version 3.5
$$ ##JCAMPDX= 5.01
$$ ##ORIGIN= Bruker BioSpin GmbH
$$ ##OWNER= she
$$ F:/spectra/data/she/nmr/H-F/1/audita.txt
$$ ##AUDIT TRAIL=  $$ (NUMBER, WHEN, WHO, WHERE, WHAT)
(   1,<2019-06-07 14:03:44.67 +0400>,<she>,<DPX200>,
      <created by zg, POWCHK disabled, PULCHK disabled
       configuration hash MD5:
       00 E9 B6 7A A2 85 ED C7 34 08 36 98 17 FE 4E 26
       data hash MD5: 16K
       88 6D 5E 5A BC F5 0D 63 46 B2 7D A6 D7 37 EA FC>)
$$ ##END=
$$ 
$$ hash MD5
$$ 3C B9 08 1A 5F 4C AB 8F 90 8C 90 70 54 A3 4D 38
##$RELAX= 
##$RELAX= 
##$RELAX= 
##$RELAX= 
##$RELAX= 
##$RELAX= 
$$ Bruker specific parameters
$$ --------------------------
##$DU= <F:/spectra>
##$EXPNO= 1
##$NAME= <H-F>
##$PROCNO= 1
##$TYPE= <nmr>
##$USER= <she>
##$AMP= (0..31)
100 100 100 100 100 100 100 100 100 100 100 100 100 100 100 100 100 100 
100 100 100 100 100 100 100 100 100 100 100 100 100 100 
##$AQSEQ= 0
##$AQ_mod= 1
##$AUNM= <au_zg>
##$AUTOPOS= <>
##$BF1= 200.13
##$BF2= 200.13
##$BF3= 200.13
##$BF4= 200.13
##$BF5= 200.13
##$BF6= 200.13
##$BF7= 200.13
##$BF8= 200.13
##$BYTORDA= 1
##$CFDGTYP= 0
##$CFRGTYP= 5
##$CHEMSTR= <none>
##$CNST= (0..31)
1 1 145 1 1 1 1 1 1 1 1 1 1 1 1 1 1 1 1 1 1 1 1 1 1 1 1 1 1 1 1 1 
##$CPDPRG= <>
##$CPDPRG1= <>
##$CPDPRG2= <>
##$CPDPRG3= <>
##$CPDPRG4= <mlev>
##$CPDPRG5= <mlev>
##$CPDPRG6= <mlev>
##$CPDPRG7= <mlev>
##$CPDPRG8= <mlev>
##$CPDPRGB= <>
##$CPDPRGT= <>
##$D= (0..31)
0 1.2 0 0 0 0 0 0 0 0 0 0.03 0 0 0 0 0 0 0 0 0 0 0 0 0 0 0 0 0 0 0 0 
##$DATE= 1559901824
##$DBL= (0..7)
120 120 120 120 120 120 120 120 
##$DBP= (0..7)
150 150 150 150 150 150 150 150 
##$DBP07= 0
##$DBPNAM0= <>
##$DBPNAM1= <>
##$DBPNAM2= <>
##$DBPNAM3= <>
##$DBPNAM4= <>
##$DBPNAM5= <>
##$DBPNAM6= <>
##$DBPNAM7= <>
##$DBPOAL= (0..7)
0.5 0.5 0.5 0.5 0.5 0.5 0.5 0.5 
##$DBPOFFS= (0..7)
0 0 0 0 0 0 0 0 
##$DE= 6
##$DECBNUC= <off>
##$DECIM= 24
##$DECNUC= <off>
##$DECSTAT= 4
##$DIGMOD= 1
##$DIGTYP= 9
##$DL= (0..7)
0 120 120 120 120 120 120 120 
##$DP= (0..7)
150 150 150 150 150 150 150 150 
##$DP07= 0
##$DPNAME0= <>
##$DPNAME1= <>
##$DPNAME2= <>
##$DPNAME3= <>
##$DPNAME4= <>
##$DPNAME5= <>
##$DPNAME6= <>
##$DPNAME7= <>
##$DPOAL= (0..7)
0.5 0.5 0.5 0.5 0.5 0.5 0.5 0.5 
##$DPOFFS= (0..7)
0 0 0 0 0 0 0 0 
##$DQDMODE= 0
##$DR= 18
##$DS= 0
##$DSLIST= <SSSSSSSSSSSSSSS>
##$DSPFIRM= 0
$$ [...]
##$SUBNAM2= <"">
##$SUBNAM3= <"">
##$SUBNAM4= <"">
##$SUBNAM5= <"">
##$SUBNAM6= <"">
##$SUBNAM7= <"">
##$SUBNAM8= <"">
##$SUBNAM9= <"">
##$SW= 24.9336996594482
##$SWIBOX= (0..15)
0 0 2 0 0 0 0 0 0 0 0 0 0 0 0 0 
##$SW_h= 4990.01996007984
##$TD= 16384
##$TD0= 1
##$TE= 0
##$TE2= 300
##$TE3= 300
##$TEG= 300
##$TL= (0..7)
0 120 120 120 120 120 120 120 
##$TP= (0..7)
150 150 150 150 150 150 150 150 
##$TP07= 0
##$TPNAME0= <>
##$TPNAME1= <>
##$TPNAME2= <>
##$TPNAME3= <>
##$TPNAME4= <>
##$TPNAME5= <>
##$TPNAME6= <>
##$TPNAME7= <>
##$TPOAL= (0..7)
0.5 0.5 0.5 0.5 0.5 0.5 0.5 0.5 
##$TPOFFS= (0..7)
0 0 0 0 0 0 0 0 
##$TUNHIN= 0
##$TUNHOUT= 0
##$TUNXOUT= 0
##$USERA1= <user>
##$USERA2= <user>
##$USERA3= <user>
##$USERA4= <user>
##$USERA5= <user>
##$V9= 5
##$VALIST= <valist>
##$VCLIST= <CCCCCCCCCCCCCCC>
##$VD= 0
##$VDLIST= <DDDDDDDDDDDDDDD>
##$VPLIST= <PPPPPPPPPPPPPPP>
##$VTLIST= <TTTTTTTTTTTTTTT>
##$WBST= 1024
##$WBSW= 4
##$XGAIN= (0..3)
0 0 0 0 
##$XL= 0
##$YL= 0
##$YMAX_a= 177158
##$YMIN_a= -274052
##$ZGOPTNS= <>
##$ZL1= 120
##$ZL2= 120
##$ZL3= 120
##$ZL4= 120
##$ABSF1= 10
##$ABSF2= 0
##$ABSG= 5
##$ABSL= 3
##$ALPHA= 0
##$AQORDER= 0
##$ASSFAC= 0
##$ASSFACI= 0
##$ASSFACX= 0
##$ASSWID= 0
##$AUNMP= <proc_1d>
##$AZFE= 0.1
##$AZFW= 0.1
##$BCFW= 1
##$BC_mod= 2
##$BYTORDP= 1
##$COROFFS= 0
##$CY= 11.3945322036743
##$DATMOD= 1
##$DC= 2
##$DFILT= <>
##$DTYPP= 0
##$F1P= 18.9103706918063
##$F2P= -1.10871071338519
##$FCOR= 0.5
##$FTSIZE= 0
##$FT_mod= 4
##$GAMMA= 1
##$GB= 0.15
##$INTBC= 1
##$INTSCL= 1
##$ISEN= 128
##$LB= 0.24
##$LEV0= 0
##$LPBIN= 0
##$MAXI= 10000
##$MC2= 0
##$MEAN= 0
##$ME_mod= 0
##$MI= 1.114404
##$NCOEF= 0
##$NC_proc= 0
##$NLEV= 6
##$NOISF1= 3.799351
##$NOISF2= 2.8
##$NSP= 1
##$NTH_PI= 0
##$NZP= 0
##$OFFSET= 15.70392
##$PC= 1
##$PHC0= -8504.771
##$PHC1= 20.40019
##$PH_mod= 1
##$PKNL= yes
##$PPARMOD= 0
##$PSCAL= 0
##$PSIGN= 0
##$REVERSE= no
##$SF= 200.130013532006
##$SI= 16384
##$SIGF1= 3
##$SIGF2= 2
##$SINO= 400
##$SIOLD= 16384
##$SREGLST= <1H.CDCl3>
##$SSB= 0
##$STSI= 0
##$STSR= 0
##$SW_p= 3612.71676300578
##$SYMM= 0
##$S_DEV= 0
##$TDeff= 0
##$TDoff= 0
##$TI= <>
##$TILT= no
##$TM1= 0
##$TM2= 0
##$TOPLEV= 0
##$USERP1= <user>
##$USERP2= <user>
##$USERP3= <user>
##$USERP4= <user>
##$USERP5= <user>
##$WDW= 1
##$XDIM= 8192
##$YMAX_p= 0
##$YMIN_p= 0
$$ End of Bruker specific parameters
$$ ---------------------------------
##NTUPLES= NMR FID
##VAR_NAME=  TIME,          FID/REAL,        FID/IMAG
##SYMBOL=    X,             R,               I
##VAR_TYPE=  INDEPENDENT,   DEPENDENT,       DEPENDENT
##VAR_FORM=  AFFN,          ASDF,            ASDF
##VAR_DIM=   8192,          8192,            8192
##UNITS=     SECONDS,       ARBITRARY UNITS, ARBITRARY UNITS
##FACTOR=    0.0002004,     1,               1
##FIRST=     0,             0,               0
##LAST=      1.6414764,     0,               0
##MIN=       0,             -274052,         0
##MAX=       1.6414764,     177158,          0
$$ Real data points
##PAGE= N=1
##DATA TABLE= (X++(R..R)), XYDATA
$$ [...]
1946d95j391O15K039P37r04j441k38J779R62o75j417j148P31J636L10q74r91K41
1964e24J170P07r19j213k47J024J228j93q17r67K75J034K11j188p40P64R41Q64
1982A410r74j250m35J475O74l21j369l55J363Q83mj538j307O90J541J014j073
1999D24j433j0J340J010m28j930p09J053J913N22j400j741J75J471J232q98j506
2016i15p65J226J753j28j170j460M37R89J222n42j426k43J012J497p11j280p29
2033a233K51J216L69k55p72j22R12O94o04j102m94Q99J093jj094k90L00J209j04
2052H72j015m63K0R21R03q03j400N8M09J030q3q27o41R72R51M71j189j316j70
2071a300J179J275m50j506k90J160J170j79j317j196N43J431R12o39j507n44Q41
$$ y = [-495, -1886, -1271, 768, 1505, 601, -840, -1078, 701, 1663, 988, -429, -1577, -846, 790, 1100, 226, -765, -524, 646, 1353, 434, -779, -1026, -2, 1226, 1033, 216, -751, -476, 558, 769, -419, -1159, -395, 546, 1410, 436, -814, -1249, 226, 900, 579, -790, -1145, 218, 1101, 1097, -441, -1748, -1058, 483, 1497, 424, -1009, -1019, 321, 1331, 903, -1027, -1736, -683, 1230, 1752, 352, -1389, -1214, 257, 1489, 591, -915, -1680, -454, 1299, 1171, 1, -1459, -1022, -33, 1189, 647, -779, -1022, -10, 1487, 776, -504, -1233, -982, 234, 603, 348, -424, -546, 366, 1060, 456, -646, -1140, -241, 852, 851, -243, -533, -233, 976, 872, -143, -606, -586, 335, 1238, 435, -965, -907, -498, 532, 449, -378, -1019, -47, 904, 1375, 186, -1130, -1300, -121, 1154, 704, -802, -1092, 68, 1238, 1059, -258, -1454, -911, 520, 1432, 793, -714, -1258, -417]
2088d17J303R5j142o94N67J449K34r04j134m78Q19J134k88q72n72R13R19J71j108
2107er20J84J362L96p99q99j63Q02L48l50p15j60P71Q61L03r66j032L29N52M75
2127C74o77j186P25R00Q64j40q02o72j10J105P37j437r97L53J373R33p35q39l16
2146e47M70J246q4j130n23O6J034M51j166j161n7J631R17k4r97r11O05N72K04
2165E96r35o57K44Q90R57p80j005J51L04J362m45j155l25O51N04K52j067o59K75
2184h42N62J186j35p84k82O86N74m63q82r69P14J147K23n80q37K95O85J171r86
2203D83j033l17Q88P51k07j013p49M29R09P84n61o81m27J099L79l98r76m47L10
2222g77R17M50l49n60j96R05O13n71p63l51K67J076l78l22m24J74P45Q7k21n22
$$ y = [-417, 886, 981, -161, -855, -288, 1161, 1395, 491, -643, -1121, -302, 832, 544, -328, -900, 13, 932, 1103, -5, -925, -741, 621, 1017, 218, -681, -844, -42, 306, -44, -759, -919, -148, 713, 1016, 50, -982, -653, -101, 374, -303, -1489, -764, 136, 1000, 860, 58, -614, -724, 381, 1118, -319, -1316, -963, 410, 1343, 608, -231, -547, -77, 1169, 1085, -45, -568, -502, 532, 983, -183, -1344, -1401, 230, 1147, 1123, 126, -785, -180, 392, 596, -339, -996, -752, 138, 1095, 315, -690, -539, -235, 1127, 682, -473, -798, -147, 357, 609, -458, -1117, -842, -280, 906, 771, -13, -295, 391, 965, 502, -380, -1349, -635, 512, 735, 155, -682, -387, 298, 1469, 483, -550, -867, 21, 772, 565, -448, -1197, -768, 141, 925, 364, -317, -744, 355, 734, 336, -640, -1087, -777, 140, 590, 241, -319, -515, 390, 1003, 432, -331, -682, -415, 661, 283, -39, -463, -289, 456, 543, 322, -200]
2242b00O5O67M51o01q10m10M96O48Q4n01j18M12M38K82p26o72R5L72O0o1p03o7
2264g99R75N33m3r81n27P33L53K20m59n37q12J153P78l30m99m04L94J337L41j026
2284D00j050j64N26R09k48q24p70J308N51L03n45p83J55N65M25J08j400Q3M19
2303c2L62k47o7l75L06M09K86k32n59m45N04p1q3l74k82O63P21O1n80k87J05N02
2325B85q6p03j49M68M61L57o01l20J49O55O51n67o39o8Q1N43k17m89l89K38P15
2346C75L71K97p40l71L10L40j89r94k17M3P11P01k40o20n40N65Q41J33q65m46
2366e35J7N91L1k11q35J23Q13L44J73p65N0J75K06M8o11j22L13K28J49j12K31
2387C01l55M02L32m35j30o08N98m9M6j72n22M70Q4P21r6q81L2M12N67k95r33k40
$$ y = [-200, -135, 532, 983, 382, -428, -838, -342, 306, 390, -111, -229, 183, 621, 903, 177, -495, -400, -28, 32, -29, -732, -799, 176, 709, 666, -315, -842, -109, 244, 464, 5, -532, -1344, -191, 587, 257, -242, -646, -252, 1085, 1426, 400, -650, -814, -288, 621, 373, -451, -1221, 87, 638, 941, 396, -387, -232, 333, 758, 866, -534, -451, -32, 330, 83, 16, -359, -53, 356, 642, 410, -149, -594, -90, -161, -244, -618, -900, -237, 484, 545, -35, -322, -217, 285, 199, -504, -653, -185, 276, 633, 32, -288, -139, 516, 1167, 600, -39, -107, -26, 517, 300, -189, -578, -340, 375, 746, 1043, 303, -68, 242, 582, 393, -601, -818, -775, -64, 637, 397, -223, -763, -198, 643, 776, -89, -535, -518, 73, 104, -107, -942, -819, -6, 338, 511, -254, -204, -29, 177, 225, -386, -508, -195, 33, 182, 70, 301, -54, 348, 680, 245, 115, -493, 105, 56, 102, -70, -592, -122, -38, 683, 587, -294, -262, 150, 717, 422, -511, -751]
2409g51J19Q25k99o7k56K48O17K18p74k02n26L36P59k39l58O1R9N22j46n6o23
2430d93O17J24Q9j8r82J16j37P67N4j76J54j4N00K45m66p05p7J09N73j63k78n34
2452f95Q59K49k7l62k17K65L27N7l60o00K37p0K79k5j92K66L43K43k44k43l05
2473b15R7P2J36j13j0k23K35N05n4k6l01j09K40L39j26q03J11K84L56J26o55j80
2495c14K58P34J1k59o25k08K87M26n74m52N30K53M41K1n40n3RJ44nl85j1j12L67
2518e7%o6j43p0RN87o8k29N6k57J71K32k27j18q5L55K94J51n11q2j85P06p4p80
2542c91j41L05M03O14q28l30QQ29J57l15n25k1K51O1J44q7m91L08N3N34k52k62
2564B4K51m24M23j3k68l93L24J3N54j32l18j71L75K48k16l84j61J91J96N1k17
$$ y = [-751, -632, 193, -106, -173, -429, -181, 436, 654, -120, -322, -848, -512, 247, 8, -350, -289, -190, 332, 186, 130, -493, 124, 248, 337, 319, -663, -547, -684, 83, 137, -39, 115, 101, 601, 846, 380, -325, -402, -293, 280, 117, -161, -695, 164, 413, 386, 24, -193, 72, 399, 456, 96, -504, -267, -337, -58, -83, -275, -9, 334, 577, 333, 90, -215, -118, -46, 90, -23, -33, -256, -21, 484, 430, 404, 103, -6, 234, 573, 447, -356, -245, 39, 395, 521, -134, -314, -56, 678, 689, 430, -195, -403, -116, 310, -264, -716, -186, 67, 508, 529, -11, -64, -55, 89, 84, -301, -312, -424, -57, -57, -123, -266, -336, -327, 260, 192, -37, 19, -238, -67, 165, -62, -180, -265, 90, 384, 535, 24, -58, -243, 463, 389, -391, -532, -227, 176, 790, -38, -368, -360, 469, 626, 311, -214, -235, 16, 77, 221, 134, -357, -49, 4, 538, 286, 24, 275, -149, 274, 261, -7, -400, -76, -63, 491, 359, 41, -130, 245, 493, 277, -107, -268, -77, 119, 170, -47]
2585d7o0j82L10J60o8j02l57N09k48l1m4k27L28MMm9M51j91K4j50J81m00O3Q9
2609c3K64k47j11JJ9mN93n75k84R5J6M17J11o34j56J22M59k48j12P1L31K63Jk82
2633G7m22J62N25p3k93k05N45k24q9j25K71q7J49K9m2j26J93m16q5K62r1L9r8
2656a24k12O56k50M4j88R0m9N1k7j94n8K78J44k58o2O0k7J24R6n7k53L8M34j19
2680A37m0p7j67pK39J28m28L80r8J74k70K63m37J59M8K65j81K36l91k08O8K39
2702C2K86m56R2j48M35J39n03J5J90R2Q0n07R3M49M4k25m9M3j92J85K61l59k71
2725b74P5J50J15j6J87l86O1K62l05l7J41J73l14K53M7j08j28k03O67l75K1j97
2747a91K0M66n03O85p15J10L30R5k24m25J74J06K34K43m21k85K83K05k58j66J82
$$ y = [-47, -107, -289, 21, 181, 113, 11, -346, 163, -85, -116, -160, -387, -59, -55, -51, -100, 351, 160, 184, 34, 215, -185, -122, -33, 231, -16, -127, -126, -107, -111, 482, -93, -377, -282, -266, 151, 262, -372, -528, -406, 53, -195, -307, -236, 95, 358, 359, 77, -345, -183, 342, 269, -24, -229, 316, 92, 3, -122, 149, 62, 211, 240, 198, 72, 265, -151, -236, 26, -65, -26, -124, -336, 320, 70, 114, -74, 16, -33, 18, -9, -203, -261, 17, 161, -97, -159, -99, -126, -2, 94, 37, -216, -178, 256, 137, 97, 20, -147, -154, 85, 213, -215, 165, 67, 241, -29, 234, -203, -44, 4, 269, 88, 324, -67, -275, -207, 32, 318, -138, -46, -194, 241, 380, -123, -108, 82, 174, 254, -253, -160, 289, 333, 108, 59, 102, -90, 95, 356, -3, -274, -199, -49, 66, 50, 237, -149, -88, 174, -131, -168, -27, 146, -168, 85, 132, 24, -104, -307, 360, -15, 6, -191, -171, 295, -208, 477, -238, -128, 202, 297, 73, -352, -178, -72, 162, 405, -16, -301, -18, 187, -71, -237, -55]
2768e5l3J49o6j5J92l00n5K55J94l69K51l10R9k01O5J27l93P01j42o1J70m00j83
2791c80J83K15M2m37J75L30J55r7j47j22K32j46k11o2M8j39M54J35k21j95L73
2812A85j86J15j54p2p5J12K34k93j94K64K19J30k90r6K39j61qL7j73J9o6K38r2
2835f8J25J40l10K36O2O8j33l53J98J60l7j24K27k59J6J19j19n6K04o0L73l13
2857I6k35J1K64j31O9K00j35J41K09p54L65k74l3N16l89j47J35K46j11j61K37
2878A19n3q3M6j4J51k66R6k10L62m2L12j31n45M31J65l17o6p8N0J6R0J05n1j65
2902g8kK86j74k64K99J02j24M5j3j77K56m11L76n4P0J11j99j60r1M5N0J55m24
2925c76K87k27J02M67r6pJ26j63j54j55J21J04K53j57l34K7N79J95o89P0J45J76
$$ y = [-55, -88, 61, -5, -20, 172, -128, -183, 72, 266, -103, 148, -162, -63, -264, -199, -72, -465, 236, 94, 33, 203, -197, -380, -197, 18, 60, -377, -202, 128, 283, 186, 39, -83, 149, 3, -208, -270, -222, -361, 93, 228, 7, -188, 185, -1, 114, -40, -112, -187, -75, 159, -134, -328, -64, 155, 285, -5, -101, 138, -23, -31, 6, -167, -148, -214, 24, -68, 57, 197, -113, 123, 185, 253, 120, -233, -35, 125, 88, -36, 191, -68, -52, 67, -52, -108, 96, 36, 409, 96, -139, -128, 136, 5, 74, 274, 139, 280, 489, -265, 100, -174, -207, 309, -80, -227, -92, 154, 43, -118, 119, 66, -17, 29, 15, 166, -100, -4, -214, 148, 106, 418, 287, -258, 173, 338, 21, -45, -123, -73, -57, 33, 138, 87, -78, -80, 206, 32, -232, 67, 169, 45, 90, 77, -100, 156, -255, 121, 67, 137, 248, 49, -111, -202, -157, -107, 48, -376, -89, -316, -214, 253, 157, 150, 276, 113, -41, -196, -75, 29, 282, 125, -209, -182, 397, 592, -97, -27, 118, 294]
2947B94k28R3k48k21L03k04j84L91n3O5n7o0J09p3J13k47K67k3K4k97j72N33j19
2970Fj60J73R7q1K76q0j25j86J45K15j67j0j57J66J92j08r7j44O6p2P3L3K72l83
2994e6K32l1k7J9J74k98M40j94n17O6M5l7J0P2L8M9q8p6K08K3L6n8j3j60j6J88
3020B9j84p6K83%q6j64L45J71j80n87K55j36L54L53q18K06J95J53k1j09j72K63
3042G4j93P2j09o5k39O20k33J12J04l45K34lj5N0m36M34K15l13J94k22R9p4j9
3065e8K08j39j72K61k9k60k00k7K16L9L28j26Pl84K44K06L5j62l2j41M12k54k05
3088b33N71k58p4J61p1k18K22k19L08k87K24j22l64K33L03k23L14j66R2J9l12
3109a00J05o3m45M83o3J66m23m5N14J95l17nQ3n7K73k09Pl85L83k90J48l06M09
$$ y = [294, 66, 159, -89, -310, -7, -211, -395, -4, -57, 8, -49, -109, 0, -73, 40, -207, 60, 37, 61, -236, -408, 125, 6, -154, 19, 116, 35, 311, 231, 106, -80, 65, 280, 113, 103, -54, 112, 304, 196, 99, -45, 21, -51, 22, 55, 327, -56, 176, 145, 118, 137, 311, 13, 453, 259, -258, -192, -147, -184, -174, -102, -64, -15, -103, -179, 29, 52, 88, 30, 17, -143, -159, 29, -155, -231, 52, 52, -34, -198, 147, 318, 138, -449, -194, -330, 24, 377, -441, -235, -40, 113, 92, -17, -189, 74, -119, -47, -156, -221, -460, 160, -73, 39, 143, -202, 32, 29, 14, 64, -372, 62, 277, -36, 158, -64, 35, -39, -58, 150, 11, -161, 100, 71, -189, -389, -416, -200, -161, 167, 41, 48, -336, -92, 114, 149, -13, -45, -186, 226, -28, -233, 338, 80, 6, 167, 96, -122, 100, -119, 189, -98, 126, 4, -360, -127, 176, -47, 267, 101, 193, 212, -100, 5, -58, -503, -20, -83, 83, -340, -385, 129, 324, 7, 2, 85, 28, 301, 92, 99, -286, 97, -193, -45, -351, 58]
3132E8Q4L3PK6r7j76R5k48N91p34L48j1K27N4j61R1j23r5K82j42pm51J39K42q1
3157d9j18J45K78j36J32k23j27M0j86J56j35j32K54k9M67r8k09j5k01K22K7j17
3179e4l8k20J68K73k95l6L62k27K49J45m9j83k96J05K8QR5M0k21M39N3j79l23
3202a56j19L67n5J87k83J6O8o1j36L4K17J35l73N15k94k04j17K98Ok43J88O8J14
3225A72p3o3M4R9j83L39m78K00j0p0Jj92K24n8n8k5N48j07k66p7m1M0R6j4m6j32
3251a30k43J60L15m31J22K4M52l62j1Lk6k03J07J95k84M68j58Jn0l41M44k58J18
3274h8j2n8J48k24P14k12l19J22l14M84J00k26k97j79J23L34R7j02j43l20N66
3295A94j41J54j84J1q9K27l92O3J06J23mO3M7r7RQ6J02l95J34K73j81m74J99K80
$$ y = [58, 142, 175, 182, 208, 111, -65, 30, -218, 373, -361, -13, -24, 203, 257, 96, 187, 64, -31, 251, 109, 102, -349, -210, 32, -49, -167, -22, 256, 120, 252, 29, -98, -58, -244, -88, -223, -355, -101, -130, 337, 239, 30, 15, -186, 36, 63, -54, -92, -312, -144, 129, -166, -202, 160, -67, 182, 327, 278, 95, -201, -96, -68, -60, 35, 75, -146, 293, 346, 167, -156, -275, 92, 37, 224, -59, -43, 25, -36, -172, -138, 79, 214, -159, 356, 62, -142, -259, 39, 45, -198, -10, 58, 172, 99, 36, 80, 179, -4, 335, -143, 57, 47, -23, -22, -214, 10, -48, -106, -131, 417, 310, 44, -33, -74, -34, 62, 48, 2, -130, -373, -213, 102, -329, -207, -183, 269, -93, -104, -101, -127, -330, -223, -28, -312, 156, -2, -1, -51, -392, 52, -206, -88, -100, -158, -10, -234, 480, 268, -51, 71, -243, 241, 341, 115, -182, -361, -238, 96, 193, 91, -52, -372, 194, 53, 207, 23, 34, -55, 172, -220, -157, -51, 72, 68, 131, 178, 81, 90, 176, 278, -117, 17, 290, 109, -365, -166, 114]
3319A14l26l6K74J0R8J23m64J08p0kJ78j14N2j9L9K30j60m44L62K23j11j79KL12
3343B00o47M01j4J0j56N24k83Q5j01O0q8J14j58q2K52j23o8J4j3K9J30q7J7Jj67
3368a50K03N4n47J55K74L73m04Q6k70M26P7j69j53r3m3M1J98k9k0m41L79N8%l1
3392b6L6k03L7j15J2J57j96K18j4O4o6O3j77K71P7j94l7L17l36J16J56k40Q5j5
3416a0P9j85J86K0k99r3K33K83K0n1m0j61j01J15J89k15K47k70OJ52l2K5n1k83
3440b36L69k62J96P6n8K43N1m44N6j95K53l3k65O89l41k66J40j98L73P0m8j22
3462D8J75l28R0j80J92n0kr3R4K91k05l75L84Qon9M4j00j70O9J90o5L6k18K49
3487A9r6L60k82N8j91k6L38k25K05l54M01k85M79m47j38j04L37l0J62m12J35K04
$$ y = [114, -212, -248, 26, 36, 134, 257, -207, -99, -169, -171, 7, -107, -55, -74, -35, 195, 35, -409, -47, 176, 65, -114, -112, 200, -447, -46, -60, -50, -206, 318, 35, 120, 19, 79, -9, 105, -53, -135, 117, -6, -74, -60, -73, -44, 86, -1, 16, 17, -150, 53, 107, -440, -285, -11, 362, -42, 44, -226, 200, 277, 108, -45, -138, -181, -140, 58, 29, 9, -432, -53, 5, 5, -26, 10, -193, -156, -271, -259, -102, -298, -80, -94, -30, -96, -33, -210, 61, 138, -56, -93, 224, -112, 4, 160, -80, 5, -10, 69, -116, 70, 90, -209, -302, -69, 214, 234, 183, 143, -18, -119, -4, 185, -30, 217, -53, -47, 105, 73, 98, 47, -236, 133, -129, 67, 143, 85, 328, 379, -65, -9, -204, 49, 16, -249, 440, 99, -167, -27, -225, 148, 218, 170, 48, 223, -105, -15, -195, -3, -53, -55, -148, -54, 237, 32, -343, 41, 49, 43, -16, 28, -72, -242, -173, 17, -48, -12, -230, 19, -77, 283, 1, 59, -132, -158, 180, -45, 160, -194, 207, -78, 401, -46, -184, -288, 49, 19, 181, -231, -96, 108]
3509A08J2j96J58J1j97J39l22J82Q7L89n67L82j21m45J99J42J05J66j64j78K06
3530I6p2J41m63L97j89J55j64j7M02m34R3o2O7Q0RQ5j97p5N6J82k90J72O4m4J22
3555A14j12J2j0o6J19J1J57j30m0J1J4m8k70K06J24J41l22L38j79O7J33r4o1r1
3579B4j73L48J16j97m02K12N06l00R5l72k38K83K49k47K90j67K24q0l15L13j78
3600iK73p2k68j68K17n8L34j29J18o22L30j51K71k22p1K82m9%Nl4N6J62m20J81
3624d4q6K04JL10o62M24l05R0J6j18R8J84l90K58j8j65K24j83K60k80J74l28K42
3647i4j08l5J55O9l51M90k00k28N07l72q4K81J04l47R0J67k82K38Rm68N64P1j98
3670b2j89j8L64k90L64j1l7k42K65k84J25k1j77K65k5q5M4j39k1L72k94k72K04
$$ y = [108, 120, -76, 82, 93, -104, 35, -287, -105, -18, 371, -196, 186, 65, -380, -181, -39, 66, 232, 68, -110, 96, 24, 165, -298, 99, -90, 65, -99, -116, 286, -148, -55, -117, -50, 30, 39, 124, -73, -148, -92, 90, -200, -28, 36, -8, 114, 2, 14, 4, -62, 57, 68, 225, 95, 55, 66, 80, 32, -238, -32, 92, 233, -89, 249, 70, 137, 270, 176, 115, 24, -149, 199, 315, 118, -284, -72, 434, 134, 229, -143, -381, -98, 151, -96, 194, 27, 251, 171, -144, 169, -9, 264, 192, -76, -244, -27, -85, 249, 120, 238, -384, -54, -205, 66, -156, -227, 55, 6, 6, 11, -23, 33, 195, -225, -44, -130, 74, 75, 385, -277, 147, -158, -68, -52, -170, -72, 112, -278, -20, -38, -203, 21, -162, 98, -182, -8, -336, -94, -202, -237, -82, -13, -364, 126, -74, -302, 205, -167, -251, 30, 134, -213, -123, 44, -238, 0, 9, -459, 105, 176, -22, -211, -229, 135, -155, 209, 198, 161, -81, 184, -100, 25, 4, -173, 92, 67, -18, 26, -113, -134, 238, -56, -328, -124]
3693a24J19q5J6k1k3K93j91j00L4M81o80J17J23Q1p3jK66l49J9J37l60K77K33
3716A89l59L66m35J2K31Q7m2j50J01j26O1J53rj56R1K2j16K05j91K88j5l21l7
3739a51m6L64l5j3j87lj07K09R7k85J72M0Pk72O3J70k0L06l43n1J39R9l34R9k70
3764c52K23K22j15J1j24K40j82J46o1o0K81k56Q1j59J32k86j27M26l5K6l1J48
3786A48j57j9pk06K42K81o58N56k98J04m5o1J84K49l08J64l17K99Ql57LJ73J67
3809A45Mk46L40Pl50%N4O3J03m43L52ok21K22j81K4M10k40K17j08J43l15k00L72
3833A46m5J13j65L07l95K17rqq5j64J07m0k64J26j41M21M9m08K55J02j34k93M21
3856A13J05k44J17k20P8j67J62M69m59L46l02J66j45k30N4J02M69m89M1M9J71
$$ y = [-124, -5, -90, -74, -95, -118, 175, -16, -116, -82, 399, -281, -164, -41, 40, -33, -34, 232, -117, -98, 39, -321, -44, 189, -170, 196, -239, -227, 4, 91, 49, -101, 0, -126, -65, 88, 79, -77, 14, 36, -80, 125, -66, 222, 207, -114, -151, -197, 167, 132, 119, -68, -71, -178, 31, 128, -157, 15, 55, 62, -210, -147, 23, 3, 309, -34, -85, 54, 153, -181, -82, -352, -129, 93, -22, -11, -135, 105, -77, 69, 8, -52, 229, -27, 54, -105, 27, -259, -386, 40, 5, 31, 0, 148, -9, -28, -35, -241, 1, 282, -376, 180, -118, -14, -59, -120, 64, 313, 5, 169, -148, 151, 159, -198, -195, -22, 145, 149, -97, 243, 250, -100, -100, -46, 17, 120, -323, 29, 23, -198, 24, -157, -133, 277, 37, 254, 146, 289, -26, -226, 146, 101, 214, 49, 356, -39, 178, 169, 161, 76, -88, 19, -21, -285, -159, -300, 121, 170, -238, 17, 119, -15, -308, 113, 218, -26, 91, -129, -51, -218, -56, 413, -46, 300, -2, 164, 19, -211, -157, -55, 414, -75, -34, 15, 186]
3877A86l24j0J1R0J23k40p5J43J77j38J73M3j52j66J99l9K6J72Q0n20J41n1M5
3900a06L04o6j70j55K44J67j47l5j6q3j45K51l15M0J7K50K0o8K7J21l60L59l27
3923a93O2K84k62O40m90l19L38j12K10k89K64j67n1j56J95R7k14O8K83k14K03
3944A77N2n10n3J46O7q1m2M02J12m96K95K1k79L21j48q5J82n8L2J46k90L6K07
3967A54l93K10q7O1j35k72M06N2n8Q9J32l23Q0J93j29q1j80L73k25K37k69j81
3989c46L47K43l56Q8K59j47j60J69m32K44j33J24j07L76j32j48Q9j09M71l55K6
4010A1k6P9k03M0J90K0j11p2J49k0J88n44J48K9K8q2L58j46Q8k19L8pO2J2M9l69
4036c10P9M44j63l29L51k65J65K36k43J49j73K33l96K36J27n6m2l54L58o8N58
$$ y = [186, -138, -148, -137, -47, 76, -164, -239, -96, 81, -57, 116, 159, 7, -159, 40, 1, 27, 199, 279, -241, -100, -151, -106, 198, 132, -38, -193, 51, 218, 71, 36, 20, -63, -208, 43, -272, -232, -215, 35, 55, -13, 14, 135, -225, 134, -193, -131, 153, -109, 531, 41, -278, 60, -52, 158, -131, 133, -34, -85, -241, -46, 51, -163, -95, 188, -26, 177, 229, -281, -334, -188, -121, -202, -244, 158, 270, -226, 69, 90, -189, 132, -16, -101, 81, 23, 55, 201, -89, -53, 154, -239, -29, -116, -55, -190, -462, -56, -4, -62, 27, 159, -164, -84, 109, -20, -101, -281, 92, -133, 104, -165, -346, 1, 244, -112, -24, 235, 88, -72, 97, -335, -91, -224, -100, -207, 169, 37, -111, -22, -131, 340, -15, 11, -15, 64, -139, -99, 91, 111, 0, -72, 77, 57, 245, -299, -151, -122, -94, -176, 182, 36, 124, -95, -57, -64, -2, 10, 59, -310, -231, 213, 50, -279, 72, -193, -28, 208, -35, 114, -59, 174, -222, 14, 141, 85, 43, -311, 47, -21, 537]
4057E37n90j9K3k5J24l4P1l12K37J64j07j77k30L26N4m8j80K22k0j14%N3L5r5
4081a05K18k50K46l11p0L11r5K7M0j35J22J48l1j87k10N22k84L5n0P8O1J63j20
4104A23j95J30k40J10j53j9L69j72K20j58O0k65L81j28j26l32O79m39M42n17K75
4125D5r2J28N5k95O5K0lK27l73L88l86R6L29j79L4l82N80j49r8J14k87J41J75
4148A53k5k51jJ43M9K49k72j6q1l1L1Q5m0N4K04j55k09r4L14n4Om8l10M3L34j49
4174g1J8K72n1k76K38M8k03j43Q3o6R3K87k75j2K5K00l45L87k91P3j83K84R4k22
4198c6J51k54K33j83O7o2j7L72j72k52J53J41J84l41J78J78k98j0J62l97L01j04
4220fL1k50J81j29M18l23J12J63M1j5j43P3P2j71O9j37j8j52n7L43m28J17K65
$$ y = [537, -53, -72, -49, -74, 50, 16, 87, -225, 12, 176, 69, -108, -338, -12, 42, -6, -186, 36, 16, -98, -98, -45, -10, -105, 113, -137, 109, -202, -272, 39, -56, -29, 11, -124, -2, 146, 115, -72, -282, 240, -44, -9, -59, 19, 80, 243, 123, -72, 58, -182, -72, -225, -244, 125, -47, 173, 15, 75, -190, 191, 63, -63, -395, 284, -155, 287, -230, 45, -47, 81, 136, -159, -94, -74, -77, 150, -223, 165, -221, -125, 204, 25, 59, -323, 257, 108, 10, 124, -163, -22, 153, 128, -123, -124, 19, 68, 317, 45, 29, -52, -83, -52, 33, -7, 47, 251, 96, -113, -207, 107, 53, 59, 11, -299, -256, 78, -71, -53, 219, 168, -108, 130, 178, -25, -168, -85, -151, -58, 229, -46, -58, -33, 167, -178, 209, -82, -9, -192, 92, 186, -36, 115, -139, 94, -89, -22, -84, -101, 271, 99, -153, 0, 141, 325, -16, 162, 340, 42, 32, 194, -203, 98, -6, 25, -225, -44, -173, 245, -78, 34, 197, 238, 223, 80, 153, 225, 54, 123, -14, -32, -184, -241, 102, -326, -209, 56]
4243E6J04j1m84L93L48l93jJ92m0k61R7M04k87r7j47Q5K49k98K50j24j33j20M82
4266B64k67O4R8k93lP8j4k50N13K34n59L08k27N8j46J73j66J47K42j99j10J54
4288I9l19K1M22j49l7J15l27Q4J95k31J14j10J63j33j51J35Q0m47Q78l85j40M60
4310C37m03K37J08j22l29J1LK52Q4k51J01j21J00l66M19N6j06N2j06K35l9l83
4332b31J27M6J35Q4j01J32l52K47J98j57p0p5j07L80J9l28n6R5P9r5r2n1j5K50
4356F2j03NL21l17n0J83l55J42j5O3Q3j99O63l90k45L73k77o4K80j5l1p2j13K48
4380A77r6o5j08K81N2k48j8j05j9J76l03M92l22l8K14m20M52J23j79J47k50j29
4402a86J41J25J50k94j8L22j34Rk19j62K31j2k2L12k01l45J24O7k40L8N14p5m82
$$ y = [56, 160, 149, -335, 58, 406, 13, 12, 204, 164, -97, 0, 404, 117, 20, -127, -42, 207, -91, 159, 35, -98, -218, 264, -3, 61, 159, -134, -137, -59, -73, -323, 190, 424, -135, 173, -54, 4, -142, 31, -135, 12, 254, 55, -55, 99, -220, -199, 223, 74, 37, 152, -175, -91, 104, -127, -13, -123, 40, -93, -244, -109, -29, -476, 402, 17, -123, 337, -66, 171, 279, 157, -172, -161, -158, 94, 178, -73, 28, -93, 7, -359, 60, 116, 10, 62, -44, 191, 152, -231, -104, -58, 77, 161, 60, 192, -160, 87, 285, 128, 58, -17, -124, 256, 275, -53, -109, -14, 65, -30, -122, -173, -188, 62, -41, -36, 285, -32, -82, 101, -254, -112, -127, -64, 19, -180, 483, 93, -152, 221, -56, -120, 160, 145, 114, 42, -71, 177, 81, 16, -92, 189, 241, -7, -25, -130, -149, 27, -276, 216, -106, -144, 70, -350, 102, 225, 46, 193, -57, -186, -45, 80, 230, -64, -82, 240, 106, 115, -104, -266, -35, -47, -69, 243, 42, -303, -179, -112, -352, -314, 200, 125, -357]
4425c57L98r0j2J94j49m4J17p2R3l01J90R9m1l0J22k29jJ48l39L29QJ88j01n2
4449F8j55J53J71m16J45R3j70J14K2j45L07k63K57j25J70p9k55p5M3k37J70OL88
4472A87j26O3o6p8r2J42l33Q8J09j97O70o18K54npJ73m5l47K48o8L61o80J43M22
4496A98Pl20K58P7j81K0o0PNq3K21k51Q0k67L03m31O22j2j26p3k44P3j81M90M4
4521A76k81k35L27j22k6J16L64k41k2j38L9J15N3k26P9j9M58l19r8j09o8L15q9
4544D9j50l37L20J79k8K03j87k3p3J81l24K01J41q1o1J75m62K0K45K5K00k15j39
4567a41mK09J56l8%n4k13N5N4j09n7J44K9l16J63J6L21k6nj90l71K94n2P2j49
4592b12K79j53n6J55p2N28p84K44N6k47L48r5k72M00L3j28J29J1j30j50J28r8
$$ y = [-357, 41, -49, -61, 133, -16, -60, 57, -15, 78, -223, -33, 66, 25, -5, 117, -112, -113, 35, -304, 25, 33, 221, 120, 68, -87, 66, 237, -179, -34, 59, -111, 3, 25, -120, 187, -76, 181, 56, 226, 147, -108, -183, -140, -377, -207, -201, 187, 61, 124, 58, -20, -112, 30, -303, -215, -106, -303, 367, -251, 3, -2, -9, 164, 119, -228, 20, -48, 313, -367, -224, 198, 205, -115, 143, 220, 39, 59, -1, 6, 11, -72, 149, -102, -22, -289, 14, -417, 205, 193, 67, -6, -250, -177, -358, 132, 176, -105, -340, -13, -135, -161, -45, 319, 78, 56, -82, -43, 72, 125, -101, -22, -41, 417, 98, 0, -109, -177, 138, 49, -101, -438, -118, 61, 33, 236, 49, 26, -47, 134, -190, 11, 152, 71, 10, 185, -277, -257, -12, 13, 213, -2, -141, -145, 64, 220, 182, 182, 128, -85, -30, 24, -85, -142, 2, 31, -285, -122, -106, 215, 189, 184, -6, -377, -83, -135, -63, -212, 67, -86, -142, 13, -59, 469, -315, -71, -15, -262, 86, -9, -281, 119, 152, 24, 153, 164, 34, -116, 12, -86]
4614h6j34L25m0j3J7j14K26l50K11n9P8j56k44N40l64Rn5K49k17J49j25O6m1M5
4638h3J62n26M39N9LR5l15K24K6k18J75n3Q6n9M6o7K19j87m0N0o3O2k21K37Q8
4663A39Pj29n53O88Nk15L8m0n2J71Q2J98n54M74l57K31j44M7K51k42j12l5LL45
4687B46k59k0J11j34K28l79K50J16k88Q9J41j41J2j59J84j21L29j93j3Q9m17M08
4709G9o6k0R7j62k62M41l27L12j44K39l78L25k54J90j55M42k91Rk5j79K20K14
4731C05L95m75k84q4M4M7k5j25J93l7K21k01N7l25J5K77j62J51m30L78k48L98
4753H5no3k07N29m00k83K48J93l04M07l51l5M48m25M39k04K3m2j95o7K26Oq2k9
4777h8M0K48P3l62J97n1k09J78J09J40o99N66j13K06l82p5J58J40k72J11l55K84
$$ y = [-86, -220, 105, 65, 52, 69, -45, 181, -169, 42, -17, 61, -95, -339, 201, -163, -154, -209, 40, -177, -28, -153, -87, -128, -83, 79, -447, -8, 51, 54, 149, -166, 58, 84, -134, 41, -12, 74, 15, 61, -6, 213, 26, -14, 36, -27, 35, -186, 51, 139, 146, 17, -536, 152, 157, -58, -20, -60, -112, 59, 141, 339, -215, 259, -98, 133, -11, 36, 287, 45, -67, -102, -99, 246, -13, -33, 78, -56, 172, -207, 43, 159, -129, -40, 101, -40, -28, -187, -3, -124, 205, 12, -1, 88, -329, 79, 13, -7, 90, -72, -334, 107, -220, 92, -52, 187, -191, 134, -120, 70, -85, 357, 66, 75, 50, -129, 91, 305, 700, 225, -59, -143, -99, -52, -77, -202, -9, -46, 175, -26, 31, -294, -279, -2, -164, -13, -443, -65, -313, 85, 80, 17, -190, 339, -61, -344, -96, 97, -207, 200, -151, -186, 262, -163, 276, 72, 95, 53, -142, -209, 17, 23, -59, -88, -48, 200, 273, -89, 108, 57, -152, 26, 135, 275, -424, 142, 29, 235, -147, -222, -64, 76, -196, -85, -440, -156]
4799a56M72K5n99L33L8j70j53K65l9JN1J01m14NK18r0J64L1k87J7K50k40K41K29
4823B93m01J66K05k75K31m54M32m98M90j07l7K9k74R3K7K75l53K78k30K63j73
4844b0k34J57J68n6n3K96m18L05l15R4j23L12J47k83%k44M18l31J36K08j47j70
4866a53J1J1j97K95j50O27n12M6m6j44K95J9qo3K80k87j81r1K08K34l65Q1J68
4889G8p6m46K87L38k85J51j83O4K40N6M3m46J92R1J6K3jj91K72j46J46j58k3j74
4913a32R3K08k33k60rM51J57m54J12Q5J00n4q1j38L8j11L27j55J3P0P3n9k05M36
4937B72n3k79J09N4r0p0k23L27j69J89O3k36J97J31o7l92L9k6M20m82m7L75l01
4960b59M17l47K58j06J28m5m2J86j27p7J34l85J08j71M2M73J57k47j50l2J40q3
$$ y = [-156, 316, 341, -258, 75, 113, -57, -210, 55, 16, 17, 68, 169, -245, -240, -22, -112, 52, 83, -204, -187, 63, -177, 64, 293, -108, 58, 263, -12, 219, -235, 197, -301, 189, 82, 45, 74, -200, -107, -80, 195, -158, 120, -110, 153, -20, -254, -97, 71, 15, -38, 258, -160, 145, -170, -76, -199, 113, 260, -23, -23, -267, 151, -180, -44, 164, 17, -153, -142, -131, -328, -33, -183, 444, -68, -22, -68, -212, 83, 102, 94, 31, 311, 24, -157, -248, -40, 194, -171, -90, 78, 2, -444, -157, 181, -104, 47, -136, -72, 168, 224, 267, -179, 13, 104, 120, 143, 142, -49, 223, 77, 223, 65, 42, -132, -39, 169, -64, -324, -333, 118, 275, -179, -67, 18, 118, 64, -17, -155, -117, -228, 99, -56, -43, 27, 100, 41, -164, 272, 219, -60, 49, 103, 13, -57, -280, 47, -122, 67, 130, -106, 91, 222, 155, -237, -198, -224, 196, -286, -333, 42, -259, 158, -189, 69, -37, 91, 46, 4, 190, 63, -14, 120, -265, -157, -328, -286, 187, 344, 97, -53, -85, 55, -28]
4982b8J71j19k31K28j06j42J23J99l12L36J5m95N87k11k82M1K84m87J56M00k00
5003g3q2k5J84l6k3PO1j59lo1K95m8j5q2R1k79N09j21m15L01N5k00J61k88K22
5028b4l67M22j19j82M17p5j03q6K33o3k04K53q9J06Lm25K50R7K43k87j30N5k2
5051i7L8M83k01m15QK42p3n2J49K59l63j66J60k16M42l70Q7q2k9J00J32m9K78
5074B65j56K41m26j40l7J46Q7K29j49j79K61j36l6l37L02J31nj36J32J85j30n1
5096F1j32k20L31J04Jo8J32l17nK09M7Kj74j42N31n05k6J75q1K44k92j33L53O5
5120A60l31J45L24k91J80m07J98Q3K8j09k41K57l2k63M88j64K26k80r4P9j81J22
5142a03P8qm3J97l79K49J39k31Q6j15K37J30K4j65j5j93K41k33P3P9Mj32J06j57
$$ y = [-28, 143, 24, -207, 21, -85, -227, -104, 95, -217, 119, 134, -361, 226, 15, -267, -226, 58, -429, -273, 127, -73, -155, -180, 4, -32, -55, -48, 13, -146, -149, -210, 85, 37, 22, -60, 31, -248, 261, 140, -275, 26, 81, -119, 42, -246, -24, -391, 31, -88, -270, 147, 72, -31, -117, 116, 53, -151, 102, 13, 119, 122, -303, -53, 44, 287, 0, -130, -75, -97, -59, 424, 223, -192, -184, 58, -15, -67, 82, 341, -22, -188, -28, -244, 198, -172, -85, -167, -196, -96, 36, -13, 265, 109, 350, -76, -216, -253, -107, -20, 209, 60, -119, 142, 6, -30, -367, -65, 66, 61, -75, 57, 242, 112, 61, -71, -291, 40, 144, 145, 77, 209, -108, -113, 96, 143, 145, -29, -171, 360, -145, -171, 4, -77, 167, -125, -258, 95, 160, -171, -26, 298, 7, 187, -220, -22, 61, 89, -20, -261, -4, -36, -299, 189, 25, 251, -29, -123, -44, -225, -103, -25, -33, -76, 121, -258, -9, 130, -101, -15, -130, 107, 237, 261, 96, 81, -112, 129, -104, -31, 48, 52, -80, 26, -131]
5166a31O9k6M08l37n7O2J03N3l55L07k31Rj43K28j33J57j98l3N37j46j95J03l0
5189B1J06n3J10N7k30k95J72K09ql06M46k34J77K0l28n5K16o7N9j52j77J10R8
5212a04l09M62j09J36j5m8l38L73J72l59J6K5M26l82K5k01L87k42R7j65J19N6
5234B2p5K27J18l23J60o3p0M1K6m6l1J2O0j56M4o8O9N7l5q1M6N1j26K36l26L94
5260A63J8j66R4j67n2K81J7k37n7j11K77j25Q0J70l29J66L3q7J11J1j25n0R3j75
5284a67O1J86j64l78O18j00j07K33r9L21m57L38k49K95l49k68M78m78K15M6j4
5305c9J28l47M34j02J57j59q4J30j27k8k5q7L70j93j03j86J14J91L3K02q7k47
5327e5K20j1J47m90P8K77o4k72q7L63J41n21J50L20j27m12J92J5M4L23l97J5J25
$$ y = [-131, -62, -88, 320, -17, -74, -12, 91, 144, -211, 96, -135, -126, -269, -41, -174, -17, -215, -248, 289, 143, -52, 51, 21, 127, 74, 184, 241, 11, -284, -112, 97, 89, -217, 229, -5, 172, 192, -136, -191, 25, -42, 17, -135, -312, -202, -104, -413, 49, -60, 76, 61, 13, -325, 48, 220, -139, -123, -98, 328, -54, -29, -230, 157, -85, 12, -153, -34, 22, -53, 174, 292, -31, 129, 66, -4, 37, 63, 17, -14, -2, 58, -98, -54, -122, -53, 4, -31, -112, -66, -15, -141, 95, -231, 163, 181, 15, 109, -58, -110, 171, 188, -49, -106, -217, 60, -65, 15, 185, -144, 22, 55, -32, 79, 90, -35, -85, 8, -167, -106, 80, -84, -462, 156, 56, -51, 182, 83, 404, -53, 285, 36, 331, -18, -286, 192, -286, -71, -25, -39, 89, -258, 176, 74, 231, 72, -12, 118, -9, -37, -62, -149, 221, 28, -75, -261, -147, 44, 77, 279, 192, -55, 165, 154, 301, -189, -111, 166, 102, -170, -257, 106, 247, -274, -124, 196, 69, -343, -151, -136, -92, 231, -166, -151, -26]
5350b6L37j20j99J38j31j90R4M2K90m09q2K71J87q1j84J10J02j38J16k89J71K16
5372B25j69PJ1k89J31j01Q5M8K54n04L88k1j33K52j48l9j71L81k64K9oJ47j30
5395a7j08L64j39N0l61M20l23n0J54n5P6j73J64j88K41k88M25j89L89k69k97J87
5417A3k45O45n88j06L31j86J11J26l19K45M4l7O6l8M4k35l3j07J40j0K02Q9j41
5440A1p7l9J40N2j93K20n1j83j97K54K48l59J78J7L7j16P3k57J37M5K67j25k26
5463a44k12N10j47j6J01j28J44n7K8j62K8j77J97J45q8k14J97J50l64K28k8q7
5485i6KmM8K74m35N01m37L8K44k05j5L3J17m84N59rm52K35n4P3J17r2K01j23j04
5510f8L42m30J01j02J6j01K29j08K58k84J16N1k9l60K92o2N6%J69l5l81L50kJ70
$$ y = [-26, 311, 191, -8, 130, -1, -191, -97, -55, 235, -174, -256, 15, 202, 121, -63, 47, 149, 11, 127, -162, 9, 225, 56, 63, 74, -215, -84, -185, -100, -52, 202, -302, 86, 65, -68, 184, 36, -3, -174, 207, -57, -28, -34, 113, -17, -125, 239, 100, 150, -211, 209, -114, -164, -10, -65, 11, -162, 2, -186, 55, -233, 192, 3, 392, 123, -174, 13, -232, 413, -175, -281, 50, -136, -25, 101, -218, 27, 71, 34, 100, 62, 106, -129, -162, -269, -129, -139, 63, 152, 11, -66, -105, 35, 87, -106, 114, 63, -120, -317, -63, 185, -174, 4, 21, 58, -58, 15, -242, -105, -60, 207, 82, -144, -356, 154, 7, -9, 92, -36, 108, 51, 79, -83, -55, -232, -35, 110, 22, -192, 5, 155, -209, 19, -9, -96, -94, -98, -50, 224, -211, 290, -147, -109, 135, -70, -85, -52, 65, -419, 140, 131, -321, -86, -140, -67, 50, -42, 159, 36, -68, 274, -156, -55, -157, -141, -242, -13, -121, 137, -147, -31, 20, -9, -369, -77, -139, -83, -83, 86, 51, -330, 20, 18, 188]
5534A88l87M77l2j14k99J76k7O3o3Q1j29K06m3o3l99L62L4o2l61J97K53m51N18
5557A25o0O1q2l9N3j5K68k07M4l3m80J1K85J93q5m6j66J35k46L3K74l04J4L24
5581E7l37K95J91k41N9P5o14P66j37l2j33J94j47J43K82m55k2j19K60k20K57k52
5603a30J00n7k94N89l75L20j91K45j20k59L14k94N26m84j30L50k02N4r3J4J06
5624a1K40m37J00J39Q9pj02k8J38Q1m68N4K31L53k93j71M58j04n80J11Q0J9L23
5647B15k61k09Q0J18J40j71M39m56o6K79q9k22r3M11j86M35j41l86J18j15J16
5668d4j68K5k7k3K68q5k07N62j61k72J00Kj8J0l6J3j54L46m48K66O6m51M25K85
5692B74k88M0l85L70Q9j02J91l60J45K80K8k43Jrk15K16k01K95k81J75k61L81
$$ y = [188, -199, 278, 246, 132, -167, 9, -18, 45, -18, 63, -66, 140, 97, 34, -365, -3, 31, -31, -392, -195, 58, -393, 125, 65, 126, 44, 5, 58, 43, 311, 104, 148, 115, -365, -354, -69, 124, 39, -7, -173, -38, -284, -251, 23, -281, -267, 57, -280, 15, 206, -35, 24, 99, -515, 251, 114, 82, -51, 143, -4, 139, 421, -34, -56, -175, 85, -135, 122, -130, -30, -87, -381, 208, -167, 153, -38, 207, 87, -172, 142, -152, 374, -110, -240, 110, -92, -38, -131, -117, -11, 229, -208, -108, 31, 120, 113, 11, -17, 121, 202, -266, -212, 19, 372, 79, -92, 366, 262, -318, -207, -127, -108, 215, -46, -255, -175, -57, 83, -88, 351, -105, -171, 108, 19, -203, -296, 115, -71, 364, 223, -163, -45, -160, -44, -212, -187, -214, -237, 31, -54, -261, 301, 140, -132, -32, -30, -48, -38, -74, -61, -215, 131, -317, -51, 15, -436, -11, 274, -14, 26, -359, 11, 100, -2, 189, -171, -26, 254, 282, 39, 40, 31, -184, 32, -169, 126, -155, 20, -241, 140]
5714A40n3j08J69l31N2N7p5J27j02L75k7k58J8j85jNK84L2k1k15pK35O6k8j6j93
5740f0J92k65m5J50R1L17l24q7K22q0j91J56j08J90n9j87P3J49k11l7mp2L02l40
5764b28J06k2R0L21j69k24o7K5J11o8J44J63m09J20L9J69p2J09j11O2R9k90J65
5787F3k39J79j39K56j17K7j14K81j06l12M61n12M00l57j03K74K35Q3j07p5P0R
5809A57L2k93K12j9K6l68N45o05J70M1J87j04j76J62%J48pl28M50l40K72k95J33
5832@L21j32j25JK44l39n5K43k99K31K36l13r0J06p7P7J52l97J52K65k39Q3k92
5855b47J90J73k16J4J56M1j93J82m2J31j42j67J86r3qK54m62J26r0M49m74J36
5877i6J04k03J99j61J67Oj62q1L89k25K86m95J29K39r3J23J42l30j84M82m78n3
$$ y = [140, 87, -21, 148, -183, -131, -74, -149, -22, -124, 251, 224, -34, -16, -201, -202, -197, 87, 119, 98, -117, -124, 111, 177, 149, 133, -60, 132, -133, -178, -28, 63, 380, 56, -31, 191, 111, -80, 76, -32, 158, 99, -88, -15, 134, -77, -114, -118, -190, 112, -228, -122, -144, -54, 267, 98, -126, -193, -168, -57, -125, 19, 182, -227, -107, -68, 101, 29, 138, 27, 89, 188, -102, 63, -176, 3, -136, 120, 3, 30, -84, 197, 91, -221, 240, -272, 128, -229, -332, -58, 177, 260, 153, 78, 148, 157, 189, -104, 108, 89, 115, -253, 292, -313, -143, -102, 85, -19, -195, -33, -33, 115, 108, -220, 230, -110, 162, -133, 0, 321, 189, 64, 65, 309, -30, -85, 158, -141, 90, 326, 13, -77, 29, -48, 29, 181, -216, -64, 201, -38, 45, -247, -57, 116, -100, -86, 70, 111, -82, 100, 58, 189, 47, -120, 66, -27, -35, 219, -243, -117, -207, 242, -232, -96, 8, -195, 4, -157, 10, 16, -146, -227, 162, -63, 223, -272, -143, 96, 3, 126, 268, -62, -246, 236, -242, -295]
5899b95Q1k1K36o1r3J68j53K55q5k24L25j58R2q6o3K5J89k19l38L77Q9k80K12
5922b7k55Q0K00m37M14J20l03M33l26O3k9P6J30j47j39K52k20J43J35k68Q4L15
5944B94n21L70m30J32j27K27K03m7N0k4j00m1R9j03K11q9K4k74N3Q3J42j93j05
5967a66K64L5m05R2Q9K47Q4k41J28P7k67K43q9n7j3j55m5J99J51j42J98m56L11
5990H2j30j67k13L62J40j24j70M4L66l58m7K41L56n11L27j90Oj82K66l20J66k72
6012c28L34K93k24j35k19k3L66j36j52J0J22R4mj9N0K34o75K7N21m42L86j05M6
6035B1RJ04p5k51p7L80k64J0L59l73L47l05k97L49J24j4q5J27P7j9k6k17K45n7
6059I2j61R2J85l46n4O7J36k89K94j13O2Ok75L19R7j08Ln9j37K26j57J57r7K25
$$ y = [-295, -214, -235, 1, -60, -153, 15, -138, 117, 32, -192, 133, -25, 67, -19, -82, -57, 132, -87, -425, -48, 41, -239, -27, -282, -202, -2, -439, -25, 95, -208, 225, -101, -38, -67, 9, 139, -8, -147, 105, -115, 28, 163, -105, -21, 294, -227, 143, -287, -155, -282, -55, 148, 101, 151, 127, 27, -14, 85, -18, 193, 104, 128, -146, -93, -10, 132, -61, -166, 98, 133, -272, -180, -91, 156, 240, -1, 127, 204, -63, 180, 91, 34, 21, -134, -179, 20, 171, 29, 227, -229, 82, -48, -215, -428, -66, 74, -50, -220, -176, 190, -168, -215, 26, 382, -129, 198, 8, 14, -168, 98, -222, -56, -328, 6, 299, 75, -60, -279, -302, 64, -72, -224, -214, -92, 2, -2, -21, 29, 263, -412, -385, 136, -306, 80, -25, 21, 30, 134, 59, -192, -269, 111, -153, -143, 216, -157, 190, -115, -412, -63, 61, 47, -38, 89, 166, 147, 121, -96, 149, 92, -69, 23, 208, -138, -192, -125, 11, -278, 16, -97, -35, -29, -304, 15, 112, 4, 7, -52, -189, 37, -120, 37, -60, 165]
6083A65k33J72J37k90j37K36j80K39L05m60J85J54j85o4J3l72P7L30j75J30j04
6104e7n2m9l8o8L08J53K71n52k8Q1j59J18qj1J83k21j79M63m29L97k4k7l46K08
6128f6J5J9P9L60m40Q7j50M26l54K4r2K06j54k4N42m86q4n1R5n8J16l27L36j14
6152i5J39j52R6jJ96R1l61J57o1j36K30k85O8P7k75L47j68J97m25L00j7L79l55
6175e4L9k8K41k57J92j45J58j74l9P8l15J43n5J20N4JQ6n2k8J80l53j4J17o9J00
6200g4o3O6l4l11M2O34l10J9k45oK79K1j28L15j22j00K62m37J82L8j31M2L81p39
6224d19N00l2k8j99K90l0r3L2l85O15M4N1n12J12o5J45P3j04J3l73N70n1j32r7
6248g5L44m15P5J2n0K62r9J71k75j8k6j84K39L77l03m9j00K46l60Q3JJ59Q8p8
$$ y = [165, -68, 104, 241, -49, -186, 50, -130, 109, 414, -46, 139, 293, 108, 44, 57, -315, -238, 92, -83, 47, -57, -109, -158, -196, -264, 44, 197, 468, -84, -112, -31, -190, -72, -80, -91, 92, -129, -308, 155, -274, 123, 99, 72, -274, -66, -51, -32, 47, 407, -33, 54, -96, 330, -24, 0, -92, 114, -40, -64, 478, -8, -92, -143, -48, -106, 10, -317, 19, -95, 44, -108, -12, -13, 183, 274, -87, 70, 9, -127, 103, -182, -114, -37, -312, 35, -133, 64, -361, -61, -78, 301, -54, -15, -43, 198, -59, 133, -12, 146, -28, -67, 11, -304, -161, -216, -96, -42, -41, 45, -7, -35, 145, -208, -222, -105, -174, -74, -137, -71, -105, -416, -374, 260, -50, -31, -276, -282, -3, 18, -110, 205, 83, -17, 245, -192, -10, 28, -103, -61, 320, -419, 81, 49, 21, -178, 112, 82, -11, 21, -364, 251, 295, 346, -166, -54, -119, 26, 99, -5, 8, -365, 205, 154, 22, -75, 269, -146, -71, -59, -109, 153, 54, 225, -50, -68, -94, -278, -39, 338, 35, -14, -114, 132, -228, -145, -144, 15, 103, 25]
6272B5J6M23k1l73j15M7j6j21pQ8m4M26m62J12P7k74M21n68M75k42K04r9O5k73
6296b36j65P02k65O7Q7k95J58r5K18j44K0J00l4k37r7K16Q0l55K82l07M73J30
6318C03J47l12j51K94k58J87n24J89J47j77K10l56O47k03j22l30N63j63k02j29
6338b40K5J40R3J33P9o5L6j06j59p1J9K19j28j05K63n6k22L8jJ09j48N02o18N98
6362C35k66J5j22P9Q1k2J2J03j57qN1j06K6J4n5K40j97j43K24k56N2j07K84J53
6386B30M8l72J24k24Pj63M03J78n49j8K76K08n5o4q5J40Q3n14N20K3j29j25J20
6409F2K42k31r8M3j39O6L40l03p9j43L53j84n8K14k82Q7J61p9O6O7O5l52j82L80
6433A6j92J96p9j32J6J52k5j18P8K17k69K30o9k79K60p2M8j06K60P2k42L7j49
$$ y = [25, 41, 464, 443, 70, -45, 2, -14, -135, -142, -54, -98, 328, -134, -22, 55, -219, 202, -366, 109, -133, 71, -28, 37, -236, -401, 301, 36, 103, 190, -105, 53, -42, 176, 32, 52, 152, 118, -119, -216, 0, 80, -275, 7, -300, 173, 303, 450, 138, -13, 281, 23, 210, -314, -125, 22, -155, 55, -301, 346, 143, 21, -309, 254, 91, -111, -240, -215, -75, 18, 151, 230, 165, 201, 95, -64, -135, -116, 103, -25, -130, 133, 77, -145, -107, -108, 1, -147, 355, -263, 335, 69, 84, -38, 41, 122, 100, 112, 215, 58, 50, 101, -5, 21, 35, -20, 220, 23, -120, 104, -152, -100, -207, 77, 230, 278, -94, 30, -194, -187, -350, 53, 231, -318, -336, -60, 148, 93, 29, -56, 84, 167, -347, 173, 196, 67, -58, 62, 304, 73, -25, 18, -121, -55, 285, -18, -97, -240, 113, -71, -129, 85, -197, -110, 51, -28, 38, 105, 170, -182, -364, 16, -176, 20, -59, -191, -175, -23, -48, -166, -88, 129, -140, 90, 21, -258, 2, -70, -22, -128, 132, 204, -38, -1, -150]
6456a50k65L10L24m50K69R2l21K01J00l2k11J62k20j28K70K2K28j38P4j10j95
6477a68L34rk74N1J93l51L62k80J74m7Q2K49o2q9j98j06j67N04J13o63J89k0J65
6500a8l8J2J45j67j5l8o4j16N44k98m0J24l20O01m83R7k45O4J27J50l0R5j9Q6
6524A54n6J42k21lJ53l92j33L62O3j84J57K8P5m00RN75j34l76J15Rk7JL31k5l95
6549a72P0p2K74M3k39p3rL63k19j63J92L0k89K26JK58k36J71rj81M3j77J47Q7
6573F6P8k36K7P5k39J07n1P2j15J52J69l76O8J38L55j85k53J33J43J3j82K81j49
6596I1Q5k18l28L73kr7J04r6L16jk97K72J30k74k16L53n33N21j46P1K8l48J81
6619c1k07K89j39P1Q4l31M86m22p2J10J13M9J11j09j71r0K79L4J95j22J72j66
$$ y = [-150, -415, -105, 219, -231, 38, 130, -191, 10, 110, 78, -133, 29, -191, -319, -49, -27, 201, 63, 137, 27, -168, 166, 157, -117, -66, 127, -224, 138, -142, 32, -15, 67, 316, 254, 165, -33, -139, -306, 198, 311, -352, -163, -183, -18, -56, -44, 101, -66, -81, -119, -183, -299, 245, -53, -93, 31, -289, 312, -171, -74, -319, -255, -128, 22, -8, 87, 68, 154, 98, 240, 19, 16, 169, -223, -356, 6, 69, -115, 42, 70, 145, -255, -246, 329, 195, -181, -66, -57, -84, -83, 248, 223, -172, -102, -174, 100, 143, -96, -169, -178, 185, -34, -197, -5, 25, -264, -38, -37, 221, -15, 156, 147, -34, 9, -168, -21, 66, 144, -92, -65, 10, -229, -122, -173, -101, -216, -64, 105, -271, -203, -65, 290, 105, -148, -15, 128, 141, -41, 240, 91, 176, -42, -370, 3, 1, -96, 8, -88, 228, 227, -70, 202, 332, 58, -158, 195, -338, 183, 37, 108, 136, -212, -31, -238, 51, -88, -17, 67, -264, 222, -200, -272, -162, -49, 0, 111, 2, -169, -259, 20, 54, 249, 127, 299, 133]
6641A33R9l84K52p5j13j9J89j62J3K1J20O6j08L1l4j75J35j29K10l2J38k40J31
6664F7l1k19L9J53N7j8n9j47K93Jl40kJ66K34k43m6L65k15R7l74k56P38k85J15
6688I0m17J38M3L49P8k68ql20N34m46M1K65l08M36k58N9j45J37O7Q0j00R0j59
6711b2J19k06K37l98J9n5j05K45j77K26N2K0NJ56j70k4J46%o0j56p8J29j79K41
6735c5K32j56J65k39jjr6J52M35o11K80q3j6J46j82J22l84K71k09M75j02j02M3
6758A04Kj14m0j4M49l87J67j14j22J36P6j45L62l71J3o2k3p8K57j9r1J89j6k97
6782a38L44k44l25L34J30J82j34j70k34L91j77j52L52j18l62P3J04P0Q8j65L91
6803B40m8j46P7p9jk97j6p8O31l64Q7r7m9K24l25K65m9k63Q72o30k5J36J12k8
$$ y = [133, 232, -152, 100, 25, -88, -107, 82, -80, -67, -46, 74, 140, 32, 63, 29, -146, -11, -140, 70, 38, 176, -64, 67, 36, -183, -144, 9, 66, 48, -11, -158, 135, 136, -204, -206, -40, 194, -49, -95, 270, 55, 152, -222, -478, 260, -25, 90, -327, -189, -146, 203, 281, 13, 5, -315, 219, -227, -186, 79, -229, 207, -51, 8, -137, 0, 67, 147, 47, 137, -22, 97, -109, 128, -270, -251, -306, -411, -166, -343, -117, -65, -45, -40, 116, -54, -78, 68, 68, 8, -148, -226, -97, -276, -35, 197, 41, 206, -33, -34, -35, -131, 21, 456, -155, 125, 42, 26, 172, -10, 112, -272, -1, -210, 265, 163, 61, 104, 106, -8, -48, -62, 387, 0, 167, 53, -69, 67, 143, -2, 360, -11, 2, -60, -83, -161, 96, 77, -14, 175, 159, -138, 206, -38, -363, -29, 101, 283, 149, -21, -255, 136, -41, -193, 159, 41, -321, -248, -144, -74, 14, -151, 240, 192, 46, 123, 44, 43, -254, -270, -348, 283, -81, 6, -91, -140, 84, -241, 24, -25, -288, 584, -46, -71, 65, 177, 149]
6827A49n9j9k23K99m56J62M72n73M03k8p8j07J27l50n2K99l1K39k77L07j11k47
6849a54Q3j15J98N2l88N52m98nJ78m4O5R5j32M08m53K04k46L17k52K35j09j95
6871b04K83k97K01J2J5k70J23J11O1J06j61J89j09J26l49J49J8p8P3j22j10N42
6893C09o81J94L85j69j24j3K80j77J11k39k5j97K41J8J50l20l1K19ok10J27Q3
6915g5k13M55l22J61m2j35L5j28R2K32p4j59J99j75K20N5l0j52J02l05M15q6j26
6938e6K63r4j59R6l25K58K24k19L21m22j78J63J5J22j0K79l67M5m0j15M35k75
6960c9N8k25J05R1j26K5q8J10N8l01M27K12m09K30j39J71l41J47o1j11N2L9K9
6983h6K28l16K24O1m25K21L03k9j46M0j38J20j96J43l3L02k69J56j35lK43l38
$$ y = [149, 90, 71, -152, 147, -309, -147, 325, -248, 155, 127, 49, -58, 69, -281, -333, -34, -65, 174, -103, 204, 93, -154, -71, -186, 12, 64, -324, 228, -270, -275, -97, -141, -76, 19, -113, 295, -158, 46, -200, 117, -135, 100, -9, -204, 79, -218, -17, -5, 10, -260, -137, -26, 35, 141, -20, 169, 60, 186, -163, -14, 4, -74, -1, -123, -233, 309, -372, -178, 207, 38, -86, -99, 181, 4, 115, -124, -149, -346, -105, -87, 63, -257, -288, -69, -75, -285, -158, -75, -288, 167, -155, 6, -36, -171, -136, -264, -172, 60, -14, -173, 26, -149, 71, 126, 96, -56, 46, -259, 156, 70, -56, 207, 113, -46, 50, -275, -17, 207, -12, 309, -113, -291, -128, -113, 9, -1, 278, -89, -44, -84, -199, 236, -39, 19, -206, -101, -10, -136, -111, -199, -89, -31, -332, 95, 307, -102, 128, -11, 160, -181, -34, -95, -206, -154, -115, -86, 142, -174, 50, 111, -314, -93, 210, 181, 35, 75, -63, 57, -139, 4, -29, 273, 4, 160, 25, 22, 265, -73]
7005g3O2J15j62K82k5k57J77Mk00l6O8K26l44J46K14n48L42K6j6m5O3j28J42N
7029C8J64n03N34k99j09L4J58j79l6K81q0J89m12K15k36J89J81k54Q4m4K55n2
7051A18n45M82J2p6k87K12j28K42K21m10J23J33oj83L46k81J06j49K63Lrn61L30
7074d4j7M2L35m57J77l17K64k45J77Q2on1K68j85J02j83K38k5j50J11j38j05L42
7097B15k33K0n5JQ5N5k48O0jk27L74q3J55m07L72%J46k79pJ69l06L94j14k24o9
7122b07J36j7J42j8k2j07O7j03L86N2k97O5K26j12l08j04o2L37k39O9J64O5k39
7145a26M52l24N6m3J62l95J67j5J80j36J38k42M78j81k51j83N14J68k60k16M7
7166a0J62q0K3j95J56k14J81J29n07J76M26k56L35k43J46k87Q0L9n9J89j42j11
$$ y = [-73, -11, 104, -58, 224, 199, -58, 119, 123, -77, -113, -45, 181, -163, -17, 197, -351, -9, 17, 1, -44, 19, -109, 33, 38, 202, -301, 233, -66, -175, -141, 17, -162, -198, 83, 3, 192, -220, -5, -241, -52, 129, -125, -41, -85, 170, 118, -427, 55, 67, -9, -296, -84, -212, 30, 251, -159, -36, 97, 91, -92, 254, -27, 79, -70, 193, 196, 187, -374, -44, -61, -19, 316, -141, 36, -281, -17, -262, -85, -3, -9, -60, 208, 23, 125, -58, 180, 155, 5, 116, -22, -127, 215, -18, 2, -53, -52, 33, 88, -160, -100, -101, -328, 46, -37, 118, -289, 83, 83, 229, -50, -57, 112, -194, 200, 86, -138, -207, -71, -88, 54, 36, 14, -93, -26, -129, 257, 309, 12, 77, 303, 191, -117, -221, -283, 54, -185, -116, 48, 113, -126, 326, 2, 58, 15, 177, -218, -51, -66, 114, -22, 116, -126, 352, 171, -80, -263, 251, 419, 159, -57, -10, 152, 72, 95, -100, 56, -158, 23, 152, -355, -179, 247, -9, 326, 83, 229, -58, 22, 61, 2, 191, 49, -62]
7188f2N7KK7J23k44j25N06l58r0j25L19J45k63qK66N9l77L63j47r4OL36l08l15
7212c07M06Jl52K44J5L41l82J66l88o0L19l6Q9j48j10M52k79L50j45n4j97L28
7234B53j2k06o3j25k1M91k88k5j00M66k64MqJ04l16r2L37k31nL35j12k12k1N6
7258e5j65L22Kj38k02K33j40K51q1j2k71K50j87K50r4j04K73k62J58j17J56j34
7280f7j65K83J75k37J68k99k1J83m76N18k77P3M04m01J10J66j44k09L13k53L53
7301A97r5K1l35J73L48m64O7M9N8K03M7Q1l78J47k87K77m9o3J95j73J8ON1J5m66
7326c57L00m4K31k63K23j39K40q3k67K52k2r9k66K98K2J3k00M8K8j43L96j99J27
7349I6n7J32k56ML00j72P1p7k24M71l93K87P9P4n79J34K18j56K1J73j64k9K56
$$ y = [-62, -5, -3, 24, 147, -97, -222, 284, -74, -164, -289, 30, 175, -88, -96, 170, 229, -148, 215, 68, -26, -20, 316, 8, -307, 99, 100, -252, -8, 7, 348, -34, 132, -256, -316, 3, -33, 56, -92, -202, 250, -29, 321, 176, 122, -75, 253, 241, 35, -28, -153, -174, 317, 29, 4, -96, 370, 106, 110, 102, 206, -110, -202, 135, -96, -101, 234, 122, -90, -111, -55, -220, 102, 104, -34, -236, -3, -143, 108, 27, 15, -256, -6, -193, 57, -37, -141, 132, -130, 28, -89, 67, -67, -232, 51, 226, -11, 157, -142, -163, 20, -456, 62, -215, -142, 262, -139, -29, 137, -7, -216, 97, -156, 197, 102, 123, -212, -39, 309, -155, -88, -39, 19, 222, 269, 350, -28, 119, -168, 109, 60, -3, 192, 19, 37, 43, 94, 109, -357, -57, -101, 130, -133, 90, -49, 191, 108, -159, 93, 71, -28, -294, 4, 26, 39, -161, -113, -85, -228, 168, -31, 96, 39, 171, -85, -81, 219, 47, 118, 41, -183, 288, -105, 182, 261, 335, -244, -110, 108, -48, -27, 146, -18, -47, 209]
7372B09m07L04j62l0L66l58N1j51L40k04Qn9J31J89j91K89n22K04L8L2j83K39
7394A33j16K29l48R8J65k53J03r7J21j07K18k12Q8p1j16J68n4j02L40m6k33L45
7416B53j24k22Q7J28L0j96J9L03l78K27l5j18K43k85Pr2M1M5j31K00p9J1L14K03
7440D51m36j40L06K6r6k23L10j1k40K98n41K58J12l80N99k24j61J00K16P8m56
7461a54L96l41j15N82j93k69J62j02J51q6q8n0J97m50K76K64k60J44mk65L94k57
7483f8l62L17K9J1J19J45k62j6p5M4K39j31L8O8k84m3K25k01J52j64L74l07J41
7506a1J75l3pl60Q1M77k26q7j84K76j43j18N5J92k83J19M6n7k0J90L2m14L07N
7530A2j92O0J85rJ90j88k43L04k20K00m4O8k28Q5j00m0M04k13k26J9O6m1K10m0
$$ y = [209, -198, 106, -56, -86, 280, -78, -27, -178, 162, -42, -34, -93, 38, 227, 36, 325, -197, 7, 45, 77, -106, 133, 17, 246, -102, -4, 161, -92, 11, -86, 35, -72, 146, -66, 22, -49, -165, 3, -51, -153, 187, 141, -92, 253, 129, -93, -6, 122, 152, -44, -25, 278, -100, 127, 92, -26, 217, -68, -61, -153, -112, -67, -198, 2, -77, -66, 248, 451, 15, -125, 181, 207, 111, -112, 198, 187, -53, 245, -296, -38, 74, -306, 293, 69, -92, 8, 224, 302, -154, 242, -99, -214, 368, 175, -94, 68, -34, 117, 31, -57, -107, 90, -360, -84, 180, -80, 64, 60, -205, 189, -68, -430, -113, -84, -73, 46, 191, -71, -87, -162, -118, 121, -10, 28, 96, -188, -231, -6, -207, -55, -219, 155, -152, -11, 164, 131, 124, -236, -155, 322, 96, 9, -175, 101, -42, -160, -105, 87, -196, -77, -31, -88, -108, 82, 114, -300, 7, 12, -180, -120, 65, 56, 246, 58, -185, 119, -101, 99, 55, 123, -105, -20, -120, -160, 244, 31, -195, -176, -110, -151, 59, 19]
7554A9Q6j27k40P1M56l11M9K8j5j48K97l66K39N7o6N3p9P0k46R6P8N9l2J09k52
7579a15J17J7j4l5O2j86K39J78k83O1M3P9j62j49J71p4j53K44k94O3J5J52K06
7602A82J12o08N44k44L2j90K27m03L46K71n84P21l79J70o04N99l98L75N3j48O
7623H0k66J63K17k82l5m8L7J08J31p0l36M03m19K71O6R6k64L04l27K23J45q6k88
7646a77J0K2m0L68j56pJ5j73N4q7J47l02J36M16k54L42o31K61R4L5L5j4r1k6k96
7671c19K67o0m7K12m6j88K56k25J47K59j74j77J77k44J45n2Q1O8o3N9J41j63K
7694E6P6J2k02J03j77J84J06J21k65j99K39l50K99J34j79j4j18L04k10J58P5%
7716A53m9k11L16n32L87J0l52N07k62k43J02M23k31n9K11l8j08K72L2m73j65L13
$$ y = [19, 105, -22, -262, -191, 265, -46, 3, 31, 16, -132, 165, -201, 38, 95, 29, 82, 3, 73, -173, -77, 1, 60, 28, 137, -115, 2, 19, 5, -30, 32, -154, 85, 263, -20, 41, 84, 163, 1, -148, 23, -51, -204, 40, -254, -191, -176, -24, 182, 294, -314, 230, -14, 18, -172, 55, -348, -2, 269, -315, 406, 27, 197, -407, 192, -206, 169, 222, 74, 80, -186, -23, 194, -88, -123, -171, -134, -26, 105, 35, -301, 102, -317, -46, 20, 116, -148, 156, -171, 52, 197, 111, -177, -167, -145, -185, 183, 27, 20, 35, -138, -84, -171, -24, -326, -190, 226, -28, 314, -317, -56, 38, 73, 108, 94, 3, -23, -319, -52, -112, -159, 53, 7, -181, 75, -150, -3, 256, 82, -95, 82, -162, -17, -69, 12, 80, 17, 76, 217, 54, 56, 132, 144, -58, 45, -132, 52, 158, 279, 14, -185, 54, -296, 3, 137, -42, -56, -174, 130, -80, 78, 153, 153, 104, -107, 209, -323, 64, 74, -278, 229, -33, -276, -174, 249, 18, -41, 170, 132, 24, 296, 328, -145, -310, 3]
7738Cj80M0J3K90o6j25n5j83J21J94L28k16J00l59J07q8K89j7R1J01m54K54k71
7761h3J83k19M15r7m41j12K57k49L87K4l12N50m84M10o3k38j43q4M72j08j87J27
7783EJ3O1m7l2J37J31k92k91K69K35m7k75n3K19l3J12m3r1J71J53n43K06l81L81
7807c5p6k7j79j14N19j52p5n2J54J33j77M37n78L16j68J80o44M28J43J93j73k75
7829b22M35k22p9M5K53k95l8K45j34j41j66J87J86O2l36K81O8k34J22j65K98j78
7851b8K30n61N28R7j95j4O8j23k94K94Q4k24O4n1L61m93L65p1j30Q4J11l01K39
7874D0r1k0L45l77J24j14k26M00R6l29J66J87l71J28j22J08r5J49Q3r2J14o9o
7897B8j27J44l4m8P8J20j91n0M2J14Mk7J31l89K81k15J03l3M9m5q4Q2k41L52K7
$$ y = [3, -177, -137, -124, 166, 100, -25, -80, -263, -142, 52, 380, 164, 264, -95, 12, -76, 213, 196, 287, 388, -66, 188, -83, 100, -119, 296, 199, -242, -354, -97, -346, 41, 65, -247, 303, -181, 229, 166, -72, -215, -299, 173, 65, -122, 5, 18, 79, 32, 0, 137, 268, -24, -315, -46, 189, 142, -133, -186, 33, 0, 112, 69, -22, 149, 302, -241, -35, -416, -35, -111, -138, -317, -431, 88, -64, -139, -191, -37, 96, -81, 356, -222, 94, -74, 106, -538, -110, 33, 226, 53, -222, 213, -9, -88, -43, 210, -85, -123, 122, -12, -153, -319, -132, 54, 116, -220, 61, 129, -105, 17, -148, 150, -28, 202, -359, 169, 266, 71, 57, 125, 2, -292, 2, 86, -138, -74, -125, 236, -257, 108, 37, -93, -9, 102, -199, 40, -51, -71, 274, -103, 21, -93, -319, 81, 177, -152, 14, 201, -170, -42, -164, -56, -151, -2, 81, -11, 103, 34, 28, -99, 45, 11, -37, 41, 161, -30, -80, -38, 76, 80, 53, 184, -205, 76, -139, -36, -69, -20, -65, -149, -67, -308, 44, 71]
7922G1Ql76N17n36M36k47J64QQ8m00K65k3J6L5J59j39l2k45K64J57k55Q0J99j94
7946B0L39o44L25q3O9j04K4N5o8Jk34J19J32J84K13j33k68J53O9k43K57pk79K22
7970A19j48M9N2k3Q9j86kJ55J52l06J91o4r0J60p7O1j30m12M14L25j85n1M1J0
7994A44k09J07R2j87K22o0m05L58K4J5n03M84k8Ml03L09J0j84k20K20L1J24J4
8017E9q5R6k03K74j41o5j24QK12j32L38l56l01J06L36K67k92k94K99M76l94k13
8039a29J23q0n4L85j02j33k6J25k39j17L54r5K22j4l33K95K85m27j65J74j9j69
8061a39L08j49K7j34k5j93K36j88N98n5k50l68O50l08P1j12j25L88m19K37j8J06
8083A38l73L36n45M23K69m01M13l96p3J16M10k32J87k7k84K58l24K81k94K01k2
$$ y = [71, 79, -297, 220, -316, 120, -127, 37, 45, 133, -267, -2, -25, -9, 26, 185, 46, 14, -231, 33, 190, -65, 15, 214, 20, 359, -285, 40, -43, 26, -78, -54, 1, -67, -66, -300, -181, -49, 135, 348, 215, -53, 100, 169, -74, 183, 176, -103, 119, -29, 20, 72, 49, 138, -48, -50, 105, 257, -49, 142, 78, -12, 148, 71, 132, 2, -410, 4, 329, 144, 93, 134, 144, -65, 42, 134, -53, 169, 109, -296, 62, 86, 101, -402, 82, 54, 58, -245, 64, 74, -110, -330, -110, -79, 45, 59, -26, 70, -133, 141, 0, -65, -189, -181, 31, -101, 237, -119, -420, -314, 22, 289, -3, -297, 2, 478, 84, -129, -6, -86, -140, 245, 143, 10, -16, 109, -130, -247, 107, 12, 234, 220, -113, 182, 467, 40, -125, 49, 30, -139, 169, 20, 47, -87, -112, -305, -69, -257, 341, 286, 36, -332, 318, 10, 81, -31, -156, 232, -187, 50, 32, 138, -235, 101, -444, -21, 248, -153, 260, -136, -209, -93, 317, 85, 272, 245, -39, 219, -105, 176, -118, 83, 61]
8104F1J0m11J83L50l55J00K69k50J49q0J39k19K8M0j04J92l29K12j74K18k30J41
8126f0m5J19l71K98J85qm79K80M22j70l97K3K62J18k60K2J00l51K62K08j07N1
8148A02K96l79M7o3m4M4Q2k3J83k73j27J73M4j27J83l69K04P1%l37K56p5P9K3
8172c0l8j70l1L14j70M4J8j93J9K56j53J06p1J00N8k36J60K68m34
$$ y = [61, 71, -340, -157, 193, -162, -62, 207, -43, 106, 26, 165, -54, -26, 14, -90, 102, -227, -15, -189, 29, -201, -60, -105, 14, -357, -59, 126, 118, -361, -81, 341, 171, -226, -203, 59, 177, -83, -61, 39, -312, -50, 158, 51, 102, 398, 19, 66, 3, -41, 3, 85, 62, 245, -28, -155, 18, 62, -65, 118, -251, -47, 24, 24, -313, -57, -132, -53, -30, -68, -238, -269, 45, -125, -81, -63, -256, -237, 19, -134, -28, -99, 1, 59, -177, -17, 251, -183]
8191a83
$$ Imaginary data points
##PAGE= N=2
##DATA TABLE= (X++(I..I)), XYDATA
0@%%%%%%%%pJ5j6J6j8K6l2L8m6N5o6P6q9J04j21J41j63J87k13K40k72L09l48L93
32B09m41M91n48O10o80P56q40R32j028J139j263J396j548J719j908K125k373K661
50A409k999L404l901M524n337O441q038J0575j5240K6665j06616j84939J15236
63a58816J55230O0163j04322r8708J4733J17004N7408o4126j18861l4461P0144
74a04612J00914K4144n8884p2214q421M9961N8211R301l9370l5570K6950O7336
86A7746L6196l9621p7140l7541M1021O8679K2115k6746j3610L1610M0452q909
98E4252n6201l9726K2683M5433O924k7307n981L3673K7526k5866n5869j3367N6517
111B2691N9811r992o5126m0147K7328N0816j514o2039m4873L0717P6665M7304
$$ y = [0, 0, 0, 0, 0, 0, 0, 0, 0, -7, 8, -8, 8, -10, 16, -16, 22, -24, 31, -35, 41, -48, 56, -65, 76, -87, 100, -113, 127, -145, 164, -184, 209, -232, 259, -289, 321, -359, 397, -443, 489, -539, 600, -663, 733, -815, 904, -1004, 1121, -1252, 1409, -1590, 1814, -2087, 2437, -2900, 3541, -4497, 6078, -9162, 17503, -89113, -274052, -158816, -3586, 56577, -47745, -146453, -131720, -14716, 42692, -21434, -140295, -174756, -104612, -3698, 20446, -38438, -110652, -119073, -69112, -10901, -1600, -40970, -76540, -49590, 17746, 53942, 14321, -62819, -100360, -59339, 9340, 31455, 4709, -8901, 22709, 63161, 54252, -1949, -41675, -18992, 26441, 33365, 6058, 77, 33750, 61276, 35410, -20459, -33826, 22691, 82502, 72510, 7384, -32763, -5435, 45381, 43867, -18172, -63045, -32328, 44337, 91641]
123I1641k2162o4960m2646J5620M2091J1777l6622m6963J023O3529O8986m816
135G6498q2213p3387J7284R0325N8457m5420r3444k2602P4215P2014k6480r7835
147e2588n0533O5487J10646L0805p3960q2119j244O0539L3632l8731o0684m672
159f3422N8718N7879M681m2632m2048n603K6567K0914p142k3232j1000J6657K9977
172B0314O616l3148l8173J125M3172M0933l768l9325k1543J8296J8621k3332m4442
185e4654q602M6646N4475K203m5470k9183K1546L0559j4331m8962k3488L6340
197c2921N5078O953m5088l7891J2415L9191J4273k5664k9898P984L9270K2365
209B6067k0711m3935k7433J2327L9012K9008l875k2604o638K0558K5560q564m8682
$$ y = [91641, 69479, 4519, -38127, -22507, 19584, 31361, -5261, -52224, -51201, 12328, 81314, 76498, -5715, -79102, -61818, 28507, 86964, 41544, -51900, -74502, -287, 71727, 45247, -52588, -103121, -37634, 73012, 103817, 29857, -52262, -53506, 7033, 40665, 1934, -58750, -63422, -4704, 53175, 57856, 15224, -26824, -32427, -5860, 15054, 7912, -15320, -26320, -9663, 20314, 26930, -6218, -44391, -43266, -94, 40839, 37071, -2254, -23797, -5501, 13120, -10212, -54654, -63256, -16610, 37865, 40068, -5402, -34585, -13039, 17520, 3189, -45773, -69261, -32921, 22157, 29110, -15978, -53869, -41454, -2263, 12010, -13654, -43552, -35568, 3702, 26067, 5356, -38579, -66012, -53685, -14673, 14335, 10460, -12144, -18782, 1776, 27336, 18772, -29910]
222b9910l8406K2120O4486L7492k7918n6761j1519N0647M7860k0309o2439k3857
234d8514M8185O5111L433o4255n3988J7667O0539K7616l0673m0985L147M8060
246C5343L4161k2414n6152l3613J5405M0397K5364j0886k6595p392J9912K3282
258C6812m901l5352l2979R246M4777K9452j9579m5618j9124K7157L7070k832l6715
271a2586j7189K9737M0053K02m1589l5571Q630L1778R148j9995j0414K0800L0037
284C3041K154l0498k8471L510K3364P921j3045j0144J0840K0774M878k0627k4928
297b1231k611K1271K4321N817j7184k3181m468J7049J4127j1365k7979j1362K8898
310g898M6326J2227m1121m9200l164M2515L3260k1360m9946j2151M8512N2513
$$ y = [-29910, -68316, -46196, 18290, 55782, 27864, -28897, -40416, 10231, 58091, 37782, -24657, -48514, -329, 64782, 68215, 3960, -50028, -32361, 28178, 55794, 25121, -15864, -12717, 35343, 69504, 47090, -9062, -42675, -27270, 13127, 38491, 27605, 1010, -6382, 13530, 36812, 31911, -3441, -36420, -27174, 17603, 47055, 27476, -18142, -37266, -10109, 26961, 24129, -12586, -29775, -38, 40015, 40217, -1372, -36943, -28313, 3465, 12613, -7382, -17796, 3004, 33041, 35195, 4697, -23774, -20264, 3100, 11021, -2024, -12168, -1328, 19446, 24324, 3697, -21231, -23842, -2571, 21750, 27567, 10383, -12798, -17266, -217, 13910, 2545, -25434, -36796, -7898, 38428, 50655, 9534, -39666, -42830, -315, 32945, 11585, -38361, -50512, -2000, 50513]
322E0513o425n9534m5324J9010N7775K7312k9941m4018m371L4494K8330j3564
334A4257m0754k1265K2326M2465K1884j6285l5738j9640J2473K5371N744j9776
346h938k0629O690L2612K3456j5109l6333j6720J8172K7557L438k1020j3610J3763
359f671K1804l024k3922j4688J1565K1747N696j2873p213J2371J1252j2122k5353
372b1431r335J8855K7768N565j8589j5842P428J8056L043j8041k0979K47K4702
385A447K4500q37k3467k2203R24K2730J9545q883k7081j2023K2246L4170O406
398C7474l5308m1035J427M1779L3448j1703l9294j5960K8139L6963m855m3874
410a2799l0958J7291M4840K3033k0688l6358q502K2229K0762m801k1902j2464
$$ y = [50513, 44088, -15446, -60770, -41760, 16015, 43327, 13386, -30632, -35003, -509, 27821, 14257, -26497, -47762, -25436, 17029, 38913, 22628, -13110, -32750, -20277, 5094, 10838, -8938, -29567, -22877, 9735, 33191, 18082, -18251, -34971, -16799, 10758, 14196, -6824, -20434, -6671, 15133, 12109, -11813, -26501, -14936, 6811, 12507, -366, -7579, 4792, 16044, 3922, -21431, -30766, -11911, 15857, 21422, 2833, -13009, -5581, 12475, 15518, -2523, -23502, -23255, 1447, 25947, 25110, 1643, -20560, -19636, 3094, 22639, 13756, -13325, -25348, -3102, 31068, 37474, 2166, -38869, -37442, 4337, 37785, 26082, -13212, -29172, -1033, 35930, 31075, -12799, -43757, -26466, 18374, 41407, 20719, -15639, -24141, -1912, 18850, 14049, -7853, -20317]
422b0317J2481K4495R364j4070k2530j0406J0031J8006O885j0757j0985L985J4783
435A0965O064j3092j9956m646J7277J6953j652j2168n067Q649P167r364j8293
448a7163k097J9545J8338l872j8179r312J0322J2918n487j9759p595J7535K3247
461A8441M068j9375k0815Q66J7856J1162q067j4970l651J4066J8062J018j9482
474h21k0294J77J9832J9514j094j9161j2665J0483K1094K949k2222k3901L763
487b2346L1039K3948j0379k9128j2066J6565K2242j428k3456j5348J4352K6335
499B0330P683j8876k2061k007J7910J4966n087j4239m328J0150J1750o69j4293
512A229j3808M17J3025J1425p3q980o478N664R051k274j3610j0766M651J6694
$$ y = [-20317, -7836, 16659, 26023, 11953, -10577, -20983, -10952, 7054, 13939, 3182, -7803, -3818, 10965, 17029, 3937, -16019, -20665, -3388, 13565, 11913, -255, -5322, 3327, 10494, 1130, -17163, -19260, 285, 18623, 14751, -3428, -12740, -2418, 10500, 5013, -14746, -22341, -4806, 18441, 22509, 3134, -17681, -16815, 1041, 12203, 4136, -10834, -14485, -419, 17643, 18661, -821, -21115, -20938, -1106, 18408, 17314, -1847, -14512, -4029, 17065, 20014, -2208, -26109, -22346, 8693, 32641, 22262, -6866, -18932, -2367, 19875, 18447, -5009, -20357, -6005, 20330, 28013, 9137, -12924, -14931, 2979, 17945, 12858, -1381, -5709, 4441, 16191, 15522, 1229, -12579, -12162, 863, 12288, 12215, 3235, -3243, 2421, 11472, 9198, -4412, -15178, -10527, 6167]
526F167J0024p886j5441l546J1160R029n964j2860k319J4266J3583n306j8800
539g893j0263Q621J3519K688j0344o622Q730J4206J424j3852j4714r52J1185R480
553E213k745r045j506Q360Q551j627j1894j0817L054J3895J0015n161j4041p991
567a5739O438J3060P18j3011r449R140J9420Q356j4758k3073n469J5869J5647
580G149l920j6660o696J3609J9911J473j8924j6859K800J6508J0817o338j4942
593a2072m490J0509J1428n16j1328r052M412J5371J0121n460j3876q092L645J0108
607G08L184o490o400N882J3438P380o573j2678m831P765Q794j294p374j930P565
622G146Q206l04q509l889P229Q554J93o719l647L516O172j688r771n278O355J2193
$$ y = [6167, 16191, 8305, -7136, -10682, 478, 9507, 3543, -9317, -11636, 2630, 16213, 10907, -7893, -18156, -9535, 3984, 6672, -3672, -10294, -1564, 12642, 14066, 214, -14500, -15452, -4267, 5213, 2468, -6577, -8083, 277, 8828, 7201, -4693, -15510, -12456, 1439, 11454, 6293, -7748, -15739, -9301, 3759, 4477, -8534, -17983, -8843, 10577, 18933, 4175, -18898, -24367, -8498, 7149, 3229, -13431, -20127, -6518, 13393, 14866, -4058, -20917, -18117, -1609, 9208, 2870, -12072, -16562, -6053, 5375, 4859, -6469, -15521, -11109, 4262, 14383, 8923, -4953, -13045, -9400, 708, 3892, -2598, -8998, -3116, 10322, 17702, 11129, -1549, -6380, 1385, 10179, 8885, 1511, -419, 7146, 15352, 15048, 6539, 2650, 9879, 18433, 18626, 11907, 8260, 11776, 17948, 16260, 6489, 1211, 7566, 19759]
638A9759N700m718q436k536O221L674n980j1309m892P537J2653M771q197j2927
652A320k693J0232R702l273j4131r793O518J4462L251j3717j5483l49J6343J5409
666A7798l240j6036q230P625J2416j66j3899j3729K748J6378J2116k212j0733
679H36o271N285R442J278q593p853Q73Q571P033k406q589m793M932Q402M394l137
695I404n304j688L226Q84n316o043n06M715N364Q73k531J03L292m68o227o319
711f541j067M831L956l042o375l40O695N425k358q184l652N399R227L59r617j0142
727a5426j424P693Q769n78p573k963P120R633K040r681j2285k627R060R727j222
742B63q501o032N766J2638M847q674j1222j281R747Q772k099j1348p669M830J0425
$$ y = [19759, 25459, 20741, 12305, 9769, 15990, 19664, 13684, 2375, -2517, 5020, 17673, 22444, 14247, 1320, -1373, 8859, 18561, 15288, 1157, -8636, -2118, 12344, 15595, 1878, -13605, -13954, 2389, 17798, 14558, -1478, -9708, -2083, 10333, 10167, -3732, -17461, -14713, 1665, 13781, 11569, 836, -5435, -150, 9292, 10570, 1977, -5876, -5003, 3568, 10601, 8195, -394, -5187, -255, 8147, 12541, 9404, 4100, 2412, 5638, 6522, 1206, -4837, -5343, -628, 4736, 5609, 3078, 3181, 6473, 6005, -222, -6541, -7608, -2777, 1179, -1863, -8238, -8578, -1883, 3542, 1184, -7000, -10652, -5253, 3974, 4333, -5284, -15426, -16850, -9157, -388, -966, -8539, -11502, -4382, 5251, 7291, -2390, -14675, -17302, -8242, 1485, 263, -8238, -14270, -8504, 4134, 8981, 307, -10915, -12196, -2449, 6323, 4224, -7124, -14793, -9963, 462]
757D62L838m851n663J160R047N851l616r727n595J664N577L519j992k544J936
772i34N449K930j462l994l062Q96L114l56k651j571J499K111R21j159n86K477
788C622L206J48l730l393l07J259m98l974k690L689P280L709k567n559k627L183
804G51L861l113o591k845L794O993K715m260o001P95P676N145j785o775m643K568
820a715N766J254n586n313K157Q089P966%p158m183K687M365M39n476o855O31
836b932Q406N894j312n809l259L519N971L18n536n994J91L912J824k563n107j088
852c565M856M903N84k828l841o48J648l34l641l384p0K890L335J474j514r43J055
869b3J268r42k123j785K0J434M08j174l64J922K788J006k02q51J025K213j144
$$ y = [462, 4300, -551, -6214, -5054, 3993, 9844, 6228, -3499, -9094, -7430, -1853, 1666, -326, -2870, -934, 4515, 7445, 5983, 1989, -1073, -177, 2937, 2581, -70, -1641, -142, 1969, 2890, 1731, 1145, 3622, 6828, 6976, 3246, -147, -454, 805, 307, -3667, -6357, -2668, 4612, 8321, 5754, 195, -2432, 751, 4612, 1499, -5092, -7937, -4143, 2850, 5565, 1305, -4696, -3901, 3775, 8920, 7135, 360, -4283, -1715, 4051, 5305, -281, -5594, -3437, 4652, 12618, 12618, 5460, 1277, 3964, 8329, 8768, 3292, -3563, -2932, 5474, 11368, 10056, 4247, 988, 4507, 10478, 10796, 5260, -734, -543, 3369, 5193, 2630, -2477, -3565, 1291, 6194, 6778, 3950, 109, -539, 1109, 775, -2866, -6250, -6320, -3430, -95, 1379, -135, -1078, -23, 1245, 303, -1820, -3605, -3585, -2151, -1743, -2917, -3281, -1359, 1429, 2435, 2233, 1382, 2407, 4620, 3476]
886C476l940l142M11L082K816m88k128L77M009L188q11n081m183J9M048J895l254
903B94l838l09M666M526m2m571l405J730N101Q99m366o142k139M343N171K68l409
920a223k663K909N376K430m101o488k389L536L657M00l494k580K337N570K274
935E551k135l537j406K019K268o64l535k203N81K506J883k0j107L12J230J200
951B943j148j588j475j856L8N04J25J768J142K82o84J97L87Q54n22k448k284L54
969c411K488J487j296k041j67L357M268q0l687l343J98L186J766k046n007r85
985e313M040N261J730l459m245K61M450K405k490n340l190L140M955J731l712
1000B24l797O73M906L254j211n283l162J601L469O18k585k917K4L726L619o2k678
$$ y = [3476, -464, -3606, -3195, -113, 2703, 2215, 87, 464, 4473, 7661, 6850, 1769, -2414, -2395, 1653, 3548, 294, -3544, -3853, 813, 5339, 5297, 726, -2679, -949, 4152, 5051, 685, -5457, -7596, -3253, 1918, 2186, -1223, -3886, -977, 4399, 6829, 2728, -3760, -6149, -2613, 1044, 1444, -2050, -4630, -2293, 3277, 5551, 3416, -121, -1527, 492, 2760, 2096, -1439, -3642, -3061, -555, 1328, 1308, 201, 513, 1743, 2943, 1795, 207, -1268, -3124, -3086, -2582, -2457, -689, 453, 735, 51, 248, 635, 1489, 967, -1481, -3765, -3411, -923, 564, -732, -2773, -2940, 417, 4685, 4605, 918, -2425, -2227, 959, 2725, 679, -4328, -5313, -1273, 3988, 5718, 2259, -1986, -1725, 2725, 5130, 2640, -2700, -5890, -2750, 2205, 3936, 224, -3573, -2900, 2006, 5260, 4049, -1234, -4396, -2795, 674, 1292, -1293, -4210, -4186, -460, 3159, 3097, 419]
1017D19j627J22J775R53j873k585n4J312J997Q51n6q80Q32Q35j62n7p10o29q85
1036d22l58K69J395J254l14p68j9Q09J385M23k057k972q15K255J870l29k752j116
1054b262J954L975J381k916l182j077K695K608j026l926k632K320M246K161k046
1069B273l810q50L330L326q59m612k968J401M023K205k363l524m54L507L373k99
1085C699l405l135R52K934J089k127k919n28K647L204n8k333j871P48J746L15
1101I58j873j792m40J771J186N3r86o51O06J336l36q97l58M04J01p18q46k87J134
1120a635J465m97j460O01R73J120k91j901k087Q33K138J020j584j461k88K622
1136d32K119n61l232j565J777K628Q00k414k793l17L397K622j457l009j559K324
$$ y = [419, -1208, -1086, 689, 1642, -231, -2816, -2870, -1558, 439, 1290, 1234, 354, 1186, 2021, 1859, 1802, 1092, 463, -422, -780, -511, 884, 2138, 1824, 1056, 1037, 1846, 3231, 3654, 1597, -1375, -2190, 65, 1935, 1606, -1146, -2262, -308, 3667, 5048, 2132, -1050, -2127, 568, 3176, 2150, -1776, -4408, -2088, 2158, 4319, 2273, -1537, -2387, 943, 4269, 3410, -1202, -4170, -2769, 1254, 3459, 1096, -2428, -2882, 625, 3998, 3699, 294, -2841, -1889, 1045, 2134, 7, -2912, -3440, -793, 2411, 2353, 20, -1851, -1103, 643, 958, -915, -2707, -3147, -1376, -190, -137, -1123, -1774, -1168, 168, -168, -1065, -1423, -1019, -918, -1636, -2482, -2769, -1635, -170, -667, -2127, -1526, -553, 567, 276, -1625, -3712, -2879, -741, 279, -1305, -2766, -3054, -432, 1687, 1126, -2106, -3671, -1894, 734, 1534, -880, -3673, -3990, -593, 2029, 572, -2437, -3996, -1672]
1152a672L748P12l641l544M97L002L045j248l825p15K467L187K87l274k675K52
1168c397L633J896j503l062j037K277K074M00k199k488R76L138J206j474k751
1183b311j082K091K107n46k100p34J139K205P36k086j824M86J622J238p22j473
1199a254j87J748R87j350j481r0J511J174p1j294n68J111J339l44j812j070Q58
1216g93K366J109j840k029N59J712J383j220k302j165K800K899p05k250l031N88
1232a919L482J830j702l398o5K754K862n00m094k930J628M032J463k150l766p55
1248c228L287L312j059l862k355J994L351J555k666l548n24K793K525p46k766
1263a937j608J590L397Q98k999k768k74K234K209o11k372k59J492K057j30j870
$$ y = [-1672, 2076, 2788, -853, -4397, -3900, -898, 2147, 899, -2926, -3641, -1174, 2013, 2300, -974, -3649, -3397, 236, 2132, 629, -2433, -3470, -1193, 881, 1281, -918, -3406, -2430, 708, 1914, 440, -2311, -3393, -1302, 805, 259, -1841, -2575, -1436, 769, 1505, -581, -2405, -1919, -297, 941, 219, -1254, -1441, 307, 1294, -56, -1537, -1627, -116, 1058, 987, -307, -875, 236, 1575, 1231, -581, -1651, -793, 1573, 2682, 842, -1187, -628, 1084, 2467, 1247, -1055, -2220, 580, 3479, 2774, 524, -2507, -1919, 1563, 3393, 1691, -1707, -1772, 982, 3844, 3344, -750, -3680, -2052, 1980, 3443, 1293, -2473, -3228, 59, 3371, 2312, -1550, -3905, -1911, 1440, 2995, 329, -3219, -3743, -950, 1575, 829, -1937, -3545, -1955, 1442, 2340, -659, -3427, -3701, -1467, 742, 131, -2241, -2500, -1008, 1049, 919, -951]
1279i51j348N62K202O07j454j544N17J268O30n97j463O71K222J022j107j657q06
1296a226R20J212q12k092l44K129K812p1k104k783N09K501J275j608k758p68K603
1313f05L056m59l297k546J539L810J808k045l754j181K924K647o49l727k173J793
1329b859M743K150k428m350l58K719K685j024l785j890K276L967R63k420k742
1344b353O4K867K358q24k957j288J484K128M3k236k063J104L177J853j176j990
1360A91q90J515J219j155k384n92J715K240O63k127r19J036K010m3k396j287P69
1377d35J882Q93k153k228j46K851J835k01k298r43J467K334p60k946l068L81L480
1394e5K413j117k785o16K318K532l94l412l073J233L015J684j955k974q14L232
$$ y = [-951, -2299, -1737, 465, 1072, -382, -1926, -1409, -141, 489, -108, -1571, -900, 1322, 2344, 1237, -420, -1226, -306, 906, 94, -1998, -2342, -213, 2599, 2528, 424, -2359, -1850, 651, 1926, 318, -2440, -3208, -605, 2451, 1992, -1305, -3851, -2312, 1498, 3306, 1261, -2493, -3674, -750, 1897, 1248, -2479, -4652, -2859, 1884, 4034, 1606, -2744, -3102, -383, 2302, 1278, -2507, -4397, -2121, 1846, 2809, 389, -2353, -2289, 578, 2936, 2112, -845, -2133, -649, 1479, 1522, -714, -2777, -1673, 1504, 3357, 2181, 191, -699, 816, 2035, 880, -1504, -2096, -381, 1859, 2522, 395, -524, 512, 2522, 2479, 83, -1204, -435, 1447, 2340, 187, -2041, -2187, 664, 2499, 2298, 0, -943, 524, 2858, 2098, -848, -3916, -3535, -55, 2358, 1241, -1544, -2160, 158, 2690, 2296, -1116, -4189, -2956, 59, 1743, -212, -3186, -4000, -768]
1410g68K845O4l630j650J704K950J005l384l600K47K883K691m26k401j011K160
1426c21L241l54l503k672O70K598J596j053k312m49K264K334n75k263j087O71
1442a215K458N2k158k346M97J488J744j062j934J22K557K206r93l223j802M67
1458c142K036N12j728j363J209K855J204j601k498j055K817K236q25k724j737
1473c804J378K539J361j998k084J410K912K021j046l254j592J307K363l23j988
1488g98j414J536L555J717j925k911p48K118J425l31l378j144J927K126J016l000
1504b29j873P41L608J740j397l909o71J678J806n68k868j263K045L646J051j854
1520A683k589m37K190J631j750l031m81K203K690Q00k085k214M71K801J249p36
$$ y = [-768, 2077, 2141, -1489, -3139, -1435, 1515, 2520, -864, -4464, -4217, -1334, 1357, 931, -1470, -2481, -321, 2920, 2566, -937, -3609, -2939, -341, 1255, 202, -2110, -2559, -295, 2039, 1464, -799, -1886, -1215, 1243, 1295, -863, -3209, -2712, -1224, 520, -542, -2476, -2354, 203, 2409, 1416, -1807, -3609, -3142, -1106, -594, -2322, -3685, -2476, 379, 1583, -18, -2516, -3571, -754, 1482, 657, -2067, -3804, -2426, 113, 1474, -524, -2608, -1198, 1714, 3735, 2689, -565, -2157, -850, 1513, 1190, -798, -2212, -676, 2879, 4596, 2671, -240, -988, 1130, 2555, 2224, -1154, -2298, -371, 1755, 2771, -229, -2102, -1361, 2247, 3987, 2590, -1319, -1990, -312, 1494, 926, -1942, -3205, -1160, 2486, 3537, 1683, -906, -1343, 847, 2478, 728, -2303, -2784, -581, 2109, 2909, 824, -1390, -919, 1882, 3131, 2395]
1536B395k765j222J598J892l82l071j263K127K613J451j609k202O3J646M28j966
1552b67k019j112K413K388p6j960j038J337J705M24k135k145L09K598O98j568
1568d48k155m04K443K188Q1j876r63J234K139o5k820k929K76L078K724j006k280
1585g83q17K419K400l12l400k628R46L208J220j883k962n27K702K508Q3k560k014
1602b400J352K809O83l160k768n35K548K405lk094p07J907K082k47k287k470J94
1619b691K314J628r95j424m29J986J378p4k028q38J640J549qk372j690P83J975
1636G04P19p88j564P16K017J454j391k512j470J623J540k12k078j004J680K430
1652A864Q59j684k730q9J755K561j198k391j811J568K465M34k213k045J160K914
$$ y = [2395, -370, -1592, 6, 1898, 1516, -1555, -2818, -691, 1922, 3373, 1764, -438, -375, 1271, 1699, -267, -2286, -3398, -985, 1403, 1327, -633, -1671, -334, 1371, 1795, -340, -2485, -2176, 422, 1120, -448, -2603, -3007, -564, 1624, 1705, -171, -1134, 100, 2239, 2174, -646, -3575, -3299, -221, 2503, 1497, -783, -1600, 819, 3219, 2907, -493, -3121, -2175, 1033, 2253, 370, -2592, -3119, -417, 2091, 2174, -386, -2400, -1048, 1761, 2444, -716, -3484, -4019, -1471, 934, 931, -1163, -1870, 37, 2119, 1872, -415, -2885, -2691, -377, 1251, 256, -1168, -1597, 389, 1767, 1693, -335, -1173, 467, 2016, 2008, -364, -2054, -1271, 704, 1423, 635, -929, -213, 1804, 3258, 1867, -645, -2115, -492, 1048, 836, -1242, -2246, -566, 1864, 2723, 1039, -1691, -1780, -25, 2536, 1338, -1053, -2864, -1296, 1169, 1603, -610, -2655, -1495, 1419]
1668A419J973j143l783r65J312K558J92k451j788J061L908J500j626k955r00J425
1684b63K292k97k057j730J047K497P73j645j728k50K275J608n65k495r68Q49J282
1701F25m82j445j163J756K108R38j573j445m71J661P20j606j443m15K024J958
1717A747l87k182o71J301J944K24j762j882O86K162P59j731k371k56K231K351
1733B163Q18k555j577P62J966O21k129k542R3K513K337m48j931j910R89K410R85
1750B565k011k860O11K113J334j063j985j213J801J958J57j448j210O09J560R83
1766A901j862k534J18J889J982k05r54j428J134J540J10k018j433P55J891N39
1782A425q85j893j13J855R65l4j770o64J203J923l3k476j443N40J509J390j111
$$ y = [1419, 3392, 2249, -1534, -2499, -1187, 1371, 1563, -888, -2676, -1615, 2293, 3793, 2167, -788, -1688, -263, 2029, 1732, -325, -2055, -1008, 1489, 2262, 617, -1111, -1361, 914, 2522, 1957, -538, -1506, -657, 625, 143, -1302, -2465, -709, 1399, 2337, 764, -681, -1152, 509, 1229, -377, -1820, -2235, -211, 1747, 1360, -822, -1493, -192, 1752, 1976, 214, -1668, -982, 1180, 1939, 208, -2163, -2419, -188, 2163, 2981, 426, -1151, -389, 1577, 2198, 69, -2473, -2380, 133, 2470, 2022, 91, -1819, -830, 1580, 2565, 554, -2306, -1695, 418, 1752, 689, -1296, -2509, -708, 1250, 1407, -41, -1251, -642, 918, 1901, 39, -2495, -2377, -488, 1494, 1289, 335, -1093, 41, 1581, 1691, -327, -1760, -1005, 886, 1425, 540, -1353, -1466, 389, 1354, 1320, -450, -1114, 89, 2012, 1979, -497, -1940, -1400, 109, 1499, 388]
1799C88j378k9J780J130o98j833j688R43K058O39j340j617J17K355Q22r60j753
1816a064q04J542K014J9j779k003M68J800J240j086j382K60J808J111p83j865
1832e04j343Q20J719L62j129q62K78J775P90j349j860l77J374J912j74j644j240
1849a452J306J015J49j568j294M16K263J280q61k672l85J459J239n0j734r17J148
1866f58K350N79j534k062k96K023J006m83j695r22J315J824o6j750j502P50J667
1883E46J504n36j974q02J073R73j74j193q76N47K163M36q98j760M0R61R62m30
1901E62j311m38J430J170m64j160j015P51J180Q14j445j267M34J528M69j036j326
1918a124m71J139J838N10j945p52N55J535R8j478j410n6K173J411o78k015p84
$$ y = [388, -990, -1019, 761, 1891, 1193, -640, -2328, -1385, 673, 1312, -28, -1645, -1528, 827, 1649, 689, -1064, -1868, -326, 1688, 1707, -72, -2075, -1607, 193, 1433, 347, -1035, -775, 1033, 2144, 1361, -504, -1847, -1027, 692, 1054, -75, -937, -659, 1116, 1906, 557, -1303, -1680, -306, 1606, 1432, -212, -1452, -146, 869, 1018, -550, -1844, -1428, 835, 2115, 1254, -1418, -1803, -344, 895, 845, -889, -1806, -658, 1692, 2271, 737, -1325, -1621, 402, 1408, 925, -770, -1692, -377, 1447, 1381, -369, -1871, -1121, 546, 2050, 1514, -460, -1262, -189, 784, 610, -583, -1459, -912, 1251, 1687, 789, -971, -931, 30, 992, 562, -749, -1187, 243, 1413, 949, -211, -1226, -475, 705, 1519, 74, -1193, -759, 769, 1238, 202, -1124, -1595, -456, 1382, 1892, -53, -805, -250, 1285, 1383, -95, -1505, -1561, 612, 2023, 1345, -670, -1454]
1935a454Q99J951r3j348j684J065J416J346j042k117p75J446J683o7j216j341
1951a331P26J410J067j308j656m21J326J614j18j180j186L16J537P1j085q43k5
1968a086J376J117m66j269o75N23R32j57q45m55R95R22R5j252q53J92J270O82
1986A046q60r50l3J334O24m66j661p17R35J705M61j142j152j66J630O17j078j354
2004a227l64J530J621O5j972j125M84J696P17r30j871J67J302J473n60j669q84
2021a547P19J631O22j099j059q3J232J155j202j337m36J087J448M40j480o30N24
2038a5N17O10p71j278J24J101O63k03r42n46O42R84o8p15q00P73O74K94j096j120
2058a172J16J416O19n39n05m59O57J278o32j478o57N46J296L49l77j085j78J195
$$ y = [-1454, -555, 1396, 1303, -45, -1729, -664, 752, 2098, 1056, -1061, -1836, -390, 1293, 1226, 10, -1331, -605, 805, 1872, 564, -1092, -1513, -187, 1427, 1309, 129, -1057, -741, 796, 867, -218, -1061, -1086, 290, 1407, 941, -328, -1003, -480, 452, 295, -550, -1005, -10, 912, 1007, -245, -1098, -906, 364, 1046, 186, -764, -797, 537, 1161, 695, -966, -1683, -748, 957, 1418, 276, -876, -1042, 588, 1205, 127, -1227, -1591, -61, 1560, 1625, -347, -1472, -988, 708, 1425, 495, -1376, -1209, 93, 1566, 1006, -663, -1547, -828, 803, 1425, 326, -733, -816, 416, 1571, 369, -968, -1404, -317, 1131, 1571, 91, -539, -15, 502, 1112, 341, -937, -813, 288, 951, 748, -194, -740, -98, 886, 818, 103, -697, 76, 750, 1044, -52, -1172, -1056, 360, 979, 440, -65, -524, 133, 1411, 779, -699, -1356, -810, 486, 835, 458, -627, -805, 390]
2076C90J035o72j451n85Q61J712k75q00j431l5J657O85m48j549J77P29Q80K42
2094A122j475r65J51J337O81q44o85k23J206P32m20j368n27Q91R62J78q84r46
2112a077N65J067K3n00p93Q0J051R82r32q43q72Q10P81L20r76m0r1J305P66j277
2132C49p62n70P93J124p21m69o38L30J443K65j004q87Q4R76Q36n05j359l50L91
2151f74J230K10j376o46P34J212Q13r65j040k91M45R51o84n92l37O39J007J61
2169G97n51r44K34R45k2K36j167j01O44N47j30j012j41P66P34P4o66p57J45O28
2189B59N61o27j137LR15J222r2j211p92P62Q80j2r00q63J11J316M47k19j049n87
2209a013R29Q26N35j089q57M2R09J69k77j283jP60J187J78o81p83K86Q96Pn10
$$ y = [390, 1425, 753, -698, -1283, -422, 1290, 1015, 215, -1216, -1251, 406, 1091, 643, -906, -729, 0, 880, 1122, -353, -1318, -1167, 170, 851, 7, -678, -901, 305, 1037, 617, -751, -1278, -387, 575, 753, -131, -1077, -512, 555, 578, 78, -715, -635, 416, 1398, 466, -377, -1249, -439, 342, 662, -314, -354, -445, 860, 1626, 349, -413, -983, -190, 934, 213, -256, -894, -564, 879, 1144, 140, -747, -663, 313, 1149, 644, -715, -1065, -674, 556, 766, -610, -1256, -522, 690, 1503, 538, -502, -793, -348, 603, -81, -673, -1010, -371, 636, 797, 246, -698, -464, 481, 459, 695, -472, -573, 71, 618, 488, -524, -665, 101, 835, 909, 243, -514, -369, 259, 820, 193, -944, -941, -26, 1196, 1104, -107, -899, -137, 743, 731, -169, -1032, -921, 395, 842, 623, -426, -1013, -84, 742, 1277, 188, -669, -627, 282, 451, 174, -1109, -1110, -350, 837, 1015, 334, -449, -163, 733, 740, 230]
2229B30q26p1M71P88o2p79m65N47P58L9l95m25N9O93K93j401l19K81M13Q05l06
2250C28q05J87K27M55j59r06j34J96O42M74n29o97O14L82O18n61p90p8K28O44
2270C36J60p00m97K58M47R28m43p48j1O33R50m15j131r57O54R81L74n22n82r5
2290c80J067M81n87p37q05O25O20j07l80n92J83Q26J80k68l52m18M66P99j98n43
2310a20p53N8M98J88O2m95N8R71L86m31p10n76N96M79m1q10R9N82O27J41p85n21
2332d97M56Q38n1m42p63m22R77L65l87m34n6M43M91K5l13n68l69K96N74k77l53
2353d67k29M58J017k28o05j94j4K11M32j44o84l89O54K51O3k99k22J80J047J77
2373A015o42o95J61O82j13k71q41O23L5N29L15n06j81q5K51j41q3n76lK89L95
$$ y = [230, -596, -667, -196, 592, 530, -249, -714, -167, 591, 630, 235, -190, -131, 562, 855, -546, -865, -584, -171, 634, 328, -477, -290, -63, 392, 233, -673, -807, -611, 31, 505, -24, -721, -107, 275, 893, 332, -458, -536, -308, 336, 496, -204, -701, -443, 4, 932, 489, -259, -270, 363, 1313, 898, -233, -1190, -536, 445, 819, 297, -285, -380, 687, 1168, 581, -156, -961, -336, 284, 177, -203, -795, -612, 214, 394, 126, -226, -644, -178, 621, 423, -120, -873, -815, -317, -129, -67, -562, -504, 467, 853, 422, -288, -864, -268, 211, 170, -640, -541, 41, 668, 809, 24, -497, -41, 797, 746, 304, -459, -881, 96, 461, 74, -360, -416, 27, 518, 543, 230, -338, -707, -411, 163, -114, -467, -696, -238, 779, 551, -54, -248, -262, -51, 381, 237, -447, -836, -182, 69, 132, -167, -389, -209, 838, 1015, 373, -322, -161, 521, 408, 137, -704, -81, -46, 483, 798, 292, 111, 26, 277, 136, 53, -523, -526, -237, 158]
2394A58k62j46j71o6Q22J11m90l50k49O27J97q70l90K99N84N81K37p42m00O05
2414H5L15N7o95p27M79P52K68m58l13l20R30L08l5k64q43M47N69j92k75l65j60
2435d37L22L71O55o62l47J95J42J23l58p79qQ47o4k2j23K6L44L97l96n69R8J03
2457a42N21L0p43k45J65O59K21n74O5N9K14L88m78m72j43J55K80K07l69J12K80
2478A90K7K71l30M3n01r7P01Ok79o34n0P50K76j99l25j29M30K79Po85m84K82Q03
2501C52k6n11j4j70P05K76m52o89K72K03n0J79j80J66j66J60Q6J73m39M08j80
2522A03J60o5p4k09K42J17l48J38J70j43M25L32k89n23J5K1L12j46p67r6Q09L72
2544E56j53l78k46K14K85J17l57k76p7K25L34lm02j61N02K07K69o38m40K79J64
$$ y = [158, -104, -250, -421, -487, 335, 446, -44, -394, -643, -16, 181, -689, -1079, -780, -196, 385, 622, -120, -520, 85, 400, 457, -238, -965, -486, 266, 534, 76, -237, -557, 373, 681, 646, 382, -461, -14, 555, 363, 88, -277, -437, -115, 256, 911, 249, -98, 97, 239, 362, 4, -775, -783, 64, 0, -22, -145, -119, 225, 622, 226, -343, -245, -142, 379, 409, -334, -579, -414, 245, 466, -108, -43, 16, 230, 618, 140, -332, -475, -320, -40, 167, -202, -90, 190, 217, 488, 158, 201, -300, -397, 304, 310, 31, -603, -653, 97, 373, 174, -151, -280, 150, 429, 436, -249, -733, -451, 352, 326, -185, -199, -369, 336, 612, 160, -529, -257, -54, -104, 75, -105, 61, -105, 55, 141, 314, -125, 283, 103, 263, 198, 124, -85, 157, 274, -74, 64, 234, 91, 516, 848, 559, 36, 51, 72, 384, 238, -529, -625, 184, 556, 403, 25, -221, -7, 278, 395, 38, -238, -315, -90, 244, 241, -161, -322, 180, 387, 656, 18, -422, -143, 21]
2565B1J94j58m43P2j5N65K57j35m59q9L93P5k29l81l48M70L01J45l89k71L28L34
2587B38J99k16k10j39J55k8j04l04O2O29p6k47r9k19P84j89m51Q0j59J82J14K77
2609B79j34k65M76l70K68q6l94n2J67K03J92m07k05j02O85K92k07j76m36J5P76
2630E19l10j41k17O7m5M87l15m37K54n1O77l52l19j22M03R6J08n16K3m3L56k53
2652a31j14L32m0rm2L68j37m81M94k94P62n47k26J88o4K18m09J18p0L16K76l35
2674A73m87J7J92Q04n63m43L74Q6K01k68N7j03m5K07k3j59K10l23K03r7K25n08
2696b70L1M25j80J35J18p1j83j55J66K70k61k22k7N56k37n0j19o8M43j99R8k12
2718a2j16M4J54J35j36k62M23Q5k02l07J57J29J28K0L3k34oK4M6j64j67m6N05
$$ y = [21, 215, 57, -386, -314, -329, 236, 493, 358, -101, -190, 203, 278, 49, -332, -680, -210, 91, 236, -153, -424, -96, 238, 437, 221, 11, -128, 27, -1, -105, -409, -347, 282, 206, -41, -140, -359, 425, 236, -215, -135, -294, -112, 2, 279, 145, -120, 356, -14, 254, 168, -226, -278, -111, 92, 284, -123, -328, -430, 255, 547, 340, 164, -272, -257, 519, 209, 68, -149, -82, -127, 360, 45, -392, -138, -189, 488, 136, -183, -305, 98, 194, 302, -214, -191, -234, 122, -131, -245, 87, 47, 38, -4, 364, 227, -254, 240, -54, 708, 161, -65, 123, 59, 277, -132, -14, -84, 232, 508, 173, -314, -297, -105, 699, 136, -307, 67, 153, 354, 86, 143, 40, -5, 202, 179, 20, 230, -93, 110, 13, 238, -270, -239, 186, 6, 141, 259, 188, 5, -150, 16, 286, 25, -197, -224, 332, 95, 45, -74, -142, 301, 102, 200, -12, -128, -84, 70, 205, 69, -193, 230, 315, 113, -194, -37, 92, 220, 240, 273, 39, 33, 57, 103, -61, -228, -274, 231]
2741B31k89K67j70J10j74K07K01l36j93r6R0J34J30k85j39L5J39L72j08o62L40
2762a96K39L3J39k67M3L63J33k93l42L14k72JK12l33K51j10J91m1n3l2j39Q3o1
2785a37o9K11K6j48j84R7K98l08j7K11M20o8n8n13Q1O8j82M44o87K89J07M69m46
2808i6j34p9K09L16k7k49j52J20r0j08P7L51n12N77N2l9j73oM0p6k17K08Kl7n4
2833i7J74jj07J72k17m8L51k3m65j59L43K16l12J80o5J91J09k74l23j08O99k46
2855a0k00K20l1j91J70k43K41J51L0j66J40p7m6J06Q0j76L33l55k9K11j42L02
2877C18k56oJ00k38p5M04n07K84l4J21J46k93o0m8N4J05K75o38J92J22J68j37
2899ck20J79j5J35j93J54%j60Q7Om9J9j33Q1L0p0n0J95j01K42l95L23O1j8K0m18
$$ y = [231, -58, 209, 39, 149, -25, 182, 383, 47, -146, -242, -152, -18, 112, -173, -312, -277, -138, 234, 126, -536, -196, 43, 76, 215, -52, -9, 354, 487, 194, -148, 166, -106, -105, 107, -226, 25, -85, 106, 65, 12, -20, -159, -76, -137, -206, 5, 31, -117, -301, -204, 94, -214, -231, -20, 400, 332, 274, -239, -158, -90, -272, 172, -515, -226, -119, 350, -96, -230, -309, -100, 216, 189, -60, -212, -92, -182, -290, -213, 138, -374, 203, 255, 216, 43, 37, 77, 1, -216, -8, -6, -43, -97, 77, 76, -31, 141, -76, -124, 227, 204, -261, -420, -77, 139, -173, 7, -58, 133, 242, -32, -355, -463, 236, -10, -210, 10, -21, -212, -42, -285, -44, 107, 137, -29, 111, 34, -12, 94, 174, -2, 331, -24, -53, 158, 16, 318, 62, 56, 156, -82, -157, 247, -260, 24, -10, 111, 257, -36, -96, -144, -90, 15, 290, -348, -156, -34, 134, -3, -223, -44, -59, 76, -117, 37, 37, -123, -36, -30, -79, -60, -193, -112, -82, -152, -202, -7, -108, 134, -261, 62, 123, 105, 125, -293]
2925b93L65mO3J01k21J41k94K00K14l8k67n3J46j47K77k0K64k67k2k08M69k74
2947A32n48K71J11M69k27n09K72L37kL5k40j9l6l4j96m0K21P0K0%O3l3kL8k6L8
2973A65K92m39M1qJ07m41M83k24lJ62R3m11J20r4Jj89N8O9J23j24L71j79J06o8
2997A1k31M89l61K07m13%Q9n2K5L69q9J55Q5j16k32J49r6j00M32m69Q4q1K24L3
3021A12K13j52Q5j10m62L47K7k05r5K31K42l80o7L05n6M0J44j59K59n15Q8J64
3043E6q5j36l7K93p1J82j72L0K05k41j39K92l03Pl9L31j83j64K45r5J10K36m64
3066a42K10j01J93l80J96j02J14j35K14r8k4J2K62j11k84K88q5J59k50k2J08j54
3088a32L72k55m4K24k83K54n4o5p8m5j52m6J77J45j05K09l10J91J31J46k29k04
$$ y = [-293, 72, 68, 131, 232, 11, 152, -142, 58, 272, 234, -33, -86, 60, -87, 190, 170, 434, 167, 145, -63, 406, 132, -416, -145, -34, 435, 208, -301, -29, 308, 306, 341, 101, 82, 46, 12, -184, -224, -3, 67, 87, 87, 150, 117, 115, 153, 127, 165, 457, 18, 59, 51, 158, -283, 200, -24, -27, 135, 228, -183, -63, -157, -156, -345, -287, -218, -95, -219, 152, -27, 79, 11, -220, 269, -92, 115, -298, -298, -209, -261, -236, 133, 44, 199, 284, 168, -64, 85, -11, -111, 321, -148, -64, -145, 79, 112, 325, 173, 258, 148, -314, 33, 60, -145, -240, -9, 233, -147, -214, 91, 35, 75, 219, 60, 319, -196, -108, 56, -29, -165, -202, 91, 20, 202, 30, 60, 265, 24, -115, 177, -126, -119, -158, 173, -10, -174, 71, -24, 86, 322, -142, 68, -33, 160, -220, -24, -126, -12, -147, 67, -31, -55, -43, 219, 108, -176, 112, 27, 186, -64, -86, 22, -132, 240, -15, -59, 165, -118, 136, 82, 17, -61, -106, -258, -304, -127, 18, -87, 122, -188, 3, 134, 280, 51, -153]
3110a53L61J14l88K5K49j54J59K4j2j36J94k7k32l7K04m08L14L60n84R7J86NJ43
3133C04k73Q4ml24Q6K36O5j38m4K90j64J84k58R3j39q0K9N4p2l90K53K54J59k16
3157a1k67L83k84M25m02n4J41J29K3j9Kq1k38L71K39l35Kl78j8L20K7Q5k97k3
3181b60K24K51N8n42L04j56M01k73j63J01K81J6m99L75N2l1M2Jk98J6J14l2k02
3204b20Q2o7mK76j51Q1K57n00J56L24m33K68q0k74J02L24N9l12p4K15L51l63Q3
3227A00o4p3J7Nk28mL48r7K19k01L7P6Q4k64K0jNJ14j62r8J6J67K6j5p7j59J15
3254i4j50L42m9j45j79N7M28j65q4l4p2K62r9J9j29l83N15R2k38J17O1n5J77k7
3278A67Q1k03K05j95L4L8k60m7K17k9K37J54o12J73J97k6J06k08l49L77P6j43
$$ y = [-153, 208, 322, -66, -41, 208, 54, 213, 237, 225, 89, 283, 256, 24, -13, 191, -217, 97, 457, -127, -30, 156, 161, 304, 31, 115, 111, -213, -127, 109, 174, 36, -8, 282, 118, 302, 44, 137, -2, -82, -53, 1, -71, -461, -208, 46, 205, -11, -278, 105, -179, 246, -156, -210, -69, 60, 83, 64, 66, -15, -253, 118, 357, 22, 24, -354, -372, -52, -25, 60, -237, -260, -36, 215, 273, -269, 35, -121, 280, 7, -156, -55, 226, 242, -257, 118, 170, 139, 181, 182, -116, -100, 14, -18, -220, -138, -205, -209, 67, -84, -3, 254, -246, -90, 234, -199, 69, -11, -285, -183, 141, 200, -112, -186, 29, 380, 17, 100, 36, -37, -20, -15, -243, -247, 101, 4, 223, 22, 59, 135, 219, -45, -25, -26, -21, 93, -69, -167, -151, 16, 42, 27, -50, -209, -94, -244, 98, 49, -96, -275, -218, 210, 45, -39, -73, -145, 117, 18, 37, -92, -475, 40, 132, -106, 11, 72, 17, 194, 167, 248, 45, 250, 55, 89, 127, -133, -180, 37, 8, 245, 399, -213, -40, 157, 131, 237, 29, -320, 57, 133, -10]
3300a0kn3R7N4L1k52J51j20L9R8j50j91M69j55k3K38k17J92k15K04K3j02j86j33
3324b13J63n9Q3J34k68O7J92l40N83l81K21r2m9K02j31j41Q7N2j57L22l12j36
3346a73J05K92J0m57K04p0j06K93l53K25J18p5J84k56K10m18n9PJ98m0k87M48
3368@J78m7k78L78l85m0K97J55n03L7K33J65j60k7J3o0K8j06K59j66j12J72q3
3391e2O0m2j19K9K83k53M6L7J94k89R7K04k28j73N66n12J61r8K64l35N88n25K49
3414A52Nm32M43k49J53j75K48j88l0K28j38j60K43k30Q1L38j40j08P5k89J62q4
3436i5j98L21L05m70O2k8K54l11L18k82J54m6J45j50K14N8P5q6k33J26Lj25O8
3459G9j12J15Q8r2o3k14L64j98q3L04m71K24M96p49K10J02J4L63l88Q2L5k75K80
$$ y = [-10, -12, -65, 32, 86, 117, -135, 16, -104, -65, 33, -117, -308, 161, 6, -17, 221, 4, 196, -19, 185, 208, 106, -80, -213, -50, -109, -26, 108, -160, -93, 99, -241, 342, -39, 182, 90, 41, 243, 112, -29, 58, 110, -47, 275, -37, -173, -68, 224, 234, -223, -19, -89, -195, 98, -255, -30, 88, 13, 197, -59, 151, -267, -326, -319, -121, -161, -448, 0, 178, 131, -147, 231, -154, -194, 103, 258, -245, -208, 25, 190, 30, 3, 16, -44, -16, -122, 137, -29, -141, 31, -52, 8, -34, -153, -124, 159, -94, -48, -11, 183, -106, -9, 195, -33, -206, 360, -152, 9, -89, 175, -160, 428, -97, 152, 157, -275, 168, -81, 72, -103, 145, -43, -73, 155, 17, -143, 100, -130, -49, 289, 149, 41, 116, -173, -11, -95, -293, 28, 333, -137, -75, -103, 151, -160, 158, -124, 30, -16, 129, -21, 193, 251, 326, 240, 7, 133, 136, 11, 79, -33, 82, 170, 78, 15, -199, 165, -33, -116, 188, -283, -59, 437, -312, -102, 0, 14, 377, -11, 71, 106, -169, 111]
3482A11k14K20j61J7j09K43n93L75J00l68L63p2k08J89KK69l25j05n3K73r8j95
3504c39Q34n54j99PQK26J23J29k80K0J78l48J79p8J56m2m18K75O0K4j6o8J22j13
3528a14MJ57r2j06M7L22k27P6Ll78M42j32k91M92k83O2J76K99k50j94K66j87J70
3551B62j75j83J35k63K32R0q6J95k04j44L00j23J76k00j41M58j20m48K8k9L76
3572A36k38K30l28M11j06j25j53J15Q1%k12K92J43k25p7r8J65rq6j86L31p7J71
3595A55j68m4j18j22q6L48J0o9j62J64j43J35J92l0q3M13p79O86j39o01L40J08
3617Gj41m3L08j56o9J23K52ml15k84N60l40P7K01j18j6J27j14N6j11p3n4J45J2
3641C0kq3j2k97J11K70l30K95K40l77K22K75k20k3J44o6j03M05m84K82l00J53
$$ y = [111, -103, 117, -44, -27, -136, 107, -486, -111, -11, -379, -16, -88, -296, -107, -105, 164, -161, -266, -319, -46, -144, -339, 495, -59, -258, -251, -243, -17, 106, 235, -45, -25, 153, -195, -16, -94, 62, 20, -398, -123, -63, -39, -55, -123, -1, -114, -110, 47, -45, -151, -104, 218, -9, 67, 70, -308, 134, 2, -289, 203, -80, -18, 158, 457, 207, 13, 279, 92, 262, 87, -96, 39, -224, 8, 98, 12, 207, 3, -141, 159, 36, 212, 12, -129, 329, 209, -239, -211, -240, 136, -102, 128, -200, 211, 105, -20, -173, -58, 23, 23, -189, 103, 246, 21, -56, -154, 11, 2, -84, -270, 61, -16, 155, -13, -57, -175, -297, -383, -35, -25, -94, -256, -92, -235, -100, 92, 62, -21, 392, -387, 299, 160, -441, -101, 7, -134, -177, 131, -25, -94, 29, 281, 277, -38, -322, 238, -102, -25, 176, 58, 42, 169, 55, 111, 0, -73, -127, 18, 30, 28, -55, -67, -364, -253, 17, -313, -18, 222, -155, 67, 342, 122, 99, 243, 177, 74, 479, -5, 277, -23, 130]
3663A30M70o39l8J69k33K60j22J49k73r1J37K9J47j09J95o0j57J40j63k0%l7L55
3686B39j88K49k7m81J63Q3n3l05J32j89L61K03J5l37M21k61k7K6j25%K61k95N3
3709h2K04j88K54K66k74Lj74K83m32l4Q0q2K15j80n3J61n3Q0K02m46N56l30O3
3732C9j26J13N6q6j0j52L24q1j16j55M04l45k72M94N0k4p3K54m41M90k96k70J65
3755e8k2J16Nj36l1j83L95M7j69k74M85j48k50L37j11m7M6j48J99R7k61k19M16
3778H6k13R8R2m9J24k50J49K16n76M47J6k28q5M05k52Pj51K27l8K10k35l07M98
3801A91k99Q1j19L48k70P6J11k53L01k78n3j34M94k54J53K34l74K20P9j95k33
3822a74J86l7k39J3K98J09j05j48K28J5mJ30k41j62L10j03J36k12m72M39O5k01
$$ y = [130, 600, -39, -77, 92, -141, 119, -3, 146, -127, -218, -81, -52, 95, -14, 181, 121, -36, 104, -59, -79, -79, -116, 239, 51, 300, 273, -208, -45, 38, -15, -320, -188, -377, -16, 187, 202, -135, 286, 25, -2, 24, -101, -101, 160, -135, -82, 122, -66, 188, 454, 180, 183, 9, 292, -140, -174, -94, -176, 39, -141, -194, -33, -86, -6, 196, -250, 306, -24, 39, -87, 26, 82, -4, -14, -166, 158, 77, -39, -194, 210, -135, -407, 87, 137, 113, 40, 294, -147, 343, 47, -223, -58, -80, 36, 41, -95, -126, -309, 86, 133, -36, -310, 175, 27, -223, 114, 3, -44, 2, -146, 53, 150, -111, -330, 86, -127, -29, 63, 14, 138, -112, 37, 253, -323, 124, 140, -88, -173, 232, -20, -13, -164, 63, 25, 235, 0, -307, 191, -108, -27, -146, 202, -68, 8, 119, -134, 167, -111, -164, -298, 196, -58, 95, 329, -45, 175, 254, 59, -174, 12, -25, -264, -251, 47, 156, 51, -97, 131, 146, 142, 272, 31, -131, 179, 76, 212, 0, -472, -33, 32, -169]
3844a69J60p8o4L12k3j53p4L86l14K6P7k61J46Q3K52l35K5K40Q8n38L87j35j96
3867a58K96l83K01K27L3l32K15j10j23J58p7L11k26K1J28L4j93J32j70J3M0L8
3889G5R6l18K60O2k93L4J10j98J46k7K08m04M47k14K72m02J44K0q6k9m6Qj70K26
3913g9K79op2l55j08J51L72k79M52l68J95k61J25l7k04J36j88K97n7O4j7p7L2
3936eJ40l47K40M04l80P9j72K43R8l1k76n5L7j50K23p5J76k06j21K45j70O4r4
3959a33J83J54j87K20O6k87j71m0K13J0K2jQ1j42j03l9J87K01j49j45j8J25p0
3982b3N4j36P1q8K66J7l44K41J03n82M33O1Qq9L1k84J19K54K02k60K90l99k2J70
4006I3k06K32R8k80kK19k52K71m03L35k33R7J07l56K06Q9k0o2J21p2J14j60n4
$$ y = [-169, -9, -87, -151, 161, 138, -15, -89, 297, -17, 9, 86, -175, -29, 54, 306, -29, -4, 236, 324, -214, 173, 38, -158, 138, -245, -44, 183, 216, -116, 99, -11, -134, 24, -53, 258, 32, 53, 181, 215, 22, 154, -16, -3, 37, 75, 171, -147, 113, 175, -118, -84, 26, -172, -26, -53, 155, -249, 198, -16, 256, -146, -2, 18, -68, -97, -143, -135, -305, -79, 200, 194, 122, -233, -341, -190, 182, -97, 355, -13, 182, -79, 46, 9, -195, -59, -247, 50, -7, 57, 40, -37, -5, 135, -212, 28, 432, 52, 131, -41, 202, 300, 269, -7, -62, -25, -175, 48, -27, 149, -57, -178, 67, -103, -39, -133, 50, 204, 17, 237, 303, 16, -155, -195, 18, 28, 50, 49, 130, -12, -115, -154, 33, 234, 85, -60, -78, 47, -23, 31, -105, -34, -122, 144, 161, -183, 58, 161, -421, 12, 73, 81, -8, 23, -261, -142, 112, 314, 54, 344, -55, -77, 93, -113, 119, 217, -63, -65, 154, -98, 173, -230, 105, -128, -31, 76, -280, -74, 15, -5, -67, 54, -18, 96, -64, -118]
4029a18o6K68j06K87n09M21j43k12J42R9k44J02J43J22l14J54J76j01l8l17L72
4050A18k29J71o5K5J50j43O9j28m1O43m89j3R4n5j61J62j21K10l63Q7L61R3l68
4073Gj85K28K24k95K3K34l15q4O5K6J12J14j95L9K90k84l35K58O4R4k84J03K61
4096A65k98M0j18J86p4K85j63q8l21N19j15K01k52k47K21Q2O2N8j13qJ38k02L06
4119B64k20k65N8j8J75J64l02K76k52J04j82L15j43r0r5L64l92n4K7K90l67O12
4141B69k44j68K03Jk44J27O8k43K65j49R1l79M64Q1k82k08M20r0P0k93K46k9J41
4164A17J10l44J72l9L1n9j07K9p8J08l86L38J52J13m8j72J58N7j87N7k52J31J15
4187A6o0q9O7J14K25k83p8K61j88m6o8L0P2J24m6Q1mk14K62k6j35j76O92n65J25
$$ y = [-118, -184, 84, -22, 265, -244, 177, 34, -178, -36, 63, -181, -79, 64, 186, -128, 26, 202, 101, 63, -254, 118, -111, 60, -5, 20, 170, 27, 96, -32, -73, 570, 81, 68, 162, 107, -54, 108, -13, 197, -166, -79, 282, 375, 7, -178, 50, 274, -21, 2, 236, -79, -163, -98, -72, 40, 154, -41, -2, 288, 4, -331, -73, -9, 85, -199, -96, 165, -133, -93, -211, -25, -99, 186, 23, -65, -386, 133, 18, 219, -33, -280, -59, 23, 85, 143, 30, 22, 160, -42, 264, 44, -221, -163, -181, -6, 158, -144, 132, -120, -16, -198, 117, -26, -116, -211, 153, -239, -293, -266, 24, -343, 269, 25, -143, 60, 61, -183, -56, 12, -231, 34, -115, -24, -403, 61, 142, -140, -348, 72, -18, 52, -241, 5, -24, 117, 227, -117, 55, 16, 47, -12, -119, -90, -168, -60, -446, -108, 44, 157, 109, -63, 95, 152, -35, 22, -230, -99, 16, -44, -133, -66, 48, 273, -10, -88, 173, -15, -61, -129, -99, -27, 97, 51, 132, 128, -86, 176, 150, 15, -161, 531, -34, 91]
4212I1J57l38K81l52M12j02r5J4R3l88L03mm9K46q7k00P7r8kL39k10n09L37k76
4236c60N28m19J93L70k52N1L0p2j78m3J19j31L38k99K63k02K56l25j62J51N0O8
4258b6Q5J9j75j13K20j11K87l9r3j47k98Q31m74K40m99J78J24J40m30K98m1K4
4280@qj39L0J10O0j25l69L88j30L9P4k59M23k77K25J0j63K18k23L84l93J37j01
4303h9O9K32l31J69o2J92k23J38k97L39r6J40k19n0J16r0J76lo3j27J19r8K50
4326A92o5k58J53l9K23n29rM27j23K51k77K29l34K73n49K22J05J83j86K56L24
4347D69p70N22M7k92K83l6m11J42M3k66M66k90J58J63n29K15k16J36K10K8j72
4368a00kj19L3n7J3K56k2J78l29O08k14j51q3q2Ln6J80L4r4J10o6K55k72K04k55
$$ y = [91, 248, -90, 191, -161, 251, 149, 54, 68, 161, -227, 76, 72, 23, 269, 182, -18, 59, -39, -41, 298, 88, -421, -84, -360, 168, -251, -58, 312, 60, 111, 141, 69, -109, -152, -33, -164, 174, -125, 138, -64, 192, -133, -295, -144, -94, -26, 59, 78, -97, -210, 10, -101, 186, 147, 54, -93, -391, 440, -34, 206, -293, -115, 9, 149, -281, 17, -24, 0, -8, -147, -117, -7, 53, -72, -441, -53, -183, -144, -70, -329, 94, -183, 42, 52, -111, 107, -116, 268, -125, 12, -89, -20, 212, -119, 50, -12, 180, -43, 95, -202, 137, 41, 181, -38, -88, 28, -62, 114, 111, 48, -79, 40, -58, 192, 127, -131, 22, -17, 206, -323, -332, 95, -28, 223, -54, 175, -159, 114, -435, -213, -108, 75, -111, 145, 469, -301, 221, 268, -24, 259, 223, -188, -46, -3, -269, 197, -93, 65, 228, -301, -86, -302, -166, 44, 72, -100, -102, -221, -188, -245, -232, 24, 2, 180, -149, 459, 245, 94, 11, -71, -68, -124, 56, 90, -4, 106, 40, 295, 23, 227, -28]
4393b8R0J2p3N2l13J38k40K24jm6l7J54p4K50j79K66M3l03k50K18O2J4m4J53O
4418I4n7m03M69J40n66O12k86pm4k13N87k22q8J70n9k57k9l1j86N18p5k72K0J31
4442e4O8L94l05N2m01N77k08j31q0M4J31k94L33l15l3K62j18J18K04qk39j42J01
4465d4j64K01J14j81j1K08k92M07m62K3L04q9J48k53O4l3kl3K39J13m94K49J69
4488A81j03k08k0l9k3j07N53K0l2l6j67L1k74J39j7J00l68K19J83J61Q4k96k45
4511b64j9L14n8L6K27o2k15K09l78N58p9k56m3O1k36l9N12N6k68o3O0k96L81J21
4535B59l81L2P1J3k55M77k91m8Q3K73l48K3L2j0L9k76N0K37r8Q2q7J90j02O4l03
4560b74J52l3j09K06o2rj65K41j15LJ25p4K06Kpk15M19j41J08k73j85K24P5j05
$$ y = [-28, 62, 74, 1, 53, -260, -122, -362, -138, -139, -185, -222, -68, -142, 108, -71, 195, 238, -65, -315, -97, -35, -21, -65, 88, 94, 37, -366, 103, 243, -323, 289, 3, -4, -48, -261, 326, 104, 16, 186, 127, -130, -159, -190, -376, 142, 67, -205, -185, -54, 14, 408, 103, 155, -246, 331, 123, -8, -88, -44, 87, -207, 126, -189, -222, 40, -78, 40, 244, 236, -3, -145, -44, -208, -7, 107, -74, -85, 123, -169, 238, -224, -201, 103, 14, 162, -91, -27, -60, -62, -95, 144, 257, -237, 12, 181, 78, -130, -150, -189, -212, -319, 234, 254, 222, 186, 19, 50, -224, -85, -102, -2, -370, -151, 32, 193, 277, -19, -264, -283, 31, -27, 9, 236, 174, -41, 168, -210, 348, 269, 13, -30, 31, -205, -244, 268, 324, 56, -7, 53, -243, 138, 259, -122, -90, -19, -6, -261, 216, -75, -123, -40, 233, -115, -92, -60, -70, -31, -307, -257, -20, -118, -36, -123, 67, -35, 29, -274, -122, -155, -264, -58, -120, -129, -294, -53, -168, -165, -40, -114, 92, 94, 87, -128, 291, 150, 258, -15, -200, 24, 99, -6]
4584fo9M30k55j13k18L8L4J09K34k42k94N81n24L60k95K19L1K2k48J97L18l22
4606a3n6J52j76J08M77m25k47O3q6K47j3J34k26K81k29J99j90l11M47r8j24J73
4628H7J21l45p1K56J12o5J26l99L22j89k7J99j29l7J0j28J35J69m5l06K32k09
4650a81K21j80K24K12l64L92J41l80J14k05p4kJ61p8J91j67l2P1m77L42k4K04
4672A09J9m9k64J94k30L70J26n11K55J99k53M8j12J84J37n13M60l56K45k64N78
4693C72l53O0j71R0j14J0J5o6K79j44M96l99j95j6j46N37l40K05J00m99M35j1
4715A45k35K00j02o7p2J37j08K74l01k82N24j10j28K48R7n3j84O3J08j61j78K29
4737D4J12m5J3k47K66k05O9nJ61n13L65k41L53p7J58n66N71j29j67K52k80k44
$$ y = [-6, -75, 355, 100, -13, -231, -193, -159, -50, 184, -58, -352, 229, -295, 65, -230, -11, 20, 42, -206, -9, 309, -13, -69, 83, -93, 15, 492, 67, -180, -117, -203, 44, 31, 165, -61, 220, -9, 190, 0, -311, 136, 38, -86, 87, 208, -137, -208, 48, 160, 95, 221, -178, 144, -45, -72, 127, -2, -39, -29, -157, -22, 147, 102, -204, 28, -181, 40, -140, 84, 296, -68, 324, 465, 85, 199, -6, -80, -82, 79, 1, 192, 25, -7, 64, -413, -71, -95, 109, 128, 79, -185, 9, -221, 149, 275, -236, 19, 218, -35, 13, -99, 85, 222, -291, 169, -187, 58, -206, 372, 19, 79, -92, -2, -116, -106, -91, -157, 122, -22, 474, 75, -120, -136, -282, 255, -85, 120, 220, -279, 156, 145, -90, 110, 8, -59, -131, 6, -102, 172, -129, -411, 113, 3, -125, 123, 220, 167, -17, 46, 154, -7, -185, 44, 156, 111, 124, -123, 143, -62, 7, 2, 163, -350, 15, -226, 127, 50, 208, -358, 213, 84, -83, 169, -111, -355]
4759c55N59P1m90oM38L1m19L59j44p6j7pN2K1k13K89qq1Q4N8j4k20p2Q1L29n6
4785A94r4J20n82L13J24L2j68L96j70Q5o4j13Qj67k1K24k26K1L2r8M89j43k97
4808a05K32Nj53k16M13J50j84m10M10j84O4q2j22J97m8o6J09M13m14K4J60m6j81
4831c4L30j65j13o7L3j28M03k99J19l18N3J28K57j36K58l69K9N9ql26K88P8J53
4854B25k0k39L81l48pk68J21K59r6k38K30K14k51L28k26N7l50J63r3L58j77K67
4876B90k69j13K94m17L1L09r7j10L13j61R2j76o2R2K19r8j95m6P3J67j41j38r8
4899b41K70kl97M41n03P19k49KM07p88N85l68J08P1m9j02J53M8K0j27r4k14J63
4922a47L04j70N9jK9P6j63mo8q0K84k50J85J11n5k9j82J91m6l99M81M3j89J77
$$ y = [-355, 204, 275, -215, -221, 217, 248, -171, 188, 44, -32, -49, -56, -4, 17, -196, 93, 85, 4, 88, 146, 132, -88, -160, -79, 250, 194, 100, 220, -362, -49, 75, 107, -61, 335, 165, 250, 186, 73, 81, -86, -107, 117, -109, -88, -56, -154, 335, 192, -105, 127, 132, -21, -237, 176, 326, 142, -268, 142, -42, 22, -60, -182, 15, -33, -99, 10, 423, 9, 33, 193, 147, -34, 296, 131, 18, -49, -16, -144, 259, -40, 79, -239, -186, -58, 199, 63, 321, -48, -19, 40, 32, -294, -6, 72, 225, 205, -34, 347, -1, -8, -276, -155, 104, 8, -230, 0, 214, -37, 291, 65, 122, -228, -65, -158, 200, 23, 290, 21, -92, 202, -215, -184, 125, 28, -82, 231, 70, 162, -14, -76, 16, 235, 137, -58, -104, -31, 136, -5, -143, -241, 29, 27, -370, 71, -432, 287, 38, 40, 447, -341, 244, -124, -16, 55, 6, -96, 57, 105, 125, -2, -96, -310, -147, 157, -13, 46, 45, 74, 150, -13, -17, -85, -165, 119, -131, 54, 165, 110, 81, -101, 90, 44, -355, 126, 169, -20, 157]
4946A57j32p5J9r4%L28k63m0O7k71O44k49k37J22LJ12k77j04J5L82k86K93k95
4969a81j61L91j03j07M9K81k12N01l91J57k93m6M79l18l6O0k05J40K28m41J52
4990e6j24L39j72k1J17k34L02r6k0L60k95l24L51j98j04L41Oq9l46K80K6j39K68
5013A72k22m4n1K9j22K38m5J21j00j63j46K60r0M41l63L28j44k2r0l8P5j50L27
5036B01k65P0m7j85K6L68l20O8K43j85j13M24k69L2k52j01M97m74K78j16J28m97
5058d89M93J70K26k30j57qk27K44j17N6N26l51l52J46K2j71J17Q2k88L70P3k41
5080a06J51J84l60K56p6j24J8m1K44R5k41j02L8N6k72L89r6k16K50m6Q8n2p9j22
5104a64L5J34J68l9k34J1l7o8N0J17K0o4J00L69q1m46k61L10n2K2K60j86M42j9
$$ y = [157, 25, -50, -31, -125, -125, 203, -60, -100, -33, -304, 340, 91, -146, -24, -21, 91, -186, -290, -275, 107, -179, 114, -181, -342, 49, -54, -161, -112, 169, -43, 458, 67, 224, -69, -115, 364, 46, 10, 70, -135, 5, 233, -208, -56, -180, 159, -13, -34, 83, -151, 151, 55, 35, 395, 100, -224, 127, -71, -175, 166, 172, 83, -263, 17, 43, -96, 172, -50, -94, -145, -116, -238, 0, -45, 76, -24, -187, -333, -73, -163, 278, -85, 243, 99, 77, -13, -51, 24, -126, 201, -64, 6, -41, -226, -200, 168, -152, -84, 159, -26, -139, 285, 16, 48, -204, -305, 192, -282, -4, -120, 8, -489, 4, 174, 400, 170, 13, 5, -222, 22, -95, -39, 487, 136, -216, -70, -48, -219, -102, -20, -308, 62, 135, -106, 45, 229, -131, 125, 49, -75, -57, -98, 146, 241, 0, -102, -64, -8, -280, 109, 13, -203, 47, 1, 89, 37, -42, -164, -129, 5, 173, 134, -100, -89, -126, -194, -144, -27, -7, -71, 29, 398, 317, -129, -390, -80, -132, -110, 150, -36, 406, 387]
5128C87j19m36%K05K60l74J62j59K96m82K54J43l98M27p7o2m0j19L2Q4J20J37
5150B41p4k83P4K74k07o1j36K67l09L74j52j26K75K7k40J39J82l74J65J60j13
5171A03j14M1j87j61K12p9M22m81k5L39M7l4m90O34l09L4J61K26l50p3L31j17
5193A30j53J15j09M28n93J98p8J09o6j42K15j75N3O4j46J66J8J22m37O33j89k58
5215i5o2K16p0J84k4j87Kp5%P3K20q3J36k09p3K58l35J40k17L44k74L5k29K41
5239h4K64k07J4O4k35o0L8O1Q4K24J32n80K28J04j92J94K24k61r6J74j77J9PJ50
5263H9l53J89J13j89K79K84m80J07j5p0N7m31M18J24K56k93o8J19o3L86n22J83
5285A20k94J81K22l69L06j57l2R7n4j26J85l25M27l74M54k85k08N05j66M2K5l11
$$ y = [387, 268, -168, -168, 37, 297, -77, 85, -74, 222, -260, -6, 137, -261, 166, 89, 27, -13, -132, -100, -16, 104, 241, 167, -116, -42, 232, 25, -36, -172, 95, -214, 160, 8, -118, 157, 184, -56, 83, 265, -109, 56, 216, 103, -11, 30, -157, -318, -106, -185, 237, -244, -269, 70, 117, 83, -407, 227, -82, -48, 113, 339, -11, -84, 247, 130, -23, 92, -17, 411, -182, 16, -62, 47, -19, -161, 54, -121, -68, -4, -150, 16, 34, 156, -281, 352, 163, -95, -157, 59, -11, 173, 149, -38, -36, -111, -111, -38, 182, 99, 235, 26, -47, 211, -124, 16, -201, 143, -131, -96, -325, -84, 180, -27, -13, 51, -184, -244, -206, -145, -61, 163, 295, -285, -57, 47, -145, 49, 273, 12, -84, 90, -87, -68, -61, 89, -264, -75, 38, -151, 128, 412, -68, 39, 24, -46, 11, -420, -2, 122, 378, 85, 17, 136, 73, 459, -63, 120, -174, 7, 229, -140, 166, 9, -23, 74, 20, -106, 79, -246, 181, -193, 261, -24, -232, 273, 107, 149, 174, -137]
5307a37K27m72L86K7R1k26J19K17k97o5K13K0j36j07N62k42j63K14J36m99p9M60
5329B49n11j40L3K24J74j68J55j03R3L1m4K62m76K89R4k53k63L73J44M9j12r8
5351BL8j21J39j44K37j04k23n5J96N0J78j13M8j51O5m5k67L29k39Q7K75o2m17
5374b97N1J14J97kj9o7K27k43L54l60M6j38M1J09j6R7j32Q6O8k6k63L52l34K31
5398G6k19K65k1j36j34k06K74Q6K28K57m92n5O7j75J50MQJ5P4R8kk80K11r9p7
5423h3J97n7r5M26l58k03L73j23k15J14L6r1J23N8k71k7J22j85QJ80p8P7Q0K82
5447B90l31M2r3N7K7j82M72l24R1K76k68N0j48K19m7r2J86l99k9L30rOl34J09
$$ y = [-137, 90, -382, 4, 31, 122, -104, 15, 232, -65, -130, 83, 103, -33, -140, 422, 180, 17, 231, 367, -132, -211, 249, -262, -402, -369, -145, 29, -139, 16, -87, 6, 37, -7, 255, -221, 68, 162, -91, -354, 19, 163, 212, 100, 2, 40, -81, 58, -86, 151, 47, -176, -231, -35, 15, 193, 80, 128, -23, 42, -3, -270, 59, -180, -93, 182, 120, -297, -246, -132, 65, 63, 44, -23, 204, -39, 315, -45, 1, -137, -96, 13, -3, 94, -38, 48, 116, 90, -173, 179, -155, 76, -143, 122, 101, -35, -169, -375, -101, -15, 213, 470, -22, -77, -10, -185, -35, -31, -23, -8, 66, 164, 162, -118, 93, -6, -83, 114, 57, -38, 388, 30, -173, 200, 77, -138, -24, 12, -79, 44, 102, -169, -196, -74, -259, -251, -71, -149, -72, 8, 290, -41, 1, -92, -35, -8, -190, 282, -42, 49, 325, 57, 107, -41, 178, 131, 39, 225, -174, -203, 127, 118, 124, -210, -101]
$$ [...]
8191A21
##END NTUPLES=NMR FID
##END=
