##TITLE=1H_CG-1108
 CDCl3, 8 sc, 
 6.6.2019
##JCAMPDX= 6.0         $$ Bruker NMR JCAMP-DX V2.0
##DATA TYPE= NMR FID
##DATA CLASS= NTUPLES
##ORIGIN= UXNMR, Bruker Analytische Messtechnik GmbH
##OWNER= root
$$ XWIN-NMR		Version 3.5
$$ Thu Jun  6 13:51:21 2019 Russian Standard Time (UT+4h)  she@DPX200
##.OBSERVE FREQUENCY= 200.13155
##.OBSERVE NUCLEUS= ^1H
##.DELAY= (6, 6)
##.ACQUISITION MODE= SIMULTANEOUS
##.ACQUISITION SCHEME= undefined
##.AVERAGES= 8
##.DIGITISER RES= 18
##SPECTROMETER/DATA SYSTEM= spect
##.PULSE SEQUENCE= zg30
##.SOLVENT NAME= CDCl3
##.SHIFT REFERENCE= (INTERNAL, CDCl3, 0, 15.7039)
##AUDIT TRAIL= $$ (NUMBER, WHEN, WHO, WHERE, WHAT)
$$ ##TITLE= Audit trail, XWIN-NMR		Version 3.5
$$ ##JCAMPDX= 5.01
$$ ##ORIGIN= Bruker BioSpin GmbH
$$ ##OWNER= she
$$ F:/spectra/data/she/nmr/H-F/1/audita.txt
$$ ##AUDIT TRAIL=  $$ (NUMBER, WHEN, WHO, WHERE, WHAT)
(   1,<2019-06-06 13:49:51.46 +0400>,<she>,<DPX200>,
      <created by zg, POWCHK disabled, PULCHK disabled
       configuration hash MD5:
       00 E9 B6 7A A2 85 ED C7 34 08 36 98 17 FE 4E 26
       data hash MD5: 16K
       67 5A C2 41 95 C4 89 46 E5 BF 60 50 51 B9 1A ED>)
$$ ##END=
$$ 
$$ hash MD5
$$ C1 93 29 6F 17 37 4A 48 02 EC 3D 65 0E DC 67 29
##$RELAX= 
##$RELAX= 
##$RELAX= 
##$RELAX= 
##$RELAX= 
##$RELAX= 
$$ Bruker specific parameters
$$ --------------------------
##$DU= <F:/spectra>
##$EXPNO= 1
##$NAME= <H-F>
##$PROCNO= 1
##$TYPE= <nmr>
##$USER= <she>
##$AMP= (0..31)
100 100 100 100 100 100 100 100 100 100 100 100 100 100 100 100 100 100 
100 100 100 100 100 100 100 100 100 100 100 100 100 100 
##$AQSEQ= 0
##$AQ_mod= 1
##$AUNM= <au_zg>
##$AUTOPOS= <>
##$BF1= 200.13
##$BF2= 200.13
##$BF3= 200.13
##$BF4= 200.13
##$BF5= 200.13
##$BF6= 200.13
##$BF7= 200.13
##$BF8= 200.13
##$BYTORDA= 1
##$CFDGTYP= 0
##$CFRGTYP= 5
##$CHEMSTR= <none>
##$CNST= (0..31)
1 1 145 1 1 1 1 1 1 1 1 1 1 1 1 1 1 1 1 1 1 1 1 1 1 1 1 1 1 1 1 1 
##$CPDPRG= <>
##$CPDPRG1= <>
##$CPDPRG2= <>
##$CPDPRG3= <>
##$CPDPRG4= <mlev>
##$CPDPRG5= <mlev>
##$CPDPRG6= <mlev>
##$CPDPRG7= <mlev>
##$CPDPRG8= <mlev>
##$CPDPRGB= <>
##$CPDPRGT= <>
##$D= (0..31)
0 1.2 0 0 0 0 0 0 0 0 0 0.03 0 0 0 0 0 0 0 0 0 0 0 0 0 0 0 0 0 0 0 0 
##$DATE= 1559814590
##$DBL= (0..7)
120 120 120 120 120 120 120 120 
##$DBP= (0..7)
150 150 150 150 150 150 150 150 
##$DBP07= 0
##$DBPNAM0= <>
##$DBPNAM1= <>
##$DBPNAM2= <>
##$DBPNAM3= <>
##$DBPNAM4= <>
##$DBPNAM5= <>
##$DBPNAM6= <>
##$DBPNAM7= <>
##$DBPOAL= (0..7)
0.5 0.5 0.5 0.5 0.5 0.5 0.5 0.5 
##$DBPOFFS= (0..7)
0 0 0 0 0 0 0 0 
##$DE= 6
##$DECBNUC= <off>
##$DECIM= 24
##$DECNUC= <off>
##$DECSTAT= 4
##$DIGMOD= 1
##$DIGTYP= 9
##$DL= (0..7)
0 120 120 120 120 120 120 120 
##$DP= (0..7)
150 150 150 150 150 150 150 150 
##$DP07= 0
##$DPNAME0= <>
##$DPNAME1= <>
##$DPNAME2= <>
##$DPNAME3= <>
##$DPNAME4= <>
##$DPNAME5= <>
##$DPNAME6= <>
##$DPNAME7= <>
##$DPOAL= (0..7)
0.5 0.5 0.5 0.5 0.5 0.5 0.5 0.5 
##$DPOFFS= (0..7)
0 0 0 0 0 0 0 0 
##$DQDMODE= 0
##$DR= 18
##$DS= 0
##$DSLIST= <SSSSSSSSSSSSSSS>
##$DSPFIRM= 0
$$ [...]
##$SUBNAM2= <"">
##$SUBNAM3= <"">
##$SUBNAM4= <"">
##$SUBNAM5= <"">
##$SUBNAM6= <"">
##$SUBNAM7= <"">
##$SUBNAM8= <"">
##$SUBNAM9= <"">
##$SW= 24.9336996594482
##$SWIBOX= (0..15)
0 0 2 0 0 0 0 0 0 0 0 0 0 0 0 0 
##$SW_h= 4990.01996007984
##$TD= 16384
##$TD0= 1
##$TE= 0
##$TE2= 300
##$TE3= 300
##$TEG= 300
##$TL= (0..7)
0 120 120 120 120 120 120 120 
##$TP= (0..7)
150 150 150 150 150 150 150 150 
##$TP07= 0
##$TPNAME0= <>
##$TPNAME1= <>
##$TPNAME2= <>
##$TPNAME3= <>
##$TPNAME4= <>
##$TPNAME5= <>
##$TPNAME6= <>
##$TPNAME7= <>
##$TPOAL= (0..7)
0.5 0.5 0.5 0.5 0.5 0.5 0.5 0.5 
##$TPOFFS= (0..7)
0 0 0 0 0 0 0 0 
##$TUNHIN= 0
##$TUNHOUT= 0
##$TUNXOUT= 0
##$USERA1= <user>
##$USERA2= <user>
##$USERA3= <user>
##$USERA4= <user>
##$USERA5= <user>
##$V9= 5
##$VALIST= <valist>
##$VCLIST= <CCCCCCCCCCCCCCC>
##$VD= 0
##$VDLIST= <DDDDDDDDDDDDDDD>
##$VPLIST= <PPPPPPPPPPPPPPP>
##$VTLIST= <TTTTTTTTTTTTTTT>
##$WBST= 1024
##$WBSW= 4
##$XGAIN= (0..3)
0 0 0 0 
##$XL= 0
##$YL= 0
##$YMAX_a= 414028
##$YMIN_a= -892156
##$ZGOPTNS= <>
##$ZL1= 120
##$ZL2= 120
##$ZL3= 120
##$ZL4= 120
##$ABSF1= 10
##$ABSF2= 0
##$ABSG= 5
##$ABSL= 3
##$ALPHA= 0
##$AQORDER= 0
##$ASSFAC= 0
##$ASSFACI= 0
##$ASSFACX= 0
##$ASSWID= 0
##$AUNMP= <proc_1d>
##$AZFE= 0.1
##$AZFW= 0.1
##$BCFW= 1
##$BC_mod= 2
##$BYTORDP= 1
##$COROFFS= 0
##$CY= 11.3945322036743
##$DATMOD= 1
##$DC= 2
##$DFILT= <>
##$DTYPP= 0
##$F1P= 18.9103706918063
##$F2P= -1.10871071338519
##$FCOR= 0.5
##$FTSIZE= 0
##$FT_mod= 4
##$GAMMA= 1
##$GB= 0.15
##$INTBC= 1
##$INTSCL= 1
##$ISEN= 128
##$LB= 0.24
##$LEV0= 0
##$LPBIN= 0
##$MAXI= 10000
##$MC2= 0
##$MEAN= 0
##$ME_mod= 0
##$MI= 1.114404
##$NCOEF= 0
##$NC_proc= 0
##$NLEV= 6
##$NOISF1= 3.799351
##$NOISF2= 2.8
##$NSP= 1
##$NTH_PI= 0
##$NZP= 0
##$OFFSET= 15.70392
##$PC= 1
##$PHC0= -8496.389
##$PHC1= 9.600187
##$PH_mod= 1
##$PKNL= yes
##$PPARMOD= 0
##$PSCAL= 0
##$PSIGN= 0
##$REVERSE= no
##$SF= 200.130013532006
##$SI= 16384
##$SIGF1= 3
##$SIGF2= 2
##$SINO= 400
##$SIOLD= 16384
##$SREGLST= <1H.CDCl3>
##$SSB= 0
##$STSI= 0
##$STSR= 0
##$SW_p= 3612.71676300578
##$SYMM= 0
##$S_DEV= 0
##$TDeff= 0
##$TDoff= 0
##$TI= <>
##$TILT= no
##$TM1= 0
##$TM2= 0
##$TOPLEV= 0
##$USERP1= <user>
##$USERP2= <user>
##$USERP3= <user>
##$USERP4= <user>
##$USERP5= <user>
##$WDW= 1
##$XDIM= 8192
##$YMAX_p= 0
##$YMIN_p= 0
$$ End of Bruker specific parameters
$$ ---------------------------------
##NTUPLES= NMR FID
##VAR_NAME=  TIME,          FID/REAL,        FID/IMAG
##SYMBOL=    X,             R,               I
##VAR_TYPE=  INDEPENDENT,   DEPENDENT,       DEPENDENT
##VAR_FORM=  AFFN,          ASDF,            ASDF
##VAR_DIM=   8192,          8192,            8192
##UNITS=     SECONDS,       ARBITRARY UNITS, ARBITRARY UNITS
##FACTOR=    0.0002004,     1,               1
##FIRST=     0,             0,               0
##LAST=      1.6414764,     0,               0
##MIN=       0,             -892156,         0
##MAX=       1.6414764,     414028,          0
$$ Real data points
##PAGE= N=1
##DATA TABLE= (X++(R..R)), XYDATA
0@%%%qJ6j6J8k8M2n6P2q9J13j39J71k09K50k99L54m17M92n75O64p69Q87j017J164
27F21j328J505j701J923k164K426k719L040l388L772m195M655n161N722o336P013
43C685p767Q604r537J0590j1780J3138j4711J6550j8736K1388k4684K8916l4580
56a8924M2595n4909P6504j25412M31677P982p40521J56290L98343K40403k27883
67A86145j79126J4605J67641l3748j64897j60468K3419J13866J35703k0781j76561
78i4202k22587k0822K13366K52610n6051l37410k06078K23272L30987K541k83882
89a98256j25333K06348K33773j05732l16361q4187K87377L06854j372k49564j81703
100b28156Q0778K38253J29439p7924j56617q7419L1405J15120Q3767l4678o9091
$$ plain form
0 0 0 0 0 -8 8 -8 10 -18 24 -32 40 -49 64 -75 96 -113 137 -162 192 -225 267 -308 356 -413 474 -543 621
27 621 -707 798 -903 1020 -1144 1282 -1437 1603 -1785 1987 -2208 2447 -2714 3008 -3328 3685
43 3685 -4082 4522 -5015 5575 -6205 6933 -7778 8772 -9964 11424 -13260 15656 -18924
56 -18924 23671 -31238 45266 -80146 351531 359513 -381008 -224718 173625 414028 186145
67 186145 7019 21624 189265 155517 -9380 -169848 -146429 -32563 103140 82359 -94202
78 -94202 -316789 -337611 -124245 128365 72314 -265096 -471174 -247902 83085 85626 -198256
89 -198256 -323589 -117241 116532 10800 -305561 -389748 -102371 204483 203111 -46453 -228156
100 -228156 -147378 90875 220314 142390 -14227 -101646 -70241 44879 128646 93968 24877
111B4877M4584J35156K0961k19272k65816M1744L65102K53568j67679l54722j27504
122b49001J64208J82212k5662j52580l4937J33415R4734r3840j77655o9030R8467
133a29669J49949L4694j15483j42088k1661J44074J92896J8454k14108j84307
143b67249R0415K27694O0871j48518j20289Q7476J80801J7625j78667j25870J05165
154g0546K14079Q6463j25853k01151o2331J28849J62478M3005p5213r9745k5858
165b5823O6185M5682p0384q8371N7480J73673P7559j56646k50877n4558K07157
176a8923K05366l0393j80995r6109P4201J19829m829j25049o6604Q3141J15272
187G4907O579r5047q8820J2929J11571R2757l0546j29258r4848O2149J81600Q6967
$$ plain form
111 24877 69461 204617 225578 6306 -259510 -217766 147336 400904 233225 -121497 -249001
122 -249001 -84793 97419 71757 -80823 -115760 17655 112389 18549 -159106 -228136 -129669
133 -129669 20280 54974 -60509 -202597 -224258 -80184 112712 131166 -82942 -267249
143 -267249 -176834 50860 111731 -36787 -157076 -69600 111201 128826 -49841 -175711 -70546
154 -70546 143533 229996 104143 -97008 -159339 -30490 131988 174993 99780 35 -25823
165 -25823 40362 86044 15660 -72711 -15231 158442 236001 79355 -171522 -226080 -18923
176 -18923 186443 156050 -24945 -121054 -46853 72976 68147 -56902 -123506 -40365 74907
187 74907 81486 -13561 -102381 -89452 22119 114876 84330 -44928 -139776 -77627 103973 190940
199A90940j32070j72584K1514J69375Q2977r2770j20795K7754J46024N5439j21527
210E4277j35700K1594J43732J05703l0920j24360r1299J0712P0412O3651J1445
221I9247n9186o0355K9194O7692l2673j26319n4138J09989J57532P306j65098
232b6809j35218M6989J28728L4429p5002o9100K1767P9163K7423o0695o0492P263
244h1554M1420L2238Q483k6572m0788M460O0178M8798l1491r3759l6601R3783
256b1405J16253j5561j13214n3195N7905P7031k901p1809l0647O6429P3120k0235
268F1771p9142m5324K1352O0149M5261o287m5002m8765j7809L9678N9666o480
280C9068o6925j6911O1114L8502n2480q4424q216Q8389P6405l4097q8144k6253
$$ plain form
199 190940 58870 -113714 -92200 77175 160152 67382 -53413 -25659 120365 175804 54277
210 54277 -81423 -59829 83903 189606 158686 34326 -56973 -46261 24151 87802 99247
221 99247 40061 -20294 8900 76592 43919 -82400 -136538 -26549 130983 138289 -26809
232 -26809 -162027 -115038 13690 48119 -26883 -95983 -74216 4947 32370 -28325 -88817 -81554
244 -81554 -40134 -7896 587 -25985 -66773 -62313 -2135 46663 15172 -78587 -115188 -21405
256 -21405 94848 79287 -33927 -87122 -29217 47814 44913 -26896 -57543 8886 82006 61771
268 61771 -17371 -62695 -41343 18806 64067 57780 12778 -35987 -53796 -14118 45548 39068
280 39068 -27857 -44768 16346 54848 2368 -82056 -90272 -1883 74522 40425 -47719 -73972
292g3972M3095L7276q269l1646p987L0504K7726o564j8226j7494k3480L511M9118
305C592L6291k6389m4924N666N5251K6172n8169p5884J8228R3517M7702l6832
317D4221n3166q108L1122J4861l2629l1365K4411M8861J7405j2419k4901l3114
329a4821j7722K1568M3229K0053l1853m9030R654O2958J4270o6487m7890L8489
341a7582O8015Q486o3975n6367K7865P4403K0050m8124m5571k052K6128K2558
353A3834k684j9440j0446P549K5542L0256j2981p0520m3488N2684P9856J692o9437
366a7583m0178N0288P6644j2602r4955n1354N1617P8793J9843m3157m4874P786
378a9732L9326O485l3531k8092p55K9533N3233K5574m7905p6189j4130O5145O2712
$$ plain form
292 -73972 -30877 6399 -1870 -33516 -41503 -10999 16727 10163 -8063 -25557 -49037 -45526 3592
305 3592 39883 13494 -31430 -25764 29487 55659 -2510 -78394 -60166 33351 81053 44221
317 44221 -8945 -17053 14069 28930 -3699 -35064 -10653 38208 55613 43194 18293 -14821
329 -14821 -32543 -10975 32254 52307 20454 -28576 -18922 44036 58306 -8181 -56071 -17582
341 -17582 50433 58919 -5056 -61423 -33558 40845 60895 12771 -32800 -34852 -8724 13834
353 13834 11150 -8290 -18736 -11187 14355 44611 31630 -38890 -82378 -29694 50162 51854 -17583
366 -17583 -57761 -7473 69171 56569 -38386 -89740 -38123 40670 60513 17356 -27518 -19732
378 -19732 19594 26079 -7452 -35544 -36299 -6766 46467 72041 24136 -52053 -66183 -1038 61674
391F1674k7895q6394j6494Q9221P0071m8787r6885k4996P0361P4234j6617q3928
403c6435l6318N1935O3511M720m5171m6165j608M5658M1951j1154n4536m0892
415f4504L0590Q6112L2967p9682q9565K3754J01076M2532o7924q6783J4138J04052
427D6763N4810o5547r4097r466O9375O0620j1887o0070k7893L4786M6667R347
439E3408l4748n6167j8969N8764P2690j0912q4665n0022N0664Q9389M778r5762
451b1552o6318N5795R6901Q293q1594o6102K8961Q4445K8392o0832o1810Q577
463d6844N1497L3263j2672m6189k9632K7108N7655K1719m8004p3586p454Q3580
475A0441O9170m3810r4018j2267Q2752O5166m0639j01726k9730Q4770Q3222k3127
$$ plain form
391 61674 33779 -52615 -69109 20112 90183 41396 -55489 -80485 -10124 64110 47493 -36435
403 -36435 -72753 -20818 42693 47413 2242 -43923 -45531 127 42078 30924 -23612 -64504
415 -64504 -33914 52198 85165 5483 -84082 -60328 40748 83280 15356 -71427 -57289 46763
427 46763 101573 36026 -58071 -67537 1838 62458 50571 -9499 -37392 -2606 44061 53408
439 53408 18660 -37507 -56476 2288 74978 64066 -20599 -70621 -19957 69432 74210 -21552
451 -21552 -87870 -32075 64826 73119 -8475 -74577 -45616 38829 67221 6389 -55421 -46844
463 -46844 4653 37916 25244 -20945 -50577 -23469 34186 55905 7901 -65685 -73139 10441
475 10441 79611 35801 -58217 -70484 12268 77434 36795 -64931 -94661 -9891 73331 50204
487E0204q5753l7428M5994O4444L469o1660n0027J4908N5759M2058j2022o4264
499c4318m5347M0094P7541N662p8993o3274L9917J03937L4364q6585r1320K7533
511g0789J01280L9614o6230q3132P913R1106N5064m3885p1816j3208M5157M9012
523D0086M140m8361m6947J7151O9615M5211l6655q8280l1729P5794Q6156k4194
535F1987r9329l9131P1630R1407r696j04197o3721N9040R3387L448p8463n7264
547g0902K7349P3760L0583m7142o7037j7451M2655O0703J4495n9518o2778K3731
559e1552Q4722L3412o5500q4284P117J00231O8617n4724j00426p871R0585O9966
571I0293l3166q8511k8579O6864P1271o325n6390l5405J5943M9675L2028k8423
$$ plain form
487 50204 -35549 -72977 -26983 37461 40930 -20730 -70757 -55849 -90 41968 29946 -34318
499 -34318 -79665 -39571 37970 43632 -35361 -98635 -58718 45219 79583 -7002 -98322 -70789
511 -70789 30491 70105 3875 -79257 -71344 19762 74826 30941 -40875 -54083 -8926 40086
523 40086 44226 -4135 -51082 -33931 35684 80895 44240 -44040 -75769 25 86181 61987
535 61987 -37342 -76473 -4843 86564 76868 -27329 -91050 -32010 61377 64825 -13638 -70902
547 -70902 -43553 30207 60790 13648 -53389 -70840 -28185 32518 47013 -12505 -75283 -51552
559 -51552 33170 66582 1082 -83202 -76085 24146 92763 38039 -62387 -70258 20327 90293
571 90293 57127 -31384 -59963 6901 78172 71847 15457 -19948 -4005 45670 77698 49275
583D9275o0156j6428N2208O3005n294q1299o0205M4544R2649J5085q0225p3014
595e9855K1431Q2617K8837o7676p0770K2586P2954K1816n1130n9197o083M7421
607a7049M3511q049m5354l5819P713M9724L7624l1163o6890j1830O2032N7014
619D1464j8878p1069k7361O2969P0604k3398q5113k8779O3593P4440k005o7072
631a0605m1843L1073N0965P788k8181k8220n131K4936L0154o825m0571k4189K4652
644a5997N0612J2644n8120o6924J3663P9570M1820m4494p0344r140N8108L7018
656B8416m1886n5409J4662O0607K7521l0030m7352j4555L0857L8996N165k6417
668i425k9360j371M0266M5043o750n3010l0835K7946M9608Q955m4628l2238M0592
$$ plain form
583 49275 -10881 -27309 24899 87904 82610 1311 -58894 -14350 78299 93384 13159 -59855
595 -59855 -38424 44193 73030 5354 -65416 -42830 30124 51940 810 -58387 -64470 -17049
607 -17049 26462 18413 -26941 -62760 -55047 -5323 32301 1138 -65752 -77582 -15550 41464
619 41464 22586 -48483 -75844 -12875 57729 34331 -50782 -79561 -15968 58472 56467 -10605
631 -10605 -52448 -21375 29590 37378 9197 -19023 -24154 782 30936 24111 -16460 -40649 -15997
644 -15997 34615 47259 -10861 -77785 -64122 15448 57268 12774 -57570 -66710 -8602 28416
656 28416 -13470 -68879 -54217 6390 33911 3881 -43471 -58026 -27169 11827 16992 -9425
668 -9425 -38785 -40156 110 45153 38403 -14607 -45442 -17496 32112 41067 -3561 -35799 4793
681D793O3399p498p2653m3993L4671O7386K2820m0244m6316l27K8100J6505n041
694B1602j9135j6847R092K6983L720l0111l0585Q057M8095L3595l5315p2994j9405
707g3248N5669N8063m651n1848k7543K9518L6650j2706l6830m333K8788K5657
719B3186K990k1242k3921K697L0723K8698n05l5088l5871J4425N7616L2186k7797
732D8097m6119q028L3527K4444k2795l3386J7534N0975J0546m3540m4950m255
744a7950L1246L1614L628k0249k3861j7399J107K2256J2895j7627k1108O461J8835
757I848m747l5564k6192K7171N5573O095n7275m6877J6541M6999J8817k2174k6221
770c8006M150J5507j733o438P128O517k732K446N483n127j3664k078K6602L6395
$$ plain form
681 4793 68192 60694 -11959 -55952 -21281 46105 68925 28681 -17635 -17962 10138 26643 21602
694 21602 2467 -14380 -5288 21695 25415 -4696 -35281 -27224 20871 54466 19151 -53843 -73248
707 -73248 -17579 40484 35833 -16015 -43558 -14040 22610 9904 -26926 -31259 -2471 23186
719 23186 26176 4934 -18987 -16290 14433 43131 42626 7538 -28333 -13908 43708 75894 48097
732 48097 1978 -6050 27477 51921 29126 -4260 13274 64249 74795 31255 -13695 -17950
744 -17950 13296 44910 48538 28289 4428 -12971 -11864 10392 23287 5660 -15448 -8987 9848
757 9848 5101 -30463 -56655 -29484 26089 32184 -25091 -71968 -55427 -8428 10389 -11785 -38006
770 -38006 -33856 -18349 -20082 -26520 -19392 -12875 -15607 -13161 -7678 -12805 -26469 -28547 -1945 34450
784C4450k404n0354l5580K8270N3786J5129k9881k7068J0896K3548j0113l0125
796a9446L595L7130J9688j6654k7919j6952L53J3673J7744J5450l229l1330k9261
809c7158J1706L2626M864k2928j1826J9234K1478j7499m4144p134M8289L9262
821C6770k0559m5111j2832K4605K7482Q91j5303n449J373l598L639J5194N248
834A2350j1743j714J3689O563j9415k6916Q807N1203L2511l5878n9523q040M5644
847G538L6420j0404l2046k811K4616L967k8510j8725J2822K3407J4749j454k0910
860H659k7185j1042J8923L7231J5776l2253m3821K658L9431J5104k9156k8007
872c3682J7044M4303O818m8215l7060K7285N2162J1791l4865l6113k709K7288
$$ plain form
784 34450 32046 -18308 -53888 -25618 28168 43297 13416 -13652 -2756 20792 10679 -19446
796 -19446 -15851 21279 40967 24313 -3606 -20558 -20205 -6532 11212 26662 23433 -7897 -37158
809 -37158 -25452 7174 12038 -10890 -22716 -3482 17996 497 -43647 -50781 -2492 36770
821 36770 16211 -28900 -41732 -17127 10355 11246 -4057 -9506 -8133 -11731 -8092 7102 12350
834 12350 607 -1107 12582 19145 -270 -27186 -18379 32824 65335 29457 -30066 -38106 7538
847 7538 43958 33554 1508 -1303 23313 27280 -1230 -19955 -7133 16274 31023 29569 8659
860 8659 -18526 -29568 -10645 26586 42362 10109 -33712 -31054 8377 23481 -5675 -33682
872 -33682 -16638 27665 34483 -13732 -50792 -23507 28655 40446 5581 -30532 -33241 -5953
884e953K4968K749j0066j4473q918J1999K2758j955k7397j0241K7664L1718j2459
897C0394n5133k7631M7913O8851j9o3679m3606K1097M5262O924l2519j7717K1980
910B117K1189j1241k5989j5184L724K5099L1006N492l2508m4752j2584L9445M4967
923C0781j2187n2174j4600M4268L8977k2059n2206p778N3261L9503l4219n9790
935d8223o817M5943L9840k422l2524k4745N072K2549J8276M301j5610k1973K880
948a3453K7720P070l1652k8030K0673N4887K1034m9063o0219J2669O7902L0348
960E9886m1010n2461j488L9505J9694k4841k4288J6368L3416R341j9915l1810
972a7603j9868J0779L4744K5321j0870l9824k8259K3776M9121O249m6891k8412
$$ plain form
884 -5953 19015 21764 11698 -2775 -11693 306 23064 21109 -6288 -16529 11135 42853 30394
897 30394 -24739 -52370 -4457 64394 64375 696 -42910 -21813 23449 30373 -2146 -19863 2117
910 2117 23306 12065 -13924 -29108 -25384 -285 30721 36213 3705 -41047 -53631 -14186 30781
923 30781 18594 -33580 -48180 -3912 35065 13006 -39200 -46978 6283 45786 11567 -48223
935 -48223 -55040 -9097 30743 28321 -4203 -28948 -23876 -1327 16949 21250 5640 -16333 -13453
948 -13453 14267 21337 -10315 -38345 -17672 37215 58249 9186 -51033 -38364 29538 59886
960 59886 18876 -33585 -35073 4432 24126 -715 -25003 -8635 24781 34122 14207 -17603
972 -17603 -37471 -26692 8052 33373 22503 -17321 -45580 -21804 27317 33566 -13325 -41737
984d1737L2125M8090m848n7026l1638M1359N6061p782n6198k7274K9467M6653
996B7252J5724k4251l0144p123J1108J3456N590q537j6272M739K9688J4562k8511
1009G281m0881K346N4534M1397l4253p1664j4039N6564M6259j8351m7994j1466
1021c0267L6189K8262k1375l8579l855L1710K8041n84l0125l4133n653K9533L5831
1034B4995Q095l1524l6835P760M5714J7197m0073m0602J6260N2607J6729m6671
1046f348m7220K1914O2915K0510m2086m7374k447L7030L2339n219k6679j4777
1058a7442O916J5904J1817q573k4314m838L1262L0448j5056n0438k5613L9064
1070a0863N9972N34n9396l6262K7968M5879M209l5863k2966K1475L2556l604l3007
$$ plain form
984 -41737 -9612 38478 33630 -23396 -55034 -13675 42386 34604 -21594 -48868 -19401 27252
996 27252 42976 18725 -11419 -18542 -7434 6022 11612 3075 -13197 -8458 21230 35792 7281
1009 7281 -33600 -31254 23280 64677 30424 -41240 -55279 1285 47544 29193 -18801 -30267
1021 -30267 5922 34184 12809 -25770 -29625 2085 30126 29542 -583 -34716 -40369 -10836 24995
1034 24995 33090 1566 -35269 -27509 18205 35402 -4671 -45273 -29013 23594 40323 -6348
1046 -6348 -53568 -31654 31261 51771 9685 -37689 -40136 -3106 29233 24014 -2665 -17442
1058 -17442 -10526 5378 17195 8622 -15692 -20530 10732 41180 26124 -24314 -49927 -10863
1070 -10863 49109 49643 -9753 -46015 -18047 27832 32041 -3822 -26788 -5313 27243 23639 -9368
1083i368j9382J0279K7143K0347n779k7419k1944N117K8024K2541j4236l7813
1095b2490q147L7540K9530k0914m0027l874L8486K8406k4043m5874l230M0988
1107F351K9501j1699l1517j5654J2526K1853N640j0229j0081l792M807J3666K556
1120A3928j9855j6220J5031L1547P250l2055l4682J1065M4851J5962l1812l2421
1132b7411O399K8481J1363j8413k0039R115K4752M981j7283j5435l691P377J4027
1145D223Q474p527j6145q485J1985K4317K321k8080j8272J9437K7360m887k8488
1158a3767j2848K1757K7898p072l2258j1319K1529K2036l40j5009j2715M02P652
1171d054L416J57p97o754k828J2858J2283j1887k2346o56K4839J9281j4071l3147
$$ plain form
1083 -9368 -28750 -18471 8672 29019 23240 -4179 -26123 -21006 7018 29559 15323 -22490
1095 -22490 -30637 6903 36433 15519 -24508 -28382 10104 38510 14467 -31407 -34637 6351
1107 6351 35852 24153 -7364 -23018 -10492 11361 17001 6772 -3309 -7101 -2294 11372 13928
1120 13928 -5927 -22147 -7116 24431 31681 -374 -35056 -23991 20860 36822 5010 -27411
1132 -27411 -21012 7469 18832 419 -19620 -10505 14247 19228 1945 -13490 -17181 -9804 4223
1145 4223 12697 5170 -10975 -19460 -7475 16842 19163 -8917 -27189 -7752 19608 14721 -13767
1158 -13767 -26615 -4858 23040 15968 -16290 -27609 -6080 15956 15616 607 -12108 -11706 -4054
1171 -4054 -638 -481 -1278 -8032 -10860 1998 14281 2394 -19952 -20608 4231 23512 9441 -23706
1185b3706o659L0151K2580j2385k3165k752J7180J3538p617j7273j279J2613O111
1198G337j240j926o672q019M223J5937Q767j0776k0196k215K4421J5696j8994
1211F343k5773M318K5162J1116j5004k0253K361K1078P975j4451j2559J970O363
1224a354M769K476k206o341o232N23J1948J0291j1465j9787N004K4141Q164k0099
1238a68k0645N406K5959J1556j8792j8981P717J7808L875r440q619M80P768M425
1252H349q07m49m106r221L468J7701N694j7897j7195P814K3138P302k1863k0802
1266a8874J0953K6673K013k2265j4408P900J7787N156j2952j2186K671O993J907
1279A368K279j529j0255n996R305J3821j28j8393j4530J2917K6023j192k8600
$$ plain form
1185 -23706 -30365 -214 22366 9981 -13184 -15936 1244 14782 7165 -10108 -11387 1226 7337
1198 7337 6097 4171 -2501 -10520 -6297 9640 18407 7631 -12565 -14780 9641 25337 6343
1211 6343 -19430 -15112 10050 21166 6162 -14091 -11730 9348 17323 2872 -9687 -7717 -1354
1224 -1354 3415 5891 3685 -2656 -8888 -8365 3583 13874 2409 -17378 -12374 11767 19931 -168
1238 -168 -20813 -15407 10552 22108 3316 -15665 -7948 9860 13735 4295 -4324 -3844 3924 8349
1252 8349 7542 7093 2987 -6234 -2766 14935 20629 2732 -14463 -6649 16489 23791 1928 -18874
1266 -18874 -7921 18752 20765 -1500 -15908 -8008 9779 14935 1983 -10203 -7532 -539 1368
1279 1368 3647 2118 -8137 -14133 -4828 8993 8865 -9528 -24058 -11141 14882 13690 -14910
1292a4910j3495K0096K4608k476k4882j4723J4918K1545j782j6453n123O911P937
1305B171L118l985o900l231K953J0048R886p584k0684m542K3605J8415j3245k5819
1319a5794m466K4325K0044j4115k8908n05K5482J4155j4162k1493l441J7086J4616
1332A2824m990j4130n813K721O140J0077Q46j4960j2749Q805K1234N761j9975
1345d209k2363J0889L2488P153k9768k4301J3205L1891J0355k2743k5001O769
1357a5635K5820Q333j4142j3481o03J0860J1850M58j1744j1832N57J5876J7181
1370B3498p209k9331j1015K6251K9050p880l3741j7161K3607L2823m346l4779
1382a0233j4782K2302K5767k611k3804j7126J0376K1794O966j2090j5046o709
$$ plain form
1292 -14910 -28405 -8309 16299 13823 -11059 -25782 -10864 10681 8899 -7554 -12677 -5766 2171
1305 2171 5289 1304 -5596 -8827 -5874 4174 14060 6476 -14208 -18750 4855 23270 10025 -15794
1319 -15794 -20260 4065 24109 9994 -18914 -19419 6063 20218 6056 -15437 -18878 -1792 12824
1332 12824 7834 -6296 -12109 -9388 -3248 6829 7675 -7285 -20034 -11229 10005 15766 -4209
1345 -4209 -26572 -15683 16805 23958 -5810 -30111 -16906 14985 25340 2597 -22404 -15635
1357 -15635 10185 18518 4376 -9105 -9708 1152 13002 13460 1716 -10116 -9559 6317 23498
1370 23498 16289 -13042 -24057 2194 31244 23364 -10377 -27538 -3931 28892 24546 -10233
1382 -10233 -25015 -2713 23054 20443 -3361 -20487 -10111 11683 18649 6559 -8487 -15196
1394a5196Q548K0709Q217j9271k3496L066K7514J7915j8539l2782K0L7240K2020
1407C5965k3868l5492k032L2433K5935j3511l3294p942K2464J9381k974j6903
1419A62j2848L520J6661J0730q325j8706j0269J3919K6352J805l1545k4881J7506
1432a5919L5939P495k9802l0023J0457L5468R523k8181k4086J0294K6020R176
1444A6361j6467k1402P82J8404J3074l206j3286j4584N58K1401J7030j0339k5174
1457a6848p396K1720K4893p668l2030r798K9547K7145j1377l3016j1732K3914
1469b646K8503l217k8039j2612J3611J7212L186r831j2667k355J0652J1308j898
1482A1207j4383j3754O924K5983R194k5938k7555Q101L2064J5026k1162l0718
$$ plain form
1394 -15196 -6648 14061 22278 3007 -20489 -17423 10091 28006 9467 -23315 -23295 13945 35965
1407 35965 12097 -23395 -25427 7006 32941 19430 -13864 -21806 658 20039 17065 162
1419 162 -12686 -9166 7495 18225 9900 -8806 -19075 -5156 21196 23001 -8544 -33425 -15919
1432 -15919 20020 27515 -2287 -32310 -21853 13615 23138 -5043 -29129 -18835 7185 16361
1444 16361 -106 -21508 -20726 -2322 10752 7546 -5740 -20324 -19766 1635 18665 8326 -16848
1457 -16848 -24244 -2524 22369 14701 -17329 -27127 2420 29565 18188 -14828 -26560 -2646
1469 -2646 25857 22640 -5399 -18011 -4400 12812 15998 6167 -6500 -8855 1797 13105 11207
1482 11207 -3176 -16930 -10006 15977 25171 -767 -28322 -20221 11843 26869 5707 -25011
1494b5011J561L1177J4016k0466k2678M548K2618J1726j2067j9935l046J5333
1506b224J3563J659r630j6036m294J6867J9253m069k1748j0997J5619K4177k485
1519A9655k9426j4290K3873K8570l959l0579j8571J6610K9295L943k3082j5691
1531a3652P024J3547N341n973j1356l930Q844J1844Q04j3727j7460K618K6593
1544A0517J6148j8930l0378l052K6212K1776j0196k8482o354K4548J7004j2908
1556E905k1515j831J7999J5640m983j8005r814O104J2985J1082q16j5490j3660
1569a6399Q344J9281M364j5297j4742O928K2263M965k3665j9128J3454K7424O483
1582B4275k0476k2034K749K0949R703j1018r954L32L836L046L71n371m354L176
$$ plain form
1494 -25011 -23450 7727 21743 1277 -21401 -16853 5765 17491 5424 -14511 -17557 -2224
1506 -2224 11339 12998 3368 -12668 -16962 -95 19158 15089 -6659 -17656 -2037 22140 19655
1519 19655 -9771 -24061 -188 28382 24423 -6156 -24727 -8117 21178 25121 2039 -13652
1531 -13652 -6628 6919 12260 6287 -5069 -8999 -155 11689 12493 -1234 -18694 -16076 10517
1544 10517 26665 7735 -22643 -25695 517 22293 12097 -16385 -22739 1809 18813 5905
1556 5905 -15610 -17441 558 16198 11215 -6790 -16604 -10500 2485 13567 12751 -2739 -16399
1569 -16399 -8055 11226 15590 293 -14449 -7521 14742 19707 -3958 -23086 -9632 17792 24275
1582 24275 3799 -18235 -15486 5463 15166 4148 -5806 -5474 -1638 1408 1779 -3592 -7946 -4770
1596d770Q854N434o595j8024o566J8029K0385m733k2418j0493J2082J8158q2j7706
1610h445n547J5491J0672r823j4371j226J1904J2035m14r448o830j143K853Q861
1624D569Q094n050j1832j388R023N005n782r647L726J6364N713j7948j8326O974
1638a0505K1087Q387j1285j5066m93R636J990n767N16N819R9l982l034k361j702
1653f661K977N925O856j241j5192j1788R738J8695L250j3042j0540M314J1314
1666D605o76j3091r26J5722Q566r799j3285k342P673Q717K963k518k472n400o323
1681h586L635J2419L350q663n924L722O088l419j0877j95J6588J1062j2889j9730
1695a3419j168J3864J0741k135q088j675K330l902m672N695Q222q78o004j326
$$ plain form
1596 -4770 4084 9518 2923 -15101 -21667 -3638 16747 12014 -10404 -20897 -8815 9343 9261 -8445
1610 -8445 -13992 1499 12171 2348 -12023 -13249 -1345 10690 10276 828 -6002 -7145 -4292 4569
1624 4569 12663 7613 -4219 -5607 3416 8421 2639 -7008 -3282 13082 18795 847 -17479 -10505
1638 -10505 10582 18969 7684 -7382 -7875 1761 3751 -2016 -1500 4319 4418 436 -2598 -4959 -6661
1653 -6661 -3684 2241 9097 7856 -7336 -19124 -9386 9309 12559 -483 -11023 -6709 4605
1666 4605 3929 -9162 -10088 5634 14200 4401 -8884 -11226 -3553 5164 8127 5609 3137 -2263 -8586
1681 -8586 -4951 7468 10818 2155 -3769 -47 6041 2622 -8255 -8450 8138 19200 6311 -13419
1695 -13419 -14587 -723 10018 7883 -205 -1880 450 -3452 -8124 -2429 5793 4915 -1089 -2415
1709b415J194j211m795L39J1528J0630q950j9375l745J5169J1575k534r165j767
1723c522N707p44q738l22J2079N936o219o557q88R04n97m90O612R794k563j7528
1739g136r015J1816J5055p31r859m923N255M058p922p181Q878J3263j609j1350
1753a401o430R83L168K132M219O241k23j4066j1170Q733J6052J444j0749n423
1767f490O226O419o693j1728M357J8653O054j4621j3681J333R731N831j125j253
1781C013J463l723q517J069J0911M213o212l665M357K846p492j0905M109J9433
1795A0900Q867j6943j8009L024J6566O964p810q664L658P369n138j0890J850J0551
1809B295M493k468l271l416l914k489M433J1996M841j2872j5363M223J5237L715
$$ plain form
1709 -2415 -1221 -2432 -7227 -6888 4640 15270 6320 -13055 -16800 -1631 9944 7410 -1755 -3522
1723 -3522 2185 1441 -7297 -7619 4460 10396 4177 -2380 -3268 -2364 -2961 -3451 3161 12955 10392 -7136
1739 -7136 -16151 -4335 10720 9989 130 -4793 462 4520 -3402 -10583 -1705 11558 9949 -1401
1753 -1401 -7831 -6848 -3680 -1548 2671 8912 8689 -5377 -16547 -7814 8238 9682 -1067 -6490
1767 -6490 -264 6155 -538 -12266 -7909 10744 16798 2177 -11504 -10171 -440 5391 4266 3013
1781 3013 4476 753 -7764 -6695 4216 8429 2217 -1448 2909 5755 -1737 -12642 -8533 10900
1795 10900 19767 2824 -15185 -12161 4405 11369 3559 -5105 -1447 5922 784 -10106 -8256 2295
1809 2295 6788 4320 1049 -2367 -6281 -8770 -4337 7659 12500 -372 -15735 -11512 3725 7440
1823G440r986o350Q957J1665n883j8847m076J8635J3820p752j4939m830P370P852
1837C076O70j968J571l64o299j193N531N06n395k8R162N809q835j6222p81K2660
1853G900J5733j3159k2631k637J6553R841q355j2351M140J4635J342j3070p827
1866i886N457Q745N263q09o590q569n430M845J3702Q368j1092j5757L820J6498
1880H565L895j5243j2418R680K1275P43k4074j6072J4325K2170L345j3988j2481
1893a0278J826J1044L458m264l199j293n52L541M455l802r209o77J3467J3159
1907A7676n962k3430j0863J8804K3353m826k2859q979J4311J6091m572j7008l830
1920a2094J5781J0821o807j3251n685M229R807O665k077q486q459M48J2165J0515
$$ plain form
1823 7440 -2546 -8896 61 11726 5843 -13004 -17080 1555 15375 7623 -7316 -12146 -4776 3076
1837 3076 3746 1778 3349 2985 -3314 -4507 1024 1530 -3865 -3893 5269 11078 2243 -13979 -14760 7900
1853 7900 23633 10474 -12157 -14794 1759 11600 3245 -9106 -4966 9669 11011 -2059 -9886
1866 -9886 -4429 4316 9579 8770 2180 -6389 -11819 -6974 6728 15096 4004 -11753 -7933 8565
1880 8565 12460 -2783 -15201 -5521 15754 16497 -7577 -23649 -9324 12846 16191 2203 -10278
1893 -10278 -8452 2592 6050 1786 -1413 -2706 -3258 283 4738 936 -8273 -8950 4517 17676
1907 17676 11714 -11716 -22579 -3775 19578 14752 -8107 -17086 -2775 13316 8744 -8264 -12094
1920 -12094 3687 14508 7701 -5550 -11235 -7006 2801 9466 7389 -1097 -9556 -9108 3057 13572
1934A3572q705j6556J031J7783P464j3845j9259M182K4073J1337j8039k0897L201
1947a4658J8942Q798q467j3453j119R426N650l194l912j590n72M624O600l569
1961C506j1767n107J0091J6235R63j9066j4975J1714K1485R92j8602j0625J0224
1974d932J6449j620j7637p859J2540J3796o57j0797p626M72P275O782m74o308
1988e96o531j074R159R341o722j4336N06J6629J0162j0789k0453k302K0943J4748
2002A8685j2260j9752k66J6243J1905n899j3778l337R065P035k685o119m161L32
2016d992P095Q908k240j2435q215P888J7479N122j7277j7734P640K0262L570j6438
2030a367j3558Q725J9458M426j7410j3733O934J4282M138p495j0173l566N888
$$ plain form
1934 13572 4867 -11689 -10658 7125 14589 744 -18515 -14333 9740 21077 3038 -17859 -14658
1947 -14658 4284 13082 4615 -8838 -9957 -531 5119 1925 -1987 -3577 -4149 475 7075 3506
1961 3506 -8261 -13368 -3277 12958 13921 -5145 -20120 -8406 13079 14071 -4531 -15156 -4932
1974 -4932 11517 9897 -7740 -15599 -3059 10737 10080 -717 -8343 -7871 -596 6186 5712 -596
1988 -596 -7127 -8201 958 10299 3577 -10759 -10253 6376 16538 5749 -14704 -17006 3937 18685
2002 18685 6425 -13327 -13593 2650 14555 8656 -5122 -8459 606 7641 4956 -1163 -5324 -4992
2016 -4992 2103 11011 8771 -3664 -11879 -3991 13488 18610 1333 -16401 -8761 11501 15071 -1367
2030 -1367 -14925 -6200 13258 17684 274 -13459 -6525 7757 11895 4400 -5773 -9339 -3451
2043c451P828K224l695p797k491R710J1020o257j8191m995J4988J5698n014k0247
2057a0670q228J6733J7435n477j8194n359J1674J1613j604j2908n983O369P316
2070B717L28k830l908k775M931R355K580r721j2157O1J4795J0184j0560j6272
2084a3272L110J7588P213j1702j3899K064J5616P054j1183j1988J914Q896L513
2097D924k373m303j804K303K627K454Ln685o489M410J0708J70j3020p416P883
2112e608J3912J034j3813q353R466J3497l414j3323n736P894Q729n33p583k283
2126f114N784K986j772j119p79k733M61N309M020l616q520k813R351J0112n808
2141D749j2963J288J2874N921q446j2372N84J2845O642q508r032K943Q033J367
$$ plain form
2043 -3451 4377 6601 2906 -4891 -7382 2328 13348 7091 -11100 -16095 -1107 14591 9577 -10670
2057 -10670 -18898 -2165 15270 9793 -8401 -13760 -2086 9527 7923 -4985 -10968 -4599 2717
2070 2717 3045 215 -3693 -6468 -1537 7818 10398 677 -11480 -11419 3376 13560 3000 -13272
2084 -13272 -10162 7426 14639 2937 -10962 -8898 6718 13772 2589 -9399 -7485 1411 4924
2097 4924 2551 -1752 -3556 -1253 1374 3828 3831 -1854 -8343 -3933 6775 6945 -6075 -13491 -5608
2112 -5608 8304 9338 -4475 -12828 -3362 10135 6721 -6602 -12338 -4444 4285 3752 -3831 -6114
2126 -6114 -330 2656 884 -235 -1014 -3747 -3286 2023 6043 2427 -6093 -8906 445 10557 4749
2141 4749 -8214 -6926 5948 11869 3423 -8949 -8365 4480 11122 2614 -6418 -3475 4558 5925
2155E925l918l741N89K121P4J004J942k834o475J276R209K905p803p386L220J0842
2171F950K599j1457q872P019J2253l60j0676n080N827P640j107p303j186N410
2185A657J668l235j60J407k216k154K440M968J442o424n642M421R328j821j0130
2200d451l065Q708P227l908r467k000Q445N133o089o232M139N067j224m010j133
2215b860K677Q59l049o78N592J937o581m118M905N173j752n683j194O292M617
2230F137n480p744L078Q044k21n666k006M987L158m003n409K935P485j670o752
2245c127L93N689J718n025m080K978N969r3o563j139N492J568n090k660L149M148
2261C327j095n471k37O384J424p836l249O615N501m198o646J72O507K810n822
$$ plain form
2155 5925 2007 -1734 -1145 976 1050 2054 3996 1162 -5313 -4037 5172 8077 274 -7112 -3892 6950
2171 6950 9549 -1908 -10780 -3761 8492 8132 -2544 -7624 -1797 5843 4736 -2567 -3753 1657
2185 1657 3325 90 -70 1337 -879 -3033 -593 4375 5817 -607 -6249 -1828 7500 5679 -4451
2200 -4451 -7516 1192 8419 4511 -4956 -6956 1489 6622 533 -5699 -1560 3507 2283 -1727 -2860
2215 -2860 -183 676 -2373 -3051 2541 4478 -2103 -6221 -1316 3857 2105 -3578 -4772 1520 6137
2230 6137 657 -7087 -4009 4035 3814 -1852 -3858 1129 4287 284 -5125 -2190 5295 3625 -3127
2245 -3127 -2734 2955 4673 -352 -4432 -1454 4515 4422 -2141 -3280 2212 3780 -1310 -3970 -821 3327
2261 3327 2232 -3239 -3476 2908 4332 -3504 -6753 -138 5363 1165 -5481 -5309 1198 4008 -1814
2276a814n539N107O079k077n745K06L790J381k790k729L068L890l049m851L444
2291a629N357j834n634j14O236M072n353p359K825R132j3p929k133O104N340l051
2307D017p057j066O372L041m549k177L577J700l005k270J260L442p54m056K3N522
2323D020N06p346l062O190N522l247p624n77P404N167n753p867K573P206o04n966
2339c458k214M576M601j410n563k24M056j38k699K194L062j946m248n21N430L853
2355E351m006o449L211P866o79r078k645P766Q213k498j0343m176P873O922l496
2370C832n877K002L679J15k751j867R91Q08j87M97L296j785o887j497Q355N985
2386H709n178r476k157Q862P815o043r548K005R017J703p343o273K607Q434L134
$$ plain form
2276 -1814 -7353 -2246 3833 1756 -3989 -3783 7 1388 -1402 -4131 -1063 2827 -222 -5073 -1629
2291 -1629 3728 1894 -3740 -3854 2382 6454 1101 -6258 -3433 5699 5686 -2243 -4376 1728 7068 4017
2307 4017 -3040 -4106 2266 5307 758 -1419 2158 3858 853 -1417 -157 3285 2531 -1525 -1502 4020
2323 4020 4526 -2820 -5882 308 5830 2583 -5041 -5618 1786 6953 1200 -6667 -4094 3112 2508 -3458
2339 -3458 -5672 -1096 3505 2095 -3468 -3692 364 226 -2473 -279 2783 837 -3411 -3932 1498 5351
2355 5351 1345 -5104 -1893 5973 5294 -3784 -6429 1337 9550 7052 -3291 -7467 406 7328 3832
2370 3832 -2045 -43 3636 3751 1000 -867 124 932 745 1242 4538 2753 -4134 -5631 2724 8709
2386 8709 3531 -5945 -8102 760 8575 2532 -7016 -5011 4006 5709 -1634 -7907 -5300 3134 6268
2401F268n435m322Q76K6J16L484K584k794l956n74N509L175m481o714L719R876
2417G357l71j0476n791O431J0639J343q908p193M512O394j408m448Q81L336L14
2432B612k098k449p9J185l93J969L644j518q453l187P388P427j599q269m424N705
2448b539O782l333q336J989Q661K829o795p437M59P143M350k552k830J46j237
2463b700n77K425K917n71k863o63K574K034l447m789L511R777K03r304p010M207
2479d276R900L165p044o698M035N478k303n152N11N032L282j772n315k036J212
2494a981K342K696L129j966p776k900N055N935m96n611k503O426M710o771r715
2509i426K626J1476N672o692r799j690P517N256k825l498O21O26m97K14L01q53
$$ plain form
2401 6268 833 -3489 -2613 -2587 -2471 1013 3597 803 -3153 -3727 1782 4957 476 -6238 -2519 7357
2417 7357 6986 -3490 -9281 -2850 7789 9132 224 -6969 -2457 3937 2529 -1919 -1038 2298 2612
2432 2612 514 -1935 -2014 -829 -1222 747 4391 2873 -5580 -8767 -1379 6048 4449 -3820 -8244 -2539
2448 -2539 4243 910 -7426 -5437 3224 6053 -742 -8179 -7720 -577 3773 1221 -1609 -1463 -2700
2463 -2700 -3277 -852 2065 1494 -1369 -2032 542 2576 -871 -5660 -2149 7628 7831 -1473 -8483 -4276
2479 -4276 5624 8789 1745 -4953 -918 4560 2257 -2895 -2384 2648 5930 4158 -1157 -3193 -1981
2494 -1981 361 3057 6186 4220 -3556 -6456 -1401 4534 4038 -1573 -4076 2350 7060 289 -9426
2509 -9426 -6800 4676 10348 3656 -6143 -7833 -316 4940 2115 -1383 -762 -136 -633 -419 -118 -971
2525i71M46J369K257J17n840n734M955J1566K028j0022q726K442R835L344o399
2540F67n285M783O219l431p146j565N220O518Q18m570m679j022K66L755N657M62
2556F667o645m021K971M301q24n202n98P250O413o896j1857kJ1096O690l600q465
2572b722k897N722K915k269k335J719J405r13j053j001n96K35K109L389M49o692
2588b535p765L297J1123M176p087q610N40P354K211o319l835O813O895l292r053
2603f087l820L704P220L618k674l551j730j713O89N053J478l339k003K913K872
2618B630k382o834r28R747R212o099j2806k359R271Q177k299q338j956O285M261
2633E582m196m132J899L382J917j249l313l041M23M154M995K101o614r566R51
$$ plain form
2525 -971 -525 844 3101 3218 -2622 -8356 -3401 8165 10193 171 -8555 -6113 3722 7066 667
2540 667 -4618 165 6384 2953 -4193 -5758 -538 5980 6798 2228 -2451 -3473 -3207 548 6205 6667
2556 6667 22 -3999 -1028 3273 2449 -2753 -3351 3899 10312 3416 -8441 -8443 2653 9343 5743 -2722
2572 -2722 -5619 103 3018 749 -1586 133 1538 625 -428 -1429 -2025 -1790 319 3708 4157 -2535
2588 -2535 -10300 -7003 4120 8296 1209 -7401 -6861 493 2704 -3615 -7450 -637 6258 2966 -6087
2603 -6087 -9907 -6203 1017 4635 1961 -1590 -3320 -5033 -4344 709 2187 -1152 -3155 -242 2630
2618 2630 248 -6586 -7514 2233 11445 5346 -7460 -9819 -548 7629 5330 -3008 -4964 1321 5582
2633 5582 1386 -2746 -847 2535 4452 3203 -110 -3151 -2728 1426 6421 8522 1908 -7658 -6707
2648f707J1025N718o267p910J082P815J857r362o862P645J1725M09r371q203M60
2663f946O953M224j519j693l83k292j030K352R99k710q59L947M460j493r435n534
2679a0959Q121J1511j280j1778n097O814Q387m49p451l340O018M556m156m444
2693c547J290M248J811m90k137k366j114L78M872O284j878r765m142O961O363
2708F768j439o457m60P586L520q611r241L631J0860M085n283o845p88L099Q34
2723A259j809R77L089j414l195J70J210k218k414J549N437K500o351q190L274
2738f126R637J586q529n309L792P185M12o740l050O117M112m150m710P92M231
2753g50K314m28j557q69j571k706K125P224K820o473m218K448M380j103n156p05
$$ plain form
2648 -6707 4318 10036 3769 -4141 -3059 4756 6613 -2749 -9611 -1966 9759 10168 797 -7406 -6946
2663 -6946 7 4231 2712 1019 636 -1656 -2686 -334 665 -2045 -2904 1043 5503 4010 -5425 -10959
2679 -10959 -2838 8673 7393 -4385 -9482 -2668 5719 5270 -2181 -5521 497 5053 897 -3547
2693 -3547 -2257 1991 3802 3312 1175 -1191 -2305 -1927 2945 9229 7351 -2414 -6556 405 6768
2708 6768 5329 -1128 -1588 5998 9518 907 -8334 -4703 6157 10242 4959 -1886 -2674 425 1259
2723 1259 -550 427 3516 2102 -1093 -923 287 -1931 -4345 -2796 2641 5141 -1210 -9400 -6126
2738 -6126 3511 5097 -3432 -8741 -4949 2236 2648 -4092 -7142 -1025 3087 -1063 -5773 -4981 -750
2753 -750 1564 1136 -421 -1290 -2861 -5567 -3442 3782 6602 129 -4089 -1641 2739 1636 -3520 -4225
2769d225Q049O078n828j0484m43Q064N542k276m901j75L234m77m398k36L508P07
2785A739j029P22J453k076l910n44M266M837k851q183J08Q185L168n375o324J359
2801d455O591K165n196l498L875M566l075m605j15L006K023q44L79J381p63n485
2817d050j838N871N507k881m780j89M205R16m735l867M496P793r13o613k855K800
2833a133K412q22j578J732K745p07m981Q67L776o19m164q7M690K787l000n083
2849c165M3O156J664n738l354M034N221j304m233k080K361K121j884j216L396
2864B022K503l648l376J966K126j034l462L36N754K671n557o690K584O462J383
2879D040l821k854K244L455k440n289J98N376J187j768j89J589p19k996j350L062
$$ plain form
2769 -4225 3824 9902 4074 -6410 -6853 1211 6753 4477 -424 -599 2635 2158 -2240 -2476 1032 1739
2785 1739 710 1432 2885 809 -3101 -3645 621 5458 2607 -5576 -5468 2717 5885 510 -5814 -4455
2801 -4455 2136 4301 -895 -4393 -518 4048 973 -3632 -3747 -741 1282 438 817 2198 1435 -4050
2817 -4050 -5888 -17 5490 2609 -2171 -2360 1845 2761 -1974 -5841 -1345 6448 5535 -1078 -3933 -1133
2833 -1133 1279 457 -1121 611 3356 2649 -2332 -1465 2311 1692 -2472 -2559 2131 4918 1918 -3165
2849 -3165 -3122 3034 4698 -1040 -4394 -360 4861 3557 -676 -2756 -395 1726 -158 -1374 2022
2864 2022 4525 877 -2499 -533 1593 559 -2903 -2567 3187 5858 301 -6389 -3805 2657 4040
2879 4040 219 -2635 -391 3064 624 -4665 -4467 909 2096 328 139 1728 1009 -1987 -3337 -275
2895b75L910k254n130Q87O100L34n824l335M363O380P5n547l050M163K998m204
2911d09l960J969M423J372j786j482R04L37k483j052L684K098m258k808K325L501
2927B375r22m859j492O041O491m367q014k38N254K202l307l943J102N710J528
2942C561m202k163J935O48n57J236J574j272l260j470K571L917k696m915K469
2957b624P909K131p059o514R88P034K723n985m250M210N813j042n069j696K097
2972a334L334J412j841j172j448k223M31M665J200m826k724N208O046j267q266
2987b805n372O176Q683j890q827k598N801N866j670o617j949O035L925j427l105
3002B26j564j874J01L056K488j174l263o61M694M262m439q764J99R605N613n183
$$ plain form
2895 -275 3635 1381 -3749 -2862 3238 3572 -2252 -5587 -1224 5156 5231 -316 -3366 797 3795 -409
2911 -409 -4369 -2400 2023 3395 1609 127 1031 1368 -1115 -2167 1517 3615 -643 -3451 -1126 2375
2927 2375 1453 -3406 -4898 1143 7634 3267 -4747 -4985 269 2471 -836 -4779 -3677 2033 3561
2942 3561 -641 -2804 -869 -221 -778 458 2032 760 -2500 -3970 -1399 2518 -178 -5093 -2624
2957 -2624 5285 7416 357 -6157 -5169 1865 4588 -1397 -5647 -1437 4376 3334 -1735 -3431 -1334
2972 -1334 2000 3412 1571 399 -1049 -3272 -2841 1824 3024 -1802 -4526 682 6728 5461 -2805
2987 -2805 -8177 -2001 6682 4792 -4035 -6633 -832 5034 3364 -3253 -5202 833 4758 3331 226
3002 226 -1338 -3212 -3111 -55 2433 1259 -2004 -2665 2029 6291 1852 -6912 -6713 2892 8505 3322
3018C322r403o69P232N746m415o612K273O566J923l943l863j587K082J957J094
3033A703Q99j550l218L60N512K257n807n590K850P841L052p547q296L537R707
3048E710P52p160m426M546O279K47n995m832K408L817K94k8o39k063j548K195
3064d43L134q67m092k398M361O717k313r699l608P717P758j755p790k724O137
3079A35O148l991p842J81N956K944j412k811j656J158J139O67J537j135l311M
3095b289N117K767m925o881J430P814M771n444q204J292Q995K012p264n559K589
3110c779P259K323n602m756J078L327L83k51Qj847j210J474K959n25m226l532
3126f917L605Q044N20q968n222N772P714o17q156l882O549P759k228p628k284
$$ plain form
3018 3322 -6081 -6750 482 6228 1813 -4799 -2526 4040 5963 2020 -1843 -3430 -1348 609 1703
3033 1703 2602 1052 -2166 -1806 3706 5963 156 -5434 -2584 5257 8309 762 -7534 -3997 5710
3048 5710 6462 -698 -5124 -578 5701 5948 -47 -4879 -2471 1346 1640 1612 973 -1090 -2638 -443
3064 -443 2691 1824 -2268 -4666 -305 6412 4099 -5600 -9208 -1491 6267 4512 -3278 -6002 135
3079 135 6283 2292 -5550 -5369 587 3531 2119 -692 -2348 -1190 -51 616 2153 1018 -2293 -2289
3095 -2289 2828 5595 670 -6211 -4781 3033 7804 2360 -5844 -4552 4443 6455 -809 -6368 -3779
3110 -3779 3480 5803 201 -4555 -3477 -150 233 -18 -10 -1857 -3067 -1593 1366 841 -3385 -6917
3126 -6917 -3312 4732 5252 -3716 -8938 -3166 4548 3931 -4225 -8107 -1558 6201 3973 -3655 -5939
3141e939M176L934N62k061k176N23R42Q51J075n18l758j079O003M333l214p601
3157c947j943O951O518l333q802o00Q454M015n582o429N16O282L419l687l807
3172a975K23K103K51M01M11j384k309J526K978K046l562n683P26P585L358o333
3188C62o312L210O890J753o721n940M126P710k13n293k861K713J325nq30r8J003
3205H19o49p03J975P26m235k895L971N518q7o203m337L659O983r36p713j229N893
3222E57M228l240n219n84M865K885k602l443J117J663n18K73J348k64j983j457
3238b374K192L743o03m624j379N248L579m631n315J334O655K523m693o540K018
3253b867O292R47m246j260J869R70j628k291K46K529J27j236R75J549l298m283
$$ plain form
3141 -5939 -1763 2171 2733 672 -1504 -981 -39 812 1887 1369 -2389 -3468 2535 6868 3654 -3947
3157 -3947 -5890 1061 7579 4246 -4556 -5156 3298 7313 1731 -4698 -4182 2100 5519 1832 -1975
3172 -1975 -1752 351 602 1003 1414 30 -2279 -753 2225 4271 709 -4974 -4248 3337 6695 362
3188 362 -5950 -2740 4150 5903 -818 -6758 -2632 5078 4865 -428 -3289 -576 749 744 -86 -184 819
3205 819 170 -533 1442 2168 -2067 -4962 -991 4527 4440 -1763 -6100 -2441 4542 3606 -4107 -5336 557
3222 557 4785 1545 -3674 -4258 607 3492 890 -2553 -1436 227 -291 -18 1330 1066 -917 -2374
3238 -2374 -182 3561 2958 -1666 -3045 2203 5782 1151 -4164 -2830 3825 6348 1655 -4885 -2867
3253 -2867 3425 4372 126 -1134 735 1705 77 -2214 -1968 561 688 -548 427 1976 -1322 -5605
3269e605J869N144J794m053m864J521O007K86o154k217M519M249j738m515j394
3284e151L893L560k269k798O60J032o50j20K663J502j352l100J75L507J500l884
3300h32k550M297M436k168n534j033M550M714k205n074n95L416M49j785J99J972
3316B257M59k048k101O16K338m44k356J764L889j392n530k081L214N184o75m866
3332a772j954L769K403k663k244K140J920k68k958p56J344J996r74m42K204K91
3348B036m303k496L259M678R41m471l667K962M075k256l610R98L823J501l106
3363C64l750J314L259R05j541o6N49j991k103J969L868Q39l199l056J411L630
3379B402j187m066M31N427J928l943m625M09M774K931k326l493R49J175j211l42
$$ plain form
3269 -5605 -3736 1408 3202 -851 -5715 -4194 1813 2099 -4055 -6272 -1753 2496 758 -3757 -5151
3284 -5151 -1258 2302 33 -2765 -2105 -1073 -1723 -1843 820 2322 970 -2130 -1955 1552 3052 -832
3300 -832 -3382 915 5351 3183 -2351 -3384 1166 5880 3675 -1399 -1994 1422 1871 86 285 2257
3316 2257 2716 668 -1433 -817 1521 1077 -1279 485 4374 2982 -2548 -4629 -1415 3769 3094 -1772
3332 -1772 -3726 43 2446 -217 -2461 -321 1599 1331 -1627 -2383 -1039 957 -17 -459 1745 2036
3348 2036 -2267 -4763 -1504 3174 4115 -356 -4023 -1061 3014 758 -2852 -1854 1969 3470 364
3363 364 -3386 -2072 1187 2092 551 485 1034 -957 -3060 -1091 2777 3616 417 -2639 -1228 2402
3379 2402 1215 -2851 -2420 3007 4935 992 -3633 -3224 1550 4481 2155 -1338 -389 786 -425 -767
3395g67J708R29o73j271m86J099m54k899R71N343J946m868n487O41N568K835l196
3412I39m227J592L911p39m092o78L164K383n72l109j742Q49J768P01J709K22l267
3429a188l253J400M583J401l167k837K217M537j440o166j293O626M457k803n720
3444b646k551M131M962p14l199l82R01j128M40K51lJ98M06J466R30l262m943Q89
3462d254O997M463m246p156p64N783M186l517n770J032O065J132m159l696J319
3477b585L658L434k553l454k104P04K157M152M92m820l833J820N306J105m333
3492h54m471L530P172o70q529m412N534Q318Q32o667o011J856N433J865k393j200
3508f67l29L59J399k14j549k121J237M368L681l333p966k208P747P056k243q340
$$ plain form
3395 -767 941 1870 1197 -74 -560 539 85 -2814 -1843 3500 5446 578 -4909 -4268 1300 4135 939
3412 939 -3288 -1696 2215 1476 -2616 -3294 -130 2253 1681 -1428 -3170 -2321 -553 148 1857 2079 -1188
3429 -1188 -4441 -3041 1542 2943 -224 -3061 -844 3693 2253 -3913 -5206 1420 5877 3074 -2646
3444 -2646 -5197 -1066 3896 3182 -17 -399 502 -626 -186 65 62 260 666 2132 3062 -200 -5143 -4254
3462 -4254 2743 7206 2960 -4196 -4960 823 5009 1492 -4278 -3246 2819 3951 -208 -3904 -2585
3477 -2585 1073 4507 1954 -1500 -3604 -2900 -743 3409 3901 -919 -4752 -2932 2374 3479 -854
3492 -854 -5325 -1795 5377 4707 -3822 -8234 -2700 5618 6450 -217 -6228 -4372 1061 2926 533 -667
3508 -667 -996 -637 762 548 -1001 -3122 -1885 2483 6164 2831 -5135 -7343 404 7460 5217 -3123
3524c123k888N643O193k101p329j116O307M239k813m987k291K976M331J094k489
3539A646l037k451J406N191L114m276n534M03N445L272m364o593K000Q357K996
3554G575p887p432K383Q298M478m080o469p57M219J662j462p51k76M65K195J656
3570C817k293m116j404M099O314k06p877n933N381Q555J19p365m764M504P129
3585E960q10p472l204N334M618n27m388l976J668L789J843n87k243l529m87M901
3601H90L498k937n852j050N369N101l823p825p3R119N531n940q787j206O956O045
3617E016j875o117j006L578K633j450j762j384K39L558K650q77m646m212K375
3632c280P670K585o601p117K847Q653K374o455p501K608Q635J909o783n268K793
$$ plain form
3524 -3123 -6011 -368 5825 3724 -3605 -4721 1586 5825 3012 -1975 -4266 -1290 3041 4135 1646
3539 1646 -1391 -3842 -2436 2755 5869 1593 -3941 -3538 1907 5179 815 -5778 -3778 4579 7575
3554 7575 -312 -7744 -5361 2937 7415 3335 -3134 -3891 328 1990 528 -223 -499 -34 2161 3817
3570 3817 1524 -2592 -3996 103 6417 6211 -1666 -7599 -2218 6337 6456 -909 -5673 -1169 5960
3585 5960 5150 -2322 -5526 -192 4426 3899 -489 -4465 -2797 992 2835 2248 5 -3524 -4011 890
3601 890 4388 1451 -4401 -5451 -82 5019 1196 -6629 -6702 2417 7948 2008 -6779 -7985 -1029 5016
3617 5016 3141 -2976 -3982 -404 2229 779 -983 -2367 -2128 1430 4080 3203 -1443 -5655 -3280
3632 -3280 4390 6975 374 -6743 -3896 4757 7131 676 -6825 -4217 4418 6327 -456 -5724 -2931
3647b931N249J835k964m224p96K822K813Q39j026m530k495L785N709m68o171l495
3663f048M535O612n69q861m117O985P848j392p097l832L251O061n0m166j679J927
3679e92K174L08n94k117j719R01L727K838k249o182j444N915O192m117p347o43
3695d949O419N263l238p332j085O612L979l225m913rK833K545p51k329j205J68
3711a217J179K194K001l045m993J392M854K529m202m861J547P010K259o613o168
3726f134K911O368J957m254m104J244M002J021l325j437J101M11Q52J140o19k654
3742a520j852K142L659Q19m866l544L285N963n15o345k862M224N341n02n545l014
3758e132M326L349r90k538r30J665J262l37k45n18j217j036J869M245o16n087
$$ plain form
3647 -2931 2318 4153 1189 -3035 -3831 -1009 1804 2643 1617 -2913 -5408 -1623 4086 3618 -2553 -6048
3663 -6048 -1513 5099 4530 -4331 -8448 -1463 6385 4993 -2104 -5936 -2685 3376 3326 -840 -2519 -592
3679 -592 1582 1890 1296 -821 -2540 -1639 2088 4926 2677 -3505 -4949 966 7158 3041 -4306 -4949
3695 -4949 1470 6733 3495 -3837 -4922 1690 5669 2444 -2469 -2478 355 2900 2149 -180 -1385 -1217
3711 -1217 -38 2156 4157 1112 -3881 -2489 2365 4894 692 -4169 -2622 4388 6647 34 -6134
3726 -6134 -3223 3145 5102 848 -3256 -2012 1990 3011 -314 -1751 -650 -239 613 1753 1134 -1520
3742 -1520 -3372 -1230 2429 3248 -1618 -5162 -1877 4086 3571 -2774 -5636 -1412 3929 3427 -2118 -5132
3758 -5132 -806 2543 1553 -985 -1915 -250 1012 675 430 -88 -1305 -2341 -472 3773 3157 -1930
3774a930j552M218L474j918n437j597N360M837l399n651Q7L978K661j787l444
3789b100k17K610O34j013o28l17j494k7K851K331j946l934q51M187L849l357n232
3806d654M82N335K500l934m225P59N178K793l107k816R68J863n55j77k52l73o48
3823h63P92K278J680k009m274L15N332K418m620m509J166N736J741m563m824K351
3839a853N065Q64l449k258J045J352O00j275j355k39m42O56K852P18l532l195
3855d446K812M579J018n167m799K377O094M67n541k176L803M870j58m187k839
3870c293J699L080N91j604N9r41r65K054K240m51l347j613L039M565p83o005k991
3887d666M703M568j819n524j655M520N142j308n472j984L028J962q93j624j169
$$ plain form
3774 -1930 -3482 736 4210 2292 -3145 -4742 618 5455 2056 -3595 -3508 470 3131 1344 -2100
3789 -2100 -2317 293 927 -86 -714 -1031 -2525 -2552 299 2630 684 -3250 -4101 86 3935 578 -4654
3806 -4654 -4172 1163 3663 -271 -4496 -3737 1441 4234 1127 -1689 -721 1142 587 410 158 -215 -863
3823 -863 -71 2207 3887 1878 -2396 -2081 3251 5669 1049 -3460 -2294 3442 5183 620 -4204 -1853
3839 -1853 3212 4076 627 -1631 -586 766 1366 91 -1264 -1503 -1945 -1289 1563 2281 -1251 -4446
3855 -4446 -1634 2945 3963 -1204 -6003 -3626 2468 2935 -2606 -4782 -979 3891 3733 -454 -3293
3870 -3293 -1594 1486 2077 473 532 -409 -1374 680 2920 2469 -878 -2491 548 5113 4330 -1675 -4666
3887 -4666 37 4605 2786 -2738 -4393 127 5269 3961 -1511 -3495 -467 1495 602 -1022 -2191
3902b191L44J209J006J020j405k821l62M648L129l556n797l38N990M234l222o172
3918d284m58O942L427m205m996J074M544K849k723l651o30J823J502J187R0k575
3934h4j750K183L711m0m759m302K023P009J622o796m928L418O584Q91o151n256
3950f625K805O270J308m537l122M16L122J331n16k347j832Q82L157K633j178n482
3966c715j930N133O163k212p150k729N861O825r53p811k690N716N528j667n765
3981a396k599L356N034N13l468k452l88K094K883O16l736m376J490N872K597m143
3997A897p493J08P797M671n717p930N70P614L977m313p025r12O168L537k179l988
4013c218j394J406L213K399k254m068j267L314M980P63n982m989M350P785P22
$$ plain form
3902 -2191 -1847 -638 368 1388 -17 -2838 -3200 1448 4577 1021 -4776 -5114 876 5110 1888 -4284
3918 -4284 -4742 2200 5627 1422 -3574 -2500 2044 4893 2170 -1481 -2111 -288 1214 2401 2491 -84
3934 -84 -1834 349 4060 4020 -739 -5041 -3018 3991 5613 -1183 -6111 -2693 3891 4782 -1369 -6625
3950 -6625 -3820 2450 3758 -779 -3901 -3485 -363 968 452 -1895 -3727 -2845 312 2945 1767 -3715
3966 -3715 -5645 -512 5651 3439 -3711 -6440 -579 6246 5293 -2518 -5208 508 6036 4369 -1396
3981 -1396 -3995 -639 4395 4908 1440 -1012 -1400 694 3577 4193 457 -3919 -2429 3443 6040 1897
3997 1897 -5596 -5488 2309 6980 1263 -6667 -6097 1517 5494 1181 -5844 -6756 -588 2949 770 -3218
4013 -3218 -4612 -3206 7 2406 152 -3916 -5183 -1869 3111 3874 -2108 -7097 -2747 5038 5760
4028E760p236n746L347Q842J881p157n451L559O357J952m556m454J98L932K621
4043C849r34l086j628K97L687L286k819o400j061N622N539j586p853l849O393
4058e43P082k692p610k716N926N767j615o480l005M298M336n62k874k620n18K921
4074i05L883q3l588l127P65N078L326n014o013J406P902L540n296p447R44P862
4090C233M507n115o720O57N520K888k053l866j343K765K551J0k042k520r08L125
4106F89M201l58o673l797L273P373J076o717n729L667P637j38o695m278L404O731
4122C666N67n451m259J958M386J758j443k736k497J317L509K262j842m236j144
4137d185M402N244k815p344p13O320O241k872q288k733O663O100j493o720j423
$$ plain form
4028 5760 -1476 -7222 -3875 4967 6848 -309 -5760 -2201 4156 6108 1552 -2902 -2704 1228 3849
4043 3849 2915 -171 -1799 -1502 2185 5471 2652 -3748 -4809 813 6352 4766 -3087 -6936 -543
4058 -543 6539 3847 -3763 -6479 -553 5214 3599 -2881 -5886 -1588 2748 2186 -688 -3308 -3826 -905
4074 -905 2978 2895 -693 -3820 -3055 2023 5349 335 -5678 -4272 3630 7170 1874 -5573 -4629 3233
4090 3233 7740 2625 -4095 -3438 2082 4970 2917 -949 -2292 473 3024 3034 992 -1528 -2436 689
4106 689 4890 4532 -2141 -5938 -2665 4708 5784 -933 -6662 -2995 4642 4504 -2191 -6469 -3065 3666
4122 3666 4233 -1218 -5477 -3519 867 2625 1182 -1554 -4051 -2734 775 3037 1195 -3041 -4185
4137 -4185 217 5461 2646 -4698 -5411 909 7150 4278 -4010 -6743 -80 6020 4527 -2193 -3616
4152c616L226L519J60l453k282J264K043J697n74k961l144J780N902J764m872
4167D53o326P0P049M709m692o474K61O624K941m344n673P79N432L545l349m468
4183c463o98K453K480J427j421l119j681K602L879P48l836l649K389N865L81o380
4199b023l890M055P055J351o586n619K825O024J199l570k560R58K038J007j062
4214A202j889k07N35J879J560j395m279j446M760M584j407o429k829L922N735
4229D296q30n756j653M541L429k114m707j335L658M006r13k722j522r9J098K332
4245A709J543k318k938r5K757L242j799m929N07N434K227m406n355R59N619L886
4261F043l024n773J2L516J754j332j667m75J288Q96n92n95p71j042J064L093O66
$$ plain form
4152 -3616 -390 3129 3289 -164 -2446 -1182 861 2558 1984 -977 -4121 -2341 3561 5325 453
4167 453 -5873 -5803 1246 5955 1263 -5211 -4950 1674 4615 271 -5402 -4623 809 4354 1005 -3463
4183 -3463 -4161 -1708 772 2199 778 -2341 -4022 -1420 2459 3207 -629 -4278 -1889 3976 4357 -2023
4199 -2023 -5913 -1858 5197 6548 -38 -5657 -2832 3192 4391 821 -1739 -781 1257 2264 1202
4214 1202 -687 -894 -359 1520 3080 1685 -2594 -4040 720 5304 3897 -2532 -5361 -1439 4296
4229 4296 3466 -2290 -3943 598 4027 1913 -2794 -4129 -471 3535 2622 -100 -1622 -1721 -623 1709
4245 1709 3252 934 -2004 -2099 658 3900 2101 -2828 -2321 3113 5340 934 -4421 -3462 2157 6043
4261 6043 3019 -2754 -2742 774 2528 1196 -471 -946 342 1238 646 51 -720 -1762 -698 2395 3061
4278C061m491m230K493N641J885m279n033R71N488J311m529k740K315L812O32
4293B307l538k604J245K759J371l31j331k204r09K970L110k33l315k497J969M488
4309C257n71m473j883M387M439j756n242k520L173N088J19l954j841Q85J370J038
4325A516m42j296q73M34J105J078j009l179n72M262L700l114n924r73M637M865
4341D215j442n417j774M018K724k119k928l12K697K230l57k650j182N38J183K509
4357A933J263l187l574N96M862K754k695m714n5N035K335m171m321J629N486K069
4373E245l322m863j31M028K183j052j885j214J31J291J420K45k712j443J008L775
4389B704N90m598l863L360O347J48n632m511K217O239J287m355l232J782L387
$$ plain form
4278 3061 -1430 -5660 -3167 2474 4359 80 -4953 -3982 1506 2817 -1712 -4452 -2137 1675 2307
4293 2307 -1231 -3835 -2590 169 1540 1209 -122 -2326 -3235 -265 2845 2612 -703 -3200 -1231 3257
4309 3257 2686 -1787 -3670 717 5156 3400 -1842 -4362 -1189 3899 4018 64 -1777 -892 478 1516
4325 1516 1074 -222 -1095 -661 444 1522 513 -2666 -3238 1024 4724 1610 -4314 -5287 -650 4215
4341 4215 2773 -2644 -4418 -400 2324 205 -2723 -3035 -338 1892 1535 -1115 -2297 -1759 -576 1933
4357 1933 3196 9 -3565 -2969 1893 4647 1952 -2762 -2817 2218 4553 382 -3939 -2310 3176 5245
4373 5245 1923 -2940 -3071 957 3140 2088 203 -1011 -880 411 1831 2076 -636 -2079 -1071 2704
4389 2704 3294 -1304 -5167 -1807 4540 4688 -944 -5455 -3238 3001 4288 -67 -3299 -1517 1870
4404A870p4k288j863M17K478J517m69j701k055l44K981L877j566n379k193M299
4420d93M538p43o047j793M850M776k997n497p19M134L920q00m337k362J791K738
4436I59J006p30j815j756J145L193Q74l110k817K03M931K644m358n915J399O789
4452B642L739m540o217J60N325L583l077m607K60L302K045q22l033j336Q06K897
4468A127J810j288l451k862K497N943M19n789m480L214O288J079n727n018L691
4483b547O237N38n659l717J650N341K053l048l441j31K355J877J325j846l492
4498b505l5L537L465k082n045j605N302N743k321p618j948N855N471j453o469
4513a708l053M477M869j173m197j653J428L015Q88j961k890q66J731L244J095
$$ plain form
4404 1870 1796 -492 -2355 -1938 540 2057 1588 -113 -2168 -2512 469 4346 2780 -2599 -4792 -493
4420 -493 4045 3302 -2745 -4538 312 5088 2091 -3406 -4125 9 3929 3129 -1208 -3570 -1779 959
4436 959 1965 1235 -580 -2336 -1191 2002 2876 -234 -3051 -2848 2083 4727 369 -5546 -4147 2642
4452 2642 6381 1841 -4376 -4216 1109 4692 1615 -2992 -2732 570 2615 1793 -1240 -2576 -1770 1127
4468 1127 2937 1649 -1802 -4664 -2167 3776 4195 -1594 -6074 -2860 3428 4507 -1220 -6238 -2547
4483 -2547 3690 4228 -1431 -5148 -3498 1843 3896 848 -2593 -2724 -369 1508 2833 987 -2505
4498 -2505 -2540 997 4462 2380 -2665 -4270 1032 6775 4454 -3164 -5112 743 6214 4761 -1708
4513 -1708 -4761 -284 4585 3412 -785 -2438 -1010 2005 2893 932 -1958 -2824 -1093 2151 3246
4528C246l363n292R88O231K929m384n894J97O816L352m424o479R80O138K613l133
4544E21m507m70M088L395j190k915j901R93J958K961m81m300j655L046M605L81
4560D529n087m462L245P320L2o073m547L891N496Q67m929m544K619M909R12l250
4576I28k914m3K056K210m4k469k573J55L571K822j941n690j358N600M616k829
4592B097o141j827N408N380j949o675j610N034M088r99m321k305K255L521P39
4607B695k010j947p48J577L563Q36l786l963J569N162K813l980o134P47O713K761
4623E868m833n439Q28N727L034l472n126l6M232J821j142k673k099N13K901K060
4639B164j368l024k091K600M439M70n531l587L941O115k5n584m320K957O564O59
$$ plain form
4528 3246 -117 -5409 -4421 1810 4739 355 -5539 -5342 1474 4826 402 -6077 -5097 1041 3654 521
4544 521 -3986 -4456 -368 3027 1837 -1078 -2979 -1986 -28 2933 2452 -1848 -3503 -457 4148 4529
4560 4529 -558 -5020 -1775 5545 5577 -496 -5043 -1152 4344 5211 282 -4262 -1643 3266 4178 928
4576 928 -1986 -2029 27 2237 2193 -276 -2849 -2694 877 3699 1758 -3932 -5290 310 4926 2097
4592 2097 -4044 -5871 -463 4917 2968 -3707 -5317 -283 3805 2806 -1515 -3820 -1565 1956 2695
4607 2695 685 -1262 -2010 -433 3130 3966 180 -3783 -2214 2948 5761 1781 -4353 -3606 3107 5868
4623 5868 1035 -4404 -3576 2151 5185 1713 -3413 -3449 783 2604 1462 -1211 -3310 -2797 104 2164
4639 2164 796 -2228 -4319 -1719 2720 3190 -2341 -5928 -1987 4128 4103 -1481 -5801 -2844 3720 4379
4655D379m973l106K295M032Q56k189l001J44K422J694K8j277k862n82L877L292
4671E029k037n000j898M105N068j610o391k085M947M688k406n243j676L472M356
4686C319j303l750k109J738J743R20n76k098j378Q54K847J625k187l852k42N032
4702E83K649l725m927R16N708L152l129n114J50N452K231k798k970J92K336J670
4718B376m69j342j003K03J345J711N55l113l000K106M298J037m451l447J559M884
4734C249J376n065l174K266M546Pl889k658J115L060Q97k028j670j26P51J250
4750i3J553j114k429j050K069L044j53m443k309L771M822j278m755j707L870M328
4766D126l71n011j709K852K742p14j512r57N09J699M71q7j116j596P6K387K808
$$ plain form
4655 4379 -594 -3700 -1405 2627 3483 1294 -1707 -1563 859 2553 2581 1304 -1558 -2140 1737 5029
4671 5029 2992 -2008 -3906 199 5267 3657 -2734 -4819 128 4816 2410 -2833 -4509 -1037 3319
4686 3319 2016 -1734 -3843 -2105 -362 558 -18 -2116 -3494 -2640 207 1832 -355 -4207 -4449 583
4702 583 3232 -493 -5420 -4504 1204 4356 1227 -3887 -3737 1715 3946 1148 -1822 -1630 706 2376
4718 2376 1907 565 -438 -235 1110 2821 3376 263 -2737 -631 3667 4704 253 -3194 -1635 3249
4734 3249 4625 -440 -3614 -1348 3198 3205 -684 -3342 -2227 833 1730 -298 -1968 -2094 -1343 -93
4750 -93 1460 346 -2083 -3133 -1064 1980 1827 -2616 -4925 -1154 3668 2390 -2365 -4072 -202 4126
4766 4126 3755 -1256 -2965 -113 2629 1915 403 -554 -45 1654 2125 2038 922 -674 -598 1789 4597
4783D597k672m217k35L693L239j858n270l12M586K680k557m631r3L233J847j441
4799E89k742p68K090J496o5l00j427j882P69L313O60k589k760P12L979K225l287
4816A3m731J646N011K261l854l954Q05M149J897k457k945M46J764J803n1r14j482
4833e93m13J741J621K70l233k560K381M612J01m899k970K664M677L47m723l514
4849d491K538M321j42l097k557J529K453O83j344j567m27O73J240J710j213l399
4865c090p63L365L114j081m413j654L888M842j643n627j120L920L617j220l774
4880a639j123K652K904m50k260j184J97J398J947p9k211j864M39L316K544l175
4896A412m269j48N268K517l613m797O38N153K728l521m555J06L986J955j841k310
$$ plain form
4783 4597 1925 -2292 -2527 1166 4405 2547 -2723 -3035 1551 4231 1674 -2957 -3050 183 2030 589
4799 589 -2153 -2921 -831 665 600 300 -1127 -3009 -2240 1073 1733 -856 -3616 -2904 1075 3300 13
4816 13 -4718 -3072 1939 4200 346 -3608 -2803 1346 3243 786 -2159 -1713 51 1854 1803 889 -593
4833 -593 -1006 735 2356 2626 -607 -3167 -786 3826 3927 -972 -3942 -1278 3399 3746 -977 -4491
4849 -4491 -1953 2368 2226 -871 -3428 -1899 554 1237 -107 -1674 -2101 -1428 -188 1522 309 -3090
4865 -3090 -3853 -488 2626 1545 -2868 -4522 -634 4208 2565 -3062 -4182 -262 3355 2135 -1639
4880 -1639 -2762 -110 2794 2344 84 -1100 -903 495 2442 2363 152 -1712 -1273 2043 4587 1412
4896 1412 -2857 -3005 2263 4780 1167 -3630 -2992 2161 4889 1368 -3187 -3081 905 2860 1019 -1291
4912a291j252J569J839K99r49j703j097J726L176L63l612l065K545M718O08m582
4928g08l899K332O257Q92m914l319K290M296O60l424l297J450K898J074r47j455
4944A86j458M54K409J897j621l813j494L831L808r35n771k152N049M023j804n969
4960c360j638M528M668j421n490j729K963K365N51j945k172J76J672K275J73k414
4976g98k902P05M221J819l159m288N22N709L369l656n771k21N856L127l081m218
4992b766L4L803K519j796l447p1J819J878Q62j503k439j639K511L476m01l681
5008h41l477K123N345J314m842m076K603M912Q49m920m418J911N909J066l603
5023a45l113O83K162J544L4j727j935Q62J687J977m54m206r52L670L962j311n205
$$ plain form
4912 -1291 -2543 -974 865 1164 215 -1488 -2585 -859 2317 2680 -932 -3997 -1452 3266 3874 -708
4928 -708 -4607 -2275 3982 4874 -40 -3359 -1069 3227 3887 463 -2834 -1384 1514 2588 1641 186
4944 186 -1272 -818 1591 3488 1867 -1946 -3440 391 4199 3264 -2507 -4659 390 4413 2609 -3360
4960 -3360 -4998 -470 4198 2777 -2713 -4442 -1479 886 1437 -508 -2680 -2504 -832 1443 1616 -798
4976 -798 -3700 -2995 1226 3045 -114 -4402 -3880 1829 5198 1542 -4229 -4450 1406 4533 1452 -2766
4992 -2766 -2732 1071 3590 1794 -1653 -1724 95 1973 2835 1332 -1107 -2746 -235 3241 2840 -841
5008 -841 -4318 -2195 3150 4464 -378 -4454 -1851 3061 3910 -1010 -5428 -3517 2392 3458 -145
5023 -145 -3258 -2575 -413 1131 1165 -562 -2497 -1635 52 2029 1575 -2631 -3583 87 4049 2738 -2467
5040b467k372M589N270j018n976k546M148L730q28l026j808K294K902m52k297
5055A43j837O70J363K273M4k708k824J134L095K650k801m304l02M909K797l580
5071G22m337P35M581K391l293m458j08M841J999j625k403j314J285J318J000r51
5087C83j089p99Q62K678M12l504k501K414M874l1m283l889K230N812R99m492l716
5104c640K279L688K21k597k012J153K334M98j193j587r43M51J926K162j313l385
5120a958j614L113L154J84m671k458L881L658j480m875p37L395M023j042m365
5135a792k046K566K927l5j448j206m19P95J411M47j280j560J4K487K188k497m095
5152c543Q62M482K844l245m875n0M146L157k525l544K93K581R47j064k083K67
$$ plain form
5040 -2467 -4839 -250 5020 4002 -1974 -4520 -372 3358 2530 -496 -2304 -10 2892 2440 143
5055 143 -1694 -1024 339 2612 2656 -52 -2876 -1742 1353 4003 1202 -3102 -3404 1505 4302 722
5071 722 -3615 -2880 1701 4092 799 -3659 -3767 1074 3073 1448 -955 -2269 -984 334 1334 383
5087 383 -706 -1505 -643 2035 2447 -1057 -3558 -1144 3730 3699 -584 -4473 -2243 3569 4568 76 -3640
5104 -3640 -1361 2327 2548 -49 -2061 -908 1426 1924 731 -856 -1799 -1348 578 2740 1427 -1958
5120 -1958 -3572 -459 2695 2879 -1792 -4250 -369 3289 1809 -3066 -3803 -408 3615 2573 -1792
5135 -1792 -3838 -1272 1655 1620 172 -1034 -1453 -658 753 1200 -80 -1640 -1626 861 3049 552 -3543
5152 -3543 -2681 1801 4645 1400 -3475 -3525 621 3778 1253 -2291 -1998 583 1530 466 -1617 -1350
5168a350J183J198J17o46j561j498J410L467L77k528l198Q69L968J572l182l328
5184c130J726L951M58l782k294J811L240J092k666k412M79J694N38M57k36j542
5200f16l78Q83J313R9k253j426J732L465o14m090j395K519L758m91l785k348K752
5217h75K625m90j979k83R74R17k54j014n21K49m3J375J263p70k900p81K916K760
5235C169j560l529j054L324K916j557l625J83L367R08j717k616J23J863J938j031
5251A102j077l61m21j04J553Q60j448j254q4J861J576k259k969R35L603J036k957
5268d08k830J113L713J038k280k947P63K263K56q65j67J39O08k55O68m01r40j017
5286a549R41K728Q35l029k635J737L439N33l383k400J831L838k06l132j392J779
$$ plain form
5168 -1350 -167 1031 1148 502 -1059 -2557 -1147 2320 2697 169 -3029 -2160 1808 3380 198 -3130
5184 -3130 -1404 2547 3005 -777 -3071 -1260 1980 3072 406 -2006 -1527 167 705 1162 926 -616
5200 -616 -994 -111 1202 1301 -952 -2378 -646 2819 2205 -1885 -3280 -761 2997 2506 -1279 -3627 -875
5217 -875 1750 1260 -719 -1002 -28 889 635 -379 -900 -651 -694 681 1944 1174 -1726 -2507 409 3169
5235 3169 1609 -1920 -2974 350 3266 1709 -1916 -1733 1634 2542 825 -1791 -1668 195 2133 1102
5251 1102 25 -336 -757 -861 692 1552 104 -1150 -1234 627 2203 -56 -3025 -2090 1513 2549 -408
5268 -408 -3238 -2125 1588 2626 346 -2601 -1838 425 681 -184 -351 -212 396 141 809 408 -532 -1549
5286 -1549 -608 2120 2955 -74 -2709 -972 2467 3000 -383 -2783 -952 2886 2680 -452 -1844 -65
5302f5J871l18j998j529J340J519M19P1l24j854j093J338K270o84k544j468K692
5319c57L126p01m215j569L485K714j126l399r38K228K838m17k585p41J044P05
5335I2O26O1o48p00O54Q63J301j502k862l25L910K329k258l560KL605K142k123
5353A607m198J55L637J567k166j936j75J561J453o38j208o58j44K29J932J072
5369B090k674k587J126L121J300l233k804R94M708Q14m024k835J675L326J154
5384B151k577k309J231K438R72j529j025m25K02R94J262m10j723j006J863K623
5400B732q3l814j811K808L672q12l808j676K362L600o83m018j309K718K182p32
5416A328j767j191O96J559O24p07r65j258k34K215J898j493l503J03L342K371
$$ plain form
5302 -65 1806 1488 -510 -2039 -699 820 1239 1310 986 -868 -1961 -623 1647 963 -1581 -3049 -357
5319 -357 2769 2068 -2147 -3716 -231 2483 1357 -2042 -2980 -752 2086 1669 -916 -1657 -613 92
5335 92 718 779 131 -569 85 948 2249 747 -2115 -2440 1470 3799 1541 -2019 -2017 1588 3730 1607
5353 1607 -2591 -2436 1201 2768 602 -1334 -1509 52 1505 867 -341 -999 -1143 -914 1018 2090
5369 2090 -584 -3171 -2045 1076 2376 -857 -3661 -2667 2041 2855 -1169 -4004 -2329 997 2151
5384 2151 -426 -2735 -1504 934 1906 377 -648 -1073 -871 123 1385 975 -748 -1754 109 2732
5400 2732 2649 -1165 -2976 -168 3504 2692 -1116 -2792 -430 3170 2487 -1531 -2840 -122 2060 1328
5416 1328 -439 -1630 -934 625 1249 542 -423 -1681 -1915 300 2198 705 -2798 -2695 647 3018
5432C018j818m554l50M382K682k245l776L97K624K595j893k844L5K169J174k79
5448A317r31j057l90J082K136P7k511j829P97L379J312l268l116J691M218R18
5464C825l662l588J509M403Q98l450k419J181K610P34j488j517p56J440J101k4
5480G97J60k696j201K272K968o29l975j515L166L656m34m717k244L515L928j172
5496A879l750j019K157K993n79k283j536J287J547N70J40j380j993P36K576J255
5512B600j724l150n15L777K765k306m317j6M313K222k382m198n17L818K344j730
5528I84k693j85J504J183P1j025j322O6R26J391N80k107k478J357L535M62l447
5545a198k414J643M310J483m266l455J945L575P08k406j891Q55K777O11j550k067
$$ plain form
5432 3018 1200 -3354 -3704 678 3360 1115 -2661 -2264 360 2955 1062 -1782 -1747 422 1596 1317
5448 1317 386 -671 -1061 21 2157 2234 -277 -2106 -1309 2070 3382 114 -3002 -1311 2907 3825
5464 3825 163 -3425 -1916 2487 3385 -65 -2484 -1303 1307 2041 553 -964 -1720 -280 821 797
5480 797 957 -1739 -2940 -668 2300 1671 -2304 -3819 -653 3003 2569 -2148 -4392 -877 3051 1879
5496 1879 -1871 -2890 -733 2260 1681 -602 -2138 -851 696 1266 1406 26 -1967 -1231 1345 2600
5512 2600 876 -2274 -2789 988 3753 1447 -2870 -2886 1427 3649 1267 -2931 -3448 370 2714 984
5528 984 -1709 -1894 -390 793 864 -161 -1483 -1417 -491 900 1480 -627 -3105 -1748 1787 2249 -1198
5545 -1198 -3612 -1969 2341 3824 -442 -3897 -1952 1623 2331 -75 -1966 -1111 1666 2277 727 -1340
5561a340N57M52J124J331p41k275r21K319K301n78l343j711K942L437j049m197
5577a692j132K984K664p26l526j613K529K956j004j871j024O18J077L98l09r64
5593f35q86P67J211J801j865l169K25L600J820k356l347J52L926K478k490l467
5609b235P3K977J734k182j666J89K061J150o03j442p63l87J184J862L66k008k029
5626a719J157K420J282l190l370K006M015Q39l626k487J175L257O95k730k559
5641b835J291K409K09p29j014p47L41J138K77l60j681q68J649K697o09l127j470
5658c429K767K900k23l676j989K802L154l67l145j038J800J861j53j443r01O30
5674d50J159K58J78m46j777o07K290J757q03k841p96K986K562j793l967k95L746
$$ plain form
5561 -1340 -783 -331 793 2124 1383 -892 -1813 506 2807 2229 -1114 -2825 117 3554 2505 -1692
5577 -1692 -2824 160 2824 2098 -1428 -3041 -512 2444 1440 -431 -1455 -837 240 638 329 -635
5593 -635 -1521 -754 457 2258 393 -2776 -2551 1049 2869 513 -2834 -2682 1244 3722 1232 -2235
5609 -2235 -2162 815 2549 367 -1299 -1110 951 2101 1498 56 -707 -1094 90 1952 2318 310 -1719
5626 -1719 -562 1858 3140 -50 -3420 -1414 2601 3440 -186 -2673 -1498 1759 2454 -276 -2835
5641 -2835 -1544 865 1074 345 -669 -1416 -1075 63 340 -20 -1701 -2569 -920 1777 1168 -1959 -3429
5658 -3429 -662 2238 2015 -1661 -3650 -848 2306 1939 -1206 -2244 -444 1417 1264 -179 -1080 -450
5674 -450 709 967 1145 699 -1078 -1685 605 2362 1559 -1282 -2078 908 3470 1677 -2290 -2585 1161
5691A161J373j877k514j34K434J354j255k002L65Q77M72m0J28q31q37K27J713
5708F14Q43j513j975M97K806J212k396k701J015L094J083k350k878J267L037J8
5724A673j669j096Q42J182M72r87l53j49k22J62J284O82j841j409J690J850Q9
5741B200k575j985J594L406M4l272j890K116K198j68k249j110J095J413k92o70
5757a45n73K96l12Q19J047o68j662l95J349K181m4l245r80K357K453j099k892
5774a513q83K321K764j025k860l92J912J138r66r51o8K78O74M61k1m76j104q90
5792a601J940J702j128k841K3K990J399j919l153J24L571J543k391k204K34J601
5808a10J372r44j274j13J110L82pk41n52j221P09J916L09j629k384O90L496R66
$$ plain form
5691 1161 2534 657 -1857 -1991 443 1797 542 -1460 -1095 -218 254 214 342 -489 -1326 -1099 614
5708 614 1457 -56 -2031 -1534 1272 2484 88 -2613 -1598 1496 2579 229 -2649 -1382 1655 1673
5724 1673 4 -1092 -250 932 1404 417 64 -85 -307 -145 1139 1821 -20 -1429 261 2111 2200
5741 2200 -375 -2360 -766 2640 2684 -588 -2478 -362 1836 1668 -581 -1691 -596 817 525 -145
5757 -145 -718 -422 -734 85 1132 464 -1198 -1593 -244 1937 1893 -1352 -2332 25 2478 1379 -1513
5774 -1513 -2396 -75 2689 1664 -1196 -1588 324 1462 496 -455 -523 -245 429 890 869 393 -711 -1601
5792 -1601 339 2041 913 -1928 -1905 1085 2484 565 -2588 -2464 1107 2650 259 -1945 -1711 -110
5808 -110 1262 318 -956 -1069 41 423 416 175 -377 -1598 -889 1027 1336 -293 -2677 -1987 1509 2475
5826B475k633k852J833L256Q30k841k248J111K858J91k423j198J269R08N59J30
5842A225p97j031m52J111J637j72j958j761J750K828l21l182j124K065L177o77
5858B318l987j583K872K598m84k307j049J033R86L33r99l90P67j39O32J141j791
5875d9k265J49K665K005j102l113p45L320K859k600l000p20L347J834j826j941
5891a182j98K379J467j691j472l39O06J094J088l2j697j640O66J868J524k141
5907C00k835Q64L806J029l236k434O40L869P95l487k640J734K921N32j204j457
5923h03m75J059M24j72p65j3n82J436J543o86k912r07K115L191n10l310k072L046
5941c93L168o55l631j860K660K479n7k195j521J875J789k47j486j001p50J040
$$ plain form
5826 2475 -158 -3010 -1177 2079 2909 68 -2180 -1069 1789 1980 -443 -1641 -372 536 1095 1225
5842 1225 428 -603 -1055 56 1693 1521 -437 -2198 -448 2380 2059 -1123 -2247 -182 2995 2318
5858 2318 -1669 -3252 -380 2218 1734 -573 -1622 -589 397 730 -269 -659 108 -31 601 1742 -49
5875 -49 -2314 -2165 500 2505 1403 -1710 -2455 865 3724 1124 -1876 -2596 751 2585 759 -1182
5891 -1182 -1380 999 2466 775 -697 -1036 -430 664 1752 1720 23 -1617 -951 917 2441 300
5907 300 -2535 -1671 2135 3164 -72 -2506 -1866 2003 2798 -689 -3329 -1595 1326 1858 654 -803
5923 -803 -1278 -219 205 33 -732 -745 -1327 109 1652 966 -1946 -2853 -738 2453 1943 -1367 -3439 -393
5941 -393 2775 2120 -1511 -3371 -711 1768 1711 -484 -2005 -130 1659 1412 -74 -1075 -1825 -785
5957g85J908Q50q74k338k55J798K328j360l437l01L577K405k376l492m22L597
5973H23K320j970l315k28K466J425o63j095n18K53Q94lk38r85p70J129K445M98
5991B468k903k405J189L433J390l161l249J198M143Q98k849k476J224K501L48
6006A749k019j207M36K201M29k96r49j353j65J463J479p3j923j823J874K747n53
6023B017l091j722K945K664m42l473j900K235L387l92k730j076J195J064K00q11
6039G0p22J8M71O21N24p19k281J47K435J974j877l151l37K961K807j975l655J00
6057b589K649K136j913j843K16J921J184j022j716l41J240L96N93K98j371j584
6073a746J032J885R97j819k505P51K918J000l013k021J609K643Q09k523k824J402
$$ plain form
5957 -785 1123 1973 1099 -1239 -1494 304 2632 1272 -2165 -2466 1111 3516 1140 -2352 -2774 823
5973 823 3143 1173 -2142 -2370 96 1521 858 -237 -755 -502 392 389 151 -834 -1604 -475 1970 2468
5991 2468 -435 -2840 -1651 1782 3172 11 -3238 -2040 2103 3001 152 -2324 -1100 1401 1749
6006 1749 -270 -1477 -1041 1160 1589 1293 344 -1009 -1174 289 1768 1695 -228 -2051 -177 2570 2017
6023 2017 -1074 -2796 149 2813 2371 -1102 -3002 -767 2620 2228 -502 -1578 -383 681 881 70
6039 70 -652 -634 -163 458 982 263 -2018 -1871 564 2538 661 -2490 -2827 134 2941 966 -2689 -2589
6057 -2589 60 2196 283 -1560 -1344 577 1761 739 -977 -1318 -78 318 911 1209 -162 -1746
6073 -1746 -714 1171 2168 349 -2156 -1405 1513 2513 -500 -2521 -912 1731 2540 17 -2807 -1405
6089a405K743N48j762j201L99O15M42m77l01k78MM10J610l46k400j372K294K394
6107A917m94k633j542J995K933m43k909j287K415J403n62j717m34J531R48k47
6123H74r41l77j95L56J000J270r20k109l1J524J631p93k831j18K783J582j794
6140I11k627J08K261J486j424k072Q5J929O15r36m36m27l92O31K54M99l85j272
6158a192O6J940J149j943k683J116K619J042j926k513R39K491N90k032j643R59
6174a021J404P33p14j095M71P45q9k00J34o24j030P92J811K87j372j646M87K230
6192A303K32k763r36J835K347l84k447q28Q37J868m01j512k71Q98N11l01L90m14
6210c6n79l94J22J243R5j132q12J303K488j538k314o45J977K045q56k269k4J969
$$ plain form
6089 -1405 1338 1886 124 -1077 -678 -63 379 -98 -399 -677 -673 -263 1347 1001 -1399 -2771 -477 1917
6107 1917 1423 -1210 -2752 -757 2176 1733 -1176 -2463 -48 1355 793 -924 -1358 173 1121 874
6123 874 -67 -444 -639 -283 717 1987 1067 -1042 -1073 451 2082 1289 -1542 -1660 1123 2705 911
6140 911 -1716 -1608 653 2139 715 -1357 -1272 657 1272 336 -100 -527 -919 -288 -34 465 80 -1192
6158 -1192 -1126 814 1963 20 -2663 -1547 1072 2114 188 -2325 -1386 1105 1695 -337 -1980 -1021
6174 -1021 383 1116 402 -693 -222 523 434 234 368 -256 -1286 -494 1317 1604 232 -1414 -927 1303
6192 1303 1535 -1228 -2164 -329 2018 1634 -813 -1641 -804 1064 663 -849 -1120 -222 289 -12 378 -36
6210 -36 -615 -1009 -887 356 451 -681 -1493 -190 2298 760 -1554 -2199 -222 1823 967 -1302 -1326 643
6228F43J124j128j699L32O25L77J70m5k5K0n43M11O94l34j707j51K208R64q08
6247A128k183K5K084Q61j960k157J328J540J146j441j623N89J246j62p63n19P14
6264a47n56K70O99K46q96j105M09J652P60j720j651J361K704k46k197j434Q40
6281a011K270L09k007j504J809J969n11j080o63M0Q81j53k2L17k33j039O17J978
6299A967n50k013r54J491J905j85k606j069K329J792j049k346n10K040P41m66
6315E17j128k50N52M56l16k37K38j249k21J444J081n16j826k48J364J990j245
6332D06l002J93K634J203j095j717j88K277P08j486j542P79P43O35J61n04k78
6349g3k39K52P89J01p23j175O2K220Q73j985j728Q51K069O29k021k180J491K402
$$ plain form
6228 643 1767 639 -1060 -728 -103 274 444 399 374 394 -149 262 956 622 -1085 -1236 972 1936 1128
6247 1128 -1055 -1030 1054 1915 -45 -2202 -874 666 1812 371 -1252 -663 583 421 -342 -861 -147
6264 -147 -703 -433 266 512 -384 -1489 -1080 572 1332 -388 -2039 -678 2026 1780 -417 -1851 -1011
6281 -1011 1259 1568 -439 -1943 -134 1835 1324 244 -419 -379 502 349 327 644 411 -628 -11 1967
6299 1967 1417 -596 -1550 -59 1846 1661 -945 -2014 315 2107 1058 -1288 -1798 242 983 517
6315 517 -611 -861 -309 147 -169 -406 -168 -1417 -1638 -194 887 371 -1455 -1703 -339 1651 406
6332 406 -2596 -2403 231 1434 339 -1378 -1566 711 1419 -67 -1609 -830 -87 548 709 205 -73
6349 -73 -312 -60 729 830 107 -1068 -1006 1214 2087 102 -1626 -775 1294 1923 -98 -2278 -787 1615
6367A615R5j757j248O92O69M39p86l14M58l89M34O37j05j224p08R67J604Q2k061
6386i00j477J666K730n97k669j028K103J463l70k115l43K201J380r81j699k55
6402h91Q41M35P27j28n65q48j29P78J484o52k112k33K482J139j037k596n0K696
6420A341J119j692k422J69K433O35j528q97M63Q11L50p23p72kM8J76J058L86j761
6439h08r50R11J575N52j813k027J013K962O53k744j607J172K187N1j757j103J175
6456e58J765k06j210m15k94K18Q31O62l56o89p31P74J514j87k148j239K211K330
6474B272j240k293q45J927K127o73k655m72J850J232p54j165m47L40J141ol73
6491c4K4q97J28J353Q57j317j783P1J853J873j735k391k76K930J287j822j870
$$ plain form
6367 1615 1710 -47 -1295 -603 66 505 -281 -595 -137 -526 -92 545 440 -784 -1492 -525 1079 1161 -900
6386 -900 -2377 -711 2019 1422 -1247 -2275 -172 1291 921 -1194 -1537 664 2044 1063 -636 -891
6402 -891 -50 385 1112 984 419 -429 -558 220 1704 1052 -1060 -1293 1189 2328 1291 -1305 -1355 1341
6420 1341 2460 768 -1654 -1485 948 1583 55 -842 -379 432 782 59 -713 -715 -667 -491 567 953 -808
6439 -808 -1758 -847 728 1280 -533 -2560 -1547 1415 2068 -676 -2283 -1111 1076 1127 -630 -1733 -558
6456 -558 1207 1001 -209 -624 -918 -700 131 793 437 -252 -983 -209 1305 1118 -1030 -2269 -58 2272
6474 2272 1032 -1261 -2106 -179 1948 1275 -1380 -1852 -2 1230 476 -689 -1136 -796 345 339 -34
6491 -34 -10 -907 -779 574 1431 114 -1669 -1598 255 2128 393 -1998 -2274 656 1943 121 -1749
6508a749M17J792J520j629j405J22J528K81m31p14J06m5M34O41J76j076r11L59
6526e84K116j9j873j589J208K615J41k066j757J174K251O0k289j009J288J597
6542A264k61j217n15M67M20J8K54J7p66p71J257J382p14j925n90J667J956l94
6560A549k640o75J966J885j225k045P3J533J179q91j556m3J172P7q4K41n44q03
6578h31K39P65Q30p63j274r4J915J341j878k015L05K126R50j546j747N48K175
6595A046N4j484r02L24J122Pj93o07m7J96K04M92M18j189q17M63J795L18j922
6614g22j441J180K060L96k383j188J465K071n31j713q07J286J197j41j320k64
6630h55O42P7L50O9q8o15j41N48J172l0j561j236J278K068m20j961p81J458J555
$$ plain form
6508 -1749 -1332 460 1980 351 -1054 -932 596 877 446 -268 -162 -207 227 868 1044 -32 -943 -584
6526 -584 1532 1513 -360 -1949 -741 1874 2015 -51 -1808 -634 1617 1677 -612 -1621 -333 1264
6542 1264 1003 -214 -729 -262 158 176 430 447 -319 -1090 167 1549 835 -1090 -1680 -13 1943 1549
6560 1549 -1091 -1766 200 2085 860 -1185 -1112 421 1600 709 -847 -890 282 359 275 516 -28 -831
6578 -831 -592 173 1003 240 -1034 -1128 787 2128 250 -1765 -1460 666 1616 70 -1677 -1129 1046
6595 1046 1100 -384 -1286 -962 160 167 -26 -633 -680 -484 -280 212 630 -559 -1376 -913 882 1200 -722
6614 -722 -2163 -983 1077 1473 -910 -2098 -633 1438 907 -806 -1613 -327 870 729 -591 -855
6630 -855 -213 -136 214 283 195 -420 -561 -13 1159 1129 -432 -1668 -390 1678 1258 -703 -1484 -26 1529
6649A529p40j970o6J830P94j258j019N15K30L79k44o1J44m04r10R16J277n71j681
6668a310M6J842O58j143j258M2K262J163k219j563O54J286P01j094o37N37P66
6685G33j31n12L84J65p77k99P42R17o61q06JJ170R78j326k113R95J751J10j365
6704d4j090R73J558k30j948l30J289M68n87m18K13K07o32q7L51P08o60j058K40
6723a077J611L24j532o43Q62J327l31j764p99J502J740m97j653J33J124M76n85
6740B18n19O88M49o52o29K84P87j018k50J084P16m49j274o32J282J989q91k071
6758h88k28J562P71j121q75L16J431N4j189q61P87M65k07j21K75l58n02m14O65
6777d38J217r0j914k16J779O36j384j180O03J487N83j701j253J130J651k5j269
$$ plain form
6649 1529 789 -1181 -1247 583 1377 119 -900 -385 -155 224 -20 -81 63 -341 -1251 -335 942 371 -1310
6668 -1310 -1264 578 1236 93 -1165 -1123 1139 2302 83 -1480 -826 460 1161 67 -570 -33 733
6685 733 602 90 474 639 -138 -437 305 1222 561 -245 -244 926 1904 578 -1535 -540 1211 1321 -44
6704 -44 -1134 -161 1397 1167 -781 -1111 178 646 59 -359 -146 61 -571 -658 -307 401 -259 -1317 -1077
6723 -1077 534 858 -674 -1317 -455 872 541 -1223 -2022 -520 1220 723 -930 -797 327 803 218
6740 218 -301 387 836 184 -445 -161 626 -392 -642 442 1158 709 -565 -1197 85 2074 1183 -888
6758 -888 -1116 446 1217 96 -779 -463 968 1022 -167 -1028 -241 224 17 -104 171 -187 -689 -1103 -438
6777 -438 779 689 -1225 -1441 338 974 -410 -1590 -987 500 1083 -618 -1871 -741 910 885 -384
6794c84j73M65J48q0q9K76L37n62k48N62P40p73r62J045J305n1j620j559J057
6813e66K149J07k153l72J368O69l58j153m30J246O11j021l04Q4M57n10q1J124
6831H67l33q89q26N34J547M15j996r25J420J464r53j956J87J466J966j241j919
6848a172J0J114L99n75J57k43J85l10q1Q03K56r46k13P23O03l19j574J11J839
6867G67J048j176k081M3K301M16j237r84R14Q03j74j072m09P10P91o73LK23k60
6886d7m27K7R23O75j250j250K54J902N20j535j263J197J775o17j576q65J121J571
6904A135M2j718l89J131M42n13o2K44j22k17k66L41P55q51k58N28J337p76j799
6923a016n97J850J759n61k591j65J711R06j165q21r6Q33P55q85m37R2J08L05o0
$$ plain form
6794 -384 -557 -92 56 -24 -113 163 500 -62 -310 252 992 219 -743 302 1607 1556 -64 -1623 -566
6813 -566 1583 1690 -463 -835 533 1202 844 -309 -739 507 1118 97 -207 -123 334 -176 -257 867
6831 867 534 -355 -1181 -647 900 1315 -681 -1606 -186 1278 325 -1631 -1444 22 1988 747 -1172
6848 -1172 -1162 -48 351 -224 -67 -310 -125 -435 -516 287 543 -403 -616 107 710 391 -1183 -1072 767
6867 767 1815 639 -1442 -1399 902 1318 81 -903 11 814 640 -432 -841 -131 660 -13 -10 213 -47
6886 -47 -474 -447 476 1151 -99 -1349 -1095 807 1327 -208 -1471 -274 1501 884 -692 -1557 -436 1135
6904 1135 1177 -541 -930 201 643 130 68 312 190 -27 -293 48 803 -48 -306 222 1559 783 -1016
6923 -1016 -1613 237 1996 1435 -1156 -1321 390 1296 131 -690 -786 47 802 -83 -520 -428 -320 -15 -75
6942g5N68n63q91q6R31J333m11k197l44J890J141j372j539Q86J680O01j645j473
6960a566P56J978j56j168l54P47K3j45N52jk02n62m75J317L76j261o83M09K019
6979A604m77j213j534Q30J967O48k194j183J524R75o33r99m16R11N63l89o76M00
6997b92k87J12K92P37l00j242n89J073J634n87j537o01J206J688q83k075K79J510
7015A38J349j039j479K02J267L55o85l35N41k24o7j75Q57j59o04l31R57P97n73
7034G92j878L09K082O83j281j930K72K137N86k196p70P11J167j07j119q7M01O88
7052D60l37o61J5M14n86L55Q34J5q26q72M36J098P04j608j239J571J565q03j230
7071f95l55J032J324n26j230k11J123L73n97m11M48p2Q9j16M22Q6o41k50J40J529
$$ plain form
6942 -75 493 -70 -961 -1047 -116 1217 806 -1391 -1735 155 1296 -76 -1615 -729 951 1552 -93 -1566
6960 -1566 -810 1168 1012 -156 -510 237 260 115 667 666 464 -98 -573 744 1120 -141 -824 -415 1604
6979 1604 1127 -86 -1620 -790 1177 1825 -369 -1552 -28 947 314 -685 -1101 -190 373 -16 -692 -292
6997 -292 -579 -467 -175 562 262 -980 -1569 -496 1138 551 -986 -1587 -381 1307 424 -1651 -1372 138
7015 138 1487 448 -1031 -829 438 793 108 -227 314 90 23 -152 705 546 -58 -389 568 1365 792
7034 792 -1086 -777 1305 1988 707 -1223 -951 1186 1772 -424 -1194 -483 684 577 -542 -629 -228 460
7052 460 123 -538 -523 -109 -695 -340 494 509 -317 -1189 -753 345 1049 -559 -1798 -227 1338 535 -695
7071 -695 -1050 -18 1306 780 -450 -661 462 835 238 -173 275 203 292 176 598 684 43 -207 -67 1462
7091A462p02j527l0J489P92p95j638j32J866R50j339j569P03J188K9j021l83J02
7109e55P64n85k28M83N18j255J05Q84J80k96j466L53J616L31r71j865J232J647
7127H92k45j201j048R75J493l65r00k40N48N62p29j07M94k2m03j36P01L10m50
7146A29r75K50J375p1j359p89J179J237j87j714Q4R03R96p21j392M65R53L38o82
7165A9j49K25K51m47k54L82N07o27n92R01P22n15p47p44J093J198q89j212j07
7184i85J812J82r82n53J05J305k73q95o59J227Pn20J45L67j25k89l95K9J326l47
7204D82r19l03J283L43q00j018M56J240L07j093o56O45J231j058o06O16K90M1
7222D81m48n8n6P53o47l85K60N90m01n76J37R07K53p48r36R40J173o65q70m20
$$ plain form
7091 1462 760 -767 -797 692 1484 689 -949 -1081 785 1735 396 -1173 -470 718 747 -274 -657 -555
7109 -555 209 -376 -604 -121 397 -858 -753 131 311 15 -1451 -1098 518 849 -122 -1987 -755 892
7127 892 647 -554 -1602 -627 866 501 -399 -639 -91 471 -258 -365 129 107 -296 -432 269 579 129
7146 129 -846 -596 779 708 -651 -1440 -261 976 789 -925 -841 62 1058 337 -1055 -590 363 701 19
7165 19 -130 95 346 -101 -355 27 534 -93 -685 216 938 423 -324 -1068 25 1223 334 -878 -985
7184 -985 827 1009 27 -526 -421 884 611 -284 -943 284 291 -229 -84 283 158 -131 -526 -497 829 482
7204 482 -437 -740 543 886 86 -932 -476 764 1071 -22 -678 -33 1198 140 -466 150 440 481
7222 481 33 -25 -81 672 25 -360 -100 490 89 -487 -350 557 810 62 -874 66 1239 574 -296 -716
7242g16J096M46m03j127J30J258n5j180K53K92L48m23j16K02L29l67o02J97R78
7261E40j30p38o97J034P95m04j299J60J174M64j132p70P58O65oq49R9L95k9l03
7281b73m45O34Q03j133p86J018Q49o27j036K2J191Q17p86j271M24J307K6j006
7299b72m03M95K92n2n67K25N16K45p30j36Q25j6n72k01O06P13n56j150J62R61
7319C85Q81j265j139J163J073l11r29m91J102J98n45p26M11N88l49l66L92M96
7337E68l14p96RP61K63m55j024M13J100l28p76l68Q70J049m23j434M1J249M66
7356H71r22j74L05N79m81m73J07N75L42p65l54J336m8j236j65P71O47K09j449
7375c25m06J184P02o75j025J57P70M85j209m50O01O86l24p99K03N20j02o76L03
$$ plain form
7242 -716 380 826 423 -704 -574 684 629 -551 -298 -6 342 -81 -197 5 334 -33 -635 -438 540
7261 540 410 -328 -1025 9 804 400 -899 -739 435 899 -233 -1003 -245 420 414 -435 -336 59 30 -273
7281 -273 -718 -84 719 -414 -1200 -182 667 40 -996 -974 217 1034 248 -1023 -599 708 734 -272
7299 -272 -675 -180 112 60 -507 -282 234 479 -251 -387 438 422 -150 -351 255 968 412 -738 -576 385
7319 385 1266 1 -1138 25 1098 787 -142 -633 469 667 122 -604 -193 395 46 -320 72 568
7337 568 254 -542 -533 228 491 36 -988 -575 525 197 -579 -947 -77 972 549 -885 -844 405 871
7356 871 -51 -225 80 659 178 -295 -188 387 729 -36 -390 946 898 -338 -503 268 915 1124 -325
7375 -325 -731 453 1155 480 -545 -388 382 867 -342 -792 -191 495 171 -628 -425 95 -7 -683 -380
7394c80P23k36n89j66M68O27p18j256N00J421J15j213m59P63J128j38j575l19
7412a304J323N31p16m50J64M45O06n98K38J02J82m86k42O44J77p46n22M05J341
7431A094L7j385n23J154J192r76j024n4P00O10n17q25Q0J038j12m74j13L22L07
7450E31p41o7N34K15j257l20J007R71q25j182j77J502Q63j319r60K98J134M57
7468F64j074n80N51R44Kq22J4k8N03k81J11J46L42q19k24J181K93r62q44M91J359
7489I67M72j497r18O43J689n20j061l92J153M45l49q90j54Q94J82q21J23M47j44
7508B69o80J27O04L53o41j067P44J313j40j451m25J022R03m10j484P9J449K31
7526G96r56o96J5R12M58n08m22M05J22k59k82O61j35l01o42J015N55m53j103M7
$$ plain form
7394 -380 343 107 -482 -648 -180 447 -271 -1527 -1027 394 509 -704 -1163 -400 728 590 -985 -1304
7412 -1304 19 550 -166 -616 -452 -7 599 1 239 341 523 37 -205 439 616 -130 -652 -247 1094
7431 1094 1131 -254 -777 377 1569 593 -431 -485 215 825 308 -517 -437 601 489 15 -98 224 531
7450 531 -210 -277 257 472 -785 -1105 -98 873 48 -1134 -1311 191 1054 -265 -1225 -927 207 664
7468 664 -410 -990 -439 505 507 -315 -301 -329 174 -107 4 150 492 -327 -551 630 923 -39 -883 -392 967
7489 967 1439 -58 -976 -333 1356 836 -225 -617 536 981 632 -258 -412 482 664 -157 -34 413 269
7508 269 -411 -284 320 673 32 -1035 -291 1022 882 -569 -994 28 931 521 -963 -884 565 796
7526 796 -160 -856 -841 71 529 21 -401 4 126 -133 -415 246 111 -190 -832 183 738 285 -818 -771
7546g71J326O67r38j465N53J419K01r69n81M31Q74K0j087k0Q58M3n17jK76n90
7566b71k10J65O31O30r31j172P60Q52Q12j798m47Q06J179n29j112l65J305O86
7584I91o34r58L9P02J27k5k31M20q9q68L58Q18k23p45j68O96O59k39j240m45J664
7605F09J015j112j667K35J519O39j002q46M1J070k97o24q5P01L28o04l5K66m42
7624b91l86Q0N22O27j60j296j48J325M18p34p80L61J135l6j355q38J440J069m93
7643D60p32J24K58qj19L35J96q5o64j19Q66M1k90j134N84Q27M29j498m72J041
7663D0J177m20j353l48R87L58k42p26K00O42J6j076RP03l79rK59M06o2j189m66
7684a473P52J356N9j260m07R50J048q33j007k50J470O87j289p63P94O96j59K7
$$ plain form
7546 -771 555 1222 284 -1181 -628 791 992 23 -558 -127 747 767 -320 -340 518 561 44 43 319 -271
7566 -271 -481 -316 315 945 14 -1158 -398 454 1266 -532 -979 -173 1006 477 -635 -1000 305 991
7584 991 357 -601 -562 140 267 242 11 431 342 -526 -168 650 427 -318 -486 210 869 630 -610 -1055 609
7605 609 1624 512 -1155 -920 599 1238 236 -610 -569 501 204 -420 -505 196 524 -80 -115 151 -291
7624 -291 -677 -597 -75 552 392 -904 -1052 273 691 -43 -823 -462 673 637 -718 -1556 -116 953 460
7643 460 -272 -148 110 102 -17 318 514 429 -235 -354 512 553 263 -871 -287 540 969 -529 -1001 40
7663 40 1217 797 -556 -904 83 441 199 -527 -327 315 331 -745 -736 -33 -412 -421 -162 244 182 -1007 -1473
7684 -1473 -721 635 694 -566 -973 -23 1025 192 -815 -1065 405 1092 -197 -960 -166 530 371 398
7702C98k79L89j7l85k98P32N67j040n32Q32M76n29q68O25M27O31q74j525P50J040
7722E20J68r02m22N46M09k72n76L24M71J71r15P8L43P3m94k68R81L91m88r72j19
7743i53J469N18j100r29P72J063m65j126L37Q82R47r56p80J55L69K45l29M64j48
7762D35J51p89n41J188N74p93j198N69J292k89j025k07O19J075m65j410k05J247
7780B28J46n96n60N75K30j70m97l84J109K58j109M14O00j37r37j86Q67P63J17
7799G31j674j28J230O82q48p72M03M19L66p62n24P16J026q65l66N38J22n6m77
7818b39L10O92j60r02m16Q91O80l26j675N23J525k25p14p21J69J170n4q23n00
7837g95P33N22m73m37Q61j79j58l80m4N84K97p35j37R22J55q96r81O49J514K47
$$ plain form
7702 398 119 508 491 106 -192 540 1107 67 -465 367 843 314 -554 71 498 1129 255 -1270 -520 520
7722 520 688 -214 -636 -90 319 47 -529 -205 266 437 -478 -400 -57 16 -478 -746 235 626 138 -834 -953
7743 -953 516 1034 -66 -995 -223 840 375 -751 -414 468 1415 459 -321 -166 203 448 119 583 435
7762 435 586 -203 -744 444 1018 225 -973 -404 888 599 -426 -633 -14 1061 596 -814 -1019 228
7780 228 374 -222 -782 -207 23 -147 -644 -1028 81 339 -770 -356 244 107 -830 -1016 -149 614 731
7799 731 -943 -1071 159 841 -7 -779 -376 43 409 -353 -877 -161 865 0 -366 172 294 238 -239
7818 -239 71 763 603 -299 -715 176 856 530 -1145 -622 903 678 -36 -757 -588 582 528 -295 -795
7837 -795 -62 460 -13 -450 411 232 74 -306 -350 234 531 -204 -341 581 736 -160 -1141 -492 1022 1269
7857A269j410n07P41Q00j40j036mP06O9k54p41L40O82k68m15N27J27o57m84K23
7877d32R20J27r06o58P09J144m02j165k7J176K90l30j280j29J176O24r86m00O34
7896H5K90j98l55RN95l59l85K61N48K37j138k66J191N46j071j093K64J107J134
7915A402j542r53O42J187K3p23k89k67J054j46m15K2J17M0n97N59K50l69o72R2
7935e85J027N72j076j105Q66R26P3j240m40Q85R81l40j126m23R46P76o34k88K0
7954a85m9K65k4J75J13l79k13K41Q70j42j245j57P59J057m22j304l07J164J013
7973A230o57j351K31J103j65o45j68k58P37J24k28J54j72j30j94O34J84k21n61
7992c53m57J376M26o05j246L6J289O88j143o86K96J280O8r73o82Q08M14l91o8
$$ plain form
7857 1269 -141 -648 93 893 753 -283 -287 419 488 234 -507 -167 515 247 -168 359 486 -171 -655 -432
7877 -432 488 615 -291 -949 -240 904 502 -663 -690 486 776 446 -834 -963 213 837 -149 -549 85
7896 85 375 177 -178 -169 426 67 -318 -57 491 728 -410 -676 515 1061 -10 -1103 -839 268 1402
7915 1402 -140 -1093 -451 736 759 36 -253 -520 534 388 -27 -5 112 152 -445 114 364 -5 -677 -585
7935 -585 442 1014 -62 -1167 -301 625 698 -542 -982 -97 884 544 -582 -1005 -59 717 83 -205 -185
7954 -185 -234 31 7 182 295 -84 -297 -56 814 672 -573 -730 29 1086 664 -640 -947 217 1230
7973 1230 573 -778 -547 556 391 -254 -422 -680 57 181 -47 107 -65 -195 -389 245 429 208 -353
7992 -353 -810 566 992 387 -859 -823 466 1154 11 -675 -379 901 969 -4 -686 122 536 145 77
8011G7l12J58j95K31L38K03o11n67K20R88L97j211n11O90R70q7j055q35R79J344
8031A211o12q44l49N47P60k18p16p6O45J17k65j17K32l69m65O11R07o26o26l88
8051f41P13J243q58j388L03R94P51q26p85k78J183N00j163m41L29M13O3m77K79
8070h6k37J7L4M61M96o23n25m01J234P68j185q96M17J212Qq83q27M56J593q2j270
8091c19l17M41M70J98p99M88j0j20R6J85J62o01k71M17O62J24j127o22O91J433
8111A181j47j745n49J170J040k72r72n70J133K83n70n99K59N48j40k62J39j3p7
8130a63o7J52P45m14j227j41J014J079o34j097m5J084R24q58j185p1J187L33o65
8149d9k45J51M74Rk70k00L48k38m44M38J48R5p84j54J360J17o36j038J51J385
$$ plain form
8011 77 -235 -77 -272 -41 297 500 -111 -678 -458 530 927 -284 -795 -105 865 778 -277 -1112 -133 1211
8031 1211 599 -245 -594 -47 713 495 -221 -297 348 465 200 83 315 -54 -519 92 999 373 -253 -641
8051 -641 72 1315 457 -931 -628 366 1117 291 -494 -772 411 911 -252 -693 -364 49 112 -365 -86
8070 -86 -323 -306 -272 189 685 62 -463 -864 370 1138 -47 -943 -526 686 694 -189 -1016 -560 1033 951 -319
8091 -319 -636 -195 275 473 -326 162 152 32 128 313 475 -126 -397 20 682 806 -321 -943 -252 1181
8111 1181 1034 -711 -1260 -90 950 678 -294 -864 269 552 -18 -617 -358 190 50 -212 -73 -86 -163
8130 -163 -230 -78 667 253 -974 -1115 -101 978 344 -753 -798 286 1210 352 -833 -904 283 616 -49
8149 -49 -294 -143 331 340 70 -130 218 -20 -464 -26 122 217 -567 -721 639 756 120 -918 -767 618
8169F18L35j152n16O30J025m1j191m03R24O44o04n70K00N5p2K25J05J63l72m79
8189d76K88Q05
$$ plain form
8169 618 953 -199 -715 -85 940 899 -292 -695 229 873 269 -301 -101 -46 -118 107 212 375 3 -476
8189 -476 -188 617
8191F17
$$ Imaginary data points
##PAGE= N=2
##DATA TABLE= (X++(I..I)), XYDATA
0@%%%Qj6QqJ6k2L0m0M8n6P2q9J06j29J58j87K20k59K99l47M02m59N28o06O86p77
29d14Q81r90J110j246J396j557J735j934K148k381K643k926L237l586L972m400
45b312M880n424O040o748P571q539R704j1129J2923j5266J8465k3123L0562m4373
59b6769P8584l17057o26914M10521N49215J31018l38217k12311P4008J73154m8097
70a52865j65610p2742J21597J56756P5998q2266j67647j03457J16705K57910J63907
81A48286j42529l02725o6714L20694L04314r3198l11903o2993K51872J89001j55703
92G8402k69539L3900L42316K20684j51687l07879j08596J72708K31253K9000j79887
103I0675j75202k1193J00987J19425L7036p7688q7952K3550P7203m4919k02855
$$ plain form
0 0 0 0 0 8 -8 0 -8 8 -14 16 -24 24 -32 40 -49 57 -72 86 -101 119 -140 159 -188 214 -245 283 -323 363 -414
29 -414 467 -523 587 -659 737 -820 915 -1019 1129 -1252 1391 -1535 1702 -1884 2088 -2312
45 -2312 2568 -2856 3184 -3564 4007 -4532 5172 -5957 6966 -8300 10165 -12958 17604 -26769
59 -26769 51815 -265242 -892156 -481635 67580 198598 -139619 -351930 -277922 -104768 -152865
70 -152865 -318475 -391217 -269620 -112864 -36866 -119132 -286779 -390236 -273531 -15621 148286
81 148286 5757 -296968 -363682 -42988 261326 168128 -143775 -206768 45104 234105 78402
92 78402 -191137 -157237 185079 405763 254076 -53803 -162399 10309 241562 270562 90675
103 90675 -84527 -105720 -4733 114692 151728 74040 -13912 9638 86841 41922 -160933
114a60933j41980J60182L47388J06833l03732l50088R81K74435J82212p8218j66010
125a28930q432J40919N9041j25395j43348K1314J61528J32751k4816j39112q8810
136a43290O5370J69381J20858p2303k22874j06474J68813K29437k187j89505r4094
147g6868J19257J53472l8616j87916p1523J55378J81091j7303j95849j67609L0218
158a16268J86300J32401m3140j37932r4462J0971Q1005L8235o5637o0662P1473
169B284J28864r690j93845j79575O2524K58710J52132j21655k12478m7033J28030
180c1732J15844l4719j21976k7890J13956R9772l9258j12111n0131O2527J13240
191H7522M4221q0378j21666k9484J10583J52434J1557j71920j42961P9095J81844
$$ plain form
114 -160933 -302913 -142731 204657 311490 7758 -342330 -341349 -66914 115298 37080 -128930
125 -128930 -137362 3557 62598 -62797 -206145 -184831 -23303 109448 84632 -54480 -143290
136 -143290 -77920 91461 212319 140016 -82858 -189332 -20519 208918 206731 17226 -76868
147 -76868 42389 195861 157245 -30671 -102194 53184 234275 216972 21123 -146486 -116268
158 -116268 70032 202433 159293 21361 -73101 -62130 18875 57110 -8527 -69189 2284
169 2284 131148 121458 -72387 -251962 -189438 69272 221404 99749 -112729 -159762 -31732
180 -31732 84112 49393 -72583 -100473 13483 113255 73997 -38114 -88245 -25718 87522
191 87522 131743 51365 -70301 -99785 10798 163232 174789 2869 -140092 -60997 120847
202A20847L5883j35456j09672N6622J32555P775j45952j02744P7234J50750M3197
213A31039j03275j40130m5285P0677R5220L5872l1999p1835m6635L7570O0138
224h643l5830r5346J272J33594J12134o0518j79161q1268J13659J49073N161r9399
236d5272n2688N0390P9489N648p2354m5769L8508O1213K0519j4017l0498k5055
248b9886K0273N5551K1446n1185p3492L379J04447Q2192o1013j25771k5485Q8028
260H484P0983k7790p6116j5044P0736N0806n0306q5382j5698N5548O1009J5422
272F2652l9972n6878k8445J5306N0492M4102k3522o6834p654O3127K5228o0651
284b3049o1415K9152R6215M6532o5624r0985O61O9610L8554k0326l1945O29L3913
$$ plain form
202 120847 156730 21274 -88398 -31776 100779 108554 -37398 -140142 -62908 87842 131039
213 131039 27764 -112366 -157651 -86974 8246 44118 12119 -59716 -106351 -68781 -8643
224 -8643 -44473 -139819 -138547 -4953 107181 46663 -132498 -213766 -100107 48966 54127 -45272
236 -45272 -97960 -47570 31919 37567 -34787 -80556 -42048 19165 39684 25667 -4831 -29886
248 -29886 -9613 45938 67384 16199 -57293 -53914 50533 132725 71712 -54059 -79544 8484
260 8484 79467 51677 -24439 -39483 31253 82059 31753 -53629 -69327 -13779 47230 62652
272 62652 22680 -34198 -62643 -47337 3155 47257 23735 -43099 -50753 12374 37602 -23049
284 -23049 -84464 -55312 40903 87435 21811 -69174 -68513 1097 39651 19325 -12620 -11991 21922
297B1922J9659k1150k7019p476Q3J7303M3494J8303m0252m3658J5196M8722O978
310E2105o0061n0215M5013R3351J7483p0707n9828P522L9267J2851k9846k0635
322b3700L2646M4283n711l8346k9761j6182N461L3899L5078j442m1592l7696K0146
335b2917N6597k4o7441l1011N5191O0658j6184o9784l4713M9175P0686l086o7253
348b0106l8537K2521L9500J8037j2397k2028l340J6083J8006P899k4857n4862
360e4081j1788O9741O8787k4982p7931k2732O0463N7373l5653r0891j9054Q1422
372F74P4464j3489o6106l9453K1728M2480m60l7411j6702K2131L5092K9572p441
385D5079o1146n7603J9071P7353M2189m6994p6326O643R2078M2900p5117r0039
$$ plain form
297 21922 41581 20431 -6588 -14064 -13981 3322 46816 65119 24867 -18791 -3595 45127 52105
310 52105 -7956 -58171 -13158 80193 97676 26969 -32859 -25337 13930 26781 -3065 -23700
322 -23700 8946 53229 47518 9172 -20589 -36771 -31310 2589 37667 36225 -5367 -43063 -22917
335 -22917 33680 33656 -33785 -64796 -9605 51053 34869 -34915 -69628 -20453 50233 47147 -20106
348 -20106 -58643 -36122 3378 21415 9018 -13010 -16350 -267 17739 25638 781 -54081
360 -54081 -65869 3872 72659 47677 -30254 -52986 7477 64850 29197 -61694 -80748 674
372 674 75138 61649 -4457 -43910 -22182 20298 19838 -17573 -34275 -12144 22948 52520 45079
385 45079 -16067 -73670 -54599 22754 64943 17949 -58377 -51734 40344 83244 8127 -81912
397h1912J2542Q9871N4136m3852q4055j1326P3418N5377k4571n9456k9635K3465
409b5998N1381K4592l1240n1761j3421M8622O7760j750r0556o5259N5990J02318
421G0678J0798q8112o8140M3361J00614J9920r2601q2065K9049Q8532M1461m1347
433C2148o5957j1509M9047L9247j5962m6925l5838J1604O4468M8246l9654q5438
445e6523k0829P1230P2510k4943r8174l6965Q0704Q6824k4761r5090m0565N8207
457b8375Q1385J228p7673n0578L6413O2402J5698l3091m3627r253M0922M7001
469D2452n552n8862m9666K4290Q5310M1227o8381q6698J5835R1492L9463o6692
481D218q7712P229J00506O1857n6996r1922r988O8329N5687k1329o7969k8779
$$ plain form
397 -81912 -69370 20501 74637 30785 -53270 -64596 8822 64199 39628 -19828 -49463 -25998
409 -25998 25383 49975 18735 -33026 -46447 2175 69935 68185 -22371 -87630 -31640 70678
421 70678 81476 -6636 -74776 -31415 69199 89119 -3482 -85547 -56498 32034 73495 32148
433 32148 -33809 -45318 3729 42976 27014 -19911 -55749 -44145 20323 68569 28915 -56523
445 -56523 -77352 -6122 66388 41445 -56729 -93694 -12990 73834 49073 -46017 -86582 -28375
457 -28375 53010 54238 -23435 -74013 -37600 24802 40500 7409 -36218 -45471 -4549 42452
469 42452 36900 -21962 -71628 -47338 37972 79199 10818 -75880 -60045 31447 70910 4218
481 4218 -83494 -76265 24241 86098 29102 -62820 -72808 -4479 51208 29879 -38090 -66869
493f6869M4010O0077J6195l8157n8492j7192N6975O5883j8151q1280l2959O6468
505c492Q9813l966j02096o6916O0660J03197Q650q7463o4565M0173R4153K6282
517I4430p2799p0452J3822O2856L5238k1763n3077k7268L6770O2549J2027o1372
529A0961p3591L081Q8102O2489n3389r8875q324R0165O6781m5233j05778k9705
541i3316Q6461Q5288k8054r1311l3328N6324P1124K243o6058n4188J7540O2643
553A5368M5727j3729o3899m0225M6231P9143M935p9515n9910M1523J00552L3770
565A09971q2354r0236K4728J00794M2097o5795q5907P05Q2847N4533l9742p1160
577a9519k0014L6455M4199P128m4784n2165N926N8879L9172l5143p9748l0907
$$ plain form
493 -66869 -22859 37218 53413 15256 -43236 -60428 -3453 62430 44279 -37001 -69960 -3492
505 -3492 86321 82355 -19741 -86657 -25997 77200 85850 -1613 -66178 -26005 68148 94430
517 94430 21631 -48821 -34999 27857 63095 41332 -11745 -39013 -2243 60306 72333 10961
529 10961 -62630 -59549 28553 91042 37653 -61222 -69546 20619 87400 42167 -63611 -93316
541 -93316 -6855 78433 50379 -40932 -74260 -17936 53188 55431 -10627 -64815 -47275 15368
553 15368 61095 47366 -16533 -56758 -10527 68616 73551 -5964 -65874 -24351 76201 109971
565 109971 27617 -62619 -37891 62903 105000 39205 -46702 -45997 36850 91383 51641 -19519
577 -19519 -39533 -3078 41121 48249 3465 -48700 -42774 16105 55277 20134 -59614 -90521
589i0521O6302Q0494j7853r4468m9565N2897Q1731N378p8870n3420M7233P6110
601B5448K86o5726m3078K4907O0384L0600k8299m8330j4471L1744M8974J7055
613C9494m2301n3997J3436P1552L8550m2280o6658l145P0882N1479m5878q1784
625e0650j731Q0492N5778l4569p7868k5084M9834N0328j1476m3074k2131J0291
637a9860K8258J7917j8663l8124q897L5148L8211r520n9231m1203M1215Q0082
649D5333J6479o6143o0920J7338O8233K7059m8499m4876L2016O3099P694m8360
661H453m1138Q767M4029L2510j1371l4759j8012J5993L9093K4298k7724n5124
673a4985j3287M3118M3385r132m9134k0747M2600M6196k9434p4425k0088N8548
$$ plain form
589 -90521 -24219 56275 38422 -56046 -105611 -52714 29017 34395 -44475 -97895 -50662 25448
601 25448 25734 -39992 -83070 -58163 2221 32821 4522 -43808 -58279 -26535 22439 39494
613 39494 -2807 -56804 -43368 28184 66734 24454 -42204 -45349 25533 77012 31134 -50650
625 -50650 -52381 28111 83889 49320 -28548 -53632 -3798 46530 35054 -8020 -30151 -19860
637 -19860 8398 26315 7652 -30472 -39369 -4221 33990 24470 -34761 -75964 -34749 45333
649 45333 61812 -4331 -65251 -47913 20320 47379 -1120 -45996 -13980 49119 56813 8453
661 8453 -32685 -23918 20111 52621 41250 6491 -11521 4472 43565 67863 40139 -14985
673 -14985 -28272 14846 58231 49099 -35 -20782 21818 68014 38580 -35845 -55933 2615
685B615O1419o193o0220m1824J7723L8682J0433j7270j9723p167J4311K2448l421
$$ plain form
685 2615 64034 57841 -2379 -44203 -26480 12202 22635 5365 -14358 -21525 -7214 15234 11813
$$ [...]
8191I05
##END NTUPLES=NMR FID
##END=
