##TITLE=1H_CG-1108-p
 CDCl3, 8 sc, 
 5.6.2019
##JCAMPDX= 6.0         $$ Bruker NMR JCAMP-DX V2.0
##DATA TYPE= NMR FID
##DATA CLASS= NTUPLES
##ORIGIN= UXNMR, Bruker Analytische Messtechnik GmbH
##OWNER= root
$$ XWIN-NMR		Version 3.5
$$ Wed Jun  5 14:56:38 2019 Russian Standard Time (UT+4h)  she@DPX200
##.OBSERVE FREQUENCY= 200.13155
##.OBSERVE NUCLEUS= ^1H
##.DELAY= (6, 6)
##.ACQUISITION MODE= SIMULTANEOUS
##.ACQUISITION SCHEME= undefined
##.AVERAGES= 8
##.DIGITISER RES= 18
##SPECTROMETER/DATA SYSTEM= spect
##.PULSE SEQUENCE= zg30
##.SOLVENT NAME= CDCl3
##.SHIFT REFERENCE= (INTERNAL, CDCl3, 0, 15.7039)
##AUDIT TRAIL= $$ (NUMBER, WHEN, WHO, WHERE, WHAT)
$$ ##TITLE= Audit trail, XWIN-NMR		Version 3.5
$$ ##JCAMPDX= 5.01
$$ ##ORIGIN= Bruker BioSpin GmbH
$$ ##OWNER= she
$$ F:/spectra/data/she/nmr/H-F/1/audita.txt
$$ ##AUDIT TRAIL=  $$ (NUMBER, WHEN, WHO, WHERE, WHAT)
(   1,<2019-06-05 14:54:44.48 +0400>,<she>,<DPX200>,
      <created by zg, POWCHK disabled, PULCHK disabled
       configuration hash MD5:
       00 E9 B6 7A A2 85 ED C7 34 08 36 98 17 FE 4E 26
       data hash MD5: 16K
       58 73 04 69 56 EC 2C 34 82 7C 5D 91 0E 2D 7B 3D>)
$$ ##END=
$$ 
$$ hash MD5
$$ 3C DE C3 6C 0E 29 FC 65 70 D0 BB F6 9F 38 11 71
##$RELAX= 
##$RELAX= 
##$RELAX= 
##$RELAX= 
##$RELAX= 
##$RELAX= 
$$ Bruker specific parameters
$$ --------------------------
##$DU= <F:/spectra>
##$EXPNO= 1
##$NAME= <H-F>
##$PROCNO= 1
##$TYPE= <nmr>
##$USER= <she>
##$AMP= (0..31)
100 100 100 100 100 100 100 100 100 100 100 100 100 100 100 100 100 100 
100 100 100 100 100 100 100 100 100 100 100 100 100 100 
##$AQSEQ= 0
##$AQ_mod= 1
##$AUNM= <au_zg>
##$AUTOPOS= <>
##$BF1= 200.13
##$BF2= 200.13
##$BF3= 200.13
##$BF4= 200.13
##$BF5= 200.13
##$BF6= 200.13
##$BF7= 200.13
##$BF8= 200.13
##$BYTORDA= 1
##$CFDGTYP= 0
##$CFRGTYP= 5
##$CHEMSTR= <none>
##$CNST= (0..31)
1 1 145 1 1 1 1 1 1 1 1 1 1 1 1 1 1 1 1 1 1 1 1 1 1 1 1 1 1 1 1 1 
##$CPDPRG= <>
##$CPDPRG1= <>
##$CPDPRG2= <>
##$CPDPRG3= <>
##$CPDPRG4= <mlev>
##$CPDPRG5= <mlev>
##$CPDPRG6= <mlev>
##$CPDPRG7= <mlev>
##$CPDPRG8= <mlev>
##$CPDPRGB= <>
##$CPDPRGT= <>
##$D= (0..31)
0 1.2 0 0 0 0 0 0 0 0 0 0.03 0 0 0 0 0 0 0 0 0 0 0 0 0 0 0 0 0 0 0 0 
##$DATE= 1559732083
##$DBL= (0..7)
120 120 120 120 120 120 120 120 
##$DBP= (0..7)
150 150 150 150 150 150 150 150 
##$DBP07= 0
##$DBPNAM0= <>
##$DBPNAM1= <>
##$DBPNAM2= <>
##$DBPNAM3= <>
##$DBPNAM4= <>
##$DBPNAM5= <>
##$DBPNAM6= <>
##$DBPNAM7= <>
##$DBPOAL= (0..7)
0.5 0.5 0.5 0.5 0.5 0.5 0.5 0.5 
##$DBPOFFS= (0..7)
0 0 0 0 0 0 0 0 
##$DE= 6
##$DECBNUC= <off>
##$DECIM= 24
##$DECNUC= <off>
##$DECSTAT= 4
##$DIGMOD= 1
##$DIGTYP= 9
##$DL= (0..7)
0 120 120 120 120 120 120 120 
##$DP= (0..7)
150 150 150 150 150 150 150 150 
##$DP07= 0
##$DPNAME0= <>
##$DPNAME1= <>
##$DPNAME2= <>
##$DPNAME3= <>
##$DPNAME4= <>
##$DPNAME5= <>
##$DPNAME6= <>
##$DPNAME7= <>
##$DPOAL= (0..7)
0.5 0.5 0.5 0.5 0.5 0.5 0.5 0.5 
##$DPOFFS= (0..7)
0 0 0 0 0 0 0 0 
##$DQDMODE= 0
##$DR= 18
##$DS= 0
##$DSLIST= <SSSSSSSSSSSSSSS>
##$DSPFIRM= 0
$$ [...]
##$SUBNAM2= <"">
##$SUBNAM3= <"">
##$SUBNAM4= <"">
##$SUBNAM5= <"">
##$SUBNAM6= <"">
##$SUBNAM7= <"">
##$SUBNAM8= <"">
##$SUBNAM9= <"">
##$SW= 24.9336996594482
##$SWIBOX= (0..15)
0 0 2 0 0 0 0 0 0 0 0 0 0 0 0 0 
##$SW_h= 4990.01996007984
##$TD= 16384
##$TD0= 1
##$TE= 0
##$TE2= 300
##$TE3= 300
##$TEG= 300
##$TL= (0..7)
0 120 120 120 120 120 120 120 
##$TP= (0..7)
150 150 150 150 150 150 150 150 
##$TP07= 0
##$TPNAME0= <>
##$TPNAME1= <>
##$TPNAME2= <>
##$TPNAME3= <>
##$TPNAME4= <>
##$TPNAME5= <>
##$TPNAME6= <>
##$TPNAME7= <>
##$TPOAL= (0..7)
0.5 0.5 0.5 0.5 0.5 0.5 0.5 0.5 
##$TPOFFS= (0..7)
0 0 0 0 0 0 0 0 
##$TUNHIN= 0
##$TUNHOUT= 0
##$TUNXOUT= 0
##$USERA1= <user>
##$USERA2= <user>
##$USERA3= <user>
##$USERA4= <user>
##$USERA5= <user>
##$V9= 5
##$VALIST= <valist>
##$VCLIST= <CCCCCCCCCCCCCCC>
##$VD= 0
##$VDLIST= <DDDDDDDDDDDDDDD>
##$VPLIST= <PPPPPPPPPPPPPPP>
##$VTLIST= <TTTTTTTTTTTTTTT>
##$WBST= 1024
##$WBSW= 4
##$XGAIN= (0..3)
0 0 0 0 
##$XL= 0
##$YL= 0
##$YMAX_a= 281787
##$YMIN_a= -302852
##$ZGOPTNS= <>
##$ZL1= 120
##$ZL2= 120
##$ZL3= 120
##$ZL4= 120
##$ABSF1= 10
##$ABSF2= 0
##$ABSG= 5
##$ABSL= 3
##$ALPHA= 0
##$AQORDER= 0
##$ASSFAC= 0
##$ASSFACI= 0
##$ASSFACX= 0
##$ASSWID= 0
##$AUNMP= <proc_1d>
##$AZFE= 0.1
##$AZFW= 0.1
##$BCFW= 1
##$BC_mod= 2
##$BYTORDP= 1
##$COROFFS= 0
##$CY= 11.3945322036743
##$DATMOD= 1
##$DC= 2
##$DFILT= <>
##$DTYPP= 0
##$F1P= 18.9103706918063
##$F2P= -1.10871071338519
##$FCOR= 0.5
##$FTSIZE= 0
##$FT_mod= 4
##$GAMMA= 1
##$GB= 0.15
##$INTBC= 1
##$INTSCL= 1
##$ISEN= 128
##$LB= 0.24
##$LEV0= 0
##$LPBIN= 0
##$MAXI= 10000
##$MC2= 0
##$MEAN= 0
##$ME_mod= 0
##$MI= 1.114404
##$NCOEF= 0
##$NC_proc= 0
##$NLEV= 6
##$NOISF1= 3.799351
##$NOISF2= 2.8
##$NSP= 1
##$NTH_PI= 0
##$NZP= 0
##$OFFSET= 15.70392
##$PC= 1
##$PHC0= -8657.047
##$PHC1= 15.20018
##$PH_mod= 1
##$PKNL= yes
##$PPARMOD= 0
##$PSCAL= 0
##$PSIGN= 0
##$REVERSE= no
##$SF= 200.130013532006
##$SI= 16384
##$SIGF1= 3
##$SIGF2= 2
##$SINO= 400
##$SIOLD= 16384
##$SREGLST= <1H.CDCl3>
##$SSB= 0
##$STSI= 0
##$STSR= 0
##$SW_p= 3612.71676300578
##$SYMM= 0
##$S_DEV= 0
##$TDeff= 0
##$TDoff= 0
##$TI= <>
##$TILT= no
##$TM1= 0
##$TM2= 0
##$TOPLEV= 0
##$USERP1= <user>
##$USERP2= <user>
##$USERP3= <user>
##$USERP4= <user>
##$USERP5= <user>
##$WDW= 1
##$XDIM= 8192
##$YMAX_p= 0
##$YMIN_p= 0
$$ End of Bruker specific parameters
$$ ---------------------------------
##NTUPLES= NMR FID
##VAR_NAME=  TIME,          FID/REAL,        FID/IMAG
##SYMBOL=    X,             R,               I
##VAR_TYPE=  INDEPENDENT,   DEPENDENT,       DEPENDENT
##VAR_FORM=  AFFN,          ASDF,            ASDF
##VAR_DIM=   8192,          8192,            8192
##UNITS=     SECONDS,       ARBITRARY UNITS, ARBITRARY UNITS
##FACTOR=    0.0002004,     1,               1
##FIRST=     0,             0,               0
##LAST=      1.6414764,     0,               0
##MIN=       0,             -302852,         0
##MAX=       1.6414764,     281787,          0
$$ Real data points
##PAGE= N=1
##DATA TABLE= (X++(R..R)), XYDATA
0@%%%%qQqJ6k0K8l3M1n6P2q8J04j20J44j73K02k37K76l19L72m28M89n59O36p21
29c82Q17r23J038j165J304j458J626j811K013k233K476k743L037l362L722m123
45b167M571n076N648o303P059p946R003j0285J1884j3944J6712k0651K6754l7587
59b2328O2630k23021j20133L37244K319j33769j12646Q6218P7370J3977n3624
70h5763Q155M4068N7753M754j0098j4473J4738K1432M1674K9222j1945o6924k6754
83E839O5289Q4979k6078j01410m0722O9964O1883m4303j00880j6345R3444P8703
95A30363n1188j23882n3860O5478Q6361m102r0579o7947K4672O8980K6400k5117
107a4421k4155K684M814j1510j4167j813J2497L4176M8130J0986n8655o6625J0950
$$ y = [0, 0, 0, 0, 0, -8, 0, -8, 8, -12, 16, -17, 24, -32, 40, -48, 56, -64, 80, -93, 109, -128, 148, -171, 201, -227, 262, -297, 339, -382, 435, -488, 550, -615, 689, -769, 857, -954, 1059, -1174, 1302, -1441, 1596, -1766, 1956, -2167, 2404, -2672, 2976, -3327, 3732, -4214, 4789, -5496, 6388, -7556, 9156, -11495, 15259, -22328, 40302, -182719, -302852, 34392, 36711, -97058, -209704, -123486, -46116, -32139, -85763, -77608, -33540, 24213, 28967, 18869, 4396, 19134, 40566, 82240, 111462, 99517, 32593, 5839, 71128, 156107, 130029, 28619, -12103, 57861, 119744, 75441, -25439, -41784, 51660, 130363, 79175, -44707, -98567, -33089, 53272, 49170, -41409, -109356, -84684, -15704, 10696, -14421, -38576, -35892, -31078, -42588, -56755, -58568, -46071, -11895, 36235, 47221, -11434, -78059, -67109]
120f7109P6802N6822r821m7784k8378K0827M0554J582m0534j6224M5952N1009
132H3698j8585o8152k6452M9736N6937j2863o9785m5034L0952O3660Q048o0989
144h829m5374K7999M8821l469m4937k6688J3135K7005J3624o202k2591k6532K95
157e3743M6124N0995j1148o7793l9069L9107O2142N642m4186j7877L7664K9725
169C7583l6093o0248L162P6669O1410l0944q6862l5025N2584O1008o355m8900
181a2011k2415K2291L1469L611k7438k7675M216L1785K4109r980l4299k5477P600
194c4214L4613K9639q603m4003k7210L0428M8594m712n1107j9338M0759L8341
206C3187k2400n3465p691N5219M6821k5162o5414k3076M3198N1943K708l5661
$$ y = [-67109, 9693, 66515, 56694, 8910, -19468, 1359, 41913, 43495, 2961, -13263, 32689, 83698, 65113, -3039, -29491, 20245, 77182, 64319, -5466, -50500, -19548, 44112, 52160, -8829, -54203, -26204, 22617, 19148, -25789, -52477, -39342, -12337, 1287, -4915, -27506, -54038, -53743, -7619, 43376, 32228, -35565, -74634, -35527, 26615, 32257, -11929, -29806, 7858, 37583, 1490, -58758, -55596, 21073, 82483, 51539, -35323, -70348, -17764, 43244, 36889, -12011, -34426, -12135, 19334, 22945, -4493, -32168, -27952, 3833, 27942, 17962, -16337, -41814, -34214, 399, 30038, 21435, -22568, -49778, -19350, 29244, 24532, -26575, -45913, -5154, 33187, 10787, -42678, -50369, 4850, 51671, 26509, -38905, -61981, -18783, 33160, 35868, 207]
218B07k0894J2579J5082l704o549N452Q587K366O87k52j0492j9650m871K7454
232F002L2758p041m2737k4057K3865L7982J916l6308k3543K5737M0765n191m4402
245a4254j6567L5538L4596j3744l6101m905K7141J5390j2447j2600L951N346m886
258F458n630L369P845r8r823m725P396J803j5193r266J8777K4005r752l8125j7133
273d0092K8922L6520m704l5457j5088K0853K2410o125k2176m402K1689J8164j1292
286I222k3016j132J9705J0837j0865j1258Q074J4419m691j7776l159J2309M530
299G199o494O17R467K0j5024j1653Q530J6668j576k0588q523K0915K4604o736
313A7426l3103j7175K0415K5952o406k3095J325K3852Q708j8949j9514L928J8594
$$ y = [207, -20687, -8108, 6974, 3270, -3279, 2173, 10760, 13126, 13813, 13561, 3069, -16581, -21452, 6002, 38760, 31719, -11018, -35075, -11210, 26772, 28688, -7620, -31163, -5426, 35339, 30148, -14254, -30821, 4717, 39313, 25569, -10532, -15437, 11704, 27094, 14647, 2047, 5998, 11344, 6458, 828, 4197, 12042, 11944, 2121, -2604, 4792, 6595, -8598, -17864, 913, 24918, 15166, -22959, -40092, -11170, 25350, 20646, -14811, -29899, -9046, 13364, 7239, -14937, -19339, 2350, 20514, 9222, -13794, -14926, 4779, 15616, 4751, -6507, 1567, 15986, 11295, -6481, -9640, 2669, 7199, 705, 1322, 10789, 10809, -4215, -15868, -7338, 9330, 7754, -12834, -21357, -442, 24162, 17426, -15677, -32852, -12437, 13515, 7109, -15986, -14661, 9191, 17899, -1050, -20564, -16636, 1958]
326A958Q096q399o985N310N582m506n483N466R762l057j4469k675J7506J0720
340A8826j6040j7238J2527K6057j159l0782j9742J8078L0477J511k5782j4010
352a7277J4807J8364n362k1621r423J3763J6624j465j0755j708L333l564m034
365h318O253P859n669j2202M033K1250Q731k1590k4653P135K9637J3144j8403
378G207k2505O208K7170P112k7379k3741J4170L2299O710k3608j8674Q868J8002
391A1839j70j4466o643N611N514M65o80j177l712m412J172R108N823j1100j7880
406b0708K105K4151J4557j6255k5106K565K7777J1675k3156k4034J0976L0457
418A5004R721j9516j9294N407J9261M278j5928j1334R468J5859K349r443o027
$$ y = [1958, 10054, 1655, -5330, -20, 5562, 1056, -4427, 1039, 10801, 7744, -6725, -9400, 8106, 18826, 2786, -14452, -1925, 24132, 22973, -7809, -27551, -9473, 21004, 22515, -3267, -17277, -2470, 15894, 10532, -11089, -20512, -6749, 9875, 8410, -2345, -4053, -720, -4284, -8318, -2065, 5794, 125, -12077, -8044, 13206, 21937, 347, -24306, -17171, 12466, 25610, 7207, -15298, -9090, 18080, 25192, -2187, -25928, -11758, 20541, 27251, 3643, -15031, -6163, 11839, 11669, -2797, -9440, -3829, 1685, 2150, 1470, 293, -3419, -7831, -6659, 2449, 8272, -2828, -20708, -18603, 5548, 20105, 3850, -21256, -18691, 9086, 20761, -2395, -26429, -15453, 15004, 24725, 5209, -14085, -8678, 10583, 14861, -1067, -12401, -2933, 12926, 15275, 5832, -195]
431a95K001J148l383O72O420o40r898j628J3043P777j2587j7407K419K0529R865
446A8136j7246k1400N656K5618R561k0511k2294P234K6211O583k3396j8369J2821
459a1396K3400J721j7611j0681P995J2192n0r112m016M907O313L437Q52k593n905
474e47l960M681J1321M205j2710j3257R529K3190K379k5832j9343J4267K8573
487B2496K184k8529j9904J6319K8551R18k7800k0245J1662K5751M499k1264j5881
500b1243R722J8396K592j2532j0446O62P653O774K424l461q299l670J0106J4097
514A2775k905j9663j1577J3371K3043K932k2756j7964J3868K7448O83k9289j9476
527b9510J6897K9832K661k5721j6396J3809K1366J38j7510j1301O720J4627N682
$$ y = [-195, 1806, 2954, -429, 243, 6663, 6023, -3875, -5503, 7540, 15317, 2730, -14677, -12258, 8271, 18136, 890, -20510, -14854, 10764, 20325, -186, -22480, -15246, 10965, 17548, -5848, -24217, -11396, 12004, 13725, -3886, -14567, -6572, 5620, 5570, -3542, -7558, -2651, 3662, 7099, 7951, 5358, -547, -4507, 174, 11495, 15700, 2990, -10267, -738, 22452, 24831, -1001, -20344, -6077, 22496, 24680, -3849, -23753, -7434, 21117, 22035, -5765, -26010, -14348, 11403, 15902, -5362, -21243, -11521, 6875, 9467, -3065, -13511, -12849, -5196, 1578, 4002, 541, -7758, -11428, -1322, 12775, 9870, -9793, -21370, -7999, 15044, 17976, -4780, -22744, -8876, 18572, 19255, -10034, -29510, -12613, 17219, 19880, -5841, -22237, -8428, 12938, 13076, -4434, -15735, -9015, 5612, 11294]
540A1294o470p963j051L778M797L230k949r174m967Q955J5166J382j7909j4910
554a6791J0659K2873J658k3341j5657J3757K4718K596k2865j6473J2534K2791
566A6459M94k1790j3733J1603J9608J405j6497j0207P474J0698k31o736m511q95
580f859K257N430M497k336q675m446Q501J2472j103j4977p736J2918J9190L30
594A9463k0333j3073J4550K2734k138k3422j0109J7333J9986m818k2521r554J4600
607B698J6396m806j8423q687R008J2165l59j1192p778J472M006J702K68k499n927
622a1956j624Q057Q324n018j5343m977J5690J7141n843k1341n906J9394J9322
635A5920o335k3359q975J7859J9565n289k0520n299J6594J4845n858j7127o029
$$ y = [11294, 4824, -3139, -4190, -412, 4385, 7615, 4666, -4508, -9475, -520, 14646, 16028, -1881, -16791, -6132, 16741, 18399, -4942, -20599, -6842, 17876, 20472, -2393, -18866, -6332, 16459, 16953, -4837, -18570, -6967, 12641, 14046, -2451, -12658, -5184, 5514, 5283, -1453, -5964, -6859, -4602, 828, 5325, 2989, -5686, -10132, -1631, 10841, 9738, -5239, -12975, -57, 19133, 19463, -870, -13943, 607, 23341, 21203, -2219, -12328, 5005, 24991, 20173, -2348, -11902, 2698, 19094, 14288, -4135, -12822, -3814, 8351, 7992, -3200, -10978, -9506, -5500, -3798, -3530, -6029, -11956, -13580, -5523, 2801, -2217, -17560, -22537, -6847, 10294, 4451, -16890, -22796, -3402, 15920, 9585, -13774, -22749, -4890, 14675, 9386, -11134, -16433, 161, 15006, 9148, -7979, -14008]
648a4008R615J0603J031m571l693j523J918M031J509m174o335j057P920R169k973
663G462j4124o302J1800J3657o108k0879p976J7419J9652n070k1392q478J3007
676g332J3782l262j3407l790J1008J0618k866r514j978O893O731Q71k994k437
690B323n99J422N016O163n64q640n021O169P744l354j1309l674J0572J1094o130
705A1212j8705q925J1081J4886j418j5756q597R219J1000n090j3027p39J1328
718c531N956o706q273J823Q884M666l559m587j47K485K581L089K909k87m741m218
734c656L655Q436J302q551m137Q125Q411n555j3166k726J2225J0683o384j5139
748f477l994R650O769o031r578J243R682J748j1439r637M879J0822K424n685m070
$$ y = [-14008, -4393, 6210, 7241, 2670, -1023, -2546, -628, 3403, 4912, 738, -5597, -6654, 1266, 10435, 7462, -6662, -12964, -1164, 12493, 6385, -14494, -22470, -5051, 14601, 9531, -11861, -20339, -7332, 6450, 3188, -10219, -14009, -3001, 7617, 4751, -4763, -6741, 152, 6883, 7754, 4760, 2323, 1724, 3146, 8162, 14325, 13761, 5121, 100, 6269, 14013, 10659, -650, -4324, 6248, 17342, 11212, -7493, -16418, -5337, 9549, 8131, -7625, -16222, -7003, 3997, -1093, -14120, -14859, -3531, 2425, -4281, -12554, -10731, -1847, 2819, -740, -5327, -5474, -2989, -408, 2681, 5590, 5303, 562, -3656, -1, 8435, 9737, 1186, -2951, 5174, 13585, 8030, -5136, -7862, 4363, 15046, 8662, -6477, -10471, -821, 5948, -83, -9661, -8418, 1264, 3012, -8427, -18064, -13185, -2363, 61, -5624, -9694]
763i694O70L92j237K256O555K546n753m603N442Q744J83p118k562P839Q439l581
779H518j1093r75J2612R012p753j4040k179J1222Q021n621r720j303M272k20m598
794c845j941K629K499k236m707j140J528j565k647L694Q064R06r174p509N426
809a0018J1609K643p393k651Q215O273o025r667J861J3423R536n965j2683l143
823c985Q143P085r70m258j362M99j089j750J591L476r25n273j868L409J752l505
839I70l433K217M731q05p091m535M291O721R6n902l471L105M063k414n983M13
855g027Q047M288n574q203j059O268O217P96k493j483n11k027j412K638N138K152
871E755l475m778J45L869L58l071Q24N284J184p122p414J773Q877L807o325o861
$$ y = [-9694, -9024, -8632, -9869, -7613, -1058, 1488, -4265, -8868, -3426, 5318, 5501, -1617, -4179, 3660, 12099, 8518, -2575, -3550, 9062, 18074, 10321, -3719, -5898, 5324, 13345, 7724, -1996, -3299, 973, 753, -3845, -5786, -3157, -658, -2894, -7601, -8741, -7213, -8778, -11425, -7731, 333, 1239, -7935, -15444, -10018, 1591, 4234, -3159, -5810, 2405, 8678, 2653, -7014, -5153, 8270, 17806, 11841, -842, -3985, 4158, 11243, 10273, 6015, 4653, 5152, 4063, 2313, 3904, 7380, 6455, 1182, -686, 2723, 4475, 970, -2463, -246, 4485, 3680, -3411, -7946, -3655, 3066, 3162, -2740, -6211, -3106, 957, -1457, -7440, -7027, 1020, 5308, -266, -8469, -9528, -3260, 2957, 3753, 1260, -223, -734, -2761, -4173, -1535, 3603, 5755, 2280, -2498, -2353, 1516, 1874, -1197, -373, 4911, 6095, -1027, -8441, -6668, 2209, 6016, -309, -7170]
887g170K271O383n0n788k165N138M744l581p354P4P597L778m140l920J960L121
903H98j260k646K983N513p08o690k124N496L158m658m434M639R035j17j1458p874
919a0247P441J2734L05j1638p405N079P953l25n311L17N214J27o575m048L099
934c280M989R47k098j187M89p72k025J259M769J362n026m355K828O271N09o621
950a941l877N701P428k042q830k725P205Q218o17q100n961J739M547J357j101
965A001k7J212K09k216k492O85K814N37j517r36q04k023j213K641M834J561m552
982b86n518M67N809L554l012m356N38M372J080n349m088M711Q454J154o585n023
998d078K209M779P91l284j792J992J354j526j583J552K276K24j766j061P6r59
$$ y = [-7170, -4899, 1484, 1434, -4354, -6519, -1381, 3363, -218, -7572, -7498, 99, 3877, -263, -4183, -2223, 898, -362, -3008, -25, 5488, 4780, -1910, -4034, 1462, 4620, -38, -4472, 167, 9202, 9085, -2373, -10247, -2806, 9928, 10233, -1405, -8810, -3731, 4222, 3897, -1414, -1097, 4117, 4244, -2331, -6379, -3280, 1709, 2656, 558, -629, -140, -912, -2937, -1678, 3091, 4453, -573, -4928, -2100, 4171, 4680, -1941, -5818, -117, 7311, 5269, -3561, -6286, 919, 9137, 8520, 420, -5541, -3802, 745, 2102, 1001, 974, 2186, 2395, 179, -2313, -1628, 1186, 1723, 206, -730, -1534, -3557, -4770, -2129, 2705, 4266, -286, -5804, -5337, 472, 4026, 1014, -3342, -2804, 1568, 2648, -2701, -6789, -2078, 6376, 7530, 945, -4078, -1869, 2910, 3701, 417, -1375, 617, 1971, 445, -1138, 414, 2690, 2914, 1148, 87, 163, -796]
1014g96k756M91N518L413m433p307o52O140M165l211m523K020N148j418o894k149
1030g244O361O631j744p525l052N429N814j451m729m95L332J014k734j920K122
1045a91K815l63j624M54Q70j689k024J375L277M92l564l412J887N048Q16m798
1061f31k965L350M044k199n956p33O815N130m223p852j121N800M399j628l797
1076a567n82K320N06k225p36K163J425j178j365O09J013q80j574J295L829K29
1092C282m971l168L467N493L16m770k890L183M346j328n297j439M458L881j804
1107B759n012j518L887L226j727l180j53J302k74p21J048J702m13k230r69J942
1123c31J582j413j599J783L237l51m405l200K826N782P16m913l139K844L774r30
$$ y = [-796, -3552, -3061, 2457, 5870, 1437, -5870, -6522, -382, 3783, 572, -3951, -1931, 3217, 1799, -5095, -7244, -883, 5748, 4004, -3521, -6573, -1144, 4670, 3219, -1510, -2005, 1327, 2341, -393, -2313, -191, 2624, 2261, 637, 1091, 1961, 272, -1752, -377, 2900, 3392, -172, -3584, -1697, 3351, 4167, -631, -3596, -246, 3798, 1599, -4357, -5090, 1725, 6855, 2632, -5220, -6341, -541, 3858, 2230, -1567, -2149, 171, 677, -1548, -2284, -121, 1304, 126, -1239, -630, 383, -497, -2071, -776, 3053, 3282, -1689, -4857, -1390, 4103, 4419, -351, -3241, -58, 4288, 2960, -2337, -3776, 682, 4563, 2759, -2253, -3771, 116, 3342, 1615, -1565, -1718, -416, -690, -1411, -363, 1339, 926, -1304, -2273, -331, 1251, -162, -1761, 22, 3259, 2908, -1497, -4697, -1871, 3911, 4627, -286, -3425, -581, 3193, 2263]
1139B263l813q17L529K468k860l991M04L672J656j860j795P19J687o65k094J51
1155a346K629P15k033j301J367J636p76j809O34K633J09l257j909K589K731j017
1171A595l151r71K629K418j968l186R31L903N95l909k870K263M420K17l850j911
1187b845K480K558j240k319J87K046P29j728j729O24J524o77j342Q77J891m61
1203E75k489r72K462K441j438l585P1L784J679k668k691J351L535J036l111k530
1219b550J698L225Qk640j228J289J704n62j590J03J296m90j785J80J968K46k300
1236a428j366J643K602n50l329r11L345K900j562l584m83L480K699j810l392M81
1252a265L519R48k640j901J294K044j04k052p94J280N42j305q97P82P54p64j337
$$ y = [2263, -1550, -2367, 1162, 3630, 770, -3221, -2817, 855, 2511, 651, -1144, -425, 1262, 597, -1497, -1346, 1283, 1998, -35, -1336, 31, 1667, 891, -918, -284, 2349, 2458, -799, -2708, -119, 2612, 1595, -1556, -2527, 102, 2520, 552, -2634, -1703, 2200, 2795, -1114, -3984, -1721, 2699, 2916, -934, -2845, -365, 2193, 953, -1366, -1179, 867, 1596, -132, -1861, -1237, 287, -390, -1732, -855, 1036, 575, -1914, -2886, -424, 2017, 579, -3006, -2935, 849, 2528, -140, -2831, -1480, 2055, 3091, -20, -2550, -852, 2373, 2381, -259, -1487, -198, 1506, 944, -646, -543, 753, 263, -1522, -1342, 626, 872, -1428, -2794, -1151, 1451, 901, -2428, -3339, 6, 2906, 1344, -2240, -2723, 757, 3456, 1646, -1746, -1265, 2254, 3202, 562, -1339, -45, 1999, 1895, -157, -951, 329, 871, -434, -1331, -549, 205, -559, -1896]
1269a896O6J723P15j977j800J588K614l36k677o48K412K182r99k764K68K912R92
1286B375k072j570J535K328p0k452j003K242K050j573k557L13K441O92k068j632
1302a021J159J964p24k270k53J755M46j508j210Q02J218m54j959o55J917J026
1318B33j760j855Q15K352J62k410j422K062K645p35k584K0K456J628j064j699
1334a156L52K177R47j307q97J085J006n42q91L76J056l75j994n81K017J271k227
1351C17k787N91K692P62k740k779P32L156P13k776k156J192K547L11k143j490
1367c858J504K050j80j385J52R40L22j47L09O74K5p66j01J747J335j264j845M52
1385c6K484J255k020k598O23L678J301k943k878J274K952N91k444k023J093J992
$$ y = [-1896, -1830, -107, 608, -1369, -3169, -1581, 1033, 697, -1980, -2628, -216, 1966, 967, -1797, -1529, 1383, 2375, 303, -1267, 268, 2596, 2526, 74, -929, 1313, 3363, 1790, -767, -454, 1987, 2679, 611, -1021, 138, 2102, 1378, -892, -1145, 610, 1056, -452, -1662, -860, 358, -96, -2055, -2710, -793, 233, -1527, -3382, -2567, -215, -53, -2463, -3885, -1823, 822, 87, -2497, -2477, -21, 1607, 543, -1156, -804, 1373, 2320, 1013, 116, 1201, 2207, 1665, 774, 1150, 2206, 1831, -163, -744, 1273, 2544, 317, -2470, -1879, 813, 1575, -1165, -3944, -3212, -56, 657, -2119, -4275, -3083, -536, -225, -2368, -3858, -2354, -304, -484, -1869, -1717, -777, -455, -602, -293, 381, 406, -360, -461, 1286, 2621, 1357, -488, -36, 2448, 3703, 1683, -915, -292, 3386, 4687, 1744, -1134, 140, 3092, 3683, 1239, -784, 309, 2301]
1401B301j59j906p14Q53M17p50r73J3O81m45j042p9J301N1j755p44J310J469m38
1420f09j715k21J990J210j265j626R73K227O32j621j426J068K325K44k051r37
1436h02J468J237p17j367M9J390K87j411j038Q81Q74q57j072J80Q74N7j076p83
1454a826R36J195p30j603L60J707L69j483j182J291K297j47k653j062K171K475
1470B115m76k466j016J757K133n23k134n10J657J183o26j263l95P40P08n4k05
1487F25j18q82p40J095J691l42k008j298J318K163j89k877j240K502K536r50l064
1504a778j254K484L027n38l182j153K172K171l44j864o88J268J420k46j158m29
1520i2L11N84M77K56p33j279m44Q86J603J70k086j776J071K280R0k207j308J280
$$ y = [2301, 2142, 236, -478, 375, 792, 42, -931, -918, -237, -682, -1724, -1803, -502, -451, -2206, -2950, -1640, -171, -609, -2324, -2545, -555, 655, -610, -2236, -1263, 964, 1596, -25, -1451, -383, 1942, 2186, 135, -802, 666, 1903, 1186, -181, -132, 1258, 1545, 134, -904, -23, 851, -6, -1078, -898, -24, 33, -1043, -1826, -890, 305, -425, -2028, -1668, 39, 408, -1075, -2257, -966, 1331, 1184, -1469, -2531, -360, 2115, 1639, -827, -1843, -86, 2047, 1524, -610, -1120, 537, 1720, 1094, -169, -564, 176, 884, 830, 625, 507, -375, -1115, -20, 1671, 1329, -679, -1977, -659, 1504, 1315, -1562, -2802, -300, 2236, 1286, -1778, -3032, -548, 2479, 1941, -1241, -2394, -222, 1949, 1605, -259, -947, 321, 1741, 1495, 337, -92, 219, 803, 1280, 1536, 803, -476, -920, -34, 1569, 1739, -347, -2123, -1052, 1228, 1318, -889, -2197, -917]
1538i17J935m41k497q89K070J982o23k023o36J076J434q5j023Q3Q32J04m81j28
1556b27M10J66q0o8N11L70q64r50P73J651K87j654j361M54J564L53j406r84J086
1575C1J317p99j868l20J849J585r36k324n01J640J036q18r60K55Q00J41p78m95
1593a145O20R82j42n45j76q1j21J05Q74P91m09j459n11J614J334r17j747J50J993
1612A210J026j688k343M29K917J454k006k642o3K184J424j040j774R8J454J83
1628H23j041o90M01Q02L11l66o00p06k27O81J429O00j449j813K38J976J205j029
1646E45k001k6K207J119j800j920P81K415R51j671j981N9J773R73o91p50j89L10
1664A04J96j10j61J82N5k29J34J28m52q31J49J358R30q58j790p28J505J638l26
$$ y = [-917, 1018, 577, -1920, -2809, -739, 1243, 620, -1403, -2039, -963, 471, 386, -637, -554, 278, 382, -99, -227, 183, 349, 269, 201, 712, 1082, 218, -732, 41, 1692, 1979, 325, -1036, -582, 982, 1335, -71, -1055, 31, 1348, 549, -1319, -1639, 210, 1795, 859, -1465, -1966, -326, 710, -108, -1068, -813, -13, 128, -650, -1145, -525, 457, 315, -230, -406, -487, -608, -503, 371, 1162, 753, -706, -1217, 397, 1731, 814, -933, -783, 1210, 2236, 548, -1795, -1366, 1551, 3005, 999, -1643, -1706, 478, 1902, 862, -912, -814, 640, 823, -218, -908, -507, 295, 606, 240, -360, -1066, -1293, -612, 817, 1417, -32, -1845, -1607, 369, 1574, 545, -1456, -1482, 725, 1844, 44, -1876, -1095, 1320, 2271, 600, -1381, -1322, 451, 1424, 733, -17, -206, 104, 300, 190, 29, 211, 266, 37, 171, 299, -153, -984, -835, 523, 1453, 595, -1195, -1923, -418, 1220, 894]
1683H94j538n14R68O51m13r71K04J311O22j121j260K25J065P37j96o90k50J77
1701i9r4k3N85L18m35m20J6L20N1k86k38N54Q74m42j270m88J009J047r1j060n02
1722f74P54L45q05n41R05J147l47j505j053R07J585K90j221p20N48N38l40m37
1740f24K87Q60K76q41p78L62N73Q3o8L38L7n57o59J50J160O37r02j074K91R84
1760E35l2r99m61J089J333n48j952p22J475J400k99j057l09M64K27m12j45O75
1778B62O14n10q26R1L67J00k43Q6O94K13j058j171N98J699N49j055j255q7J018
1797H6M92m85l67M04M66j82n59k25L51M83Q3j97k0l19m57q1P25O99j90r16n62
1818g71N01P57n5q49j70P31M43p45r27m5J122J095l61j269n56O21P72J85l36k90
$$ y = [894, -644, -1158, -190, 461, 48, -923, -719, 592, 1214, 93, -1167, -942, 123, 860, 664, -26, -276, -99, -193, -216, 369, 687, 252, -168, -152, 168, 219, -67, -305, 249, 1123, 681, -589, -1077, -68, 979, 888, -172, -674, 80, 425, -380, -921, -16, 1131, 784, -721, -1774, -867, 718, 1008, -213, -933, -385, 153, -187, -624, -337, 523, 799, -42, -820, -458, 115, 198, 130, 468, 505, -52, -711, -561, 599, 1236, 334, -740, -449, 535, 503, -496, -957, 132, 1465, 917, -1035, -1757, -282, 1118, 819, -238, -547, -83, 144, -268, -413, 262, 876, 366, -460, -369, -2, 98, -145, -59, 635, 848, -210, -1381, -783, 916, 1465, 410, -845, -932, 86, 578, 93, -274, 130, 596, 414, -145, -370, -19, 464, 547, 350, 330, 11, -446, -527, 198, 897, 707, -209, -771, -270, 487, 432, -417, -587, 144, 587, -158, -1085, -1130, -8, 1087, 726, -543, -1099, -478, 294, 479, 143, -147]
1838a47P4J72k36N5K81K58j84n4rl1j75k48K16O42K77q90q19L13J105L22o78q04
1860e60K31P99k43q34j44R23N46m26p46j34M59L54j77k88K41N6o74k09M19P03
1880B96Q9o08m84M51N16m16m64L85Q25l6r48n84O29J038J97q18l69N54N20m41
1900C32n68q1Q93M31n80j021R5R13L81l52m26j61K4J60l7j34P0j29q4L22N6m63
1922c59m04L63Q06L86p03j238j22J436Q94o81j287m4J162P89q00j138K01J388
1940F49N78q47j286q9J108J059j84j013m99L60N89L19j97n95k38N00O45j24o80
1959E5p93L71J293K45j050j303J22J360Q50o68j586k43J262R62p12j294j41J097
1977a73Q63m06j263k28Q51P68K42o46o05l3P19N38K6o34n48L49Q27L42o77q68
$$ y = [-147, -73, 99, -137, -82, 199, 457, 273, 219, 210, 179, 4, -244, -28, 614, 891, 1, -818, -505, 600, 922, 244, -560, -329, 470, 227, -607, -751, 172, 718, 292, -454, -588, -129, 225, 48, -240, 1, 57, -617, -826, -407, 296, 385, -223, -707, -256, 260, -156, -620, -235, 590, 554, -394, -978, -349, 689, 886, 68, -301, 253, 773, 332, -236, -317, 576, 1007, 427, -594, -499, 414, 795, 443, 17, -144, -120, 40, 3, -131, -61, -190, -274, 48, 104, -359, -763, -400, 406, 792, 89, -1149, -1271, 165, 1059, 378, -909, -953, 209, 998, 198, -940, -739, 649, 1227, 380, -906, -995, 113, 1172, 988, -25, -524, -164, 425, 744, 547, -48, -286, 214, 859, 735, 55, -738, -367, 926, 1171, 121, -1182, -1060, 300, 1150, 482, -1104, -1347, -85, 877, 165, -1129, -1270, -173, 690, 284, -979, -1207, -356, 412, 654, 8, -597, -630, 89, 627, 653, 19, -529, -180, 647, 989, 312, -556]
1997e56K47J061N61p77j378j75J373J001p96j438j10J092Q96m71j257k70R45P68
2015G16m32r06l36N23Q11L7o41n10K03O42L69j03p66m08N15Q72l3q00o65M96J190
2036G74L91j205r92M20J429M81j184j277J95J541O82r94j255K25J143P29o89j272
2054h58o4J085Q02n00r39n26N60R76K94q26q39K27Q07P14m48j140m82J013J255
2073A111j51j344q78R23J574J92j569j189P01J534M36j171j309J64J546P25r90
2090C05j168q8J031Q65l50j152m93N24R72K45o39r58p1J050R01m92j167o14R56
2109c43J320q2j459q15Q30J581K40j300j142L91J544N51j064j210J72J196P61
2126A171o27j123m13J026Q53n4q76p17K99R42L83o55r94p0R96P59l11j266n25
$$ y = [-556, -309, 752, 1313, 536, -842, -1017, 356, 1357, 561, -877, -987, 105, 1001, 530, -727, -997, -52, 716, 284, -622, -958, -435, 376, 413, -228, -738, -535, 107, 476, 373, -393, -801, -286, 586, 553, -247, -912, -416, 774, 1165, -40, -1032, -612, 817, 1298, 114, -1163, -968, 573, 1255, 261, -994, -769, 374, 1103, 414, -858, -922, 163, 965, 465, -474, -1000, -440, 536, 830, 4, -835, -608, 199, 913, 465, -675, -1157, -144, 1111, 960, -384, -1262, -339, 1235, 1427, -142, -1331, -630, 904, 1340, 169, -1140, -976, 570, 1295, 305, -863, -951, 80, 945, 595, -557, -1050, -526, 446, 691, 52, -906, -977, 73, 974, 482, -685, -1299, -343, 977, 895, -564, -1379, -549, 1032, 1272, -28, -1170, -779, 765, 1316, 252, -958, -786, 410, 1171, 544, -579, -992, 34, 887, 833, -43, -760, -461, 481, 864, 209, -785, -855, 141, 900, 589, -677, -1202]
2145a202R73J102r4j330p19O96J267K16j186j062O85J245K73q34j074L34J128
2162D18M55p52q67J23Q41N75l02p25l37N19P04M9o51n88J64P34N35o74q70n1R46
2183B46P59m70j114m25R72R18l23j111m94P89J045j63j042n89O41R09J32p81o88
2202g89J94Q77L44n43n74n3N57N95j68o02n01L50O82K91n17q63R0R42O80n83j028
2223f19k41Q71Q18k79j028m84P70J034j77q42o63M02R80J93p56o25J58O41M45
2242E98k74o16l65M66N28J79n41m98L9P50M33m61q59k9P38O67k72r58l33P73P91
2263G56k11r96l77N89Q90p2p90n03L50P22J26l99n19K3M46M51k73m23j74K66M24
2284C06K32n03m82N5O89K34l07o20j0N72M40l08o44q8N55L91k79n63j40M74M68
$$ y = [-1202, -229, 873, 779, -551, -1270, -574, 693, 909, -277, -1339, -654, 591, 864, 30, -1044, -710, 418, 873, 121, -746, -623, 218, 793, 491, -234, -571, -52, 652, 701, 50, -538, -374, 360, 895, 221, -649, -700, 246, 1005, 535, -579, -1004, -32, 886, 563, -548, -1042, -253, 792, 629, -413, -1002, -361, 548, 680, -101, -789, -595, 282, 626, 83, -491, -544, 13, 608, 440, -162, -663, -313, 369, 660, 143, -720, -630, 312, 992, 409, -619, -860, 11, 829, 550, -478, -962, -192, 842, 665, -177, -840, -438, 542, 735, -21, -646, -488, 153, 598, 324, -292, -657, -191, 337, 516, -25, -523, -484, 266, 699, 238, -621, -650, 88, 755, 483, -475, -808, -35, 756, 545, -451, -828, -239, 651, 579, -211, -714, -364, 358, 484, 85, -434, -411, 35, 486, 213, -210, -384, -118, 306, 538, 35, -447, -392, 297, 531, 224, -396, -406, 166, 606, 298, -346, -434, 121, 512, 233, -330, -470, 4, 472]
2305D72j46o12j31L27M08ml53l28K26J82J7kj91p4J71K91r9k94j68R1M05J25j80
2328A33l49p1L46K89j86l92l4M13J85k71l42M5L42K76j68l89j34J95L75K4k60
2349B7j39J6J52J36j00j87k5R1J96J01k52l77J69M29R1k49l82j04M59L16j82m46
2371b60j06L92L29j34n29j89L61N58j83l00l18J59L19K03j66l07k5J86J95O9k33
2392B1l10J69L88N5l84k41N9M76K62k30n36j11N24L30k27l82j01L07K73j54l49
2413a61m0J75K70r3k26k51J90J85J18j51r4j93J4L02M1j67j46nJ41K53j28l01
2435b67N7L49J62k52k80k01M02M25j23m16l3K12J10l7mq4O3J19j09q7j05o2K47
2458H6J82k4k93k51J64K63J78k32k90jK66K10k59k88O9K93K79l13m37q7M85L55
$$ y = [472, 326, -286, -417, -90, 318, 314, -39, -367, -141, 41, 58, 56, -135, -209, -38, 253, 154, -140, -308, -217, 188, 313, 133, -216, -287, 59, 348, 162, -230, -264, 149, 334, 63, -279, -234, 108, 384, 216, -173, -307, -112, 263, 287, 27, -112, -96, 56, 192, 92, -95, -120, -29, 167, 268, 16, -361, -192, 237, 328, 79, -303, -407, 52, 368, 186, -260, -366, 26, 355, 221, -308, -497, -136, 422, 239, -61, -379, -220, 99, 302, 136, -171, -196, -10, 185, 254, 21, -289, -120, 268, 323, -61, -302, -243, 233, 495, 265, -271, -382, 142, 472, 245, -137, -238, 69, 342, 188, -161, -201, -26, 244, 151, -75, -326, -136, 49, 167, 16, -78, -271, -257, 45, 86, -81, -227, -232, -91, 162, 34, -267, -210, 139, 301, 49, -231, -432, -30, 395, 272, -144, -177, 35, 145, 108, 104, 20, 83, 202, 93, 6, -99, -161, 86, 268, 244, -49, -300, -136, 127, 305, 73, -217, -218, 48, 258, -1, -289, -220, 73, 352, 39, -398, -485, 0, 355]
2480C55j91l31k36K06K97L2j93k16J73K06R7j68l02R2L87J97j64m09k25L49N67
2501E23Mm45l71K46K85J13l76k06O2M63P1l54m28QN18M19k10p23j98M31M66O7
2523C65l82l38J75L93M0l33k64J05M39J99k42n03o8L49L81J45m57m61J19N10J65
2544C37k81m21J21L93K98l78m23j02O07M59l27n48k85M37N17J52n27k82Q5K70
2564A02J65j11k61j14M41J52j78m21k32K14P16J12o00n45P1N41L95l28n02j5N91
2585A93J73m09m64Q1N67L98l13n60p6L46L38M7l14k92M0L48K24k44k90N1K41L42
2607D27j57m89j86L60N02o1o07m38L68P01J7n14l33K16M89l7l75k49K97M16R2
2628D39m50m16OM52M25m1m22l42J63L46R4k30k87J35N29Pm14l99J40N26L60l31
$$ y = [355, 164, -167, -403, -197, 100, 132, -61, -277, -104, 102, 199, 31, -271, -179, 208, 405, 241, -168, -393, -44, 523, 527, 82, -289, -43, 242, 355, -21, -227, -165, 298, 369, 15, -413, -405, 113, 532, 322, -401, -599, -168, 298, 365, -17, -355, -180, 213, 253, -80, -344, -239, 200, 399, 157, -346, -414, -65, 316, 461, 4, -457, -338, 172, 337, 56, -365, -244, 149, 447, 69, -354, -456, 151, 610, 283, -265, -550, -113, 404, 556, 29, -253, -168, 102, 267, 156, -105, -219, 222, 374, 196, -225, -457, -243, 473, 585, -15, -560, -489, 52, 447, 119, -383, -398, 193, 366, -43, -507, -426, 141, 539, 226, -334, -410, -64, 274, 321, 7, -285, -245, 103, 327, 83, -207, -156, 85, 427, 270, -219, -405, -45, 457, 396, -211, -649, -281, 420, 437, -77, -410, -194, 295, 258, -117, -366, -69, 347, 439, -11, -427, -421, 31, 456, 415, -7, -349, -186, 160, 254, 24, -263, -128, 401, 408, -6, -405, -265, 261, 621, 290]
2650B90n95r2M05M09m1n02l28K53M22J24m24l13K13K78K59m02m44l7N96M39k53
2671B57n63k26K86N34Q6l65k51J60L07M4l34k95J36N63K61l99n54l10M28O13Q7
2692D65n90m17K40M38R0l65l80J48O74J14n60m78Q2O43L67j82m92k60L79L68R3
2713C77l74k92M6M91J33l13l40pM98L16l02o36j38N44N42j42n67m17L21M69J27
2734C36m12k82K68L47K0l86m02K27N96J65k50m28j94K29M21J34l67l01K36K69
2754B26J67m01m08J13O05K40l76m61j52N16L72k12o02j35M26L91j47l12k66J88
2774b28L56Q8k56k46J35L44J13k37l94r0M49M06q3m04l66J64M63J32k82m11K27
2795a20M53J12l83m77k0O21L79k11o01k94M14M34L1m68l10K66M14J71m07m69Q0
$$ y = [290, -305, -397, 8, 417, 376, -126, -454, -201, 221, 345, -79, -392, -179, 99, 358, -44, -488, -525, 71, 510, 257, -306, -532, -246, 288, 374, 9, -242, -82, 225, 269, -65, -360, -224, 339, 600, 201, -353, -663, -235, 378, 465, -125, -542, -302, 136, 226, -139, -519, -371, 303, 417, -143, -621, -539, 104, 471, 289, -203, -463, -84, 284, 377, 3, -289, -243, 248, 381, 68, -272, -279, 219, 535, 233, -403, -541, 3, 545, 403, -164, -581, -260, 209, 336, -76, -358, -90, 257, 277, -109, -511, -284, 312, 477, 227, -201, -395, -166, 255, 389, 22, -279, -43, 226, 393, -8, -416, -303, 302, 542, 166, -295, -447, 69, 441, 229, -373, -508, -82, 309, 162, -150, -416, -228, 128, 216, -40, -286, -151, 193, 306, 69, -325, -415, 34, 440, 357, -47, -413, -249, 214, 346, 64, -347, -120, 333, 445, 62, -415, -435, 186, 565, 354, -247, -541, -127, 307, 338, -130, -440, -174, 240, 411, 4, -465, -385]
2816c85N40K64k78m36j15L31N02j43l81l88J87N22K06l35m69k3N41K65l43n35
2836d73N2N64M50k24p78k02M35N83O1n18k54L7M38J50l38k66R6M68K64k94n01
2857b50k10L74M86Q3m23l43M8M60J77l74l80J01M61K85k82n25j37M07M61k07m36
2878b24j96K28M43M6m16l35J27M40K10k07m07j03L61L42j93l17r2J87M66R4m22
2899C2m15O1N02L44k96m34p3N11K36j65n37m0L81L76p7n10l02K33M55J32m13k25
2921b24J21L71K07l72n67J8M46L62m5n07k18K35M42Q1m60l46J90N66J69m67n62
2942e60J4N55M21j58o09o5M28M27j52o31j46L67N50L9n09m48J26N78K63j79m84
2963a73j29M37L54j27o48k75L82O21K25n82n33J07O18K89l91o16n2O16M17l09
$$ y = [-385, 155, 419, 141, -295, -410, -79, 423, 280, -101, -489, -302, 220, 426, 91, -378, -401, 140, 405, 62, -473, -421, 143, 593, 369, -409, -611, -176, 407, 468, -50, -304, -267, 171, 321, -17, -283, -187, 281, 545, 251, -250, -460, -86, 400, 483, 60, -283, -235, 225, 402, 28, -352, -251, 210, 495, 213, -312, -449, -42, 419, 212, -224, -420, -192, 251, 297, -119, -454, -327, 113, 323, 116, -291, -394, -33, 309, 116, -201, -293, -106, 360, 454, 32, -383, -322, 180, 524, 228, -206, -279, 232, 468, 303, -234, -274, 107, 483, 406, -104, -406, -173, 282, 414, 1, -224, -103, 268, 475, 103, -464, -446, 0, 362, 317, -190, -408, -173, 269, 350, -110, -456, -266, 300, 469, 2, -560, -546, 9, 430, 272, -337, -402, 26, 453, 301, -330, -476, -109, 441, 480, -29, -477, -351, 227, 490, 311, -173, -302, 135, 489, 362, -286, -561, -179, 442, 667, 85, -448, -341, 277, 566, 175, -441, -493, 123, 540, 231]
2983B31o31k30M83O36J9n78m54K67N27J57l74n70M1O01M54k40o01l13M57N61J08
3004E51n46n13L55N38Q8m37n96Q9O93M33l18n89j21M41M31j26n67k92L96O23R
3025E42n62n13K36N86L06l39n48m2L86L15j94m78j90M48N65l6n66m97K40N11K37
3046D07l68m96N7N00L60l92n37oN95N29k71n43l34L98N10K6n17k98K60N28J66
3067E74m96m88Q0N61L25k79n40n1L72L67j26m82l49M00O55K6m99n80P8O46L75
3088E69m26n92O6N37L99l31o60j40N75N06m0o43m21K72N36K17m87m40J08O86K04
3109D95k52o59j41N30O21r1n74m32K94P07O7n78m88J11P93L15l92p36j43O52M92
3130E91k86n84k38M82M89o7n89m67L67O22K33l87n72j02N25M21j42o31j55M81
$$ y = [231, -400, -630, -147, 489, 508, -70, -524, -257, 270, 427, 53, -517, -476, 125, 579, 339, -262, -575, -118, 443, 551, 5, -508, -153, 385, 473, 36, -560, -471, 222, 655, 337, -252, -373, 68, 499, 373, -194, -486, -90, 533, 542, -20, -533, -297, 289, 595, 256, -292, -334, 52, 367, 173, -305, -495, -47, 518, 482, -84, -581, -341, 170, 407, 39, -457, -400, 100, 460, 68, -469, -475, 120, 649, 378, -165, -499, -101, 409, 435, -82, -380, -120, 408, 574, 78, -410, -330, 231, 556, 277, -263, -314, 58, 425, 299, -183, -532, -132, 523, 549, 50, -530, -452, 194, 569, 143, -449, -383, 154, 553, 222, -438, -578, -3, 503, 463, -180, -601, -329, 207, 424, -63, -503, -395, 291, 495, 243, -416, -557, -27, 594, 503, -71, -503, -209, 498, 565, -13, -501, -390, 403, 718, 326, -410, -553, 99, 591, 305, -279, -517, -35, 454, 387, -202, -669, -302, 320, 553, 166, -406, -508, 17, 438, 296, -335, -490, -9]
3150iN56j72n95l93L39O44J57m82n33R3M68L33k56o16n6M67N61k10n71k83K81
3171b77N78J6l99k82J78M30J03l29l97J7N50K95j58m17k39K13M70kl34l82K65
3192a01L52J27l90l24J55M73J22k83m32n1L84L44j33m66j65L32L09j35l56j52
3212c90K23K65M8k74k93J51M60J56l39m72m0M04L90r3l88k56L01L56m6k86k55
3233c78K33M19R0m11m74J28N94L25k32m42k93L12M20j12l33j97K93L83J2n28l13
3254e04J45N75J98k84m81j26M21M38l4m57l33J83N00R5l68m66J39O28K03m15m90
3275d33L6M95M11k17o06k75L87M65L3k66l79O7L42J31j87k69M5M30K68j36n32
3296a90k13L38N51M7m82l45O2L92J71k70k75pK62K32k83l80q2L51L68j12m61k65
$$ y = [-9, 547, 375, -220, -613, -274, 370, 527, 45, -488, -395, 73, 406, 150, -466, -522, -55, 506, 296, -275, -558, -277, 301, 317, -82, -364, -186, 244, 347, 18, -379, -362, 188, 483, 325, -92, -331, -118, 352, 350, 16, -366, -101, 251, 378, -12, -336, -181, 292, 414, 131, -301, -352, 32, 376, 243, -223, -388, -56, 253, 118, -238, -390, -167, 98, 146, -128, -421, -270, 190, 346, 7, -465, -505, -101, 289, 196, -192, -448, -147, 209, 163, -123, -378, -145, 274, 364, -47, -521, -393, 201, 526, 294, -148, -441, -129, 291, 179, -154, -351, -58, 325, 337, -191, -504, -359, 216, 414, 130, -351, -477, -56, 382, 348, -109, -442, -259, 241, 336, -32, -498, -359, 269, 472, 57, -433, -397, 98, 509, 292, -314, -589, -202, 263, 296, 30, -349, -282, 60, 191, 4, -265, -220, 210, 478, 342, -190, -403, -65, 486, 533, 51, -294, -232, 160, 331, 61, -214, -221, 41, 273, -10, -390, -472, -121, 247, 135, -326, -591]
3318e91J22M06K57j36l24j54J54L13J07l26KJ33L30n4l78k12K05N19J71l78l53
3339a87Q8K25J92n7j21j10J66O9m8j19j16J21J44N3m24k59J67L99K79k70m36j40
3361c84K64J55n9j01m7J54J16j35k44p5K17L01mk70l16mM02K36k4k57k41J44K21
3384D9j36j69J7L43K46j37m24k53K29M45J59k00k85l9J98J75l1j62j00J00J26
3405A51R2k79o7R5L88J35l55m84j2M09M40r2m75k65L09K27r6l04j14K24J73K8
3427A28l16k16J14L39K76k37l80l09L05L41K45k81k66N3K24J73k75l37K83M58
3447C22J48l16m87n0L74M42q7l91k10J02L16J38j99k08M6K36Jj36k83%L93K97
3469D48k06m04k47K42M20K38l77l48P8K90M4j74k20J47K27O3l22j86M7K59L13
$$ y = [-591, -469, -63, 194, 58, -266, -420, -266, 47, 154, -172, -170, -37, 293, 239, -139, -351, -146, 373, 544, 166, -187, -99, 126, 318, 261, 140, 30, 196, 265, 217, 98, -18, 103, 247, 300, -124, -383, -216, 183, 462, 192, -244, -384, -120, 35, -24, -125, -172, -18, 98, -37, -281, -356, -139, 162, 158, -112, -428, -432, -30, 206, 182, -75, -316, -172, 49, -87, -256, -239, 104, 350, 213, -211, -464, -235, 210, 369, 169, -116, -155, 43, 218, 187, 25, -75, 25, 151, 243, -36, -103, -8, 380, 515, 160, -324, -336, 73, 513, 421, -54, -319, -10, 217, 121, -183, -297, -73, 100, 128, -188, -404, -290, 49, 325, 88, -292, -601, -296, 45, 290, 9, -257, -204, 20, 193, -82, -419, -136, 322, 470, 154, -333, -383, -9, 433, 346, -45, -255, -153, 163, 301, 102, -106, -60, 176, 177, 41, -242, -242, 151, 448, 242, -162, -409, -167, 253, 491, 114, -234, -156, 134, 178, 4, -216, -69, 158, 221, -101, -287, -240, 19, 332]
3490C32o0l40k75L3L42J16j16j83L6J12R3j82k30J96L50R6k89l43n8L24L08m6
3512B16k37j84O9K66O8q5r2J23J12P6l51k59Q6M44L24k43n30j13K64K88J7l45
3534h6q5N7L08j27k87j19J37L93R6l75l74K0L71L42J5m89j91R9L25Q9k13j84J73
3557a05L46R0k82m37J09N25K97k74m83j91M83L22l6l71k35J06L84P1k81k73J57
3578g8K76J84k36n16N3L36M34m5n20k89J08M07J66k42l00L1L44J25m19k34P6M37
3600I8J78j44m04j67L20L68R5l04l15J44K42K09j51k38oK60J70j63l94kK68L23
3622C87l8l58k04K03K42Nj99k64M3K11Q0j60j25M2J80J16k11l42KK67K63oj89
3645e5j75J7K17l7n3o4J17K16j4j91k29M7L99J80k02k33oJ31K17l7k45q3J44K40
$$ y = [332, 272, -68, -343, -310, 32, 148, 32, -151, -115, -3, 90, -92, -322, -126, 224, 320, 31, -312, -370, -46, 262, 216, -21, -205, -136, 130, 198, 113, 21, 144, 256, 332, -19, -278, -192, 252, 576, 333, -197, -310, -46, 242, 259, -86, -171, -114, 194, 67, -220, -339, -202, 191, 287, -88, -462, -442, -71, 271, 286, -203, -394, -295, 30, 119, -94, -278, -105, 241, 331, 49, -388, -279, 246, 543, 269, -214, -405, 78, 400, 364, -7, -242, -136, 248, 319, 38, -235, -78, 198, 382, 146, -370, -317, 19, 453, 408, -112, -401, -293, 114, 280, 38, -262, -231, 113, 238, -181, -415, -339, 98, 276, 132, -272, -439, -119, 249, 344, 40, -275, -131, 111, 320, 169, -69, -75, 185, 355, 192, -202, -204, 64, 387, 349, -9, -213, -10, 232, 237, 38, -226, -183, 28, 108, -52, -177, -135, 45, 161, -50, -392, -390, -123, 140, 134, -55, -230, -213, 4, -33, -86, -150, -33, 183, 169, -22, -251, -204, 195, 375, 173, -60, -66, 65, 282, 245, 0, -83, 61, 301]
3669C01Lk51k37J86K46J19l00k31N7L19M8j25l29j10J75K46nl09j72J54K35N4
3691G4k49k60J40L67O7k34l35p9L61K93L9m03m4J89J79j5k06j31J58L57Q6k60
3713I4k78m5L47K46j13l06j03J31L28l6l04j49J45K63J14l12j86J2K53N9q0j95
3735a15q8Q7K89jk82j73O1K51J14o7k36l6J68O9n8j56lJ06K62K0j93j32m8K23
3759F2J42j03q6k8N3Q3n9j15j7M6J92J7j22p9o6J71j1p2q2r2J80P3o1j24M1J11
3785E4Kj52o3K6j0m3J50k0O6n8N0pq2o4R7R6NNjm0M8L1j34j2J00M6M6Rj09k0J3
3816B9K1j22l3j3P6R3Q0m9k06J0J17o0p7m9O5J1J2J9j26R5LO5J14p4j66N5N9J04
3844E3j5r7j5M7P3J8QL6j7J27k3r6o9p5R5J31M9j20n8Q2M6Lr0j50n0J35O9n8j97
$$ y = [301, 304, 53, -184, 2, 248, 367, 67, -164, -107, 212, 260, 135, -194, -304, -129, 117, 112, -197, -369, -215, 20, 74, -175, -435, -295, 72, 139, -95, -430, -509, -148, 145, 184, -219, -263, -74, 105, 90, -116, -247, -89, 268, 354, 94, -184, -229, 118, 364, 251, -55, -158, -27, 301, 265, -39, -188, -43, 220, 334, 22, -164, -152, 101, 160, 80, -115, -203, -116, 173, 172, -110, -283, -222, 29, 143, 76, -160, -196, -28, 41, -17, -173, -176, -70, 192, 212, 19, -113, -161, 62, 204, 101, 15, -13, 40, 123, 64, -51, -68, -22, 170, 187, 65, -14, -80, 91, 80, 8, -74, -166, 14, 87, 26, -98, -57, 54, 56, -96, -159, -133, -143, -186, -36, -56, 10, -48, 2, -5, -87, -151, -54, 42, 47, 52, 51, 11, 59, 90, -44, -56, 44, 90, 136, 145, 36, 16, 29, 50, -72, -105, -118, -42, 51, 131, 82, -124, -114, 3, -57, -134, -183, -118, -107, -95, -76, -202, -107, -104, -39, 75, 1, -165, -110, -51, 53, 38, -59, -74, -27, 46, 64, 72, 108, 91, 218, 195, 99, 30, -45, 50, 181, 230, 110, 52, 134, 180, 183, 93, -57, -107, 28, 97, 39, -158]
3873a58jP5J01M4p8j62N7J14J20j71k36o0K41J15m8o6o6J68K7O0j39j13k1K24
3897B7J7n1j18PJ43J70Rr4j91P6Q2J7j04n5N6J48J26q0j23q0J63J7j0r4o7L6J21
3924A48k6m0q9o1J48N3k8j94Q3k9J3m4p0L0m3J00Jrn2n2K26J0j02o8Om0M6RN2
3953b2k1J17K0m3N2j31m7J29p8Q%L8N9k6n3Ql4O4M3o9j21PJ14oqj24P3P9L7o8
3983cj05o6R8J41m8q9q0J28J13l8m2r0J43Q7J2j29l3q6J86O4J2k08q3K01N0m0
4009I5j78n8O4K19Lk43m1R1J54J8p6k39j1J90J0K9j75m9Q4J99Jj50j34N8K15k1
4035E5j50o4j7K25R1m6j38j44J51J90n9j42j26R1J98l2j19r5J92K5M3r1j12N7
4059a7J08Q5k2k14r8J56J25j9q1kJ19M5K1k72q1J03J74L6j46q5p1K23L4j16q8
$$ y = [-158, -159, -84, 17, 61, -17, -179, -122, -8, 112, -59, -295, -355, -114, 1, -47, -113, -179, -11, 16, 76, -63, -176, -197, 27, 44, -7, -125, -118, 25, 195, 204, 110, -81, -5, 77, 94, -10, -65, -9, 139, 265, 185, 62, -18, 145, 162, 152, 58, -9, 27, 148, 122, 82, -7, -68, 80, 133, 105, -89, -6, -35, -22, -66, -136, -106, -149, -49, -48, -57, -109, -161, 65, 75, -27, -95, -89, -129, -83, -74, -22, -43, 74, 94, 51, 103, -28, -75, 54, -24, -16, -16, 22, 81, 55, 2, 10, -24, 40, 83, 14, -107, -100, 14, 8, 0, -124, -51, 28, 65, -3, -108, -174, -76, 65, 17, -72, -152, -24, 89, 51, 9, -81, 62, 149, 161, 32, -1, -87, 99, 163, 175, -33, -116, 85, 135, 95, -83, -141, -77, 142, 145, -98, -139, -48, 106, 124, 48, -191, -202, -12, -2, 27, -148, -197, -113, 86, 87, -63, -197, -139, 76, 55, -95, -159, -176, 49, 140, 94, -44, -188, -37, 153, 94, -48, -174, -83, 115, 83, -36, -131, 61, 86, 129, 38, -74, -17, 91, 176, 154, -60, -158, -2, 123, 104, 23, 21, 140, 185, 206, -66, -147, -44, 130, 166, 20, -65, -136, 87, 121, 5, -83]
4084h3QL0R6p5j11m2Q7K26p5k17j37J14L09M1j60k02P2J66J25j13j77k3K26J62
4108B47j25k15p6J48M13j09l31k95K14K48J31j72k57k8K10K50k14k15j00L23J86
4129B33j26l70j51L06L25J60l90l40J14K44J38j68j64o6K54K73k32k82j16K92
4149f6K52N7k94l65J53L53J01j08l31k9L14K17r3k36j28L11J89j42k67j22J11
4170a23L92J29k90k47L7J64K14o3k75jJ04J18l9k31q1K18K79j04k70k24J33K68
4192A08J78j55k88j7J24J18o9j12L0J03J69j99k89o5L06L41j33j79k00L0K38J90
4214B29j68j44O5J04J47j27k71M4K70K48j55m20j49L23L28ml22k22J05K12J32
4235B25j73k07M6K80P9k83k47PL60K31j50l90k34J88M54N2k46k83N1L38O7k11
$$ y = [-83, -75, -45, 51, -24, -135, -177, -90, 136, 61, -156, -293, -179, 130, 171, 11, -191, -119, 47, 172, 59, -118, -141, 85, 247, 122, -93, -169, -21, 392, 283, -48, -343, -129, 119, 250, 78, -179, -207, 3, 253, 39, -176, -276, 47, 233, 107, -263, -414, -108, 217, 377, -13, -353, -239, 5, 143, -25, -189, -255, -1, 272, 40, -242, -358, -66, 186, 243, -51, -416, -263, 90, 191, 83, -248, -277, 37, 254, 161, -75, -203, 108, 297, 155, -112, -234, -123, 269, 398, 108, -139, -102, 62, 276, 213, -62, -63, 41, 159, 120, -111, -192, 26, 305, 201, -69, -293, -160, 108, 286, 131, -157, -174, -50, 68, -1, -113, -83, 20, 189, -10, -299, -364, -58, 283, 150, -29, -229, -199, 39, 229, 61, -83, -18, 86, 233, 106, -165, -121, 149, 397, 242, -178, -327, -4, 324, 320, -2, -224, -119, 93, 225, 52, -155, -109, 171, 250, -33, -280, -273, 87, 318, 168, -222, -456, -268, 186, 238, -8, -291, -240, 98, 165, -46]
4257d6k64J25L41J63k38l30j85M60L62o9l06k38P2K93J69k56k08Q5K10J51j93
4278I8l11k8M00K34j91l49j88K29L53J12l37l01O8K37J78k11k51N0K71J58j45
4299G6k91j24K40L64J9l04l44Q3L19K27o2k60j41K35K04j83k36M0K86K38j32l54
4321a00r9J40L10R6j76k81L7J23J03m6j06m4J08K00j49k14j10J97K78L7k81l37
4343c14J19K38J59j95j32N1R3J18j01k31J5K28J62j61k17r8J76L04M0k95k19J35
4365a25J59R7k6j59O6J40M5k33j50K5K24L45j86l46j63K06K91K3l06j31O2K07
4387F5N6p4k14P7J69J03j44l03q5K41L29L0l37j89N4K90J52j56k07o3K78P2r7
4410D7j37q7J81K90o1l13k05J16L74K27k31l00r8K02J67l2k02j26J67K35kk79
$$ y = [-46, -310, -185, 156, 319, 81, -249, -434, 26, 388, 319, 13, -225, -153, 140, 309, 53, -155, -70, 140, 291, 98, -213, -241, 159, 393, 202, -147, -335, -106, 247, 359, 22, -279, -211, 26, 204, -7, -258, -208, 63, 221, 76, -215, -339, -99, 265, 284, -20, -364, -281, 38, 265, 203, -57, -198, 37, 241, 58, -178, -138, 148, 386, 254, -100, -199, -59, 251, 347, 171, -110, -73, 50, 153, 107, 1, -43, 65, 265, 116, -98, -208, -11, 267, 304, 23, -314, -195, 43, 202, 7, -125, -74, 19, 137, 36, -195, -180, 48, 210, 49, -168, -266, -90, 214, 254, -41, -260, -125, 34, 131, 105, -54, 12, 152, 197, -36, -186, -161, 63, 408, 222, -124, -287, -81, 210, 233, -73, -204, -142, 65, 121, 47, -167, -90, 79, 182, 38, -265, -350, -109, 220, 250, -87, -276, -222, 68, 220, 64, -143, -206, 72, 144, 47, -90, -177, 4, 294, 233, -80, -285, -169, 205, 432, 201, -99, -197, 5, 172, 140, -62, -188, -21, 214, 212, -67]
4432f7j58J55K34J11k66l03RK53L04n7k86j39K6L19K3k40j13J40J23J83k31k60
4454b40P0K36K21n6l62r3J75K63k7k06j29P2K09Q8k09j73J8K78P6n2l48J2J85
4477HJ49K5k02j83J12J76R8j99j72R0K26M0j22k21m0K18J98q1k42r1J13K62J1
4500A73j79j13O1K04M2j83j05K0K38J16k11k00lJ87J07M1k63j61J56L13k7j91
4522B2j77N8K08J07j44l10k6K25K23k9l18j82K59K51L8k35k59O0K75J44j53l18
4544b81O7K67J99j01l53r8K30L53l1l40k13J81L91R2k49m02Q9K85K77k29l38j09
4566c13L21L78q9m35j71J93L06J55k98l53J0L76K83k22l69j43L42L56q2m09k36
4587d00L10L91p7l40k55J57L49J50k37l26K2K95K25j05l91q0K75L10J5l61k74
$$ y = [-67, -225, -70, 164, 275, 9, -294, -285, -32, 272, 215, -71, -210, -184, 135, 158, -82, -195, -55, 68, 251, 20, -240, -170, 66, 287, 231, -131, -224, -49, 214, 187, -19, -148, -76, 133, 221, 12, -161, -143, 135, 211, 159, -189, -177, 8, 157, 182, -20, -203, -91, 85, 183, -16, -188, -98, 128, 168, 46, -175, -215, 3, 201, 120, -122, -213, -100, 162, 173, -6, -119, -58, 146, 188, 5, -100, -80, 158, 274, 63, -137, -140, 47, 154, 195, -68, -229, -73, 240, 213, 22, -155, -97, 111, 218, 74, -236, -262, -37, 186, 157, -161, -343, -84, 167, 205, -30, -289, -229, 46, 190, 37, -281, -214, 53, 252, 151, -202, -300, -70, 283, 252, -88, -301, -120, 271, 363, 114, -288, -199, 86, 363, 134, -204, -313, 8, 386, 297, -138, -309, -116, 190, 345, 47, -306, -296, 80, 363, 141, -228, -371, -29, 327, 245, -164, -400, -90, 301, 224, -116, -371, -214, 135, 285, 48, -278, -256, 39, 264, 159, -232, -312, -37, 273, 288, -73, -347]
4608c47J40L54Q8l38j41m8M00J99j56l45n7K95K62p3l05k39J86L75P6l33k55R5
4630a67L34J36k01l08n4L15K41r5k88k31K13L67j2l09j83J19K92P1k40k29JL47
4652A19J32j74l30K0K25L04n6l56k01L15K38N4l13k81K19L29O1k41m46J08M35
4673A61K00k62l64j19M01L73j98l39k82L32L20O6l13k88J40M13J25l72l85J8M64
4694I1L24j72n09j26L07M13m5m02k64J80M29R0l23m92R7O09K06k82m39p8L88L81
4716C83j15m63k39L15L53J65m90k72J19M70J40k85m19j01M15M20j38m77j88K59
4736a48M75M9m59l30J48M54J95l28m10L5K84L93k25m34j38M10L81r9l73k41R7
4757b64L88J87l07l08K5M62J92j43m23j15L54L53k14k73k22K65L88P1m64k69J84
$$ y = [-347, -207, 147, 235, -103, -244, -292, 108, 307, 151, -194, -251, 44, 306, 233, -72, -311, -125, 250, 326, -7, -262, -167, 167, 303, 102, -206, -260, 55, 296, 201, -87, -318, -105, 262, 250, -59, -242, -123, 169, 240, 0, -229, -228, 119, 251, 77, -253, -233, -8, 296, 240, -116, -317, -2, 236, 290, -23, -304, -85, 244, 305, 64, -382, -274, 161, 361, 99, -265, -384, 17, 390, 192, -147, -429, -97, 223, 289, -24, -312, -172, 241, 366, -6, -391, -373, 91, 415, 243, -266, -392, -85, 328, 283, -119, -383, -203, 226, 316, -7, -499, -402, 207, 413, 131, -308, -386, 2, 383, 268, -195, -434, -119, 234, 399, -91, -363, -244, 226, 366, 81, -338, -439, -24, 396, 258, -219, -407, -148, 327, 376, -83, -413, -265, 189, 384, 56, -354, -319, -35, 358, 133, -301, -439, -29, 352, 253, -120, -361, -264, 124, 311, 4, -304, -279, 183, 375, 232, -191, -306, 48, 401, 187, -86, -308, -43, 345, 416, -48, -317, -133]
4778a33L62K06l05l29J7L88J32k69k95j10L10M10j73l44k03K16L97k7k82l73R7
4799c08L80K09k64l75P6L10L06j59m16j70L35L93j55k70l13K31M31J03m29k27
4819c12J04L73J73k01m10n8L88L22j43l69k36L20M44j2m13k56J1M91J35l01m20
4840c70N2M41K03j84m22j67L08M14lm54l03K68M48O7l70l57M7M33L14k65l45j16
4862c61K92L81K0m30l79K92M57O1l27l41K4M81K76k29m50j53M08L77l2m03l49
4883c85K67M25O1l67l52J05M21J92k12l84j43M57K86r5m90k03K65M20jl17l09
4904c59J29M12J33k95m04J11K77L76j51l90j82K88L83Ml75k14J49L83J66l48k93
4925b00L5L73J05j59l59o5L86K80j41l18j81J58L66j8k60k85J46L36j6j36l34
$$ y = [-133, 229, 435, 130, -199, -182, 206, 338, 69, -226, -336, -26, 384, 211, -133, -336, -120, 277, 250, -32, -405, -308, 72, 281, 17, -358, -282, 28, 334, 175, -241, -411, -76, 317, 162, -108, -421, -190, 241, 344, -85, -312, -208, 165, 338, 137, -273, -331, 57, 379, 236, -133, -369, -49, 395, 383, -30, -286, -275, 216, 351, 50, -370, -318, 123, 326, 142, -280, -447, -139, 275, 272, -182, -485, -217, 231, 298, -72, -429, -382, 51, 365, 100, -245, -361, -69, 312, 332, -98, -477, -185, 272, 333, 6, -335, -311, 170, 446, 217, -233, -386, 22, 399, 367, -36, -385, -118, 307, 368, 1, -351, -246, 175, 367, 155, -229, -372, 85, 371, 276, -214, -417, -152, 268, 267, -50, -359, -230, 182, 315, 20, -384, -273, 4, 380, 229, -161, -343, -55, 328, 332, -43, -257, -108, 275, 441, 93, -200, -165, 208, 313, 154, -205, -270, 116, 396, 255, -63, -244, -86, 280, 262, 2, -283, -137, 199, 183, 47, -287]
4946b87O7L00J86j63l24j56K50K92M7k70k96J75L61K7k50k36L5L35J90k07l38
4967b62m8L32K93J7l83k74K12L58N1k75l64J54L24J86k11m43J10L33K22j61l97
4988b26j67K73M50j4m47k51J63L22J99k19l77M2M33J68k74l58j33L49M10k7n38
5009b22j24Q0M57K02k66l75K3L36K35j91m35nL31L24m5m73k19L01M71R9m87l73
5031c56J06M12K12j70m18m6L05L21j64l35k10K56L94K0l55l63J87L92K27j42n00
5052b27p5L39K83r2l27j52K45L35n2m12l61L80L63K01l69l90l0L70L08j56l09
5073a28j52K71L05j04k84k58K67K42J99m02l04N8L80L41k91m08q1L78K49q2l02
5094a06j86K55K60o4l19j52J33M57J24l32l96NM39K86j88m16j29L06L35n8m40
$$ y = [-287, -220, 80, 266, 103, -221, -377, -127, 165, 212, -58, -354, -179, 182, 209, -41, -277, -242, 93, 283, 76, -262, -310, 22, 315, 332, -51, -325, -113, 245, 296, 21, -343, -189, 135, 321, 110, -333, -223, 110, 332, 171, -226, -393, -120, 330, 316, -131, -382, -219, 103, 302, 83, -294, -252, 181, 349, 75, -283, -416, -67, 343, 316, -222, -346, -266, 191, 393, 127, -248, -225, 111, 346, 155, -280, -285, 46, 370, 325, -148, -367, -66, 405, 504, 17, -356, -250, 162, 374, 204, -214, -260, 45, 366, 202, -133, -343, -87, 307, 327, -28, -391, -204, 188, 415, 273, -227, -302, 37, 320, 228, -99, -251, -6, 329, 277, -135, -496, -116, 247, 448, 79, -311, -341, 29, 337, 181, -128, -280, -9, 296, 192, -92, -350, -83, 159, 358, -44, -348, -290, 90, 431, 140, -268, -349, 29, 278, 196, -106, -292, -37, 223, 159, -160, -312, -179, 278, 402, 70, -326, -321, 118, 404, 216, -200, -329, -23, 312, 254, -186]
5115a86j30K76L22Ql75l40K06M40J96l26m20n7L70L67j92l02j62J92M16j18l25
5136a40k68K58N10Ql99l80J55L78M15k93m96o2K90L83j31l25k61L17M41Km77l52
5158d27J57N08J88k36m53j83M53M20r4m14l05K66M26Ll31l51K02M00K04l23m53
5179c43l0M04L85j20m58k61K59M22N3l08l87J84L99J53l46m27P4M91K99k10n09
5200b76j16K66M44P4m77j97J21M40J08l49l08Q2M06J67k74l81n1L71L33o1m04
5221h2k71J65M76J0k95l05J81L41Q2k70l64O8L82K59k93l79r5L53L32q0l71j49
5243c05J75L29k7k27k68J09L37K15l18l21M0L20L31k68l76j33K82L71Kl24j99
5264b55J19L34N1k06l79Q4M34K12l08l95J7K52L88j04l60j65J50M28K3l23l35
$$ y = [-186, -316, -40, 282, 290, -85, -425, -219, 221, 417, 91, -329, -386, -16, 351, 159, -143, -305, -113, 303, 185, -140, -408, -150, 360, 368, -31, -411, -256, 122, 537, 244, -252, -314, -24, 359, 228, -97, -358, -41, 400, 402, -75, -427, -270, 238, 426, 190, -263, -446, 7, 427, 333, -81, -386, -120, 306, 309, -22, -373, -171, 229, 433, 110, -343, -373, 31, 416, 296, -162, -423, -164, 258, 311, 3, -384, -200, 199, 352, 6, -421, -347, 144, 443, 233, -276, -392, -126, 318, 392, -85, -282, -161, 279, 387, 38, -270, -188, 218, 385, 111, -270, -321, 50, 383, 322, -82, -353, -188, 288, 298, 3, -302, -121, 220, 302, 32, -332, -264, 118, 377, 84, -295, -390, -37, 295, 215, -156, -305, -130, 199, 172, -55, -323, -214, 123, 338, 20, -301, -261, 59, 390, 122, -254, -387, -105, 266, 268, -56, -255, -136, 198, 249, 43, -336, -252, 182, 394, 86, -309, -292, -40, 348, 244, -116, -281, -131, 297, 320, -3, -338]
5285c38J43L83O8k26l79R5L54K98j70m78j24L09L47k5l43l02J60M34J79l65l48
5306c28%M23K16j02m39j70L56M03j29l51l08J50M76J96l84l66R2L63K00j91m35
5327c28n9N09K51j70l06k37J75L96Q0k82l72J30L66K25j96m18k8L53K21j42l44
5348a76j61K75M05q1k93k81J01L02J39j83l19J9L06K36j63l32j01K26J97Q7k94
5369i1j86J88K59M1k52k67P5K99K19j79k63l4K03K59j51l05q3K35K65J2k06j98
5391a60R9K00P4j65k16K9K09J59r5k20j37K45J88n4k58j80Q8K73P9k28k02N6K86
5414G0J29j86k20q7L23K36j43k86j11J97K05N2k96r0J19K80K0p5k92o1K64K47
5436B95j31l15j9K06K02j4k12k30O5K74N7k19k06N7L13J25j89l07K5J74K55j03
$$ y = [-338, -195, 188, 256, 30, -349, -254, 100, 398, 228, -250, -374, -65, 282, 257, -86, -388, -228, 206, 385, 20, -328, -328, 95, 311, 209, -230, -400, -44, 359, 230, -121, -429, -279, 197, 393, 9, -357, -265, 98, 298, 107, -328, -387, 122, 373, 203, -103, -340, -165, 231, 311, 29, -343, -213, 153, 378, 182, -236, -264, 89, 310, 168, -176, -337, -62, 343, 262, -31, -312, -211, 91, 230, 47, -272, -253, 53, 289, 126, -206, -307, -81, 116, 203, -91, -277, -89, 170, 211, -41, -308, -233, 66, 285, 106, -157, -191, 12, 271, 120, -185, -268, -33, 232, 244, 38, -160, -61, 139, 213, 48, -168, -139, 70, 229, 134, -86, -223, 22, 210, 156, -102, -282, -194, 79, 158, -70, -272, -216, 70, 199, 13, -207, -294, 29, 265, 122, -164, -275, -78, 127, 179, -117, -207, -88, 192, 212, 137, -155, -216, 48, 295, 164, -151, -170, 36, 238, 224, 12, -218, -153, 121, 178, -41, -247, -190, 123, 248, 59, -248, -223, -49, 206, 103]
5458A03k16j64J52K93P4l21k32M8L07J87k52j67k8K82K04q7k22k33K20K22Q9k80
5480b1k03R7K88J07j54k80R4J29J73j10j92r1J34K88q0k30j72L6L16J16j75k00
5502a30n0K12J79q7k51j62K26K38M5k79j65J49J43J79k47k30P5K12J07j9l44J0
5524a89K14J33o7j67m5J10J52N7k12j94R5K27N8j49o8m2J09J48n0k45m9J08K77
5547B11o8j81j79P9K58j2j54q4l3K02Q7o1k92M9J81J07l9k60n5K08J96J6k44j50
5571b18P2K46R3j46j79n1K72J41j40k02j10K26K03k8k85m8P9K03J30k68k24L0
5593b04L01J12j00k22j43K38K26p0k92j19J56K87l8j54k11P8K38L2o7k44l2K01
5615b7K54m4k71j26J00K47K8k64j18J07L13J13k18l07M3K60P2jl19n6K15K09%
$$ y = [103, -113, -277, -125, 168, 242, -79, -311, -263, 44, 231, -21, -188, -216, 66, 270, 183, -39, -272, -52, 170, 259, -21, -224, -127, 161, 268, 114, -166, -72, 57, 230, 120, -72, -163, -29, 259, 179, -51, -223, -187, 129, 245, 70, -130, -180, 32, 211, 124, -127, -289, -63, 175, 220, -59, -224, -75, 68, 247, 0, -230, -155, 57, 164, 145, -199, -189, 25, 158, 91, -76, -121, -11, 141, 198, -14, -208, -113, 114, 172, 23, -45, -87, 22, 170, 120, -125, -174, -66, 211, 143, -38, -217, -138, 120, 108, -46, -130, -163, 39, 126, 65, -227, -178, 3, 110, 71, -189, -244, -36, 160, 176, -68, -218, -146, 100, 193, 47, -132, -183, 89, 230, 90, -112, -222, 4, 207, 179, -106, -154, -75, 128, 258, -10, -234, -204, 97, 209, 109, -113, -256, -18, 208, 138, -154, -273, -117, 170, 132, -22, -233, -155, 83, 115, 48, -196, -228, -27, 227, 183, -88, -214, -114, 133, 161, -103, -221, -114, 199, 312, 94, -213, -170, 90, 162, 161, -158, -214, 1, 210, 210]
5638B10k64j08O5K41Q3j97j28j7K11R3j55j80j20K65J90n2j81j31J15K16M3k72
5660g3j22QK74J02j31k36K0K55J13j27k34j7J38K04pk32j55Q3K09P8j59j99J57
5683e1R4J95k12j79rK16J27o9k25k4P4J76O9k94q8J05K02K6j44j24M5J75J31k15
5707Aj09j03K49J41j27j63p3J21K19L9j91j39J9K49jm3k40N4Q9J95p6k54m6Q0
5731a09K37j0k13j55J16J94J42j64k05l1K32J83j06k53p5K34J59k1k58j51J21
5752a33K90qm7k95M3K91O1j66j81l4J99J90lk79j75J58K49Q9k49j76OK64J27j54
5776F7j79j6J58J46n9k08o3J31J54k6j28k54J33K50Q3j85k40L7K03J31k6k50q
5799a49J30J14o1j30j87K06K07K2j12j97J1K10R6j15r9p0J38L7%j15j0P5Q5m7
$$ y = [210, -54, -162, -97, 144, 227, 30, -98, -115, 96, 189, 34, -146, -266, -1, 189, 137, -44, -175, -60, 156, 199, -73, -195, -187, 87, 189, 58, -178, -158, 97, 210, 83, -151, -168, -30, 174, 167, -65, -220, -137, 72, 150, -9, -208, -51, 43, 238, 26, -153, -162, 54, 181, 112, -113, -137, -63, 113, 182, -112, -200, -95, 107, 133, -11, -135, -90, 85, 216, 1, -108, -211, 38, 179, 52, -111, -184, -63, 156, 195, 4, -135, -116, 133, 132, 89, -151, -97, -8, 187, 111, -143, -189, -109, 128, 118, -95, -250, -134, 60, 202, 38, -167, -198, 34, 217, 111, -142, -217, 17, 176, 155, -103, -254, -133, 157, 149, 102, -193, -150, 141, 202, 36, -145, -179, 20, 210, 207, -72, -247, -89, 160, 249, 0, -176, -170, 94, 221, 67, -112, -128, 30, 176, 117, -91, -154, -23, 131, 105, -23, -277, -144, 106, 189, 4, -236, -199, 4, 135, 109, -141, -149, -19, 95, 34, -96, -283, -77, 130, 152, 40, -157, -146, 64, 160, 45, -54, -124, 14, 51, 51, -64, -74, 1, 86, 39]
5823C9p5p5P6J41j5r0j46j4J64J29K2k01m0Q9J46p2j32r5R3J47J34k22j19L0Q2
5848dJ73j03j78j0K03rK4j50k2M3J32n8j36p5O2J62J01j44j66m4J42K03l6j95
5872h5n3J79J25p2k17k6P5J84J1k19j07J03K30M5j50k02J3K34K6q8m2r1J09J62
5896A44o7k29n1K01M8J42j39j92J1J17K11j14j47j24J27J07Q5j92j02J31J38O3
5918A68j36k14M4J22K11j76j38rM2J63L1j43j01N4N7L6m9q5J7J38J20j74j11l7
5942a70J80R8%j70o9O8J17Q2j53o2k5J79L5p3j96J57J4J01m6q8p3K1J90r2o9m2
5968h6K7J26N0j06j20j6J57Qn2r0pJ56Q9n9j39r1J01J11M6k11LL7J65m9r6m6L8
5995e4J71M6j13j13l6J00J01m8p5o4L2J39Pj01NrJ01N1j47q2l3J31J00L2k34m3
$$ y = [39, -36, -111, -35, 106, 91, 1, -145, -159, 5, 134, 156, -45, -85, 4, 150, 78, -54, -149, -56, 91, 225, 3, -116, -86, -4, 169, 66, -112, -122, 81, 72, 96, -54, -76, -33, 99, 41, -95, -170, -108, 54, 155, 11, -155, -199, -57, 146, 110, -85, -138, 41, 166, 94, -123, -149, -74, 110, 121, -98, -205, -102, 128, 173, 23, -179, -166, 68, 94, 6, -36, -127, -18, 144, 77, -152, -203, -2, 46, 188, 49, -143, -132, -15, 196, 82, -65, -189, -62, 45, 130, -62, -164, -33, 105, 168, 32, -182, -138, -16, 195, 19, -119, -128, -86, 77, 108, -35, -136, -82, -25, 11, -38, -123, -106, 32, 152, -22, -133, -170, 10, 108, 108, -62, -131, -63, 54, 136, -17, -79, -104, 75, 110, 37, -159, -2, 12, 113, 67, -21, -94, -73, 117, 25, -44, -86, -59, 67, 117, 11, -109, -125, 32, 40, -12, -102, -109, 47, 136, 77, -62, -153, -52, 59, 105, -106, -103, -66, 99, 50, -46, -92, -54, 117, 163, 50, -63, -99, 1, 102, 54, -21, -85, -53, 86, 93, -8, -3, -12, 89, 140, -7, -89, -122, 9, 109, 141, -93, -136]
6021a36Q6J74q4o3j02M4J11O2j22p8R0L9J54q6k37J5J49P4J4q4r2N8N3R1j16q5
6047g1m4J87K2j12j40J5J86M2Qj14j54P4J78J22j68j87J1K08l0p3J2k3P2J9lj22
6073h5m1L2J51K6l1j73O8M5J00Lj48r7J78J36m5j38o2M5J57k3j52p4L8J74O6j46
6099Dq3J8J63l3o9p5J8K3N0onm7J3M6k0m0r7R9P2O2n2j08k6P7N4k2j08J6J28Q2
6129A34m4j20j6J4J57p0l7j57R7J31j6q1k4k9J12M5j10j03j3J19Q6l7o0n6N2O0
6155C4koj52JJ47Lqj56K6R0J31j23n2o0L4K05l2j57m7N2J26j3K0p1l7P9J22j18
6183C6j04rP5R0l6q9mk8J50R5j37j25J1J43P8o1j30l9P1J41o2j91m9J18J98r6
6209D6n5j03O5J10On1j27M0M1J08n9o6L5N7qL6p9p6JJ24J2k7o2n3J27P7qj36o0
$$ y = [-136, -50, 124, 40, -23, -125, -81, 30, 92, -30, -108, -18, 21, 175, 89, -148, -133, 16, 90, 104, 20, -72, -14, 39, 130, 14, -71, -115, 72, 94, -18, -158, -143, 43, 85, 93, -21, -175, -101, 77, 199, 31, -156, -145, 63, 33, -40, -28, -51, 21, 40, 37, -85, -126, -94, 57, 83, 52, -121, -53, -8, 92, 95, -53, -150, 28, 164, 119, -19, -81, -36, 121, 98, -54, -128, -90, 84, 150, 4, -79, -61, 102, 69, 0, -75, -57, -34, 16, 10, 5, -42, -29, 17, -3, -43, -140, -41, 31, 93, 41, -67, -93, -16, 38, 16, -92, -76, 52, 134, 90, -30, -46, -32, 125, 55, 18, -139, -42, 89, 73, -8, -32, -61, 51, 96, -14, -117, -130, -11, 75, 38, -22, -78, -26, 34, 32, 26, -126, -125, 22, 25, 17, -139, -113, -23, 108, -15, -67, -127, -93, 112, 80, -77, -124, -72, 54, 41, 61, -10, -47, 32, 154, 36, -68, -77, -2, 88, 52, -37, -41, -69, 81, 176, 39, -86, -75, 68, 146, 85, -45, -84, -13, 128, 66, -125, -174, -56, 142, 46, -9, -112, -47, 63, 69, 18, -109, -69, -28, 80, 21, -45, -10, 47, 39, 75, -4, -80, -79, 45, 57, 30, -32, -85, 42, 119, 111, -25, -85]
6238h5J06J07j17n3%%Q5m0J0r0lJ15lm1j7n5J14J3n4J8q7J8J05m2K5j41O2R6J7
6267F3j12o1p4J84O3m0q5O3J4Q0n9l6m9N2R3m5j46P6P2l4Pp6l5M0N5J6nj02QO1
6297a2P8l5n3n9O0O2l8m5o3N5M9J27n7j40J7P9N4k5j14jM7L4M4j20JN3N6J0q7
6326b3p4J7J60M5o2j50j4J48Okr6n1L3J34N2j09r7l8K01L1p0j33L5N1J47k5j84
6353f8JJ06k0J7p6KrJ12K1j04k0M1L5Lj2m1l6l1J61n9n3m5K5K7J4Mp9O6K6K8n5
6384a9k7l1J19j2K2j12l9M9M0M5o9Ml1j5J16no9k5P8L0n4J7l2j6J00K7p3k3m6
6413e1R2j2n3rJ0J25Oj22m1KR1K3p5p6l4J21N8k5j4p3M0J13m9p9j3J15q3J03o1
6442B9k7M0q9J01J1j28P2N4L3l7j38RmR6Q2j72K4p0J73J25j19j36n6R8R9j4l5
$$ y = [-85, 21, 128, 11, -42, -42, -42, 43, 3, 13, -77, -80, 35, 32, -9, -26, -81, 33, 46, -8, 10, -77, -59, 46, 4, 29, -112, -50, 46, 63, -49, -110, -184, 0, 63, 23, -62, 1, 15, 95, 36, 0, -49, 3, 96, 51, -95, -19, 53, 19, 26, -50, -85, -45, 10, 26, 21, -81, -73, -12, 66, 31, -22, -81, -21, 41, 3, -42, -105, -50, -1, 126, 69, -71, -54, 25, 79, 54, -60, -61, -14, 20, 64, -56, -55, -2, 54, 64, -23, -97, -80, 80, 125, 63, -87, -101, 47, 53, 51, -45, -96, -63, 71, 123, 14, -83, -121, 80, 111, 41, -92, -57, -6, 141, 116, -68, -67, 39, 19, 36, -40, -38, -47, 65, 86, -18, -38, 3, 38, 41, 29, -12, -48, -79, 82, 23, -30, -75, -50, -23, -9, -5, -84, -18, 8, 36, -19, -46, -77, 42, 30, 52, -60, -99, -50, -10, 35, -34, -30, -61, -76, 40, 35, -34, -59, 19, 49, -5, 12, -20, -36, 64, 91, 18, -5, -51, 41, 29, -24, -33, -23, 102, 108, -14, -55, -53, 38, 61, -14, -90, -124, -3, 55, 30, 16, -57, -17, 96, 47, -32, -45, 70, -13, 90, 29, 2, 42, -47, 54, 65, -63, 9, 63, 96, 59, -79, -70, -74, 22, 104, -68, -44, -114, 59, 184, 65, -71, -127, -29, 70, 56, 21]
6469B1j02J34J3kr3m7PP3P1l8l0q2lJ33mq2o0N2J35J1l7k35KJ82kJ8r0j4J20q
6499D3N4j30m9P4M2L2j7j29KN6J06n1j01l1J06L3M2p1j03L6R1M9q7j28K8R4O2
6526E3Rj85J4J23M5m4j03L3N2J00j31j8M1K3J7n6J2p1O4P4K1m8j13L8O0N9m7o6
6554d4l0L5O1M1p6q3R6O2N7o5j14N4M7M2p6k5K7j3J06r5n6ON2J32j12m8j1pP7
6583D0M5o2q8J4l0Q9N0r2n9O3J19L1j53r2J09j5J08q9q7M2R6N4p8j24N5k1J38
6610F3m4j7j7j4N5Q5q6r1O6M2Q9j0j59l0J24J03j50j0j03N1J33mj01j19O1J12
6636B9L1j03m7k7R5Q5j5j63JJ08P9o4n1pK1L2P6m7p3QR8L3o8o4K1N7L0k2j19j7
6666h3R9M4jo5p7K1J31K1j29o2O4O3J3m0r3j5J34j5L2j08j4R8j9K8o1L7l1L1L4
$$ y = [21, -81, 53, 66, 64, -29, -76, -69, 4, 75, 37, 7, -75, -78, 55, 51, -31, -91, -39, 96, 107, 70, -165, -163, 19, 17, 35, -55, -69, 51, 43, 97, -33, -82, -8, 34, 66, 49, -80, -78, -22, 84, 33, -68, -99, 7, 40, 82, 11, -92, -56, 35, 84, -3, -131, -103, -9, 53, 62, -123, -109, 14, 59, 15, -88, -55, -3, 97, -34, -52, -11, 12, 29, -27, -15, -86, -22, 52, 73, 25, -88, -50, 10, 69, 22, -44, -74, -39, 22, 63, -13, -96, 0, 62, 119, 54, -60, -6, 41, 83, 7, -18, 9, -4, 102, 7, -49, -43, 9, 141, 29, -19, -30, -37, 40, 85, 23, -65, -51, -81, 8, 58, -34, -93, -30, 89, 120, -33, -125, -16, -31, 77, -12, -99, -57, 39, 93, 15, -109, -54, -75, 63, 19, 2, -15, -29, 26, 111, 25, -66, 0, 42, 131, 121, -38, -68, 56, 159, 9, -1, -104, -53, 80, 76, -25, -144, -83, 29, 60, -43, -90, -117, -22, 63, 48, -115, -114, -6, 73, 9, -42, -49, -28, 4, 80, 33, -40, -32, 66, 99, 31, -33, -12, 45, 75, 53, -66, -83, 16, 60, 59, -6, -83, -62, 69, 90, -39, -101, -37, 26, 39, -1, -94, -109, 25, 10, 42, -66, -80, 18, -1, 27, -34, 3, -28, 3, 37]
6695C7J7j27oJ03K6k9k2r1M1J14Ol2j30P0N0k0p7M8pO8Oo8l3J9J10n3m8oj5l0
6725g9J31k1n3n1QK6M1Pp8M2P5L4j4n8j19Q7J21K2j04j01L5Q4l2j7p8J2J87m1
6753F6l6q3k3R2L9j3j08o8O9R0K4j0j90K6J44On5q2j5P9R2n4p6m0N2J42j2r4p3
6782a11J04R5k0o1m0K5Q3oj7l1j25M5J22Kq2nPJ54r6l1n6k5J29K8k4r0mJ6L1N3
6812G0q0o4O4Q1Pj01m5L0K2J12r2r0J36j3k1J0M8j01R2m3Np4R2%l9R4q1p6L6R2
6842G1K1k3m6j9j2J50j11p2L8L8K9K0q8k7K8%O7p9j06N3M1N9k0J4j1J8O3p9K3
6871D0p5N0K8M3m1j34P8L5P4p5q1J0Q6oJ1l8J0N2k2k5q5l8J04P3mj39nQ0J9m4
6901a9n1k6J25j9Lmk7l5L9j5Op4k7P7J30K2p2p6nJQ6rq3l8J11J7mk4k4L5l5N0
$$ y = [37, 54, -73, -79, 24, 50, 21, -1, -92, -51, 63, 69, 37, -93, -23, 27, 7, -70, -22, -29, 39, 45, -23, -56, -37, 73, 20, -28, -34, -49, -79, 52, 31, -22, -73, -65, -39, 2, 9, -69, -27, 48, 82, 68, 10, -109, -22, 99, 121, 17, -84, -49, 35, 3, -14, -92, -80, 107, 66, 30, -53, -76, 16, 55, 42, -66, -134, -65, 25, 49, 39, -151, -125, 19, 25, -30, -112, -127, -48, 44, -10, -86, -126, -74, 68, 56, -38, -111, -7, 88, 68, 7, -33, -8, 75, 69, 52, 21, -104, -59, 63, 65, -17, -22, -15, 139, 43, 12, -44, -69, 60, 88, 64, -26, -30, -14, 17, 70, -10, -74, -10, 71, 78, -23, -68, -38, -16, 96, 4, -86, 50, 37, 16, 26, 74, -27, 65, 22, 27, -47, 45, 45, 6, 100, 19, -57, -21, 71, 92, 69, 23, 4, -8, 142, 31, -41, -3, 35, 64, 84, -4, -31, -3, -3, 64, -15, -121, -68, -27, 32, 12, 26, 15, 33, 96, 17, 40, -35, 15, 43, 86, 45, -89, -11, 24, 98, 23, -58, -48, 38, 32, 43, 5, 15, 67, 45, 20, -65, -103, 1, 74, 70, -69, -74, 6, 25, -19, -70, -96, 29, 10, 13, 9, -18, -53, -14, -29, -23, -97, -124, -47, 83, 105, 33, -43, -48, -47, 39, 30, -53, -91, 20, 37, 33, 9, -15, 20, -15, 35]
6933C5n8o3M7K5l6Q4o0n4Q2L9p1k7N9k3P4K8r2n7qJ06k8J5p4M5J7L2M5p7r1Q7
6963AL0Rr5KM4O0k9j0K4r7K5Q2l0l5KJ3J5K5k3n0LQ7Mq7k8n0J41L2p1p1O3QP8
6996G2l6n9n9J13M0k1n3k0O1Oj0p1k3Q4k5Pj7L5p3K0Q0m5Km9L0K6k2oo6J01J7
7027C9m8k2Mm9O4M2lo3M6J3k3Or7L8Q8k5K1Or6J8O5l1L7np5M9O7Jm3o4Q0m4N4
7060E0k1p6m2J10L0j7p0lQ3k2O6m4j48P4Q9p3J0o4P9K5L3r0kk8M9j5N2j35j5L2
7090h3J05J5pj06j8J50j9n2j18N3O6J38j22Pq5P4O3m8j13K5O3QP3j3q5Q8q1M6
7118B4L5q1P1j12J07k5Pk8k2M4J3n7k9K9N8J8j4j01J06k0K2k6n1L5K9K9p9J6p7
7147g9J97q8K8n8m0J03q0J1M2q3kK5lO3r9m9J11N0l3p3kL1L6M4q0l8JM5J16q6
$$ y = [35, -23, -86, -39, -14, -50, 34, -26, -80, 2, 41, -30, -57, 2, -21, 53, 81, -11, -68, -76, 30, 2, 17, -57, -12, 5, 37, 82, 5, -86, 1, 31, 40, -55, -53, -9, 51, 22, 12, 36, -61, -36, 46, 16, -19, -17, -4, 11, 36, 13, -37, -34, 53, 57, -30, -58, -108, 33, 65, -6, -77, -14, -6, 72, 36, -23, -82, 31, 71, 50, -3, -23, 38, 44, 34, -37, -60, 24, -1, 6, -11, 24, -49, -29, 51, 6, 8, -41, -11, 15, -7, -13, -79, 22, 39, -9, -31, -27, -76, -12, 30, 27, -36, 10, 23, 0, 6, -91, -53, 35, 10, 31, 37, -59, -41, 24, -7, 30, 25, -50, -1, 66, 67, 24, -40, 40, -4, 50, 29, -47, -89, 21, 51, 34, -36, -39, 44, 22, 88, 44, -104, -30, 59, -14, -4, -68, 11, 36, 69, -21, -23, -51, -2, -17, 35, -100, -115, -83, 22, 37, 30, -76, -94, 56, 37, -15, -133, -80, -14, 124, 2, 9, -76, -2, 61, 13, -100, -75, -12, -4, 69, 56, -29, 59, -22, 24, 59, -22, 49, -63, 44, 19, 26, -2, -24, 20, 33, -24, -53, -24, 34, 52, 38, -63, 43, 23, 45, 19, -32, 3, 32, 61, -18, -2, -79, 118, 30, 58, 0, -40, 63, -17, -6, 36, -47, -49, -24, -27, 36, -63, -112, -1, 49, 16, -57, -59, -28, 8, 52, -28, -66, -65, -20, 96, 10]
7177A0n2l2J18O1n9r7Q7k5j0j2J7j2J0J8K8j4p6rJ8J19l8n6m4O4K9k7p7JjJ49
7207H8q6Mm2j8L3J6P1j24J8l7R8n7km8R9OM6m5p7lJ23L1r1r3P2N1P3l6j2j17K8
7238c1J04m9j3o5R0K5K4m9j22P9N4L6p4K1j1QN0n9o0J7K2K7N4j53L5L6Q2q8P3
7267F3j20k0J03k0M3n6n3L4L8L6j17K1J9J29j22P8r8m8J58op8j6oQ1Jqp9lK4R4
7297G2or5j5N3nO8l0p6L7O2j7Nn3n9M5P8K0r3k3L3N5J8j7j00P2J7O1r5l9o2K7
7328f2R4Lr8j3J08JL6j01O2o9J11J8n2q2K0M6N0j1j33P7m6O7N6p0k4k1R6ml6o4
7358d1%J14M4q5j6k3K2K2k2l5K2m5L7L5L0j20M7K7K9qn6j7RO5l8k2j6O2M6m4l4
7389a1o0L4Q8mj11J1M5L5%nnp0N3P8J5j57M6L4%O3p7l3NM5L4k7m6j4N2N1l9n9
$$ y = [10, -42, -74, 44, 105, 46, -51, 36, 11, 1, -11, 6, -6, 4, 22, 50, 36, -40, -49, -31, 88, 50, -6, -50, 14, 43, 16, -61, -60, -61, 88, 2, 6, -36, -54, -21, -5, 66, -58, -40, -77, 21, -36, -38, -86, 13, 19, 65, 20, -57, -60, 63, 94, 3, -90, -18, 33, 106, 70, 58, -59, -31, 73, 24, 11, -54, 36, 61, 85, 36, -86, -7, 47, 83, 9, 30, 19, 27, 77, 18, -42, -25, -3, 24, 78, -75, -40, -4, 78, -10, 63, -57, -77, 26, 6, 49, -7, -60, -26, 12, 48, -69, -48, -29, 100, -22, 56, -42, -90, 68, 62, -16, -32, -38, 43, 44, 36, -43, -46, -22, 72, 66, -29, -44, 9, 4, 72, 42, -34, 3, 65, 48, 53, 0, -59, -14, 64, 84, -9, -32, 1, 56, 74, 57, -43, 29, 46, 107, 12, -27, -89, -62, 32, 35, -63, -76, 32, 33, 69, -32, 30, -39, 72, 90, 38, -44, -24, 22, 72, 61, -72, 5, -41, 26, 82, 12, -12, -33, 63, 59, 23, -41, -41, 73, 117, 32, 16, -7, 15, 37, 15, -20, 2, -43, -6, 29, 59, -61, -14, 13, 42, 34, -22, -39, -30, 35, -3, -25, -41, 21, 67, 23, -11, -71, -37, 51, 47, -64, -53, -8, 27, 27, 22, 17, -53, 0, 78, 93, -64, -18, 16, 16, 79, 2, -31, -26, 19, 53, 26, -20, -34, 18, 69, 30, -29]
7421b9n9RJ11J0l5q9P7N4M8j30j8L6J0J29q4r3O8j6P8Op9p1O2L9K9o0n2N0J7L7
7451E5j2p6l0Q7K2m2o5M8k2L7O3o2k8m8J51n0k9k9n0Q1Pk3j0p6J36j6k1m3J2J7
7481a6J33m0l9o9j4J27Rkq0k9L8pP4j25J6L9Q6l3j31K1nJ12m7lQr0J24Jn2kK2
7512B6o2L4J3k3k0LRL5J5j24O3NJ1N5n1m4N3N7%n2j0K2M5M1j17J05j53N0J11o8
7542B9o1pM9O7p1m9L9m0J29j59J8mN4J2O2q6L0q4K9R6l8l1j9MP3Ojp8K3O2j6m2
7574dKl4L7K0j5j9lL8Rn6k3MO6J9o0RkJ9J3K9r5l9J4Q0n3N7n3l8J03n5L7m3OQ
7608b2P9l4q4Q9p5P3LKl8j7R4PJ7j23M2J9L5m0K0q0K1L3N4q9kj7RJ33j19J4r1
7639h7Q5J12m1n3n7KJ25o3j0m8rM2l2N5j07M2P5k8J2np3N3M1Qlj12N6J0O5n8k4
$$ y = [-29, -88, -79, 32, 42, 7, -82, -5, 49, 97, -33, -51, -15, -5, 124, 40, -53, 15, -1, 77, 83, 4, -67, -5, 34, 63, 3, -49, 1, 18, 55, 43, -33, -63, 24, 46, 4, -61, -13, -35, 2, 65, 3, -25, -73, 78, 28, -1, -30, -80, 1, 8, -15, -25, -101, 35, 19, -2, -45, -33, -16, 117, 77, 38, -31, -45, 82, 91, 89, 9, -20, 18, 11, 85, -40, -24, 15, 101, 68, -63, -42, -47, 65, 18, 15, 23, -67, 57, 58, 6, 4, 26, -36, -2, 11, -12, -32, -29, -20, 15, 30, -94, -31, -26, -15, 40, -11, -55, -2, 55, 55, 3, -7, 15, 60, 101, -16, 89, -64, -14, 97, 29, -32, -39, 10, 77, 6, -43, -4, -44, 85, -74, -56, -60, -6, 6, 68, -18, 12, -72, -43, 53, 15, -16, -35, -31, 42, 48, 47, -31, -8, 54, 38, -4, -2, -36, 1, 21, 6, -13, -16, 22, 31, -25, -48, -44, 22, 41, -19, -10, -12, 7, 20, 49, -46, -85, -71, 9, -44, 13, -40, -78, 25, -30, 7, -36, -30, -22, 57, 23, -61, 28, -47, 26, 29, 31, -7, -24, 70, 77, 94, -29, 13, 32, 67, 27, 47, -33, -12, 21, 75, -14, -16, -33, -24, 109, -10, 4, -87, -2, 110, 69, 16, -41, -39, 86, 23, 13, -35, -44, -2, -34, 21, -86, -44, 31, 3, 15, 10, -63, -10, 31, 39, 36, -76, -20, -10, 55, -3, -27]
7670b7j0M1NJ2o5M8J8M0n2k8l0PN1J1l6k7O5n1M1m1o0M5K9O7n2j5m9N5L8k6M7
7701E1n1L3mj1J5j14L0K0J0Q3o5k9K8Q9o2l3K7m6O5k2K0p1k3M9K6L2p0M4kk3J7
7732A3j9l7M7L4m5j0m9N9lM6j1p2j0N4M9l0%m1j0N9J3l9q4J20m0J6k3j9O0k4k0
7763a6j3j0L1pK6k6n4k3Q3P3p0J0p6k0J51Jpo8j4O2Nl8m7J4J6RJ2%q8J59Ol9p
7796C5j4o3P3O6j16M2pL1L8r0M3r9N3L4K3l1j11R2J0LL9p9M1M6J5o1l1K5j6K5
7826A6pl8L1m0K7M%n7K1N6K0L9q9LK5J21o1Lj13P0P1j38kN1n0Q7M7m5q5K2k6N7
7858B0Mp4N8l7L0Q3m8q2J9N1J9m5Jo6M0M1n5K1K1L6j7K8q2kM3L1m3l0lj4P0R8
7890A16j68Kl4R2m4JKj1P5mM4r5k6M7l6J08j12qJ2J01j3n2l7L4QL2j1m9j6K3P8
$$ y = [-27, -37, 4, 9, 21, -44, 4, 22, 62, 10, -18, -48, -41, 10, 21, -15, -42, 23, -28, 13, -28, -88, -43, -14, 53, 1, -14, -63, -8, 30, 4, 51, 0, 33, 29, 18, 33, -81, -51, -31, -21, 62, -3, -32, -4, 85, 23, -10, 17, -29, 36, 14, 34, -37, -60, -11, 15, 47, -23, 21, 19, -4, 13, -6, -43, 4, 38, -7, -17, -66, -7, -10, 36, 25, -47, -57, -3, 46, 16, 16, -25, -35, 24, 37, -2, -86, 34, -6, 10, -13, -32, 28, 4, -16, -29, -39, -8, -15, 11, -15, -69, -92, -9, 64, -6, 4, -72, -92, 59, 60, 53, -15, -29, 33, 38, 0, -47, -33, -17, -8, 4, 4, -84, 75, 81, 42, 35, 21, -42, 31, 97, -19, 23, 16, 47, 85, -5, 38, -61, -8, 26, 49, 18, -93, -1, 9, 12, 51, -28, 13, 59, 74, 13, -18, 7, -9, 16, 9, -29, 2, -38, -11, -7, -7, -64, -43, 13, 33, 72, -17, -14, 11, 132, 71, 74, -39, 31, 102, -36, -38, 13, -37, 50, 97, 52, -33, -11, -37, 20, 24, -50, 8, -29, 1, 84, 36, -46, -27, 24, 43, -2, -1, -67, -27, 14, -41, -20, 1, 37, 20, 48, -34, -36, 7, 38, -5, -35, -38, -52, 18, 116, -52, -50, -84, 8, -36, -35, -33, -44, 31, 27, 71, -24, -50, -3, -39, 69, -43, -51, -39, 62, 49, -3, -40, -6, 2, 34, 23, -26, -42, -19, 59]
7921E9Kn1ok6M9O3p5m9n8Q6oO1J3j10N8j6J2rK1Ll3L3k5L7l6j7K9n4K4n0O4P2
7953F5o1l0J9k6M6mK2q5O1q1J34j15k3LmJ03j1k5n3O7R8m5k2p7R2l6OQk9J0j9
7984a2P1m2o4OK3R4n2j3j5k8OL5o3orL5J19m3r3j5P4O9r3j0K6l7lJ6rnQ4m1KM
8018A1j15J24k7M3o0K6K1jq1M8j3O3n9O8j0l1n6Q2j2L1j2j32O5RR6j7k6m5K1K8
8048C9L9q2Lj9J6M6l2j7k2O7M3m3p6J3J3P5p6K2o0j7J04k2n4O6j15P5P3o2m2k2
8078f7M8N7l8n7K6K0Q6k8m7j7K5K7j8o8N3m3nO6o7L6n5Q8rOO8j06K5KM0m4l5J6
8110a5M3k9J1k0k7K0Q4m4r0O8KpK5l0n0O5j4rO3j02O9k4%K6l9RN7K7l0p6M2j5
8142a0J02p6j6q3jJ77p1J3r4J9KP4j2k6j9J1Q9o0m2L9n4O2k0J8p0N0RL9k0o9M5
$$ y = [59, 61, 10, 4, -22, 27, 90, 15, -34, -92, -6, -12, 49, 62, -48, 10, -6, 6, -3, 18, 21, -12, 21, -4, 33, -3, -20, 9, -45, -21, -71, -7, 65, 4, -26, -7, -33, 13, 9, 31, -54, 7, -74, 60, -55, -78, -75, -79, 24, 13, -12, -65, 2, 100, 55, 33, -44, 48, 12, 18, 26, -3, 7, -12, 59, 17, -47, -41, -18, 76, 24, 11, -4, -32, -26, 9, -54, -60, -69, -34, 85, 42, -51, -66, 8, 77, -16, -26, 0, -37, -40, -24, -33, -38, 46, 5, 7, 11, -104, 20, -7, 36, -24, 2, 23, 22, -59, -11, -24, 39, -20, 48, 38, 7, -49, 33, 21, 52, 40, -92, -27, -18, 78, 61, 35, -10, 11, 39, 78, -4, -1, -20, -4, 42, 10, -7, -29, 38, 81, 38, -38, -25, -12, 63, -13, 9, -51, -68, 36, 14, -40, 26, -89, -14, 59, -3, -45, -67, -19, 38, 0, -57, -31, -11, 75, 47, 0, -17, 8, 35, 17, -51, 2, -41, -46, 20, -47, -11, -66, 22, 13, 19, 87, -19, 6, 8, 48, 4, -31, -15, 28, -1, 10, -10, -37, -17, 67, 23, -67, 1, 3, -4, 21, -9, -59, 6, -8, -17, 46, -56, 13, -11, -11, 15, -24, -15, 42, 69, 39, -37, 5, -10, 92, 16, 0, -83, -84, 93, 22, 35, -59, -40, -38, 36, 24, -2, -21, -10, 79, 19, -23, 16, -38, 24, 4, 22, -48, 2, 11, 50, 30, -39, 6]
8173Fl2M8K0r9K9l0J11J3k9p9K2K5L0k5l1k6O3K1
$$ y = [6, -26, 22, 42, -57, -28, -58, 53, 66, 37, -42, -20, 5, 35, 10, -21, -47, 16, 37]
8191C7
$$ Imaginary data points
##PAGE= N=2
##DATA TABLE= (X++(I..I)), XYDATA
0@%%%%%%%%%%%%%kJ0j6J6j6J6j6K1k7L0l3L8m5N2n7O5p4Q0r0J01j12J25j41J55
37H0j68J87k08K28k52K81l12L46l85M29m80N39o10O96q01R35j109J346j693K232
57A281l167N101j0594N4001K35165m6958k21411p5399J16817J03108k0238n9930
69G7776L150N1783K9454k2345l9206j7105R643J5444R064q318m1964o1352j3595
82g571O2325M9291n9552j07925j7410Q1647M7228o2713q6504J3962R9130M4673
94E6581q3271j12478l511J02463P8686l3031r2285l1983O6339Q2187J0938m4671
106d036k7837J1749J5710k685k749J3989K3830K5516J8353j8360o1773m0701M1830
119g164Q2431K7963m7416o1412j6598L2024L4966j0028m2019r698M2315K9892
$$ y = [0, 0, 0, 0, 0, 0, 0, 0, 0, 0, 0, 0, 0, 0, -2, 8, -8, 8, -8, 8, -8, 13, -14, 16, -17, 21, -24, 28, -29, 36, -38, 42, -48, 53, -59, 66, -75, 80, -88, 99, -109, 119, -133, 148, -164, 182, -203, 226, -254, 285, -325, 371, -430, 505, -604, 742, -951, 1281, -1886, 3215, -7379, 46622, 281787, 234829, 13418, -61981, 54836, 157944, 137706, 77776, 80926, 132709, 162163, 139818, 100612, 83507, 93150, 108594, 117658, 109340, 67376, 6024, -7571, 54754, 104045, 44493, -63432, -80842, 805, 48033, -14680, -101184, -87222, 11908, 56581, -26690, -139168, -142679, -40216, 38470, 5439, -86846, -118829, -52490, 29697, 40635, -4036, -31873, -20124, -4414, -7099, -9848, 4141, 27971, 53487, 71840, 53480, -8293, -48994, -7164, 75267, 103230, 55814, -5598, -22196, 9828, 44794, 34766, -7253, -16951, 25364, 55256]
131E5256l9770o7076p439N9380M0695l6818p0550j9177N2897N8123j1414o6039
143e1932k9374M6098N0353j4597m7932j1313L2910L2717M129j6446j8942p517
155c1846J8306M2941K6730l3525o5177j4432N8928N6912j4317n5123j5183L7962
167A2176K1202l8822m3532K5423P4070K8611o1599q3122m893P4323N3801k8518
179B9120n8488j1154L5773K8704r496l1739j6769J7906L3052J0744k3933l3092
191b9372q233K5191L5319J2649k4378m0425r693M0257M0833j7769n1592p560M7461
204A2688K9687l2128m6136R610N7958K8007m3887o0192J765O0027M3216j9328
216D1287m7679j6377K2685J9538o079r732M754O927k685o285m561q026r312N931
$$ y = [55256, 15486, -51590, -59029, 351, 41046, 4228, -66322, -85499, -32602, 25521, 14107, -51932, -81306, -35208, 15145, 548, -47384, -58697, -25787, 6930, 11059, -5387, -24329, -31846, -13540, 29401, 56131, 22606, -42571, -57003, 1925, 58837, 44520, -10603, -25786, 12176, 33378, -5444, -48976, -23553, 50517, 79128, 17529, -65593, -70486, 3837, 57638, 29120, -29368, -40522, -4749, 23955, 14459, -17280, -34049, -16143, 16909, 27653, 3720, -29372, -37605, -12414, 22905, 35554, 11176, -29249, -38942, 1315, 42148, 24379, -27213, -34773, 12688, 42375, 10247, -35889, -26279, 31679, 59686, 15799, -44393, -42628, 17399, 60615, 41287, -6392, -22769, -84, 19454, 13375, 3643, 8397, 15324, 12639, 6354, 1793, -6233, -15545, -9614]
230i614K6617J9059k0531m1663r504L5787L3848j0498l8277j3050L2446L3441
242C8061j6285m4351n860M1675K6703k5626l7581L051L2134J1001k0367j6084
254a3529O062P911m493n209M095O178k602r856l403P969L307j0534l762J8429
268E63J6084j6287l2406k146L7158K9780j6868l7940o017K9405K0705j2250k1957
281a2176J286K2848J1726j7447k1889M844K2495O814j5362j1815Q440J1879p566
294D077j7123L59J5710M891q908k351O497k207j3475n621J2759J5139m678j8353
308a3284k255K1975J6451j5859l1075n351K8969K4501j1889k4267L909K3393K940
321A8158k2670j4736J2403K1098L954j3346q377N931O024m804n320N066P047m951
$$ y = [-9614, 17003, 36062, 15531, -26132, -35636, 151, 33999, 23501, -14776, -27826, 4620, 38061, 21776, -22575, -28435, 13240, 39943, 14317, -23264, -20213, 11921, 22922, 2555, -13529, -7467, 444, -4049, -9258, -5163, 1015, -1587, -11443, -14846, -6877, -3570, -14104, -17866, 563, 16647, 360, -32046, -34192, 2966, 32746, 15878, -22062, -28079, 1326, 22031, 9781, -12176, -10890, 11958, 23684, 6237, -15652, -10808, 11687, 18501, 3139, -8676, -236, 11643, 4077, -13046, -12687, 3023, 7914, -994, -3345, 3152, 945, -12530, -18151, -5392, 9747, 5069, -13284, -15539, 6436, 22887, 7028, -24047, -29398, -429, 24072, 12183, -12084, -8175, 15218, 18158, -4512, -19248, -6845, 14253, 18207, 4861, -3516, 2415, 8439, 3635, -1685, 3381, 10428, 5477]
335E477j2334L59J6227O497j7395j4262J4361K1047q830l0183r386K6211K7127
348B4916q099k9792r302K0218J6417j0348k0544j786J9583J4916p036j4642j427
361f926O423n21k587N927O361n869r250N827J6813R37k3290j7131J5971K9418
375B2103L592k5310j9448J1772K4758m30k8763j5636K2322K9773m005k9963j4866
388b4101J5547J8944m214j6750l849J0383P035j832l304j591j973j134L447P161
402C769J949j0602j1359Q540K2971O487k1390k0703R830K7647N019k6143j7892
415b1877J8641K9145n12k6803j6435J1923J9700j28j7870q113J3302J4356l776
428A1553j4089o108M489L567k242J64M870j079q264j87J1423L838j3986j2842
$$ y = [5477, -6857, -6498, 9729, 16226, -1169, -15431, -1070, 19977, 11147, -19036, -28422, -2211, 24916, 16817, -12975, -22277, -2059, 14358, 4010, -16534, -18320, 1263, 16179, 9143, -5499, -6926, -503, -1024, -3611, 2316, 8677, 2808, -6442, -615, 16198, 17135, -6155, -23286, -7315, 22103, 25695, 385, -19063, -7291, 17467, 17037, -11726, -27362, -5040, 24733, 20728, -9235, -24101, -8554, 10390, 6176, -10574, -14423, -4040, 2995, 1163, -2141, -3732, -5705, -6839, -3392, 3769, 5718, -4884, -16243, -7703, 15268, 21755, 365, -20338, -10508, 17139, 22158, -3985, -21877, -3236, 25909, 25397, -1406, -17841, -5918, 13782, 13654, -4216, -12329, 973, 15329, 11553, -2536, -8644, -4155, -588, -2830, -2666, 2204, 1125, -7139, -7326, 4097, 7935, -6051, -18893]
442a8893Q344J9941L706j9661j5997J2347K4884J900k4240j6509J4548K5438Q2
455A5890k5370j2583J9338K2428n171k1420o997J3077J2379l186j0675j949P685
468C446O162n00l691m294m403m92O084P822r46j3162r108J1401J7985n388k6541
483a5625j1623K0892K4926o794l0198j1888K3416K5306q399l0061j1231K1044
495a0235K4995k810k4110j0741J6349J8530k996j6222p170P208J0787M574k296
508E863n861n827M43J0025Q822p743j7975l996J8248J8420n671k4413j1103J9075
522a693K3281p366k9774j0073K4947K6676o939k9264j0514K0385K0210o698k0399
535g221o116J2969J4465L18j1417q191K117O251L382o29m724o732l77J0148J0213
$$ y = [-18893, -10549, 9392, 13098, -6563, -22560, -10213, 14671, 16571, -7669, -24178, -9630, 15808, 15890, -9480, -22063, -2725, 19703, 14532, -6888, -13885, -808, 11571, 8385, -2290, -4239, 3446, 9608, 9108, 5417, 1123, -3280, -3772, 2312, 10134, 9188, -3974, -13082, -1681, 16304, 10916, -15625, -27248, -6356, 18570, 11776, -18422, -30310, -6894, 18412, 10013, -20048, -31279, -10235, 14760, 11950, -12160, -22901, -6552, 11978, 8982, -7240, -14410, -7202, 3585, 8159, 5863, 2, -5825, -5382, 4643, 13465, 5722, -12253, -16249, 1999, 20419, 14748, -9665, -20768, -1693, 21588, 14222, -15552, -25625, -678, 25998, 19059, -10205, -20719, -334, 19876, 13178, -7221, -13337, -368, 14097, 14415, 2998, -5193, -3076, 3175, 6557, 5928, 1204, -5528, -5905, 4243, 14456]
550A4456n007j7980q655J5168J9633m900k4285q794J9750K1282n978k5311j0381
563b1002J8123K0436o416k3332p498J7509J7924n006j9086o723J2267J1361l466
576E091r024k420L363M529M316J334m436o821m77R517R069n182j4244k914J5075
591F776J3813p425k1320p432J7885J8189r317k4725m715K0700J4831j2601k3149
604a8490l546J8617J3119j0503j8977k615J4267J1337m539j2652m518O667P341
617d492J248j216j975k561J591Q118N298o765j1580J384J7402J2146j1119j9802
631a2323N79K1723J3238j3800k2517j424K1720J5353j1685k0999l23J9249J0318
644A9109j2099j7381n92J4443R666l919q457l614Q64K878K802n09m840m063K053
$$ y = [14456, 9449, -8531, -17186, -2018, 17615, 12715, -11570, -20364, -614, 20668, 14690, -10621, -21002, -2879, 17557, 11141, -12191, -19689, -2180, 15744, 10738, -8348, -15071, -2804, 8557, 5091, -3933, -6353, -2990, 1539, 5855, 7189, 2753, -4068, -4545, 4972, 14041, 8859, -5385, -8299, 6776, 20589, 13164, -8156, -15588, 2297, 20486, 11169, -13556, -18271, 2429, 17260, 4659, -18490, -22036, -3419, 9700, -803, -19780, -22395, -8128, 3209, -1330, -13982, -18500, -11833, -4492, -3244, -4460, -6435, -8996, -7405, 713, 6011, -754, -12334, -10950, 6452, 18598, 7479, -12323, -11744, 9979, 23217, 9417, -13100, -14524, 7196, 22549, 10864, -10135, -10458, 8791, 19109, 7010, -10371, -10963, 3480, 13146, 9227, 770, -2844, -1980, 898, 3700, 3191, -1649, -5712, -3659]
659c659P772M896o571j2611j608J3384R911r670j7790n2K1028J4969j1610k1734
673a3345j970J8400J2648p338j3424J56J3232Q160o870j0518L90Q645M864l049
687I981n803k557Q44K174K785J492m416r125l312O768N761n768j0310m57J0819
702a124O586r893j6323j414J6271J3245o182j5914l761J3140J0851o386j1509
715a2413L021J3337M283q518o726M968R627K196o224m957J780M101K073P05k38
730G015k860m690k103M223O299j627r252l312P787N400p942j1646J383J3091O418
745H184j0330j4370N49J2876O050p691q225L792R652L21j0574n162R671J1922
759F665k13q017l423L369L210P29K283M638M37o265l429O225O942k712q399j541
$$ y = [-3659, 4113, 9009, 2438, -10173, -11781, 1603, 11514, 1844, -15946, -15998, 5030, 19999, 8389, -13345, -15315, 3085, 15733, 8395, -5029, -4873, 8359, 16519, 9649, -869, -479, 8166, 13030, 9981, 4178, 1621, 2465, 4639, 7424, 8916, 4500, -4625, -7937, -1169, 4592, -1176, -11486, -11943, -1124, 5462, -4431, -20754, -22168, -5897, 7348, 1166, -14748, -18509, -5369, 5482, -904, -12413, -9392, 3945, 8228, -290, -7016, -2048, 7579, 9775, 3551, -1406, 374, 4475, 6548, 7253, 7015, 4155, -535, -2638, 1585, 7884, 6257, -2995, -6307, 1480, 6880, -1062, -12708, -11325, 1766, 8184, -2146, -16516, -15967, -3091, 2959, -4732, -12957, -9165, 487, 808, -9766, -14928, -5257, 6665, 6452, -1565, -4988, -1619, 1591, 2320, 4603, 9241, 9678, 3413, -16, 6209, 13151, 10439, 2040, 499]
775D99P356M945o582j0625Q93J1740M039j1746j3138K172J2840N065r245j0248
789a2035J195O769Q37m000n93L994K481k320l463R69L878J160m76M016O042j481
805F973q808l469Q637J0974m74r436k795P539M037p603p885M481J2119L433j1272
820F451j2988M37J0614N612m923o789j507J276j29j090J235K304j815m975p30
835g017M169J855l438k513K896L898j751o098j653O504O349k036o475j893M613
850b590M050k328m611K063P646J918p258o509K903Q350M757k551n105k028K90
865a003j82R2L098L585o63m983m183J532M399M49l362J12L759o67o979m382M998
882d380Q999J295p897n671M418O889q21n862q52N721L509m348o031K356Q068K247
$$ y = [499, 7855, 12800, 6218, -4407, -3514, 8226, 12265, 519, -12619, -10447, 2393, 7458, -1787, -12035, -10840, -4071, -3234, -7234, -7827, -3833, -1352, -3672, -7135, -6166, -2288, -1128, -1604, 2412, 8454, 6973, -1835, -5304, 3333, 14307, 13833, 4397, 1602, 9141, 13178, 5575, -2310, 2171, 14290, 17723, 6451, -6537, -6100, 4514, 10126, 5203, -1586, -3093, -1817, -1946, -3036, -1801, 503, -1312, -6287, -7017, -2848, -993, -4431, -6944, -4048, -150, -1901, -7999, -9652, -3148, 3201, 1165, -5310, -7203, -2590, 1460, -868, -5479, -3416, 4230, 6148, -1110, -7619, -4716, 3634, 8391, 5840, 735, -1293, -1003, -1185, -1093, 2005, 5590, 4927, -56, -4239, -2707, 1692, 2141, -1221, -1109, 2650, 1983, -4996, -9378, -4380, 4619, 5914, -1983, -7654, -3236, 3653, 2832, -3030, -3882, 1839, 5348, 1000, -5031, -2675, 5393, 7640]
898G640n743m180K904L683j223k438K137L746k265o745r68O261K744m915l553
913b915M777O326l299j0917m028J0012J0895l854j3107m510Q611Q484j969o649
927b143q7M734n17o284k033N495N256o46l573j600R81K77q14J424L531j46n284
944a429k951M185N519j219o589k135O338N756m132q404l19Q388N741m641r440
959e332l379N126O015N75k562q70N83l63k022j389J596K855K7k432j053K72k77
976b630M89L127L383q55n162l847K765O358J882m485m187J527M376L67m734k141
992c767N749O538k165q285l766M282N069n05m111j584K296J679j679j393J554
1007h8J865q66k440j182O74Q6r44J344M389J184n605n732K111P402K990m554m440
$$ y = [7640, 1897, -2283, 621, 4304, 3081, 643, 2780, 6526, 4261, -2484, -3452, 2809, 5553, 638, -2915, 1862, 8188, 4889, -6028, -10056, -44, 10851, 6997, -6110, -10620, -2009, 6475, 4506, -2143, -2230, 2504, 1987, -4297, -6330, -835, 4421, 3775, 202, -1398, -417, -140, -954, 470, 4001, 3855, -1429, -4380, -195, 5324, 4105, -2484, -4619, 1719, 7475, 3343, -5061, -5380, 3008, 8749, 4108, -5332, -8711, -3585, 2430, 3005, 443, -427, 156, -207, -2229, -3618, -2022, 833, 860, -1572, -2625, -2353, -2630, -2141, 986, 4369, 3514, -1648, -5495, -2730, 3628, 5510, 1025, -3162, -1635, 2741, 3108, -1626, -3767, 1982, 8520, 6355, -1930, -5696, -1414, 3655, 3150, -961, -2545, -249, 1430, -249, -1642, -88, 1777, 911, -1529, -2711, -2037, -1951, -2895, -1551, 2838, 4022, -1583, -7315, -5204, 2198, 5188, 634, -3806]
1024c806K472M603j757o003R0P334M708m347p494p60O893M884l469n619J89L934
1040A852O57k977j356K519K508j239k443QQ96j236j366J737K546o36l619j986
1056d135K969M396n42n235k072M084L544k874m864J040O641K918n932o933J611
1071e384P287L295l552m364J97K929O22k119m02K408J184j735j483Q81J090n25
1087C29j022J233K638q84m654j600M683M696j758n598j825L938L584k329n050
1102c619n4N100K725l291m811J71M566K573k873l415O48K270J94n84Q44J001p76
1119F69j997j82K135J540j577j487J625K240j409m086j398M036M828r97n748k338
1135d146L793L644j797l911j0L666J579l241l366J781M124P47k666j886J091J692
$$ y = [-3806, -1334, 3269, 1512, -4491, -4401, 2933, 7641, 3294, -4200, -4960, 1933, 6817, 3348, -2271, -2082, 1852, 2509, -468, -1824, 695, 3203, 1964, -479, -471, 425, -811, -2177, -440, 2106, 1470, -2149, -4135, -1166, 3230, 2688, -2547, -4619, -535, 3009, 135, -4729, -3689, 2952, 5870, -62, -6995, -5384, 1903, 5198, 1646, -2718, -2521, 408, 1030, -1089, -1491, 917, 2101, 366, -1117, -236, 854, 329, -693, 540, 3178, 2294, -2360, -3960, 723, 5419, 3661, -1937, -3762, 176, 3760, 1431, -3619, -3673, 1427, 4152, 861, -3950, -3779, 787, 3360, 487, -2928, -2280, -10, 184, -400, 444, 1445, 669, -1328, -1510, 625, 2165, 588, -899, 726, 2966, 1557, -2529, -3927, 109, 4937, 3940, -1808, -4146, -353, 3291, 1494, -2417, -2427, 1239, 2818, -423, -3789, -2008, 2116, 2863, 197, -1689, -598, 1094]
1151A094o33j795M76K470L64k346j168J758J341j074j658O33K167n40l134r86
1167c031L109K385j749l175M5L085J667k289k748J400L620j65m099j759L367L826
1183C489r34m349j333L236K361j865k543P45K140J37j961j246J097J761m86j351
1199a102R06J557p11k133j16K580J796k033l025R71L868Q77l269k225J998L256
1215C195k18l564j945K360K974q62l113q13J906J604j088j701K23J464l68j552
1231a498M95J922j07k055o53K211K167j079k932n6L549J981k585l328N36L691
1247B259J689k711l247R88L461J90l395j600J830K027p38k284l88J504O03j228
1263a040o72J082Q52p69q96N80J657L07j752j084J954K394q45k590r6K634J589
$$ y = [1094, 461, -1334, -858, 1612, 1976, -370, -1538, 220, 1561, 487, -1171, -538, 1629, 1089, -2045, -3031, 78, 2463, 714, -2461, -2416, 669, 2336, 47, -2701, -1301, 2319, 2154, -1945, -3704, -337, 3489, 2555, -1794, -3127, 109, 2470, 605, -1938, -1193, 947, 1084, -877, -2123, -1026, 735, 249, -1102, -196, 1361, 650, -1483, -1599, 981, 2777, 744, -2281, -1310, 2558, 3435, 166, -2059, -61, 3195, 2977, -587, -2532, -172, 2802, 1940, -1173, -1986, -80, 1524, 436, -1265, -1042, 422, 54, -1498, -1003, 919, 812, -1243, -1896, 315, 2482, 1403, -1529, -1585, 1964, 3945, 1360, -1968, -1432, 2259, 3948, 1237, -2010, -1022, 2439, 2629, -766, -2366, -536, 1491, 753, -1531, -1919, -415, 188, -1040, -1712, -630, 222, -547, -1443, -863, 794, 1101, -651, -1735, 219, 2613, 1768, -822, -918, 1716, 3305]
1280C305j703k607P43K803M17k600j366J749J860q27k587p42K352J507k115k490
1296b301P89K579m4k325j403J558J829j072k282J48K049L47j699p36J104J244
1312b15n16j680J38K112Q85j782j324J504K329k05k195o45K575K220j291k601
1328f91M88K665R37j765j744O77J884K17j862j143R84Q68r95j286K96O51o00j655
1346b074k36J880P31k314j970J425K780J13k769j792J925L401J60l023j294K200
1362h57K661j47k248q18K061K105o75j619K57J211K27l87j3L00j28p30O4J135
1380B399O21j707j778Q59K238K38k538k238J349L176J90l689k372J998K939l89
1396A296l012j589J701J946o48k124l98J252O43q41o88L57Q50Op96L56J250O6
$$ y = [3305, 1602, -1005, -262, 2541, 2958, 358, -1008, 741, 2601, 1774, -813, -1555, 797, 2304, 189, -2301, -1512, 1067, 1023, -1302, -2705, -1147, 682, -390, -2672, -2524, -475, -128, -1827, -2563, -1459, -215, -731, -2411, -2273, -161, 724, -1058, -2382, -878, 1451, 1246, -949, -1594, 981, 3201, 1910, -691, -203, 2462, 3399, 1634, -110, 567, 2451, 2668, 806, -337, 647, 1515, 520, -766, -470, 181, -419, -2074, -2310, -430, 301, -2013, -3983, -2558, 222, 335, -2434, -4226, -2301, 1100, 1260, -1763, -3057, -857, 1804, 1657, -591, -1409, 652, 2757, 2082, 463, 720, 1931, 2158, 1771, 1758, 2058, 1930, 1200, 1264, 2399, 3020, 1313, -465, 394, 2632, 2870, 332, -1906, -557, 2619, 2809, -880, -3252, -1254, 1685, 1296, -1716, -3305, -1604, 342, -306, -2430, -2828, -1576, -933, -1774, -2462, -2105, -1255, -1249, -2045, -1689, -439, -373]
1414c73j231k49J724J356p16j490L05J991R00j522j460J272K012j64k001j122
1430g68J222K017o09k370p80J666J056j221j470L02J270N9j545p83J139R36r10
1447g89q84N38J010k5r54l60J145J075p83j196O05J750J06j514p09J544J807p56
1465A610k546m80K662J828j369k694l35K138J705j179k319r3J927Q98j258j274
1481g79q8J060N93m66n94j42l88j79J031J205p89j974n17J833J777q10k456m50
1499b133K747J961j574k937j42L002K318j516l322m56K865J946j342k063l62J613
1515F05J138q34j411l15P91N59o7l62p95r18J11J291J078n72j944j067J667K205
1533A160m51k357p11J811J799q45k264j34K573J574j273k043l9J611J243m63j175
$$ y = [-373, -1604, -1853, -129, 1227, 511, -979, -674, 1317, 2217, 695, -765, 507, 2519, 2355, 354, -768, 454, 2471, 1862, -508, -1288, 378, 1434, 213, -1257, -955, 315, 374, -1171, -1954, -815, 121, -789, -1673, -1135, -125, -150, -1104, -1464, -319, 756, -27, -1223, -618, 1132, 1238, -276, -985, 559, 2366, 1610, -936, -1416, 1246, 3074, 1705, -989, -1324, 814, 2519, 1340, -979, -1072, 855, 1753, 495, -779, -867, 193, 786, 320, -274, -416, -804, -983, 48, 1253, 464, -1510, -2027, -194, 1583, 773, -1683, -2133, 614, 2575, 1001, -1936, -2078, 924, 3242, 1726, -1596, -2052, 813, 2759, 1417, -646, -1008, 605, 1743, 909, -502, -817, -26, 533, 466, 104, -691, -1609, -1498, -207, 871, 299, -1645, -2712, -1045, 1160, 709, -1648, -2359, -548, 1251, 406, -1858, -1992, 581, 2155, 882, -1161, -1200, 411, 1654, 1191, 16]
1550A6M6Q41K7p17o8M61J99k89j98K70K7p60o18Q85J330m05j957r33J062J508
1570G27M2j527p17J248J140j049j564L02J911R92j436k058J23K159Q69j093r24
1587h55M51R16j4p56k82Q36Q47l02r91o2L60P4K60N82K22p34j189mJ493J018j315
1608E55j767N84J944K80j944j754J204K719M89k754k197R83K578Q33j683j688
1624a618N06J527J6j164m80Q67P22Oo47n05j48K75R32R78j70j556j309R68K146
1643A346N13j604j674N82K220N39k043j582J401K255J6k216j532P73K041N54j296
1660B93r99J17N17J63q4j76Q8L2j97j38K05k26n06M31J234K76j124j551R5J899
1680C49J292r02j793p1J189P11o12p48L59J217J47j372j020P62J235L50o84p19
$$ y = [16, 62, 903, 930, 213, 145, 606, 805, 516, 318, 588, 615, -145, -763, 122, 1452, 1047, -910, -1843, -781, 727, 769, -758, -1475, -227, 913, -136, -1700, -1398, 513, 1505, 69, -1989, -1866, 293, 1162, 69, -855, -404, 512, 498, -258, -540, 296, 1143, 841, -150, -212, 148, 222, 482, 1064, 1286, 552, -637, -641, 852, 1870, 555, -1212, -628, 1316, 1596, -348, -2102, -898, 1821, 2310, -444, -2641, -1658, 920, 1753, 70, -1618, -1112, 415, 431, -733, -1213, -346, 376, 382, -265, -770, -918, -643, 289, 1267, 1097, -459, -1768, -800, 1346, 1859, 255, -1419, -837, 1383, 1922, -121, -1703, -302, 1953, 1969, -247, -1779, -1006, 1035, 1589, 293, -706, -589, -72, 91, 7, -169, -81, -49, -246, -384, -179, -405, -911, -480, 754, 1030, -94, -1645, -1550, 349, 1641, 739, -1054, -1125, 64, 775, 163, -585, -226, 991, 1138, -234, -1254, -492, 743, 1093, 409, -310]
1698c10o6K99J48k9M76P6n52m50J83L66O8l08j38M28N22o35j122m8J290Q08n63
1719D43j152l53R38M35p24m09R13Q34p02j488k92J350J490k20j503o73R21P54
1737E62l31m91L69O98r0r52o42P39P33l2l45J01j75m92l62N17R78K20j188r38
1757a121O70J046k14r39k14J126Q19q74j702o9J919J135r12j305j02P38M18l59
1775F0k47O24K84p04o71K76N64P4k55J36L31j5j007o70R99J584p3j471j044M60
1795g65J178M36p12m81M59M11m15m97R5L30M62j67m39k06l7j93J28P41M42o75
1815I5q83j91O71Q25k12r04rP54K26p12n91M76J133O58q86j354r1J024Q42j26
1835G45p07k39K39J96j84l1M01Q5l41k89J36q7j29q2L55L83Qq74n87O73R72K1
$$ y = [-310, -376, -77, 71, 42, 518, 594, 42, -408, -225, 141, 209, -99, -237, 191, 713, 78, -1044, -1092, 198, 1006, 443, -709, -1062, -124, 311, -413, -822, 91, 925, 223, -1265, -1557, -207, 1283, 1063, -440, -1113, -192, 562, 231, -260, 109, 807, 717, -235, -877, -138, 595, 563, 218, 319, 144, -348, -710, -193, 785, 1005, -183, -1121, -451, 595, 381, -558, -772, 354, 1173, 299, -1403, -1472, 447, 1582, 670, -635, -737, 1, 419, 60, -187, 437, 721, 17, -654, -378, 186, 260, 5, 141, 472, 457, -550, -1220, -221, 1363, 1290, -181, -1225, -765, 413, 849, 137, -344, 115, 526, 111, -386, -291, 39, 501, 334, -105, -311, -348, -541, -413, 328, 770, 95, -788, -979, -308, 517, 305, -599, -608, 146, 372, -340, -931, -455, 678, 1336, 450, -904, -995, 29, 871, 745, 38, -201, 38, 234, 50, 19, 420, 505, 164, -125, 11, -76, -205, -287, 68, 451, 459, -415, -1002, -329, 643, 664]
1857F64q85o66M55P05j67p65P2R62L33p21p34Q2P50L06l89k98J76Q8l83p9O21
1878A27N40j81o21k88M23O12m61m46M38O92l06r02k37Q31J022k30j069l90O12
1897A66M94n33n50J91P38J05p08q66M20J020J45o05n16%K16J20m6K8Rp4j6K04
1919e8J49m20k28O24N77l5q24q39L40J519N67j099j175L57J300L39q48j063M76
1938c41J348J74j192j043L97J255Q08o49j260l40P55P12r3m46n12l3N30L96l19
1957A47p04m00N71J049N5j415r60O95J508M23j092j303K56J460P20j050j099L29
1975h10J234O82q33j088J37J188O20l73q19m19L76P51L36n04p15j60M71P11N5
1994H40q45p35N00R77Q3j093j041L44J507N69j138j299L14J348M79p47j130P4
$$ y = [664, -221, -887, -432, 273, 106, -659, -587, 375, 708, -13, -747, -665, 85, 391, 2, -296, -120, -32, -415, -494, 127, 667, 486, -135, -423, 0, 612, 151, -295, 143, 835, 529, -373, -610, 221, 1243, 1013, -56, -446, 166, 660, 127, -423, -232, 506, 611, -97, -963, -543, 477, 622, 17, -499, -499, -283, -163, -209, -181, -172, -246, -262, -58, 91, -329, -557, 67, 644, 609, -215, -1054, -714, 805, 1372, 273, -902, -545, 755, 1094, 246, -817, -341, 1007, 1181, -11, -1054, -657, 598, 1406, 757, -503, -843, -88, 624, 531, 85, -427, -460, 70, 466, 147, -557, -957, -386, 663, 718, -697, -1657, -962, 546, 969, -123, -1426, -1170, 290, 1010, -40, -1139, -810, 424, 1106, 273, -815, -678, 510, 1130, 757, -62, -481, -105, 646, 982, 478, -237, -397, 74, 785, 840, -5, -740, -240, 737, 820, -273, -1314, -970, 537, 1106, -32, -1331, -1017, 331, 810, 63, -1067, -993]
2012i93J150O15p75r29J21Q92O29k10q04k94N36N96J23l92o54k25P18P04k40r10
2032c42l30O77R97j26j165q22R05J302q9j343j044P59J573K22j348j079P00J310
2050G57K63j105j000L02J207N52p97j025kR34P55j41r72n09N08Q75K30p28r67
2069h63N9J158Q91o13j334m03J241J242m01j745p24J233J384o6j511r62P34J497
2087H17L29j315j132N05J174N00p18j096j38R83Q90j43q96o63L59J129N14q78
2105B21j053n6J176R13m95j411m98J260J390l85j490q36Q49J487J67j476r52N81
2123f08J372K60r04j067R2J087P72o12j016k62N69Q87M0q96p33M39R80M10o00
2142B10j080k16J205R90o51j290l15J008J173k25j329n68R17J268j76j155o84
$$ y = [-993, 157, 772, -3, -932, -811, 81, 710, 500, -304, -598, -62, 534, 657, 265, -389, -614, 104, 808, 568, -342, -672, 5, 1002, 876, -289, -1111, -206, 1096, 1007, -336, -1380, -621, 952, 1174, -174, -1253, -553, 757, 1020, -85, -1085, -783, 424, 976, 179, -846, -848, 86, 841, 700, -272, -781, -273, 602, 832, 104, -863, -804, 354, 1245, 632, -702, -1105, 136, 1378, 977, -768, -1492, -259, 1125, 1059, -452, -1414, -680, 817, 1146, -169, -1301, -796, 378, 878, 160, -936, -1074, -91, 799, 656, -240, -903, -544, 585, 1099, 221, -832, -888, 288, 1201, 706, -705, -1203, 57, 1447, 1062, -428, -1264, -415, 1072, 1239, -237, -1189, -608, 764, 1024, 120, -947, -855, 232, 1004, 392, -624, -886, -317, 570, 610, -286, -1019, -580, 400, 810, 210, -870, -1086, 119, 1109, 458, -832, -1147, -139, 1034, 809, -520, -1088, -171, 1097, 921, -234, -918]
2159i18N88J198R8r79o81M05Q99J80n35p73p0P70N11k27p89l74M29P94R6p76p57
2180i11M00Q68M15p14j039O8J148O67o20j150MJ017P01m58j063k78Q87R55l77
2199E20q94m49N77Q56J11p63n38K86O21L33l28o99k28O22O08n4o52o26L21R12
2219E36K92q29q04J53R77N85o65r99j09R98P46m76r34k66P09P53n8q89n06N28
2239b58O06K66n39n13j48O37N21j61p19l08M11O51K53o98p40K46Q65L45n00q94
2259f77jQ56O50n31q95p3P58O50k22q54l63O64O62n6o38m57K42O00K11l78m80
2280c32J4M25L80o3n98l22K71N97J63n13n03J56O06K94n92n44J29N99K65l66n05
2301d39m3O32L44m44n29R7M07L26j46l72k06K95K73o9j63j22M1K22J20j40k91
$$ y = [-918, -330, 868, 966, -13, -694, -289, 610, 790, 255, -518, -588, 182, 693, 466, -323, -697, -268, 526, 622, -154, -911, -511, 357, 772, 58, -981, -913, 235, 902, 282, -868, -864, 153, 854, 396, -667, -945, -58, 897, 520, -374, -823, -246, 610, 721, -42, -580, -294, 327, 660, 332, -367, -595, 27, 635, 581, -71, -697, -376, 536, 828, -1, -805, -652, 325, 910, 245, -754, -863, 135, 881, 405, -529, -795, -86, 667, 609, -280, -786, -258, 348, 614, 75, -438, -586, 51, 572, 411, -308, -616, -205, 446, 699, 1, -739, -493, 372, 717, 217, -677, -678, 178, 828, 297, -598, -671, 87, 737, 515, -339, -702, -38, 624, 568, -70, -527, -285, 315, 526, 148, -332, -318, 107, 487, 424, -174, -496, -225, 372, 535, 22, -481, -325, 281, 575, -17, -561, -432, 167, 432, 66, -439, -482, 150, 494, 50, -479, -382, 25, 351, 205, -167, -373, -78, 195, 126, -37, -159, -118, 104, 224, 84, -207]
2322b07k7K28K03J40l12l59J47L84R8k86j93N1M04J11l65l80K07M13O3j83k56
2343a19j97L25K95j80k25o6K7K06L8j92j65J05K25J23r6k39k77K16M80k4l60l34
2365d34J17N17K70l68m64J25M05J70k94l48K8M48K63k13m60n0K55L34nk77k36
2386b17L9K84J19o6k43j40K02L10l3l83j81K55L78Q7m38l89J61N49P5l22l54l6
2408c43L57J81j20l45J5K78J73k20k74K2J38K98l2k58j07j2J20K45Q4k79j60O9
2430a70K21J55j34k60O9L43O2l05k58P8L46L66k55m05JK50J21j01j16m8J9Q3j06
2453d4o2K8KK18pj14k64j18K54L55m5k88k43Q8K90R1k13k10J92K30J30m08l40
2476d78K25N38J39k79m26m1K68L41j6l85l7K49J12J6k92o9N9L27J14l21l71K0
$$ y = [-207, -234, -6, 197, 337, 25, -334, -187, 197, 295, 9, -184, -133, 271, 382, 17, -363, -156, 257, 320, 137, -119, -316, 9, 304, 124, -101, -167, -140, 66, 104, -88, -253, -148, 77, 200, 104, -135, -412, -196, 284, 260, -100, -434, -317, 200, 470, 102, -362, -237, 168, 338, 44, -304, -276, 172, 435, 222, -238, -288, -33, 301, 296, 19, -217, -178, 106, 225, 159, -84, -224, -22, 288, 255, -128, -309, -54, 324, 411, -27, -416, -255, 294, 369, 47, -307, -343, 14, 195, 75, -270, -255, 23, 196, -24, -298, -276, -138, 160, 128, -130, -237, -249, -129, 116, 200, -79, -239, -170, 51, 206, 72, -188, -119, 224, 286, -19, -277, -199, 147, 513, 258, -147, -146, 104, 225, 124, 8, -40, -21, 62, -44, -106, -78, -76, 142, 135, 21, -243, -361, -107, 248, 203, -85, -328, -240, 50, 141, -72, -282, -90, 140, 270, -138, -478, -253, 285, 424, 145, -281, -322, -54, 287, 271, -114, -151, 98, 210, 226, -66, -135, -76, 251, 365, 44, -327, -307]
2498c07M66L51k20n11k69L93L46j31k68k20K06M38q6m33k55J87N62J83l94o19
2518e81M3O22L34j59l77k18J95M40j06l70j44K84L04O9l10m62J13M41L20k81l86
2539b29k74L18M63P6m56k39Q3M86Q1l61m11J84N58L50n22n95L3N28N41k25n90
2560b01k19K62K92N9k22j81M6K75L6j40l71o1M06M37j20o05l95K99O85J85m28
2581C9m96J78N01J32n14k95K87M90J87m98m62P8M56L48j91m19j21K13L05R8k77
2602C9k94J35K58Q2j99l85K2O35J74k31o62j58N19O56j71o69k27L83M08q2l80
2623a47j94K97M01r8m81k39K33M64K77k80m82j45L10L47Nl36k34K64L62p7m92
2644b45j65K01N35J01m09m60k1N54L54l12n11j28L40L65m7m32j46K90L78Jl88
$$ y = [-307, 159, 510, 290, -221, -490, -97, 249, 118, -150, -370, -164, 274, 188, -245, -500, -313, 249, 432, 38, -581, -538, 84, 418, 259, -118, -336, -141, 299, 193, -177, -321, -37, 267, 336, 26, -436, -323, 118, 438, 157, -229, -503, -185, 278, 354, -102, -341, -258, 228, 309, -52, -463, -279, 279, 629, 107, -488, -455, 73, 614, 389, -201, -420, -158, 134, 193, -29, -210, -164, 111, 147, 7, -364, -425, -19, 418, 298, -307, -702, -403, 282, 467, 39, -457, -279, 222, 354, -160, -455, -168, 322, 509, 11, -451, -373, 83, 431, 240, -179, -300, -87, 218, 316, 39, -255, -120, 138, 220, 21, -364, -342, 293, 467, 236, -426, -584, -65, 591, 420, -249, -476, -93, 315, 233, -147, -341, -44, 357, 259, -222, -461, -228, 236, 513, 233, -249, -394, -84, 263, 268, -68, -302, -38, 324, 247, -245, -410, -209, 326, 427, 18, -442, -463, 91, 445, 133, -378, -506, -166, 199, 152, -280, -426, -136, 242, 243, -145]
2665a45l29J88N84K54m66n40l9N47M15m2n45j74J98L46j2m11k28K46N23M8n05
2686h7n27Q3O15N08k37n88l27L15M66Q3m77k65L46N54l3n60m12L62N34L03m98
2707A58m36r0N10M18k35m12k68K66M51J8m22k78J37M30Q2l80m69L5O77M12m32
2728A72n76k00M37M97m3m67j98L59L44j53m32j52L25M44N8l63m24K2L77L65q8
2749C04m11j53K10K87l3l96k79L33M46M8m91m39J93N28K74l11n34J6N11K99k53
2770A49m00j47L13L64m7l12j87K51L64o9k87l43Q3M96L31l34m22k15K94M33Nl10
2792A0l01K19L63l4l36m41J98N95K31m26n70Q3M08L88j51m59k35L94M34o1n32
2813b23j59J84M71J42m58k86pN14K56k76m63j55M58M47n2m48l56J54M55J85m66
$$ y = [-145, -474, -286, 298, 552, 86, -454, -493, 54, 469, 427, -118, -292, -94, 252, 240, -171, -399, -153, 370, 418, -87, -614, -531, 84, 592, 355, -233, -560, -245, 221, 304, -173, -438, -92, 462, 429, -131, -543, -181, 353, 656, 158, -278, -368, 142, 560, 325, -87, -355, -89, 362, 380, -42, -320, -183, 247, 329, -51, -520, -485, 192, 604, 172, -404, -604, -167, 330, 287, -180, -378, -19, 325, 172, -260, -412, -87, 357, 415, 52, -372, -350, 27, 392, 304, -107, -260, -50, 237, 204, -192, -471, -138, 308, 356, -135, -574, -381, 147, 421, 110, -424, -408, 103, 402, 149, -251, -398, -85, 279, 232, -80, -267, -16, 348, 279, -8, -351, -268, 228, 559, 225, -197, -412, -118, 315, 320, 10, -291, -72, 291, 257, -79, -520, -322, 273, 504, 78, -492, -409, -1, 387, 236, -223, -458, -64, 370, 309, -223, -382, -198, 273, 415, -43, -329, -336, 178, 434, 158, -305, -460, -2, 445, 393, -55, -411, -257, 198, 383, -83]
2834h3l42K39M40K67n03m87n8O15N87k35n85k47J72N05M9m16j91K65L52J46m62
2855B8m95L2M99M35j48m88k86J97M64L1l73l40L32L75O8m35l86J4N52L10k53m21
2877b88n6L51L86j52m85k13L16N09J3l88l12J02M60J60k88k95L6L17L13j69m89
2898a72k42K74M82J70m59l14K2M92J86m23m29J20L99L08k50n41j12L20N18j54
2918A95l67k25K61L96l9n01l55K77M55K81k26m77j37L74M27j90l88j54K63M88
2938C58L4o12m37K94P43K92n36n69M5N58L62l54n61l7N55M10j74n39l13L10O34
2959D63P6m32l67o0M28L31l79n00n3N83M37j08o08l68L08O31J9n16m69J59O82
2980B57K93m52n94n6O41N37l10n44l03L55N93l6m33m31K64N67K46m08o99j2O02
$$ y = [-83, -425, -186, 254, 521, 18, -469, -527, 88, 675, 440, -145, -392, -220, 285, 334, -82, -273, -8, 344, 490, 28, -467, -435, 64, 499, 351, -137, -423, -226, 238, 269, -104, -444, -112, 263, 331, -104, -490, -476, 76, 386, 133, -288, -344, 7, 393, 241, -244, -457, -141, 368, 381, -7, -319, -217, 243, 403, 115, -180, -144, 173, 486, 317, -172, -414, -140, 342, 512, 53, -261, -239, 253, 439, 16, -413, -293, 106, 414, 164, -377, -489, -169, 349, 195, -172, -397, -136, 260, 221, -280, -635, -358, 97, 378, 152, -325, -462, -88, 339, 149, -239, -393, -130, 358, 392, -220, -657, -363, 380, 672, 136, -433, -388, 170, 532, 178, -383, -420, 135, 545, 371, -168, -481, -171, 463, 539, 107, -260, -320, 108, 439, 60, -440, -493, 90, 527, 419, -189, -557, -249, 382, 401, -115, -584, -425, 257, 550, 98, -496, -552, 89, 626, 316, -228, -531, -176, 417, 381, -52, -483, -219, 348, 594, 186, -513, -525, 77]
3001G7M83j62o16k89L68N22o7m99l85K71P75J17m54o84J39N17L42k19o50r8N68
3022E6M85j77o61k81L11P06M7n23n45J57N54J32k35m47ON61L88k59o79j76M37
3043a43N41J7n53l28K08N95J77n37m27J95O57L14n11o05l5N85L83k64n22q1M10
3064G6M56j64n61k97K37O18J29m77m55J12M76L11l52m90n5N09M61j41o46m41M10
$$ y = [77, 560, 398, -218, -507, -139, 383, 316, -183, -568, -297, 478, 595, 141, -543, -404, 113, 455, 236, -414, -512, 56, 541, 364, -297, -578, -267, 439, 486, -37, -582, -425, 129, 261, 26, -421, -415, 146, 534, 275, -404, -580, -143, 398, 415, -138, -466, -258, 337, 514, -23, -450, -255, 402, 716, 205, -400, -435, 150, 533, 269, -253, -334, 76, 532, 368, -193, -490, -253, 365, 494, 17, -438, -326, 150, 461, 109, -381, -436, 73, 534, 393, -253, -694, -284]
$$ [...]
8191C4
##END NTUPLES=NMR FID
##END=
