##TITLE=1H_CG-1107
 CDCl3, 8 sc, 
 31.5.2019
##JCAMPDX= 6.0         $$ Bruker NMR JCAMP-DX V2.0
##DATA TYPE= NMR FID
##DATA CLASS= NTUPLES
##ORIGIN= UXNMR, Bruker Analytische Messtechnik GmbH
##OWNER= root
$$ XWIN-NMR		Version 3.5
$$ Fri May 31 13:44:52 2019 Russian Standard Time (UT+4h)  she@DPX200
##.OBSERVE FREQUENCY= 200.13155
##.OBSERVE NUCLEUS= ^1H
##.DELAY= (6, 6)
##.ACQUISITION MODE= SIMULTANEOUS
##.ACQUISITION SCHEME= undefined
##.AVERAGES= 8
##.DIGITISER RES= 18
##SPECTROMETER/DATA SYSTEM= spect
##.PULSE SEQUENCE= zg30
##.SOLVENT NAME= CDCl3
##.SHIFT REFERENCE= (INTERNAL, CDCl3, 0, 15.7039)
##AUDIT TRAIL= $$ (NUMBER, WHEN, WHO, WHERE, WHAT)
$$ ##TITLE= Audit trail, XWIN-NMR		Version 3.5
$$ ##JCAMPDX= 5.01
$$ ##ORIGIN= Bruker BioSpin GmbH
$$ ##OWNER= she
$$ F:/spectra/data/she/nmr/H-F/1/audita.txt
$$ ##AUDIT TRAIL=  $$ (NUMBER, WHEN, WHO, WHERE, WHAT)
(   1,<2019-05-31 13:43:36.32 +0400>,<she>,<DPX200>,
      <created by zg, POWCHK disabled, PULCHK disabled
       configuration hash MD5:
       00 E9 B6 7A A2 85 ED C7 34 08 36 98 17 FE 4E 26
       data hash MD5: 16K
       F4 B2 12 99 E5 14 44 2D A3 92 50 CF 90 D4 26 28>)
$$ ##END=
$$ 
$$ hash MD5
$$ A9 A4 65 A9 CC 04 1A AD 4A 57 9F 8D 6B CB B7 79
##$RELAX= 
##$RELAX= 
##$RELAX= 
##$RELAX= 
##$RELAX= 
##$RELAX= 
$$ Bruker specific parameters
$$ --------------------------
##$DU= <F:/spectra>
##$EXPNO= 1
##$NAME= <H-F>
##$PROCNO= 1
##$TYPE= <nmr>
##$USER= <she>
##$AMP= (0..31)
100 100 100 100 100 100 100 100 100 100 100 100 100 100 100 100 100 100 
100 100 100 100 100 100 100 100 100 100 100 100 100 100 
##$AQSEQ= 0
##$AQ_mod= 1
##$AUNM= <au_zg>
##$AUTOPOS= <>
##$BF1= 200.13
##$BF2= 200.13
##$BF3= 200.13
##$BF4= 200.13
##$BF5= 200.13
##$BF6= 200.13
##$BF7= 200.13
##$BF8= 200.13
##$BYTORDA= 1
##$CFDGTYP= 0
##$CFRGTYP= 5
##$CHEMSTR= <none>
##$CNST= (0..31)
1 1 145 1 1 1 1 1 1 1 1 1 1 1 1 1 1 1 1 1 1 1 1 1 1 1 1 1 1 1 1 1 
##$CPDPRG= <>
##$CPDPRG1= <>
##$CPDPRG2= <>
##$CPDPRG3= <>
##$CPDPRG4= <mlev>
##$CPDPRG5= <mlev>
##$CPDPRG6= <mlev>
##$CPDPRG7= <mlev>
##$CPDPRG8= <mlev>
##$CPDPRGB= <>
##$CPDPRGT= <>
##$D= (0..31)
0 1.2 0 0 0 0 0 0 0 0 0 0.03 0 0 0 0 0 0 0 0 0 0 0 0 0 0 0 0 0 0 0 0 
##$DATE= 1559295815
##$DBL= (0..7)
120 120 120 120 120 120 120 120 
##$DBP= (0..7)
150 150 150 150 150 150 150 150 
##$DBP07= 0
##$DBPNAM0= <>
##$DBPNAM1= <>
##$DBPNAM2= <>
##$DBPNAM3= <>
##$DBPNAM4= <>
##$DBPNAM5= <>
##$DBPNAM6= <>
##$DBPNAM7= <>
##$DBPOAL= (0..7)
0.5 0.5 0.5 0.5 0.5 0.5 0.5 0.5 
##$DBPOFFS= (0..7)
0 0 0 0 0 0 0 0 
##$DE= 6
##$DECBNUC= <off>
##$DECIM= 24
##$DECNUC= <off>
##$DECSTAT= 4
##$DIGMOD= 1
##$DIGTYP= 9
##$DL= (0..7)
0 120 120 120 120 120 120 120 
##$DP= (0..7)
150 150 150 150 150 150 150 150 
##$DP07= 0
##$DPNAME0= <>
##$DPNAME1= <>
##$DPNAME2= <>
##$DPNAME3= <>
##$DPNAME4= <>
##$DPNAME5= <>
##$DPNAME6= <>
##$DPNAME7= <>
##$DPOAL= (0..7)
0.5 0.5 0.5 0.5 0.5 0.5 0.5 0.5 
##$DPOFFS= (0..7)
0 0 0 0 0 0 0 0 
##$DQDMODE= 0
##$DR= 18
##$DS= 0
##$DSLIST= <SSSSSSSSSSSSSSS>
##$DSPFIRM= 0
$$ [...]
##$SUBNAM2= <"">
##$SUBNAM3= <"">
##$SUBNAM4= <"">
##$SUBNAM5= <"">
##$SUBNAM6= <"">
##$SUBNAM7= <"">
##$SUBNAM8= <"">
##$SUBNAM9= <"">
##$SW= 24.9336996594482
##$SWIBOX= (0..15)
0 0 2 0 0 0 0 0 0 0 0 0 0 0 0 0 
##$SW_h= 4990.01996007984
##$TD= 16384
##$TD0= 1
##$TE= 0
##$TE2= 300
##$TE3= 300
##$TEG= 300
##$TL= (0..7)
0 120 120 120 120 120 120 120 
##$TP= (0..7)
150 150 150 150 150 150 150 150 
##$TP07= 0
##$TPNAME0= <>
##$TPNAME1= <>
##$TPNAME2= <>
##$TPNAME3= <>
##$TPNAME4= <>
##$TPNAME5= <>
##$TPNAME6= <>
##$TPNAME7= <>
##$TPOAL= (0..7)
0.5 0.5 0.5 0.5 0.5 0.5 0.5 0.5 
##$TPOFFS= (0..7)
0 0 0 0 0 0 0 0 
##$TUNHIN= 0
##$TUNHOUT= 0
##$TUNXOUT= 0
##$USERA1= <user>
##$USERA2= <user>
##$USERA3= <user>
##$USERA4= <user>
##$USERA5= <user>
##$V9= 5
##$VALIST= <valist>
##$VCLIST= <CCCCCCCCCCCCCCC>
##$VD= 0
##$VDLIST= <DDDDDDDDDDDDDDD>
##$VPLIST= <PPPPPPPPPPPPPPP>
##$VTLIST= <TTTTTTTTTTTTTTT>
##$WBST= 1024
##$WBSW= 4
##$XGAIN= (0..3)
0 0 0 0 
##$XL= 0
##$YL= 0
##$YMAX_a= 257258
##$YMIN_a= -185228
##$ZGOPTNS= <>
##$ZL1= 120
##$ZL2= 120
##$ZL3= 120
##$ZL4= 120
##$ABSF1= 10
##$ABSF2= 0
##$ABSG= 5
##$ABSL= 3
##$ALPHA= 0
##$AQORDER= 0
##$ASSFAC= 0
##$ASSFACI= 0
##$ASSFACX= 0
##$ASSWID= 0
##$AUNMP= <proc_1d>
##$AZFE= 0.1
##$AZFW= 0.1
##$BCFW= 1
##$BC_mod= 2
##$BYTORDP= 1
##$COROFFS= 0
##$CY= 11.3945322036743
##$DATMOD= 1
##$DC= 2
##$DFILT= <>
##$DTYPP= 0
##$F1P= 18.9103706918063
##$F2P= -1.10871071338519
##$FCOR= 0.5
##$FTSIZE= 0
##$FT_mod= 4
##$GAMMA= 1
##$GB= 0.15
##$INTBC= 1
##$INTSCL= 1
##$ISEN= 128
##$LB= 0.24
##$LEV0= 0
##$LPBIN= 0
##$MAXI= 10000
##$MC2= 0
##$MEAN= 0
##$ME_mod= 0
##$MI= 1.114404
##$NCOEF= 0
##$NC_proc= 0
##$NLEV= 6
##$NOISF1= 3.799351
##$NOISF2= 2.8
##$NSP= 1
##$NTH_PI= 0
##$NZP= 0
##$OFFSET= 15.70392
##$PC= 1
##$PHC0= -8658.366
##$PHC1= 17.00023
##$PH_mod= 1
##$PKNL= yes
##$PPARMOD= 0
##$PSCAL= 0
##$PSIGN= 0
##$REVERSE= no
##$SF= 200.130013532006
##$SI= 16384
##$SIGF1= 3
##$SIGF2= 2
##$SINO= 400
##$SIOLD= 16384
##$SREGLST= <1H.CDCl3>
##$SSB= 0
##$STSI= 0
##$STSR= 0
##$SW_p= 3612.71676300578
##$SYMM= 0
##$S_DEV= 0
##$TDeff= 0
##$TDoff= 0
##$TI= <>
##$TILT= no
##$TM1= 0
##$TM2= 0
##$TOPLEV= 0
##$USERP1= <user>
##$USERP2= <user>
##$USERP3= <user>
##$USERP4= <user>
##$USERP5= <user>
##$WDW= 1
##$XDIM= 8192
##$YMAX_p= 0
##$YMIN_p= 0
$$ End of Bruker specific parameters
$$ ---------------------------------
##NTUPLES= NMR FID
##VAR_NAME=  TIME,          FID/REAL,        FID/IMAG
##SYMBOL=    X,             R,               I
##VAR_TYPE=  INDEPENDENT,   DEPENDENT,       DEPENDENT
##VAR_FORM=  AFFN,          ASDF,            ASDF
##VAR_DIM=   8192,          8192,            8192
##UNITS=     SECONDS,       ARBITRARY UNITS, ARBITRARY UNITS
##FACTOR=    0.0002004,     1,               1
##FIRST=     0,             0,               0
##LAST=      1.6414764,     0,               0
##MIN=       0,             -185228,         0
##MAX=       1.6414764,     257258,          0
$$ Real data points
##PAGE= N=1
##DATA TABLE= (X++(R..R)), XYDATA
0@%%%%%%jRj6J6k4L2m0M8n6P2q8J04j21J45j76K04k35K72l13L60m09M65n29N98
30C17o74P57q48R50j061J182j318J467j627J804j999K213k452K715l005L332l701
47a948M118m595N145n789O556p488Q648j0138J2135j4966J9321k6964M4218j49204
61a20951J6329L13860r4361j69303j8496P4258l2680Q847M3793j1439m5555O5764
73C0066M8880q5724j06037M5312R7694M3725K701l2341j15967p0009J09800J61339
85A29439k3317j48029m3742R9186O0408p0086r2988L1974J27488N8453q8994j23605
97h3813k8022P4909R9540M4800n4218j01478l4661N6783N3060j778j2804l654
109H664j2969M783K5863l6848q9208L3243J75716N7154j77812j56023P0257J47999
$$ plain form
0 0 0 0 0 0 0 0 -1 8 -8 8 -16 16 -24 24 -32 40 -48 56 -65 80 -96 108 -127 145 -168 192 -217 248 -281 317
30 317 -357 400 -448 502 -559 623 -695 772 -855 949 -1050 1163 -1289 1426 -1579 1753 -1948
47 -1948 2170 -2425 2720 -3069 3487 -4001 4647 -5491 6644 -8322 10999 -15965 28253 -120951
61 -120951 -104622 209238 114877 -54426 -72922 1336 -31344 -22497 21296 9857 -35698 30066
73 30066 78946 -6778 -112815 -67503 30191 73916 76617 44276 -71691 -141700 -31900 129439
85 129439 106122 -41907 -85649 13537 73945 3859 -89129 -57155 70333 128786 39792 -83813
97 -83813 -111835 -36926 62614 107414 53196 -48282 -82943 -26160 26900 25122 12318 8664
109 8664 -4305 478 26341 -10507 -99715 -66472 109244 166398 -11414 -167437 -97180 50819
121E0819L6540m6142n0718l7444J3481N9027K6p1617j824R8319M0470q0011p4870
134f3944J461K7022M7500Q0975Q281j30585j07912P4384J41415R357r8712m4762
146e5520N2838N5082k5417p9508k6689P9350R7813p732j07561q4709K4871R6936
158A9754O3513k5109o8153l6208J2022L0067K3397o24k8013j2383M4134L9636
170F2033o1572j04989J9945J45602P1890r3257j19189j2145O8428O9643J9572
181F5961n0972o2973J7556O5982o281p1450j0874O9694M5653k1294m3251m3446
193d5695k8454M4745J05824L0009j04949r8098L7096R6314K0870n3600m0175J9225
205a6888N1420J4243o0308o7651K6363J02206M9606o4746r6362j9619O1290O3783
$$ plain form
121 50819 87359 41217 -9501 -46945 -33464 25563 25589 -46028 -47852 50467 90937 10926 -63944
134 -63944 -62483 -35461 12039 93014 101295 -29290 -137202 -62818 78597 87954 -10758 -55520
146 -55520 -2682 52400 26983 -52525 -79214 136 97949 90217 -17344 -102053 -77182 19754
158 19754 83267 58158 -9995 -46203 -34181 -4114 19283 18659 -9354 -21737 22397 62033
170 62033 461 -104528 -84583 61019 132909 39652 -79537 -91682 -23254 46389 65961
181 65961 14989 -47984 -30428 35554 29273 -42177 -53051 16643 62296 41002 -2249 -45695
193 -45695 -74149 -29404 76420 106429 1480 -96618 -59522 36792 57662 4062 -36113 -16888
205 -16888 34532 48775 -11533 -79184 -52821 49385 98991 34245 -62117 -81736 -20446 43337
217D3337J0806l4328m3855j7297K8072M1319o276n1102j2747O3345N2502m9712
229B4064r7941j2946R1009P8668j8012p9519n7062J7033P3205M2975m3122o0778
241d2426J5334N6947K447m8977k5883J9376L7848L4372r37o2316o7850K5054J02125
254D5114M4737o8432p8767P263N9385L0794k2076m2541r534M6773M5139l2671
266B5184p9048j5831P3096O8133j5630o9800m4146J6376N0807L7957j0689n1589
278a5180l1670L4412N3978r848o3718k2728N6657O1241j6345p5330m3788L6960
290c5359P3977K9974m5826o9938j0404O0435M6536k7699n0359k62L7656K1349
302C0080j1986l2708k8087J5556O0876L3700n1661p8703K41P8290N0391l4007
$$ plain form
217 43337 54143 19815 -24040 -41337 -13265 28054 21778 -29324 -42071 21274 73776 24064
229 24064 -73877 -86823 4186 82854 64842 -14677 -71739 -54706 18499 61474 18352 -42426
241 -42426 -27092 29855 32302 -16675 -42558 -23182 14666 49038 48101 -14215 -82065 -57011 45114
254 45114 89851 21419 -57348 -50085 9300 40094 18018 -24523 -34057 12716 57855 25184
266 25184 -53864 -69695 3401 71534 55904 -13896 -58042 -41666 9141 47098 36409 -15180
278 -15180 -46850 -12438 41540 31692 -32026 -54754 1903 63144 46799 -28531 -72319 -35359
290 -35359 38618 68592 22766 -47172 -57576 2859 49395 21696 -28663 -28925 8731 30080
302 30080 18094 -14614 -42701 -27145 33731 67431 15770 -62933 -62692 15598 65989 31982
314C1982o1261j5113L5994M1630k83m6857l3521L4844O1006j637o4319m0557K9654
327b8438N6752K2378k8064m8735k2777L0705N5159J1012n3856m6010K9568O2029
339C9723L866n7359l8559K7758N8218K0671m2413n9480n665N8219N1638j9417
351C7200o3429k4030M0817M4305n629l7065k3462J0163L6442K6791k4971n7417
363d0285j1277N9791N3195k6271o9847k2551M7457N2952k736m8179l5548J7757
375b5542N1179J9521m2797m8375J4581N5564K0892l3662m1685p096L0548L9296
387C2424O885m0305m5022J0819N9500K8927m4711n5880J0716N7891K6117l3575
399A3786m8570p884M3259M5848j0201n7625l0476L6599N3469J659m5900l2133
$$ plain form
314 31982 -29279 -44392 -8398 33232 32949 -13908 -47429 -12585 48421 46784 -17535 -58092 -28438
327 -28438 28314 50692 22628 -26107 -48884 -18179 36980 47992 -5864 -51874 -22306 39723
339 39723 43589 -13770 -52329 -24571 33647 54318 11905 -47575 -53240 4979 56617 37200
351 37200 -26229 -50259 -9442 34863 29234 -7831 -31293 -21130 15312 42103 17132 -40285
363 -40285 -51562 8229 61424 35153 -34694 -57245 -9788 43164 40428 -7751 -43299 -25542
375 -25542 25637 45158 2361 -46014 -31433 24131 45023 11361 -30324 -37420 -6872 32424
387 32424 39309 -996 -46018 -35199 24301 53228 8517 -47363 -36647 21244 47361 13786
399 13786 -34784 -42668 591 46439 36238 -21387 -51863 -15264 38205 39864 -6036 -38169
411c8169J5222L7616J9847j6286l9815j9930L4106N1720m686o0572l2940L9172
423a4715N6515J962n0214l9224J7143N1269K3633l3480n0626k697N0869L6915
435D7350k6222n0381q484L5700L2067k049l0836l0807N064M3316L0043k7909n4176
448c7324o881N2467M0805k5309n4495j2744L9651M1426l706m5273l3886K3296
460b1973N3209J1278m5374l8285J6379M3274J6604k3105l3790j0627K4541L7994
472C0125O522m2265m0475K0853N7247J3865m6586m2029J3698M7814K4220k7600
484A5389m7504q294M4237M0868j6746n2713j9011L7418M1449n285l7724k3908
496c1824J0597L2623K3169j6905m4214j4546M0342M3461j3349n2951k2183L6331
$$ plain form
411 -38169 -22947 14669 34516 18230 -21585 -41515 -7409 44311 39625 -20947 -53887 -14715
423 -14715 41800 43762 -6452 -45676 -28533 22736 46369 12889 -37737 -40434 10435 47350
435 47350 21128 -29253 -37737 -2037 30030 27981 -2855 -33662 -28598 14718 44761 16852 -37324
448 -37324 -44205 8262 49067 23758 -30737 -43481 -3830 37596 33890 -11383 -45269 -21973
460 -21973 31236 42514 -2860 -41145 -24766 18508 35112 12007 -21783 -32410 -7869 30125
472 30125 36647 -5618 -46093 -25240 32007 45872 -714 -42743 -29045 18769 42989 15389
484 15389 -32115 -40409 3828 44696 27950 -24763 -43774 -6356 35093 29808 -7916 -31824
496 -31824 -21227 11396 34565 17660 -26554 -41100 -758 42703 29354 -23597 -45780 -9449
508i449M5914j996m4037l1884J7477M6874J9354l5984m5953O841M9062K3103k8060
521A1262l6762l796K6636K7916J540k9576l1020Q420M4478K3458l4171m7416N335
534c3696M9291K6877k5907m3624j0842L5019M0827n675m8328k7197L0755M5707
546C3207M02m0754k6981J6467L4060J3301j8371l1694j2329K7384M0131j500m7099
559a3776l0455K7377M7400O608l9610l4877J2233M3089K0396k8529m2716j979
571c4839M4167L3382k3086m7913r070L5819L1814m397k9294k4645M878L3022K4063
584C3901j8674m0779p446L8856L3077j8978m5267j1831L4587L7746k265m1065
596h138l3342J7849M9577J5668l8129l6961J0961L6903J3756k0423k6346l674
$$ plain form
508 -9449 36465 34469 -9568 -41452 -23975 22899 42253 6269 -39684 -32843 16219 39322 11262
521 11262 -25500 -29296 -2660 25256 26796 -2780 -33800 -25380 19098 42556 8385 -39031 -33696
534 -33696 15595 42472 16565 -27059 -37901 -2882 37945 32270 -16058 -43255 -12500 33207
546 33207 33609 -7145 -34126 -17659 16401 29702 11331 -20363 -32692 -5308 34823 33323 -13776
559 -13776 -44231 -16854 30546 37154 -2456 -37333 -25100 17989 38385 9856 -32860 -34839
571 -34839 9328 42710 19624 -28289 -37359 -1540 30274 25877 -3417 -28062 -23184 9838 33901
584 33901 15227 -25552 -32998 5858 38935 19957 -25310 -37141 -2554 35192 32927 -8138
596 -8138 -41480 -23631 25946 41614 3485 -33476 -22515 14388 28144 7721 -18625 -22299
608b2299K2330K6537m30l5046l0630J8286M8909J5408l8255m1182N201M0400K6289
621C5518j7660l9304j0537L3124L2258j3739m2791j3803L4978L8110p165m0207
633a1218k4465J3651L4061K1474j3930l7685j6856K7949L6010n470l8402j7249
645c2130K8206L5094n343l9646k5463J9925M4593J8431l3396m7021r35M4048K8855
658C5218j8117l1926o776J8353J8706p54k1418j8574J2227L5839J3439l4577m2983
671d1343N493M8239L0673k0115m2904j7504K4808L6458J842l3969k0523K3030
683e815L1937n594l5802j9133K0992L5880J2105k2940l5566j3725K5815M0857
695B9011P441l6483l2078J3109L6054P848k9019k3616J6578L7340Q188l5391l8581
$$ plain form
608 -22299 31 26568 26138 -8908 -39538 -21252 27657 43065 4810 -36372 -31171 9229 35518
621 35518 17858 -21446 -31983 1141 33399 19660 -23131 -36934 -1956 36154 28989 -11218
633 -11218 -35683 -22032 12029 33503 19573 -18112 -34968 -7019 28991 23521 -14881 -32130
645 -32130 -3924 31170 25827 -13819 -39282 -19357 25236 43667 10271 -36750 -37685 6363 35218
658 35218 17101 -14825 -21601 -3248 15458 14704 -6714 -25288 -13061 22778 36217 1640 -41343
671 -41343 -35850 12389 43062 22947 -19957 -37461 -12653 23805 25647 -8322 -28845 -5815
683 -5815 26122 20528 -15274 -34407 -13415 22465 34570 11630 -23936 -37661 -11846 29011
695 29011 36452 -31 -32109 -19000 17054 24902 -4117 -27733 -11155 26185 34373 -1018 -39599
708c9599N477M6364L4190j8915m7086j7743K5005K9353L842j5640j6280j184J7091
721D875J3771j5257k9728R27M0933K9889k5119n2287j5443L7324M4747M431l6613
734B450l4523P617L5916J1792k5671j8917J7304K6109j559k6259k2100L350K7842
747C351K9825K47l6641l7171P184M4718K7234k1027l6548m749K7788J8240j9132
760C319l0627N574M1618K3710k9049m8957j0920L8773M2409L21l3828k6447J651
773b2453J8082J7061L026j4924j3272J0888K0647p431l4875j3200L6333M5222
785D5104l962n1748l9883J5911N1688K8076k5345m1910k987L0892J1441k1902
797d625j4445J5387K2001L843j5183k4396j5840J4579M0177K4149k4409m8592
$$ plain form
708 -39599 -34122 12242 46432 27517 -19569 -37312 -12307 17046 20888 5248 -11032 -12216 4875
721 4875 18646 3389 -26339 -25412 15521 45410 20291 -31996 -47439 -10115 34632 39063 2450
734 2450 -32073 -24456 11460 23252 -2419 -21336 -4032 22077 20518 -5741 -27841 -24491 3351
747 3351 33176 33423 -3218 -40389 -33205 11513 38747 17720 -18828 -23577 4211 22451 3319
760 3319 -27308 -21734 19884 43594 14545 -34412 -45332 -6559 35850 36171 2343 -24104 -22453
773 -22453 -4371 12690 15716 792 -12480 -1592 19055 11624 -23251 -36451 -118 45104
785 45104 41142 -10606 -50489 -34578 17110 45186 19841 -22069 -25056 5836 17277 -4625
797 -4625 -19070 -3683 18318 22161 6978 -17418 -33258 -18679 21498 45647 21238 -27354
809b7354j7021L2155L9644J298l1893j9415J8777K6401j1702l8917p013M2882
821G842L8886j5539n0038k6957K0757L9841J7769j3141k4007j5711J842J7808
833f48J4804p495j7133M815K3981L119l4092l0731J8882N3767K5311l5913n6871
846c8204j2200M3980M3219r059l8134q721K3428Q820j9172j3706J0253J9300J3076
859B2880j982k3030l0454l444L5752M0299k44m1837l7303Q154M0468K1506k2423
872H342k9321J1200L4838j794m4603k4009L4035M9195N673l9038l7582j311K7620
885f755K6105N799j2866j9978j0857R048J6647j83j5250j187K3622J6465k3570
898G040m4336q205M7601N0318r042n7990l5512K6231M5629M826k8740j0821J7359
$$ plain form
809 -27354 -44375 -12220 27424 28722 -3171 -22586 -3809 22592 10890 -28027 -35040 7842
821 7842 46728 31189 -18849 -45806 -25049 14792 32561 19420 -4587 -20298 -18456 -648
833 -648 14156 6661 -10472 -5657 18324 21443 -12649 -43380 -24498 29269 54580 18667 -38204
846 -38204 -50404 -6424 36795 27736 -10398 -19119 4309 13129 -6043 -19749 -9496 9804 22880
859 22880 20898 -2132 -32586 -36030 -278 40021 39777 -2060 -39363 -31209 9259 30765 8342
872 8342 -20979 -9779 25059 23265 -21338 -45347 -11312 37883 43556 4518 -33064 -34375 -6755
885 -6755 19350 25149 12283 -7695 -18552 -9504 7143 6960 -8290 -9477 14145 30610 7040
898 7040 -37296 -45501 2100 52418 43376 -14614 -50126 -23895 21734 26560 -2180 -13001 4358
911D358R214j3905j6075j162J3375K1208J3026j4133l4827k1439J7657M2427K4350
924D4074k1661m4704j5243L1188L2559j2267l3758L390L9295J1929m0144l8666
936d4008J3564M7206K6609j7695l8483k0223J1639K5518J6152k011j5640j4513
948a1885J693J3548L081j4554q367J9924K9008n367m5557l2648K6544N7308J8103
961E0831m0705m5049M215L6000J4467j7026j2680R811J2956k664j5624j5266J166
974a9568K2409K4928P35k7503l1516m886L0996L7723J392l8455k9175J7425L4464
987A8969k126l2929p563L4332K6076k1173m2141j3125K8665L8664Q747k6817l0962
1000b1383n109J8029J9493N871r884j4056j327J2593O070j5274j8337J0962L6605
$$ plain form
911 4358 13572 -333 -16408 -17570 -4195 17013 30039 15906 -18921 -40360 -22703 19724 44074
924 44074 22413 -22291 -37534 -6346 26213 13946 -19812 -16422 22873 34802 -5342 -44008
936 -44008 -30444 16762 43371 25676 -12807 -33030 -21391 4127 20279 18268 2628 -11885
948 -11885 -10192 3356 6437 -8117 -16484 3440 32448 27081 -18476 -51124 -24580 32728 50831
961 50831 10126 -34923 -30708 5292 19759 2733 -9947 -136 12820 10156 -5468 -20734 -19568
974 -19568 2841 27769 28504 1001 -30515 -35401 -4405 33318 34710 -3745 -32920 -15495 18969
987 18969 16843 -16086 -23649 10683 36759 15586 -26555 -39680 -11015 27649 36396 9579 -21383
1000 -21383 -26492 -8463 11030 16901 7017 -7039 -8366 4227 10297 -4977 -23314 -12352 24253
1013B4253J5373l4333m6224N36M7197L5273j6071m0481j3625K1371J9635n345
1025G559j4876j370J3377J1891o029k1977j4723J1833K8210J7081j1478l2547
1037a3049k2804J5195L9130J5895k6903l1288P108L0293N064k7744j7025K1111
1049e017L1717J939l0940k9967L820L4145K6489q948k9585j6938P724J9639J1660
1062A5738p067j6490l387J6231J2795j4264k7712j422L5373K9353j7280m4342
1074b2474j7300K7960L6846L663k7847k1778P716K0681N235j4040j2923O322J9913
1087A1974Q734j6072k4458n670K0990K8389O010k7206l2271K435L4627K1556j7474
1100A1564k8888K6K5517J2305j8561k3396L298K6843J9657j1228l1736j6236J8382
$$ plain form
1013 24253 39626 5293 -40931 -40395 6802 42075 26004 -14477 -28102 -6731 12904 7559
1025 7559 -7317 -8687 4690 16581 10552 -11425 -26148 -14315 13895 30976 19498 -13049
1037 -13049 -35853 -20658 18472 34367 7464 -23824 -16716 13577 18641 -9103 -26128 -5017
1049 -5017 26700 28639 -2301 -32268 -28448 5697 32186 23238 -6347 -23285 -15561 4078 15738
1062 15738 8671 -7819 -11206 5025 17820 3556 -24156 -25578 9795 39148 21868 -22474
1074 -22474 -39774 -11814 25032 28695 848 -20930 -13214 7467 12702 -1338 -14261 -7939 11974
1087 11974 20708 4636 -19822 -25492 -4502 23887 29897 2691 -29580 -27145 7482 29038 11564
1100 11564 -17324 -17298 8219 20524 1963 -21433 -18135 8708 28365 17137 -14599 -30835 -12453
1113a2453L0625Q030j8993k2708m099J7138J8403k927k1212r903J7720K2670o349
1126A5942l2151j5555K4689L4980J477l2369k6669P848L0186J6808j4333k4679
1138a3826m018J8513J4868p167j9533o836J6268K0874j5k3506k2046N998L1235
1151A0809K0924j7404l5013p430K7626K4361r000k6757q199J9706K0199n805k4262
1164a0245j2633J4764K6155O781k1941k4994J138K4052J9043n381k3086j5096
1176b1443J1702K5166M721k3460j9896J2421K9441O431k6918k5552Q870L0853
1188A2336J4893j6552k7388p090K0686K2749k888k2881j3040J1340K0077M654
1200A6896j6843j8819K900K3732J6773j2713l0013r968K5664K9360n735l2202
$$ plain form
1113 -12453 18172 26202 7209 -15499 -19598 -2460 15943 13016 -8196 -18099 -379 22291 15942
1126 15942 -16209 -31764 -7075 27905 29382 -2987 -29656 -21808 8378 25186 10853 -13826
1138 -13826 -17844 669 15537 8370 -11163 -17999 -1731 19143 19128 -4378 -26424 -20426 10809
1151 10809 31733 14329 -20684 -28114 -488 23873 14873 -11884 -20083 -377 19822 14017 -10245
1164 -10245 -22878 -8114 18041 24822 2881 -22113 -20975 3077 22120 16739 -6347 -21443
1176 -21443 -9741 15425 20146 -3314 -23210 -10789 18652 25083 -1835 -27387 -18517 12336
1188 12336 27229 10677 -16711 -23801 -3115 19634 16746 -6135 -19175 -7835 12242 16896
1200 16896 53 -18766 -15866 7866 24639 11926 -18087 -28055 -2391 26969 21234 -10968
1212a0968j5723J8664K6544J470k3423j8033R947K4593P936j7886k1608M88K2274
1225D275J7860p940k3884j2186J3003K3680P536j9622k4222L728K8469J4944j9199
1238F442k7832P28K8093J8518j4704k8025n948K1336K1836k736k3555j6139J0995
1251a0991K3564O803j6614j8751o4J8570J6613o249k4160j2305J7487K6817R92
1264B1712k8351k0877J4969L0610N774k4657k2175O486K6009J3507j5504k4643
1276a7140k662K1703J8073o664k1960j1442J2174K1639N699j7354k0648Q75K3565
1289E858J8408j2431k9283o944K5385K4024q534k9061j2143J9407K5197r99k4205
1302e321j6321J0384K3578Q028j6983k0781R25K0253J4587o719k0111j1557J1733
$$ plain form
1212 -10968 -26691 -8027 18517 19987 -3436 -21469 -11522 13071 21007 3121 -18487 -17999 4275
1225 4275 22135 14195 -9689 -21875 -8872 14808 22344 2722 -21500 -17772 10697 25641 6442
1238 6442 -21390 -20662 7431 25949 11245 -16780 -22728 -1392 20444 17708 -5847 -21986 -10991
1251 -10991 12573 19376 2762 -15989 -16053 2517 19130 12881 -11279 -23584 -6097 20720 21712
1264 21712 -6639 -27516 -12547 18063 23837 -820 -22995 -16509 9500 23007 7503 -17140
1276 -17140 -19802 1901 19974 13310 -8650 -20092 -7918 13721 19420 2066 -18582 -17707 5858
1289 5858 24266 11835 -17448 -24392 993 25017 16483 -12578 -24721 -5314 19883 18884 -5321
1302 -5321 -21642 -11258 12320 20348 3365 -17416 -16491 3762 18349 11630 -8481 -20038 -8305
1315h305K3641N819k2000k2435P484K8590J1939k1004k5936L681K7171J4950j4682
1328H913k4955m952K0819K0808n474k3920j1533J3218K0175M431j5626j8105O75
1341a5526K0102J5895q955k4631r438K0100K5137l868k8635j5532J7225K7053
1353A8927K745k4228k0138R164K6046R248j7767k1502P21K0877J5435q528k1204
1366a0204q375J3359J9216L755j7430k0016L432K5378J4638j6387k6677j848K5579
1379D420J9627j1674k7329p553K0421K1928l193k3644j4400J2719K2971L762j8073
1392a8j6196L092J7543J3132o586k0718j0397J4903K3172J689k3677j9338J1250
1405a2149K7613P437k2099k2054N824K5420J2922j6155k4455j315K2513J7160
$$ plain form
1315 -8305 15336 21155 -845 -23280 -15796 12794 24733 3729 -22207 -18526 8645 23595 8913
1328 8913 -16042 -20994 -175 20633 15159 -8761 -20294 -7076 13099 17530 1904 -16201 -15526
1341 -15526 4576 20471 11516 -13115 -22553 -2453 22684 18816 -9819 -25351 -8126 18927
1353 18927 21672 -2556 -22694 -13530 12516 21764 3997 -17505 -16784 4093 19528 11000 -10204
1366 -10204 -18579 -5220 13996 17751 321 -19695 -16263 9115 23753 7366 -19311 -21159 4420
1379 4420 24047 12373 -14956 -22509 -2088 19840 16647 -6997 -21397 -8678 14293 18055 -18
1392 -18 -16214 -13122 4421 17553 10967 -9751 -20148 -5245 17927 19616 -4061 -23399 -12149
1405 -12149 15464 22901 802 -21252 -15428 9992 22914 6759 -17696 -19011 3502 20662
1417B0662q232k1677r928J2737J9838L633j6233j6864J911J9307J4455j0225k4206
1430a4822o103K2054K1384p791k7211j1796J8464K5375M11k4110j7798R542K3666
1443A1265Q214j6664j9537K791J9741J0828r520j7537o484J2573J9690K922k0364
1456b082j9762O789K5773J2498j6644k4526o28K3093J5913j1213k3117m929K0164
1469A329J9260p230k4449j0277J5498K1048L033j6803j7611P52J8292J4403o433
1482A0812j9488q961J4098K0009j724k3270j3511J5811K5185K056k4207k0984
1494b4174Q123K7039J2403j5744k2771k559J8450J5293o314j7980n975J2392J4883
1507A3066j07j6162j5529N812K3964J3174j6333k6383l848K2711K0697o094k3487
$$ plain form
1417 20662 12430 -9247 -19175 -6438 13400 17033 800 -16064 -14153 5154 19609 9384 -14822
1430 -14822 -20925 1129 22513 14722 -12489 -24285 -5821 19554 19965 -4145 -21943 -12401 11265
1443 11265 19479 2815 -16722 -13931 5810 16638 7118 -10419 -16903 -4330 15360 18282 -2082
1456 -2082 -21844 -15055 10718 23216 6572 -17954 -18582 4511 20424 9211 -13906 -18835 1329
1469 1329 20589 13359 -11090 -21367 -5869 15179 18212 1409 -16202 -15450 2842 17245 10812
1482 10812 -8676 -17637 -3539 16470 14746 -8524 -22035 -6224 18961 21017 -3190 -24174
1494 -24174 -16051 10988 23391 7647 -15124 -17683 767 16060 9746 -8234 -14209 -1817 13066
1507 13066 12959 -3203 -18732 -12920 11044 24218 7885 -18498 -22346 365 21062 14968 -8519
1520h519j0089J4834J8540k202j9882j1042J3593K1368J233k0649j7065N104K0451
1533E675J4334o823k1328j1848J1693K0454M015j6797j5135P316K0652M562j9806
1546c036j8254Q397K5878J1737j7404k6194l516K2012J9706m175j9417j0989Q091
1559g164J5017L074j1594j0869M137J5817R048j2512k3058l974K4396K3566o860
1572A9024k8602j5582J4517K4568M491j8232j4809P053J6975L154j5462j3683
1584a6588P176K0116Q654j2338k0074p935J3011K2657P418j7790k1845P14K0401
1597C577J2673j0939j7955J271J9957J0213j5872k2654k03K4335K0314p989k6037
1610i309j3332J1946J9897O625r676j3346k593R475Q589m013j2308l660J4139
$$ plain form
1520 -8519 -18608 -3774 14766 12564 -7318 -18360 -4767 16601 17834 -2815 -19880 -14776 5675
1533 5675 20009 13186 -8142 -19990 -8297 12157 16172 -625 -15760 -8444 12208 16770 -3036
1546 -3036 -21290 -12893 12985 24722 7318 -18876 -22392 -380 19326 15151 -4266 -15255 -7164
1559 -7164 7853 10927 -667 -11536 -7399 8418 17466 4954 -18104 -22078 2318 25884 19024
1572 19024 -9578 -25160 -10643 13925 18416 184 -14625 -7572 9403 12557 -2905 -16588
1584 -16588 -9412 10704 19358 7020 -13054 -20989 -7978 14679 22097 4307 -17538 -16824 3577
1597 3577 16250 5311 -12644 -11373 8584 18797 2925 -19729 -19932 4403 24717 16728 -9309
1610 -9309 -22641 -10695 9202 15827 6151 -7195 -9788 -313 8276 4263 -8045 -11705 2434
1623B434J7018m923k6440j5790J7323L0397O614k3695k4175L349K2828J1520j1750
1636D710j4807K690J4524M808j2146j4330J533J6217J4132j548j7338j8849N00
1649a9904K3146K0080p611k4760j0307J5036J7599m268j8945m469J8904J6586
1661B1087j0525k6397r413J9910K5645J736k0595j7844R11J3557J2047Q66r869
1674A116q738L046J0027J596j1989j0287R981K2938N567k4205k6322N026L0854
1687H610J9347j3686k7204o840J7447J4321o286j3057M58J2586O602q609j4427
1700a0738m768R767J6399R484r470k3300j2492J5572K6094M862k0323j7761O829
1713i845J9266K450j8720j1205J5943K3387j780k6919j9111J1219K6223J1320
$$ plain form
1623 2434 19452 14529 -11911 -27701 -10378 20019 26633 2938 -21237 -17888 4940 16460 4710
1636 4710 -10097 -7407 7117 11925 -221 -14551 -13018 3199 17331 15783 -1555 -20404 -19904
1649 -19904 3242 23322 15711 -9049 -19356 -4320 13279 9011 -9934 -14403 4501 21087
1661 21087 10562 -15835 -25248 -5338 20307 22043 1448 -16396 -15485 -1928 10119 10985 1116
1674 1116 -7622 -4576 5451 7047 -4942 -15229 -5248 17690 23257 -948 -27270 -22244 8610
1687 8610 27957 14271 -12933 -19773 -2326 11995 5709 -7348 -6890 5696 12298 3689 -10738
1700 -10738 -15506 -5739 10660 20144 10674 -12626 -25118 -9546 16548 21410 1087 -16674 -9845
1713 -9845 9421 11871 -6849 -18054 -2111 21276 19496 -7423 -26534 -15315 10908 22228
1725B2228j1526j7237p661M818J1671P729m061r983j687R138O062r723j5907J879
1739a4260K4285J7603j5010l1807r853K3699K7482j218k4036j3478J0488J3942
1751G837k377j1468k133J0437R679k720j2873j1027N24J4251J7733K004k0352
1764d85k1625L235K3942J5199j0859k0217j635J7670Q832j5771j7817Q472K6114
1777A5055R818k0027k5095j328K0204J7261m65j2287j2165k568Q307R976J56q671
1791a829m289P563R886m952j8916q391J8917K6068o47k8639k2019J0564K7909
1804A1225R786j6140j5997L570J2348J691r607o490N742J1786N154p440j4242
1817h614q892P201J9946J2372j1360k3524q170J5969J9448j375j8156p883J4253
$$ plain form
1725 22228 10702 -6535 -14196 -9378 2293 10022 5961 -4022 -5709 3429 9491 -232 -16139 -14260
1739 -14260 10025 27628 12618 -19189 -29042 -5343 22139 20921 -3115 -16593 -6105 7837
1751 7837 5460 -6008 -8141 2296 11975 9255 -3618 -14645 -14121 130 17863 19867 -485
1764 -485 -22110 -18875 5067 20266 9407 -10810 -12445 5225 14057 -1714 -19531 -11059 15055
1777 15055 24873 4846 -20249 -21577 -1373 15888 15423 3136 -9029 -11597 -3290 6686 6842 -1829
1791 -1829 -6118 1445 11331 6379 -12537 -20928 -2011 24057 23410 -5229 -27248 -16684 11225
1804 11225 21011 4871 -11126 -7556 4792 6483 -3124 -9614 -3872 7914 13068 5628 -8614
1817 -8614 -17506 -10305 9641 22013 10653 -12871 -21041 -5072 14376 13001 -5155 -13038 1215
1830A215J3922r771k1214k347K1515J8895o610k3029j2797Q585J7355Q958m996
1843I681j2594p637M453J0224K519p548o775N450J3368K015j7874j7355Q580K7211
1857A3718J2390j8244k6088k481K1022J5705o882j4960k591R565O567n283j0291
1870g853k213R902J1898J279j2391j5421k148J6377J8383j181j9935j4712P642
1883a0373J8972M683j4836j1638R960J6665j690j9174j1532J1117K0453O246j4187
1896D666j7337k979J2080J3773K155j0560j0606J448J0287N076p052j0318J725
1909g642J5321R441j2546k1408k354K1331J8935o243k2281j0689J1633J6148Q53
1922A0499j1487p460M907R986J668r920r657L018J3567R845n476j7241j0550R837
$$ plain form
1830 1215 15137 5366 -15848 -18195 3320 22215 15605 -7424 -20221 -11636 5719 14677 9681
1843 9681 -2913 -10550 -6097 4127 6646 -902 -7677 -2227 11141 13156 -4718 -22073 -13493 13718
1857 13718 26108 7864 -18224 -20705 317 16022 9140 -5820 -8411 1154 7721 2438 -7853
1870 -7853 -10066 -164 11734 13013 622 -14799 -16947 -570 17813 16632 -3303 -18015 -10373
1883 -10373 8599 13282 -1554 -13192 -3232 13433 11743 -7431 -18963 -7846 12607 18853 4666
1896 4666 -12671 -15650 -3570 10203 12358 1798 -8808 -7360 2927 8003 951 -9367 -7642
1909 -7642 7679 17120 4574 -16834 -19188 2143 21078 14835 -7446 -18135 -6502 9646 10499
1922 10499 -988 -8448 -3541 6445 8113 -1807 -11464 -8446 5121 14966 9490 -7751 -18301 -8464
1936h464J9654O311j4507j6690J807J6759Q251j1462j3819M057J6315O113j2046
1949B279j5820n09J5555J3757l228j5432j0669M541J4109P863p062j2529k187
1962i332J0352R312m966j4140m148J4224J5342n131k0391r936J2696J9224K836
1975A5942j5531j3614L640J3697O358p103j0512q42J0130Q213m860j2884n393
1988a2759R336J4843L120j4279j5768K616J8185J0866r610j7042k324J4682J0983
2001A2849p329j4810k088J2555J1400l641j4591q554P812J4818N068r770j3630
2014i911k175J1673J1943k773j3802o993R078J3834n3j5351j0778R541J7839K666
2028A4738j5714j3817M338J6155Q300q536j3722k549J0011J0051j601j1203p088
$$ plain form
1936 -8464 11190 17501 2994 -13696 -11889 4870 13121 1659 -12160 -8103 8212 14325 2279
1949 2279 -13541 -14050 1505 15262 12034 -3398 -14067 -9526 4583 12446 5384 -7145 -9332
1962 -9332 1020 10332 5366 -8774 -12922 1302 16644 11513 -8878 -18814 -6118 13106 15942
1975 15942 411 -13203 -9563 4134 10492 3389 -7123 -7965 2165 10378 5518 -7366 -12759
1988 -12759 -3423 11420 14540 261 -15507 -12891 5294 16160 6550 -10492 -12816 1866 12849
2001 12849 5520 -9290 -11378 1177 12577 8936 -5655 -14209 -6397 8421 13489 3719 -9911
2014 -9911 -12086 -413 11530 8757 -5045 -12038 -2960 10874 10821 -4530 -15308 -5767 12072 14738
2028 14738 -976 -14793 -10455 5700 14000 5464 -8258 -10807 -796 9255 7654 -3549 -10637
2041a0637O490J2260K762j0854j1933J591J4973J0665q467j7839l759J4966J3954
2054A4172m663j6451o624J1168J3414j567j3401p952O681J2911L888r825j2099
2067a0348K16J1850R867l339j3218p703P983J4564K184j3448j1961N290J6238
2080H175O081j2913j4856L048J6428Q240r415j4524k034J2075J0888k916j2407
2093d130o781O105J1736L639r147j1388O13J2218R196n400j4545n575J2038J4823
2107A3402k703j6909q637J0591J5558O70j4321j0682O023J4111M491r440j1540
2120i386p0J1007R050l854j1767n655O841J1964K902j0865j2331K734J5502Q267
2134A4339j0099j5754j063J5388J1613p293j6092l758J2377J1804k773j3152p183
$$ plain form
2041 -10637 -4147 8113 10875 21 -11912 -10321 4652 15317 6850 -10989 -14748 218 14172
2054 14172 9509 -6942 -13566 -2398 11016 9449 -3952 -11904 -5223 7688 11576 1751 -10348
2067 -10348 -10132 1718 11585 8246 -4972 -12675 -4692 9872 12056 -1392 -13353 -8063 8175
2080 8175 14256 1343 -13513 -10465 5963 14203 4788 -9736 -11770 305 11193 8277 -4130
2093 -4130 -10911 -4806 6930 10569 1422 -9966 -9353 2865 12061 6661 -7884 -13459 -1421 13402
2107 13402 10699 -6210 -14847 -4256 11302 11972 -2349 -13031 -7008 7103 11594 2154 -9386
2120 -9386 -9456 1551 10601 6747 -5020 -10675 -3834 8130 11032 167 -12164 -9430 6072 14339
2134 14339 4240 -11514 -12577 2811 14424 7131 -8961 -12719 -342 11462 8689 -4463 -11646
2147a1646P235J2266K471r641j0223N74J1054R173m203j3082o138Q792J3358J173
2161A1163j3599j1254O764J6424L636j3670j2684M434J5232O699r761j3502m91
2174a0609J1980R386l654j1526n924O425J0940K293q790r720Q49J1725Q978o667
2188E686j5033l533J3407J3037m193j6188p205J0916J4508p92j3879q779O550
2201e498J2792L240r691j0470J647J0939P262m488j1224n479P377J2375J958j1577
2215h37j1001L647J4450O968j0437j4731J142J5293Q914q462j4395k255J2216
2228E12J1158l657j3094o120P296J1200K233q853r507R88J0399P564m248j1832
2242e961n487R087J3217l49j4519r461Q229J4928K516j3109j1625M708J4550N283
$$ plain form
2147 -11646 -4411 7855 10326 685 -9538 -8964 2090 11263 7060 -6022 -12160 -3368 9990 11163
2161 11163 -2436 -13690 -6926 9498 13134 -536 -13220 -8786 6446 13145 3384 -10118 -10609
2174 -10609 1371 10757 7103 -4423 -10347 -3922 7018 9311 521 -9199 -8350 3375 12353 5686
2188 5686 -9347 -12880 527 13564 9371 -6817 -14022 -3106 11402 10610 -3269 -12048 -5498
2201 -5498 7294 10534 843 -9627 -7980 2959 10221 5733 -5491 -10970 -3593 8782 10740 -837
2215 -837 -11838 -8191 6259 13227 2790 -11941 -10799 4494 13408 4946 -9449 -11704 512
2228 512 11670 8013 -5081 -11201 -3905 7295 9528 675 -8832 -7844 2555 10119 5871 -5961
2242 -5961 -11448 -2361 10856 10507 -4012 -13473 -5244 9684 12200 -909 -12534 -7826 6724 12007
2256A2007r740j1777M50J1234Q195m561j1057m414O718R958K077q673j0111J620
2270h074J2434P592p755j3651k167J3076J1703n335j5643n183J1460J2649j751
2283I355j3107p856O966J2095K098r616q865J978J0150O521m822j1001m254P966
2297b392J1460J193j1618j0727M516J4622N299j0886j2444K139J3597P394q545
2310C608j3172q55J2362R555m635j2446n475P487J1072J812q638q742O73R334
2324A940P345m396j1568l418J0230J0940l186j3958p221R670J4688P59j4031j0521
2338a2727N411J3422M807q673j0510P75J0040O029m900r334k920P438J0008J83
2352I049j1027r658L767J3539P372q517j4117j432J2684R545n615j2408k835J0179
$$ plain form
2256 12007 2267 -9510 -9060 2174 10369 5808 -5249 -9663 -2945 7013 9090 417 -9694 -8074
2270 -8074 4360 11952 4197 -9454 -11621 1455 13158 7823 -7820 -13003 -1543 11106 9355
2283 9355 -3752 -11608 -4642 7453 9551 -65 -8930 -6952 3198 9719 4897 -6104 -10358 -2392
2297 -2392 9068 10261 -1357 -12084 -7568 7054 12353 1467 -10977 -8838 4759 12153 3608
2310 3608 -9564 -10419 1943 11498 6863 -5583 -11058 -3571 7501 9313 675 -8067 -7394 1940
2324 1940 9285 4889 -6679 -10097 133 11073 7887 -6071 -13292 -3622 11066 11825 -2206 -12727
2338 -12727 -7316 6106 10913 2240 -8270 -7495 2545 8574 3674 -5660 -8580 -1142 8866 9049
2352 9049 -1978 -11636 -7869 5670 13042 4525 -9592 -11024 1660 11205 5590 -6818 -9653 526
2366E26R866l715j2738n348Q750J1781J465j0363j0360J141J0857P989l250j0422
2380c821n500O358J0425K22j1015p146P185J2432J584j2429j1419M358J5131P090
2394A3455q900j3164j954R955Q994k239r259l997N460P571K00p967p464L342J2055
2409F088O314q337j4010k967J2301J3103k382j4374p395Q171J1173m36j0060n891
2423h702O421J0395M93j0629q762L222J1507P690m623j2172o480O339J1851L670
2437A0220q747r965K057J1405M013r655r867M084J3531O019r969j4442j336J3020
2451C68J1521k607j1586p229L961Q919L194n267o153O54P043M832n305j0858k080
2466a0593J1823J2156l020j5606r870P901J5676L947j1141j0173L026R763K805
$$ plain form
2366 526 10392 6677 -6061 -11409 -2659 9122 10587 224 -10136 -8995 1862 9851 6601 -3821
2380 -3821 -9321 -2963 7462 7684 -3331 -10477 -3292 9140 10724 -1705 -13124 -8766 6365 13455
2394 13455 4555 -8609 -10563 -608 8386 6147 -3112 -7109 -1649 5922 6122 -1845 -9309 -5967 6088
2409 6088 12402 4065 -9945 -12912 -611 12492 10110 -4264 -11659 -3488 7685 7249 -2811 -8702
2423 -8702 -2281 8114 8607 -2022 -10784 -7562 3945 11635 7012 -5160 -11640 -5301 6550 10220
2437 10220 1473 -8492 -6435 4970 8983 -672 -10539 -6455 7076 13095 3126 -11316 -12652 368
2451 368 11889 9282 -2304 -9533 -5572 3347 6541 1274 -4879 -4225 2818 7650 2345 -8513 -10593
2466 -10593 1230 13386 10366 -5240 -15110 -7209 8467 12414 1273 -8900 -5874 3889 6694
2479F694p309o955L319R878L968p001j0370k988P851J1672L112r691j2164p46
2493a0730J1411R672m181j1896k466J0415P385p233j2218k97J3207J0876n399
2506H546j5321p040Q386J2421L338o990q551j594N546N553o49n801l208N240Q245
2521H121j277j2412q150Q491J6384M153j3599j5234J453J4975Q767o655j0548
2534e531l59P769M125n173p285N19Q290O587k060r349q242J723J1820R909l808
2549H935j3694p618P396J2543R46j1146o038Q261J0165l433j3588o009J0414J4700
2563A1834R90j3257j1130K058J0396P168j443o938n149J377N676K828m289o037
2577e916K216J0335M208j0504j3753J323J6359J2027o929j7295o028J0942J1659
$$ plain form
2479 6694 -615 -7570 -4251 5627 9595 2594 -7776 -10764 -2913 8759 11871 2180 -9984 -10730
2493 -10730 681 10353 6172 -5724 -8190 2225 9610 2377 -9841 -10138 3069 13945 8546
2506 8546 -6775 -13815 -5429 6992 10330 3340 -5211 -6805 -1259 4294 3645 -2156 -5364 -124 8121
2521 8121 6844 -5568 -13718 -5227 11157 15310 1711 -13523 -12070 2905 11672 5017 -5531
2534 -5531 -5890 1879 6004 831 -6454 -5935 2355 8942 6882 -2467 -10709 -8986 2834 12743 8935
2549 8935 -4759 -12377 -4981 7562 8508 -2638 -8676 -415 9750 6317 -7271 -13280 -2866 11834
2563 11834 12824 -433 -11563 -9505 891 8059 6616 -322 -5471 -4094 1582 4410 121 -5916
2577 -5916 -3700 6635 10843 339 -13414 -12091 4268 16295 9366 -7929 -13957 -3015 8644
2590H644j900r344l040O023N445k908p533k790N188Q142L587n299j1080n651P761
2605d755J3657L949j0822j2223J302J2248N652q629r113M688J2109K160j2093
2618a870j1404M147J4853P651p445j2029m090N645Q234L356l821o304j818M629
2632b66M786k485p862j290J0174R289n610j5564o470J1583J6224R75j4698j0837
2646a2051N307J1572K268p315n139L649O616M37o500n988R13P396P972k6j0287
2661a176j0351J879J2774Q964n353j2861l623R836Q405n278j0773J10J1581P681
2675A1815p431j3755k911J1066J1324m67r400p997K63P106O266q21o224l896L453
2690a609O428j46q627n633P271J2568J292j3227j2238M160J5676P627r012j2316
$$ plain form
2590 8644 6744 -2600 -5640 383 5828 2920 -4613 -7403 -2215 5927 9514 4215 -6865 -12516 -4755
2605 -4755 8902 12851 2029 -10194 -8892 3356 9008 379 -8734 -4046 8063 10223 -1870
2618 -1870 -13274 -9127 5726 13377 5932 -6097 -10187 -4542 3692 7048 3227 -3077 -4895 -266
2632 -266 4520 2035 -5827 -7117 3057 12346 6736 -8828 -15298 -3715 12509 13484 -1214 -12051
2646 -12051 -6744 4828 7096 -219 -5358 -1709 4907 5344 -1156 -7144 -6231 1165 9137 9111 -1176
2661 -1176 -11527 -9648 3126 12090 6737 -6124 -9747 89 8494 3216 -7557 -7447 4134 11815
2675 11815 4384 -9371 -12282 -1216 10108 9641 241 -7756 -7493 -387 5879 5058 -1166 -5062 -1609
2690 -1609 4819 4673 -3954 -9587 -2316 10252 11544 -1683 -13921 -9761 5915 13542 4530 -7786
2704g786m48R194N534m107o725J1O425M544k968p677m543L979J0094N606o482
2719D651j2223l937R225J1483k36j1342o998O724J0059j298j0900m879Q342J1059
2733I730n55j1905q638M315J1048N728m217r093m613M589P732J946n669o052J823
2748c831Q219L278p973r487K405J2715P398p807j4059k885J1505J0888k686j0790
2762c110m627N302P215J81o546m458L498P358K564n931q735j548Q877R834j289
2777H585j1325q087M871J1765L709q880r067L217J0377K790q526q444K890J0815
2791D690N362o497j0363k471P223Q875J202p649p619J288Q178M887m388q296j204
2806f782Q632P270m770j1453l125R892J0739j718j2103p388O006J0786K238p285
$$ plain form
2704 -7786 -8234 960 6494 2387 -4338 -4327 2098 6642 3674 -4003 -8546 -4567 5527 11133 4651
2719 4651 -7572 -11509 -2284 9199 8963 -2379 -9377 -2653 7406 6108 -4792 -9671 -1329 9730
2733 9730 9175 -2730 -11368 -7053 3995 9723 5506 -3587 -8200 -3611 4121 6067 398 -5654 -3831
2748 -3831 4388 7666 -307 -9794 -7389 5326 12724 4917 -9142 -12027 -522 10366 7680 -3110
2762 -3110 -7737 -2435 4780 4961 -1585 -6043 -2545 4813 7377 1446 -7289 -8837 40 9874 8585
2777 8585 -2740 -10827 -5956 5809 9518 638 -8429 -5212 5165 7955 -571 -9015 -6125 4690
2791 4690 10052 3555 -6808 -9279 -2056 6819 8021 372 -7247 -5959 2219 7106 2718 -5578 -6782
2806 -6782 1850 9120 4350 -7103 -10228 -336 10403 8685 -3418 -10806 -4800 5986 8224 939
2820I39p136J240P110M284l996p300j517O477P332r68r325o935M770J1211M089
2835A0275q492j0387L35J0724O846n750j0152o46Q927O442m221r247k881O998
2849a229Q472j54q138o803J785Q712N585m296r076k649P096P964j221r533n500
2864h985O640J0404N1j0563p509N047J1026L394q205r110J072Q737N456l560p698
2879c803k852N305P096K19p174o144K731Q941M461o594r942m46R988P884m265
2894E405j1016l677Q547R200k336j0004m344N995Q249O84p437o423K152P922M361
2909G278m070q026k724O342Q110m01q720o309M313J0029K850q672r026K913J0931
2924D818M375p326r349K53R243O295m232q934k415O082P037K45o806o165K022
$$ plain form
2820 939 -6197 -4957 2153 6437 2441 -4859 -6376 101 7433 6465 -2860 -9795 -5025 6186 10275
2835 10275 1783 -8604 -8269 2455 9301 3551 -6601 -7247 1680 8122 3901 -5346 -8227 -1229
2849 -1229 7243 7089 -1049 -7852 -6067 2645 8230 3934 -5142 -7791 -695 7269 6048 -3485 -8985
2864 -8985 -2345 8059 8110 -2453 -9962 -4915 6111 9505 1300 -7810 -6738 1999 7455 3895 -3803
2879 -3803 -6655 -1350 5746 5965 -1209 -7353 -4622 4319 8780 2186 -7756 -8202 1786 9670 5405
2894 5405 -5611 -9288 -741 8459 6123 -3881 -8225 -2230 6019 6703 -734 -7157 -5005 2917 7278
2909 7278 3208 -4818 -7542 -1200 6910 6509 -2211 -8520 -4207 5822 8672 0 -9026 -6113 4818
2924 4818 9193 1867 -7482 -7229 2014 8309 4077 -4857 -7272 -1190 5847 6092 -714 -6879 -4857
2939d857P995M366m613q495j996P742Q195k402j0396m724P016R911j00j0125o891
2954i374N329J0197J877p924p290J550P873M849l693p593k269N270O668L27o802
2969a005o353K684R031L938o540r250q0R896P224n101j0850k049Q765P738k703
2984E345r035l934N858P768L5p203n336K132P246M180l910p920k323O175P542
2999F620k10q335o326M188R954K150q537p846L006J0023M065p329r138Q94R140
3014B319N483l925q063k846N251P018M63o293n485J732O919M169m189q226j544
3029g217P844P607k688j0140m776P281J0033m49r980o050M975Q815J806p089o578
3044f606J901P606L690m079o817j970N318O864J88p327o051K548Q710M241o238
$$ plain form
2939 -4857 3138 7504 2891 -5604 -7600 142 8337 5935 -4461 -9185 -2169 7742 7642 -2483 -9374
2954 -9374 -4045 6152 8029 105 -7185 -5635 2238 7087 3394 -4199 -6468 -1198 5470 5797 -1005
2969 -1005 -7358 -4674 4357 8295 1755 -7495 -7575 2321 9545 4444 -6406 -8455 310 8048 5345
2984 5345 -3690 -7624 -1766 6002 6037 -1166 -6502 -4370 2876 7056 3146 -4774 -7097 -922 6620
2999 6620 6410 -1925 -8251 -4063 5891 8041 -496 -8342 -5336 4687 8752 1423 -7715 -6821 2319
3014 2319 7802 3877 -4186 -7032 -1781 5237 5700 -593 -6078 -4346 2573 6742 2553 -5673 -7217
3029 -7217 627 8234 5546 -4594 -9370 -2089 7944 7495 -2485 -8535 -3560 5255 7061 -28 -6606
3044 -6606 -4705 2901 6591 2512 -4305 -6275 -957 5907 6095 -1232 -7283 -4735 3975 8216 1978
3059A978r076K11R583N915n493r456j215Q597P265l512r332l208O149P350K98
3074F054o620n707J684P014L857l599o873k190N496P220n87q498n505M961R391
3089F098J892q533q190L064J0142L862o864q257O32P939N308l677p622k110N454
3104h62O034J0n872n438J682P394M222m564q073j657P403P681k434r971m078P202
3120a321Q863j043r193n351M967Q684J233p207n942J922O824L859l594o806j946
3135f051N210O286J31o615n928K491Q653L711o674q300O96R027N672n226r249
3150f166j063Q340O552l237q503l130N587P336K20o588n333J770O330L920l095
3165B940p011k259N846O763j057p953m999M903R251J251q894p172L522R334L566
$$ plain form
3059 1978 -7098 -6887 2696 8611 3118 -6338 -7553 1044 8309 4797 -4535 -7743 -1594 5756 6054
3074 6054 -566 -6273 -4589 2425 6282 2683 -4190 -6380 -884 6336 5749 -2749 -8254 -3293 6098
3089 6098 7990 -543 -8733 -5669 4473 8335 1471 -6786 -6154 1785 7093 3416 -4206 -6316 -862
3104 -862 5172 5182 -690 -6128 -4446 2948 7170 2606 -5467 -7124 279 7960 5526 -4445 -8523 -1321
3120 -1321 7542 6499 -2694 -8045 -3078 5606 6839 -368 -6310 -4388 2436 6295 2701 -4105 -6051
3135 -6051 -841 5445 5576 -1039 -6967 -4476 4177 7888 1214 -7086 -6390 2637 8309 3083 -6166
3150 -6166 -7229 1111 7663 4426 -4077 -7207 -1620 5716 5936 -652 -5985 -4215 2115 6035 2940
3165 2940 -4071 -6330 -484 6279 5222 -2731 -7730 -2827 6424 7675 -1219 -8391 -4869 4465 8031
3180H031o454p874M61P596M637l540o609j756M889N693j85o261m888K282P249
3195C271M030m753q462j452P905P180k872q898l344O352P561j239q398m200N422
3210a897P697M59o955o128J934P449M111l513o734k466M371O440O08o389n240
3225f253L155P489K111o639p316J923R535M736o180r122r21P732O788k083p710
3240b755l376M373N904K66n209m299J848O385L020m593p144j181O894P628j536
3255F225r254n508N273Q758J064p107n767L049P464J648o564n708K306P432L709
3270G020m272p535k197N531O951O66o077o015J183P146L658m590o660O38P358
3285B805M237m944q579q34Q505P209k867q904m253M521P381J710n265n056Q01
$$ plain form
3180 8031 1577 -6297 -5836 1760 6397 2857 -3752 -5508 -619 5074 4889 -1372 -6260 -3978 3271
3195 3271 7301 2548 -5914 -7366 539 7719 4847 -4051 -7395 -1043 6518 5279 -3119 -7319 -1897
3210 -1897 5800 6259 -696 -6824 -4890 2559 6670 3157 -3577 -6043 -1672 4768 5376 -1013 -6253
3225 -6253 -3098 4391 6502 -137 -7453 -5530 4005 8741 2561 -6561 -7482 250 7038 4955 -2755
3240 -2755 -6131 -1758 4146 4412 -797 -5096 -3248 3137 6157 1564 -5580 -6761 133 7761 6225
3255 6225 -3029 -8537 -3264 5494 6558 -549 -6316 -3267 4197 5845 -719 -6427 -4121 3311 7020
3270 7020 2748 -4787 -6984 -1453 5498 6164 87 -5928 -4745 2401 6059 1469 -5191 -4553 2805
3285 2805 7042 2098 -6481 -7315 1190 8399 5532 -3372 -7625 -3104 4277 5987 722 -4334 -3533
3300c533M954K941k757n462j008N809N707j945q317m964N155R676K289q061p876
3315g392J793Q113L610m487o161M81O281L273m159o210o36N594O064l88o824n984
3331g032J658P503N079l236p755k501N877N939k292p122j811O468O527k698r161
3346d557l906O268Q569R45o841o428N93O122M165j887m719j960K867M205j64n501
3362b229l752M030P753J661p675q329J642R885N981n144q790j402O224N130k221
3377B764n690j114M829M117k032n609l281L064O704L379m138p723k817N566P744
3392E763N95p242n428L705P006P7o848m131M815Q045M72q361o682K954Q298M164
3408G202l540o689k549L399M914R47l219l525Q00M609K172m595o062J212Q307
$$ plain form
3300 -3533 1421 4362 1605 -3857 -4865 944 6651 4706 -3611 -8575 -3420 6256 8545 484 -7392
3315 -7392 -5599 2514 6124 1637 -4524 -4043 2238 5511 1352 -4858 -5494 100 6164 5776 -1048 -7032
3331 -7032 -5374 2129 7208 3972 -3783 -6284 -407 5532 3240 -3882 -5693 775 7302 4604 -4557
3346 -4557 -8463 -2195 6374 7319 478 -5950 -5357 765 4930 3043 -1676 -3636 -769 3436 3272 -2229
3362 -2229 -5981 -1951 5802 7463 -212 -8541 -6899 2986 8967 3823 -4967 -6369 -145 4985 2764
3377 2764 -2926 -4040 789 4906 2874 -2735 -6016 -2952 3752 7131 2993 -4730 -7547 -1981 5763
3392 5763 6358 -884 -6312 -2607 4399 4476 -2372 -6503 -1688 6357 6829 -1532 -8214 -5260 3038 7202
3408 7202 3662 -3027 -5576 -2177 2737 3684 465 -3060 -2260 2349 4521 -74 -6136 -4924 3383
3423C383N403n003j0113k601Q164Q235j547p893l907M033N413l01n035k341L511
3438e99M614K53m460m909k86N738O127m85p115o187K165Q184L832n294o701J205
3454c918O817K488n631o348K190Q507L824n756q039j109O083O111J52n056m497
3469d182M85M095L009j402m243j277M375M411k620p331k529O709Q371p34r434
3484b297o592M485Q896K118n733n360J398N247J477l989l634J449M687K799k186
3499B765n573l462L168P117L227m891p623j292O761N899k769o962j195O066M639
3514E875l612p549j136P300O378k165p509m242K938O156K898k814m881j712K888
3529a187M012J59m342l008L371N917K2o979n631L519R132L380o759q251N07P290
$$ plain form
3423 3383 8786 3783 -6330 -8931 -767 7468 5921 -1972 -5879 -1846 3567 3266 -1769 -4110 -599
3438 -599 4015 4268 -192 -5101 -5387 351 6478 5993 -1122 -7309 -5144 3040 6872 1578 -5123 -3918
3454 -3918 2899 5387 -244 -6592 -4402 4105 7929 2173 -5866 -6975 -892 5219 5371 315 -4182
3469 -4182 -3697 398 3407 2005 -2238 -3515 860 5271 2651 -4680 -7209 -500 7871 7137 -2297
3484 -2297 -8889 -4404 4492 6610 877 -4483 -3085 2162 3639 -350 -3984 -2535 2152 4951 2765
3499 2765 -2808 -6270 -3102 4015 7242 2351 -5272 -6564 197 6096 3327 -3635 -4830 1236 5875
3514 5875 2263 -5286 -6422 878 7256 5091 -2418 -6660 -3722 2434 5332 2518 -2363 -4075 -1187
3529 -1187 2825 2984 -1358 -4366 -995 4922 4944 -2035 -7666 -4147 4985 8365 1606 -6645 -6138 1152
3545A152M522k985n627q87M348L245k123m435j360L268M846J077m696n884m2O293
3561G12N782j677p476l902M516O609j08o334l320M250O077n46p059m185M099P064
3577D502J731n001n747n63M726M672l76m445l370J479M726J706m113m636J575
3592c134O588K921n147p387k07P717O109l169p787k612M757N470l01m942k901
3607d025K605M253O00l696l805M71N093M142k249o598l210M200O947J227o122
3622a67n654K244O672J905m971n081J775O369K555m785n875J49N614M437j309
3637C878n503l473K379N241K078l358m813j55M778L767k856o071r16N780N411
3652F167k162p404l333N037O864k2n996m264K217N288J923l379m362K27M223L094
$$ plain form
3545 1152 5674 2689 -2938 -3825 523 3768 1645 -2790 -4150 -882 3964 5041 345 -5539 -5581 712
3561 712 6494 4817 -2659 -6561 -2045 4564 4456 -1878 -5198 -948 5129 4583 -2476 -6661 -2562 4502
3577 4502 6233 1232 -4515 -5078 -352 4320 3944 -501 -3871 -2392 2334 4040 -73 -4709 -3134
3592 -3134 3454 6375 1228 -6159 -6366 1351 7460 4291 -3496 -6108 -1351 4119 3818 -1124 -4025
3607 -4025 -1420 2833 3433 -263 -4068 -3597 1496 5638 3389 -3209 -6419 -2219 4728 5955 -167
3622 -167 -5821 -3577 3095 5000 29 -5052 -3277 3092 5647 862 -5013 -4864 750 5187 3878
3637 3878 -1625 -5098 -2719 2522 4600 1242 -3571 -3726 1052 4819 1963 -4108 -5024 756 6167
3652 6167 4005 -3399 -6732 -1695 5169 5147 -849 -5113 -2896 2392 4315 936 -3426 -3199 1024 4118
3668D118j569n004k538L572N906Q15n651n426J605O765L520m314o463Q2O101L800
3684E319l246n827q11N027M410j667n428k628K840N052J688l768m986k20M788
3699E43M066j655n555k476M237N603o35o290l684L805O364R83n903n039K115O206
3715B685K351l770m860l77M306L672j332m497k242K578M623J258m247m883R27
3730c808N942L449l502o268r88N714N207k391o564k093M758N148p50n344l278
3745d768K754M985J177l583m119j6M104L800j340n205k543L336N299P15n329m806
3761e539K471O501K005m999n525J092O179L092l707n516k76M873L681j527m661
3776a856k436K657M621J116l740m207J70M685L856k257n828j732M774N047j148
$$ plain form
3668 4118 2549 -2455 -4993 -1421 4485 5300 -351 -5777 -4172 2593 6113 1799 -4664 -4582 1519 5319
3684 5319 2073 -3754 -4565 462 4872 3205 -2223 -4851 -2011 3041 4729 961 -4025 -4245 543
3699 543 4609 2954 -2601 -5077 -840 4763 4128 -2162 -5846 -2041 4323 5306 -597 -5636 -3521 2685
3715 2685 5036 1266 -3594 -3971 335 4007 2675 -1822 -4064 -1486 3137 4395 148 -4735 -3808
3730 -3808 2134 5583 2081 -4187 -5175 539 5746 3355 -3209 -5302 -544 4604 3854 -1490 -4768
3745 -4768 -2014 2971 4148 565 -3554 -3570 534 4334 2994 -2211 -4754 -1418 3881 4596 -733 -5539
3761 -5539 -3068 3433 5438 439 -5086 -3994 2185 5277 1570 -3946 -4222 651 4332 2805 -1856
3776 -1856 -4292 -1635 2986 4102 362 -3845 -3675 1010 4866 2609 -3219 -4951 -177 4870 3722
3791C722o144l086M204N921m4n891l888K630N509J660l911m423K99M198L016j326
3807B446m122k306K573M561R32m472m290J332N770L151l903o384l21O126M398
3822E491k764o034j536M705M559j385n132k111K921M240P77l635l956N45M379
3837A064L199j618m902k498L411N372K35n447l801K745N845J176n241m800J985
3852c275O234K179m254m997J07M715L544j682m441j918K382L871R61l279l819
3867c672P51M685K777k893n351j125N093N091j732o442k675M380N456k03n422
3882a282l347K590N005Q06l822l512P35L988K794j835m451j935L024M576Q80m305
3898i1m540J271N652K633l911n297L96N528L481l370n757m12N104L963j780m970
$$ plain form
3791 3722 -2422 -5508 -1304 4617 4573 -1318 -5206 -2576 2933 4593 682 -3741 -3442 756 3772 2446
3807 2446 -1676 -3982 -1409 3152 4084 -388 -4678 -3346 2424 5575 1672 -4712 -5033 1093 5491
3822 5491 2727 -3307 -4843 -138 4421 3036 -2096 -4207 -1286 2954 3731 96 -3860 -3315 1064
3837 1064 4263 2645 -2257 -4755 -1344 4028 4263 -1184 -4985 -2240 3605 4781 -460 -5260 -3275
3852 -3275 2959 5138 884 -4113 -4006 709 4253 2571 -1870 -3788 -1406 2465 3426 147 -3672
3867 -3672 -2921 1764 4541 1648 -3703 -4828 265 5356 3624 -2818 -5493 -1113 4343 4140 -1282
3882 -1282 -4629 -2039 2966 3772 -50 -3562 -2827 1161 3955 2120 -2331 -4266 -1242 3334 4214 -91
3898 -91 -4631 -3360 2292 4925 1014 -4283 -3887 1641 5122 1752 -4005 -4417 687 4650 2870 -2100
3914b100k241K959M342O44l399l400L49L636K894j619m641j541L757M497n56n354
3930a773l473L280N918Q26n394m345K112N405J936l769m380M74M257K578j925
3945A727l817j416K629L831N30l657l639P18M628L020k639n429r46M915M345j996
3961B804n559j983M267M879r66n235k737L004M627O40l641l552O29L926K359j503
3977A959l833j784K648M185M81m353l642J773N292J919m094n107R16N661K896
3992D917l502n118k29M533L535j715m551j656K808L675M24l129l244N16L855K641
4008C760k005m327j425L569M489o08n390l051L428N344M79m938l934K060N193
4023B644J490l684l897N78L888K493j658l878j370K715L604L86l580l534Q62M742
$$ plain form
3914 -2100 -4341 -1382 2960 3604 205 -3195 -2846 790 3684 2065 -2576 -4117 -360 4137 3581 -1773
3930 -1773 -5246 -1966 3952 4778 -616 -4961 -2849 2556 4492 723 -3657 -3183 1074 3652 1727
3945 1727 -2090 -3506 -877 2954 3484 -173 -3812 -3094 1534 4554 1915 -3514 -4460 455 4800 2804
3961 2804 -2755 -4738 -471 4408 3442 -1793 -4530 -1526 3101 3741 100 -3452 -2823 1103 3462 1959
3977 1959 -1874 -3658 -1010 3175 3656 -697 -4339 -2566 2726 4645 551 -4556 -3640 2021 4917
3992 4917 1415 -3703 -3932 601 4136 2421 -2130 -3786 -978 2697 3121 -8 -3252 -2736 1119 3760
4008 3760 1755 -2572 -3997 -428 4061 3453 -1937 -4988 -1560 3784 4263 -675 -4609 -2549 2644
4023 2644 4134 450 -3447 -2869 1019 3512 1854 -2024 -3394 -679 2925 3311 -269 -3803 -2941 1801
4039A801K701k963m947o75M557L939j918n289j484M192M134j201m723k339K871
4054a344M412N80l778l307N79L603K612j266l867j758K666L719J14l935l027K019
4070a978N066J261m541m381J303N263K665l067m869n52M102L231j350l619j546
4085c012K149L301K77l065k910R43L907K410k107m710j524L915M530n84m835k908
4101d223K577M674M17m215l001K097M252R56l373l775N23M095K891j556l997k089
4117c747J986L965J253l088l455N46L973K037k696m190Q8M787L189k732n160j183
4133d427M008M346m99m307k754J871L515R90k259k770K25L093J995j739l732j178
4149c622L172M333m9m858l748K123N177J733l463m127N18M098J957k641l429L01
$$ plain form
4039 1801 4502 1539 -3408 -4083 474 4413 2495 -2794 -4278 -86 4048 2847 -1876 -4215 -1344
4054 -1344 3068 3648 -130 -3437 -2858 745 3357 2091 -1776 -3534 -868 2851 2965 -970 -3997 -1978
4070 -1978 3088 4349 -192 -4573 -3270 1993 4658 1591 -3278 -3830 272 3503 2153 -1466 -3012
4085 -3012 -863 2438 2715 -350 -3260 -2317 1590 4000 1893 -2817 -4341 -426 4104 3520 -1315 -4223
4101 -4223 -1646 3028 3445 -770 -3771 -1674 2578 3534 161 -3614 -3091 1004 3895 2339 -1658 -3747
4117 -3747 -1761 2204 3457 369 -3086 -2540 1433 3470 774 -3416 -3328 1459 4648 1916 -3244 -4427
4133 -4427 -419 3927 3428 -879 -3633 -1762 1753 2743 484 -2286 -2061 1032 3027 1288 -2444 -3622
4149 -3622 -450 3883 3834 -1024 -4772 -2649 2528 4261 798 -3329 -2811 1287 3244 603 -2826 -2525
4165b525L533K464j603l977j809K491M014J169k915l988l72L801L204j380m034
4180a927j222L155L429j326m522j640L659M553n92m712l190J723M596J888k546
4195A326l414m79K348K427m72k741j466J987L233P3l700l216J614N004K384l606
4211A302n089k72M474L394j552m102j087K901K607j167l132j087K256L237L56
4226C039l133l315J56L689L332q80m179k661K268M177N27l611k608J990M032K45
4242C068m129l277K199M819J603l245m151n49L358L158l35k862k072R14K594J154
4258B247j996k672N33L572K080k667m605p63M637M440j474n223k442K893M093
4273B653K52l338k172J721K891L7k528k259Q59L224K066j543l699k001K112M247
$$ plain form
4165 -2525 1008 3472 1869 -2108 -3917 -1426 2588 3757 842 -3146 -3518 283 3487 2107 -1927
4180 -1927 -3149 6 3435 2109 -2413 -4053 -394 4159 3567 -1145 -4335 -2612 1984 3872 1326
4195 1326 -2088 -2567 -219 2208 1736 -1005 -2471 -484 2749 2822 -878 -4094 -2480 2524 4908 1302
4211 1302 -3787 -4059 415 3809 2257 -1845 -2932 -31 2576 1409 -1723 -2810 -554 2683 3039
4226 3039 -94 -3409 -3253 436 3768 2888 -1291 -3952 -1684 2493 3020 -591 -3199 -1209 2823 3068
4242 3068 -1061 -4338 -2139 2680 4283 1038 -3113 -3662 -304 2854 2519 -343 -2415 -1501 1093 2247
4258 2247 251 -2421 -1888 1684 3764 1097 -3508 -4271 366 4806 3332 -1891 -4333 -1440 2653
4273 2653 2905 -433 -2605 -884 2007 2044 -484 -2743 -1884 1340 3406 1863 -1836 -3837 -1725 2522
4289B522J470l286m023M76M048K021k604l504N71M221J949l303m151J70M124L201
4305C902j275l926k158J720L079J251j505k626o06K252K115r90l164r67L042L580
4321C724p23m920k944K992N180R44l996l787Q93L802J707k247k705M24K596J330
4337B270j455k735q96K282L218N25l075l538M9M075L219j731m353j162L284L031
4353C008j350l832r73L597L247j439m305j774K528L839Q96k795l126j44K508K277
4369B162k56k457j736J492K798K34l172k420J814M335J382m007m274P18M695K828
4385D136k359m011p83K993K418j008k609r04J835K354K7k591k390O41L477K318
4401C544j542m103j863K881M135J6l873k444J973L630K79l515k510K125L900O36
$$ plain form
4289 2522 3992 706 -3317 -2841 1207 3228 624 -2880 -2309 1912 3861 558 -3593 -3423 701 3902
4305 3902 2627 -1299 -3457 -1737 1342 2593 1088 -1538 -2144 108 2223 1233 -1931 -2898 144 3724
4321 3724 3001 -1919 -4863 -1871 3309 4253 257 -3530 -2637 1165 2872 625 -2080 -1656 940 2270
4337 2270 815 -1920 -2816 -534 2684 3209 134 -3404 -3355 720 3939 2208 -2145 -3307 -23 3008
4353 3008 1658 -2174 -3147 450 3697 2258 -2047 -3821 -1293 2546 3442 647 -2479 -2623 -115 2162
4369 2162 1906 -551 -2287 -795 2003 2237 -935 -3355 -1541 2794 4176 169 -4105 -3387 1308 4136
4385 4136 1777 -2234 -3017 -24 2394 1386 -1223 -2127 -292 2062 2089 -502 -2892 -2251 1226 3544
4401 3544 2002 -2101 -3964 -1083 3052 3068 -805 -3249 -1276 2354 2633 -882 -3392 -1267 2633 3269
4417C269l245l141M21L337K467j112l021j686J352K773J025k142k632O37L101
4432A403J550k435l559Q0M158K916k108m631j193L322L638m38l459k045J623K944
4448A766K56k120j974N21K557J690j507l248j089K578L528K76l704l142J397M178
4464A963J390k983l243O94L638J740k727l317L80L386K262j486l276j550K117
4479a012L080P16k411k683K5K886K198j465l306p40L011K880j196l933j747L028
4495f69L884k22l892k563J729L587J067k433k822L54K656J649j159k655j037K096
4511d30K850P9l015k641J092L833J692k629l768J3L798K425j839l598p20L084
4527B26K791j227l366j286K150K868M23k533k581L50K956J959j195l128j257K382
$$ plain form
4417 3269 24 -3117 -2696 641 3108 1996 -1025 -2711 -1359 1414 2439 297 -2335 -1698 1403
4432 1403 2953 518 -3041 -2961 1197 4113 2005 -2626 -3819 -497 3141 2703 -756 -2801 -1178 1766
4448 1766 2022 -98 -2072 -1551 1006 2696 1189 -2059 -3148 -570 2958 3234 -470 -3612 -2215 1963
4464 1963 3353 370 -2873 -2179 1459 3199 472 -2845 -2465 921 3183 1697 -1579 -3129 -1012
4479 -1012 2068 2784 373 -2310 -2285 601 2799 1334 -1972 -2712 299 3179 1983 -1950 -3697 -669
4495 -669 3215 2993 -899 -3462 -1733 1854 2921 488 -2334 -1980 676 2325 1166 -1489 -2526 -430
4511 -430 2420 2499 -516 -3157 -2065 1768 3460 831 -2937 -2924 874 3299 1460 -2138 -2858 226
4527 226 3017 1790 -1576 -2862 -712 2156 2579 46 -2535 -2185 771 2730 1535 -1593 -2850 -468
4543d68L155k35l601k159K098L787M55l465l055J469M007J244k704l157J56L032
4559E59K088j160k858j118J852K523L88k493k388O81L156J834k048l421n02L322
4575D15K846j331m015j264L069L174n24l509j998K052L283L82k647k329N85K572
4591G61J764j239k864r34K093K717O9k986k505J335L885J123k941l341N57L790
4607A284K071k382l599kL298K179j363l034j050K048K663P2k504k112N83K740
4623H92J920j562l275q40K816K877o84l580j866K564L569j35l678k296J945L551
4639B218O79k799k782O05L021J565j387k496q29J695K486Kk404k097J072L055
4655A604J328k414l326K19L624K404j921l745q78L126K933j038l359j172K132
$$ plain form
4543 -468 2687 2452 -1149 -3308 -1210 2577 3032 -433 -3488 -2019 1988 3232 528 -2629 -2473 559
4559 559 2647 1487 -1371 -2489 -637 1886 2274 -219 -2607 -1926 1230 3064 1016 -2405 -2907 415
4575 415 3261 1930 -2085 -3349 -280 2894 2370 -1139 -3137 -1085 2198 2580 -67 -2396 -1811 761
4591 761 2525 1286 -1578 -2512 -419 2298 2367 -619 -3124 -1789 2096 3219 278 -3063 -2506 1284
4607 1284 3355 973 -2626 -2628 670 2849 1486 -1548 -2598 -550 2113 2185 -319 -2431 -1848 892
4623 892 2812 1250 -2025 -2865 -49 2828 2144 -1436 -3302 -738 2831 2696 -982 -3278 -1333 2218
4639 2218 2897 98 -2684 -2079 942 2507 1120 -1376 -2205 -510 1976 1978 -426 -2523 -1451 1604
4655 1604 2932 518 -2808 -2589 1035 3439 1518 -2227 -3105 21 2954 1916 -1443 -2615 -483
4670d83K578r4k460j951Q94K726J259j484k784p93K227K860j94l136k093J587
4686a341L382P32k967k843J236L741J120k868l017M31L343K016j646l006p43K037
4702c93K248K3k112j867O85K559J232j767k735k01K883K552j360l739j249K947
4718b94L241m64l519k036J974L178K24k676j951R64K552J075j660k435l81K176
4734c2K261j91k661k158J241L169J162k477k967M79L212J976k111l350kL211K223
4751B985j609l202r39K391K689k07k602j758Q90K274J271j352k460n44K289K225
4767B341o07k980j693K170L356J55l515k469J676L564R66k816k741O38L001J374
4783B420j787k332k35K052J937n04k373j506J203K514J123j953k864q2L055K232
$$ plain form
4670 -483 2095 2001 -459 -2410 -1516 1210 2469 985 -1799 -2592 -365 2495 2301 -835 -2928 -1341
4686 -1341 2041 2773 -194 -3037 -1801 1940 3060 192 -2825 -2394 949 2965 1319 -1687 -2430 -393
4702 -393 1855 1878 -234 -2101 -1416 1143 2375 608 -2127 -2328 555 3107 1747 -1992 -3241 -294
4718 -294 2947 2483 -1036 -3072 -1098 2080 2304 -372 -2323 -1359 1193 2268 608 -1827 -2208 -32
4734 -32 2229 2038 -623 -2781 -1540 1629 2791 314 -2653 -2174 1038 3014 903 -2447 -2449 762 2985
4751 2985 1376 -1826 -2765 -374 2315 2108 -494 -2252 -1362 912 2183 831 -1629 -2173 116 2341
4767 2341 1734 -1246 -2939 -769 2587 2742 -773 -3242 -1566 1998 2964 148 -2593 -1955 1046 2420
4783 2420 633 -1699 -1934 118 2055 1551 -822 -2328 -1125 1389 2512 559 -2305 -2387 668 2900
4799B900j490l315q22K785K711r61l370j289K480K754k57k780j853J140K716R60
4815B309j659k270l72J881K162k93k559j688J418K972O09k661k710R77L478J510
4831C104k556l163K43L197K013j679k912o18K401K028m83k304j413J004K370Q68
4847B100j648k335j74K333K240q98l099j367K369K982k60l175k014J817L262L75
4863B508k803k214J084K564J168j715k344q6K083J755n87k156j447J142K603R06
4879B461k175k543K54K845J996j733l169m75K925K319j249l007j005K410K473
4894B327m21k763j496J277K333Q73j563k217l12K082J905n43k382j443J574K724
4910A955K86k787k211J342L249R25k560k769L96L181J586j732k546l07J982J843
$$ plain form
4799 2900 1410 -1905 -2727 58 2769 1808 -1562 -2851 -371 2383 2126 -654 -2507 -1367 1349 2309
4815 2309 650 -1620 -1992 -111 2051 1758 -801 -2489 -1071 1901 2510 -151 -2861 -1884 1594 3104
4831 3104 548 -2615 -2372 825 2838 1159 -1753 -2371 30 2058 1575 -729 -2142 -1138 1232 2100
4847 2100 452 -1883 -2057 276 2516 1618 -1481 -2848 -479 2503 2243 -932 -2946 -1129 2133 2508
4863 2508 -295 -2509 -1425 1139 2307 592 -1752 -1838 245 2000 1413 -743 -2190 -1048 1555 2461
4879 2461 286 -2257 -2003 842 2838 1105 -2064 -2539 386 2705 1456 -1551 -2556 -146 2327
4894 2327 1906 -857 -2353 -1076 1257 2130 567 -1650 -1962 120 2025 1482 -900 -2343 -769 1955
4910 1955 2241 -546 -2757 -1415 1834 2759 199 -2570 -2174 1007 2593 861 -1685 -1992 -10 1833
4926A833n13k154j001J192J967N38j718k116lK707J868j179l028j015K250K776
4942B404m15k993j457J907K452l8k562j648J313K643O09j946k147m2K038J873
4958A991m08k319j391J102K393O16j926k151O08K828J133k201k747L42K993J985
4974B848j470l119q50K295K281k92k151j383R62J959N20j514j701K15K047J593
4990B240j085k706j067K206K798Rk893k113J219K945P22k290k066R09K370P53
5006A951j756k143J70K436J508q61k209j337J110K474R02j799k319Q1K276J502
5022A986j226k492k04K541J868j385k944p33K382K629k46k635j881R94K230Q88
5038A772j164j746k66J604J434p85j963p83J539K479R3k768k367J253L201J283
$$ plain form
4926 1833 1320 -834 -1835 -643 1324 1862 144 -1972 -1975 732 2600 1421 -1607 -2622 -372 2404
4942 2404 1989 -1004 -2461 -554 1898 1860 -702 -2350 -1037 1606 2215 269 -1878 -1920 118 1991
4958 1991 1583 -736 -2127 -1025 1368 1984 58 -2093 -1485 1343 2476 275 -2472 -2130 863 2848
4974 2848 1378 -1741 -2591 -296 1985 1693 -458 -1841 -879 1080 1600 86 -1615 -1400 647 2240
4990 2240 1155 -1551 -2618 -412 2386 2395 -498 -2611 -1392 1553 2275 -15 -2081 -1172 1198 1951
5006 1951 195 -1948 -1778 658 2166 1305 -904 -2241 -1131 1343 2245 446 -1873 -1792 484 1986
5022 1986 760 -1732 -1936 605 2473 1088 -1856 -2589 -207 2422 2176 -459 -2340 -1346 884 1772
5038 1772 608 -1138 -1404 200 1634 849 -1114 -1897 -358 2121 2214 -554 -2921 -1668 1533 2816
5054B816k071k738j4K578J513j395k089o8J886J390p67k241q97J492K160N43j670
5071D28k384j96K234K140o74k485j105J636K250m59k486j138K032K400k54k758
5087h19j847J202K812J074j746k187k29J495J570j15j534j057Q75J723K74j814
5103c23j835P94K793J434k206l000j90K785K367r83k725r81J818J852n25j816
5119g41p77J206J757O9j799j614L34K044J843o85k658j458J415K581N36k155j840
5136a942Q31K479N81k397j845J152K713Q59k020k492o0K316J786n13j848j137
5152a537N55J607P69j086j488P3J794J121j111k540m15K515K487q77l157j488
5168b778J802K729L30k262j575Q97J863K74j434j203L75J725J011r37j991r17
$$ plain form
5054 2816 745 -1993 -2007 571 2084 689 -1400 -1468 418 1808 1041 -1200 -2097 -605 1555 2098 428
5071 428 -1956 -2152 82 2222 1548 -937 -2042 -406 1844 1385 -1101 -2239 -207 2193 1939 -819
5087 -819 -2666 -1464 1348 2422 676 -1511 -1740 -245 1325 1210 -324 -1381 -506 1217 1491 -323
5103 -323 -2158 -1364 1429 2863 657 -2343 -2533 252 2619 1636 -1089 -2070 -252 1600 1075 -741
5119 -741 -1518 -312 1445 1514 -285 -1899 -1565 479 2322 1637 -1021 -2479 -1064 1517 2053 -102 -1942
5136 -1942 -1111 1368 1949 -448 -2293 -1141 1572 2431 411 -2081 -2141 175 1961 1448 -400 -1537
5152 -1537 -982 625 1394 308 -1180 -1107 687 1808 697 -1843 -2258 257 2744 1867 -1290 -2778
5168 -2778 -976 1753 2083 -179 -1754 -857 1006 1280 -154 -1357 -982 743 1754 817 -1174 -2091
5184b091J357K330O75k057k312K81K500J446j426k320J6K312J388j656k363K2
5200a898K430J763q27k502j181J358K079N18j236j618k77J363J368m63j763o38
5216a524J459J924l48k535j525J694K879L77k446k185O73K465J043j470j752J38
5232a133J659P63p55j481m85J328J631j2j715j695L24K258J628j216k545o55J934
5249a67J996n72k358q28J917J940o51k352j014J505K128L13j751j762K11J628
5265A83J307m05j654r52R83J703J80j726j371Q89K260O56k039k256O67K542J374
5282B341j446k427k77J850J587o85j725n19J088J325J8j438j145M72J776R47r82
5299G60k110n98J748K077k71k291j303J280K156J41k039j406J118K113K78j770
$$ plain form
5184 -2091 -734 1596 2271 214 -2098 -1817 683 2129 703 -1617 -1601 711 2099 443 -1920 -1898
5200 -1898 532 2295 1468 -1034 -2215 -857 1222 1740 504 -1114 -1391 -28 1340 877 -886 -1524
5216 -1524 -65 1859 1511 -1024 -2549 -855 2024 2401 -45 -2230 -1557 908 1951 481 -1271 -1133
5232 -1133 526 1289 534 -947 -1432 -104 1527 1515 -200 -1895 -1571 687 2315 1099 -1446 -2101 -167
5249 -167 1829 1257 -1101 -1929 -12 1928 1277 -1075 -2089 -584 1544 1857 106 -1656 -1445 183
5265 183 1490 1085 -569 -1521 -538 1165 1345 -381 -1752 -863 1397 2053 14 -2242 -1575 967 2341
5282 2341 895 -1532 -1809 41 1628 943 -782 -1301 -213 1112 1130 -308 -1453 -981 795 1742 760
5299 760 -1350 -1948 -200 1877 1606 -685 -1988 -708 1448 1589 -450 -1856 -738 1375 1653 -117
5315a17j602M06J949J124q93j712o87J030J592L95j433j563M20J839R47j283k008
5332a596N1K146J544j205k443m84J961J925m46k106j132J281J622J51j299j200
5348a230L24J456Q77q49j628n11J399J675l0j997j462R81K321N64j844j797N11
5365a240K165Q70j469j930K82J855J109r25j649n62J246J451M5j360j258K61J627
5382E18J123r63j920l58J743J573n42k161r87J677K059k73k153j232J122K002
5398A228L59j605j457M20J563R34q38j452n26J059J546R4j598j384O27J922R81
5415A873j530j988J59K120J276j205k205j36J813J588q37j861o57J232J494J08
5431A244j388j187M04J504Q11p79j605m97J336J750k81j966j166J217K054K32
$$ plain form
5315 -117 -1719 -1313 636 1760 867 -845 -1532 -502 1090 1485 52 -1511 -1091 748 1695 412 -1596
5332 -1596 -1545 601 2145 940 -1503 -1987 -26 1899 1453 -653 -1785 -504 1118 1269 -30 -1230
5348 -1230 -906 550 1427 578 -1050 -1561 -162 1513 1483 -514 -1976 -995 1326 1890 46 -1751 -1240
5365 -1240 925 1795 326 -1604 -1322 533 1642 717 -932 -1494 -248 1203 1248 -112 -1370 -1109 518
5382 518 1641 678 -1242 -1600 143 1716 1174 -987 -1974 -297 1762 1489 -664 -1896 -774 1228
5398 1228 1587 -18 -1475 -1055 508 1442 604 -848 -1374 -315 1231 1325 -273 -1657 -1030 892 1873
5415 1873 343 -1645 -1486 634 1910 705 -1500 -1636 177 1765 928 -933 -1590 -358 1136 1244
5431 1244 -144 -1331 -927 577 1388 609 -996 -1493 -157 1593 1312 -654 -1820 -603 1451 1683
5447A683j877j692Q50K133N87j542j653L47J703R98r13j622l32J157J374L1j336
5464a04j405N20J697Q87j070j655m05J744J526p73k103o82J750J832m31k143j025
5481a840J232J906J11j457j395M63J472Q80p97j332m81J126J331n7j479j351Q22
5498h46K071N68j648j904K59K291J072j240j967j25J826J200q63j612n04J293
5514a29J397k44j379r97M56J459R10q16j765l80J399J526k15j839j066J161J969
5531A447Jj933j305J000K114M27j685j811N13J855Q53q50j425m74J030J265J7
5548A039j187j077M45J538P67j177j844L1K017J411r59k223o24J763J836n47j920
5565g11q60J302J472m8j439j046N63J516O28j040j391k62J201J462n0j679j237
$$ plain form
5447 1683 -194 -1886 -1036 1097 1684 142 -1511 -1164 539 1537 624 -998 -1330 -173 1201 1232 -104
5464 -104 -1509 -989 708 1595 525 -1130 -1535 209 1735 962 -1141 -1823 -73 1759 1328 -815 -1840
5481 -1840 -608 1298 1409 -48 -1443 -980 492 1372 575 -757 -1238 -112 1219 1162 -317 -1668 -846
5498 -846 1225 1793 145 -1759 -1500 791 1863 623 -1344 -1469 357 1557 694 -918 -1422 -129
5514 -129 1268 1024 -355 -1352 -896 563 1473 657 -1108 -1488 -89 1437 1222 -617 -1683 -522 1447
5531 1447 1448 -485 -1790 -790 1324 1751 66 -1745 -1232 623 1476 626 -799 -1273 -243 1022 1039
5548 1039 -148 -1225 -780 758 1525 348 -1496 -1465 552 1963 1004 -1219 -1843 -80 1756 1209 -711
5565 -711 -1571 -269 1203 1155 -284 -1330 -767 749 1377 337 -1054 -1316 -115 1347 1297 -382 -1619
5582a619Q15J843N39j531j702N61K069P08j562j695K92J857J116r71j739m24J311
5599a32J313r7j194j127M31J396O77q28j509k08J449J418n58k068p72J550J870
5616A611j38k011j259J095J897K84j631j140M35J443O59q73j303j73J126J106
5632A128r2j387j180O12J725Q14j367j636N2J791J248j121j871k43J838J310p70
5649H51j855n77J388J488j69j457r45N06J329O66p41j265l45J106J214k68j454
5666e28r99J052J770K41j773j469Q09J972O21j498j711L80J815Q29r86j493k64
5683a232J181J174k04j365q13N72J368O37r07j600j70J607J362p22j901n94J433
5700a74J736l74j979r06J263J647Mj533j052O50J527M51r93j220j03J011J169
$$ plain form
5582 -1619 -804 1039 1578 47 -1655 -1094 975 1683 121 -1574 -1282 575 1691 720 -1019 -1443 -132
5599 -132 1181 1084 -110 -1237 -806 590 1267 439 -1070 -1278 171 1589 1031 -1037 -1809 -259 1611
5616 1611 1473 -538 -1797 -702 1195 1479 -152 -1292 -857 586 1245 372 -931 -1104 22 1128
5632 1128 1036 -351 -1531 -919 806 1620 253 -1383 -1331 460 1708 587 -1284 -1527 311 1621 851
5649 851 -1004 -1581 -193 1295 1126 -331 -1276 -770 559 1225 484 -781 -1126 -20 1194 926 -528
5666 -528 -1527 -475 1295 1536 -237 -1706 -897 1075 1696 198 -1513 -1133 682 1511 525 -968 -1232
5683 -1232 -51 1123 919 -446 -1259 -687 681 1318 411 -1189 -1359 248 1610 888 -1013 -1607 -174
5700 -174 1562 1188 -791 -1697 -434 1213 1217 -316 -1368 -718 809 1260 267 -953 -1056 -45 1124
5717A124j47j439q55O83J623N18j401j571L00J935Q84j296j758Q7J766J142r57
5734F38j665k77J375J177k76j341r01O85J221N23q59j213k15J132J210k68j677
5751g31q09J258J650j5j795j365J061J917L66j598j400M29J617O69r04j285o7
5768a002J089R26k59j228o87N44J444N39j187j533L1J695J224p99j886m59J630
5785H2J370n33j714n66J209J445k09j607q19P45J386M80q96j307k60J186J103
5802A095j31j276r36O80J496L44j500j208O18J746O98j434j742K40J852J097r48
5819F91j539m22J111J114j36j206o64N69J093M37q81j304K9J504J160o60j835
5836i39o69J225J698N2j755j112R99J499J75j381j104O82J545L91j142j291p5
$$ plain form
5717 1124 977 -462 -1317 -634 989 1507 106 -1465 -1165 770 1654 358 -1400 -1313 453 1595 638
5734 638 -1027 -1304 71 1248 972 -369 -1270 -585 636 1159 300 -913 -1128 4 1214 946 -731
5751 -731 -1540 -282 1368 1353 -442 -1807 -746 1171 1537 -61 -1461 -1032 585 1254 350 -935 -1002
5768 -1002 87 1013 754 -474 -1161 -617 827 1366 179 -1354 -1323 372 1596 797 -1089 -1548 82
5785 82 1452 919 -795 -1361 -152 1293 1084 -523 -1342 -597 789 1269 373 -934 -1194 -8 1095
5802 1095 964 -312 -1248 -568 928 1272 -228 -1436 -818 928 1626 192 -1550 -1310 542 1639 691
5819 691 -848 -1270 -159 955 819 -387 -1051 -482 611 1048 167 -1137 -1108 396 1556 896 -939
5836 -939 -1608 -383 1315 1367 -388 -1500 -501 998 1173 -208 -1312 -630 915 1306 164 -1127 -1202
5853a202J292J172j67j392j022N66J500M96r64j436K00J501Q28j132j502L9J647
5870D24J175q17j845n28J365J440j18j312q73M26J134N07q17r42K0J012Q62m09
5888G04j468p23J146J746L7j754j385P34J889O23j353j418L36J422O07q62j250
5905i69l1J353R50n23j327q15P07J480N73r28j505j96J254J228n45j522l87J296
5923I3J318o47j718o17J315J659n2j681j160O44J362O80p37j148k25Q48Q79k23
5941E90r98n41O37J294K72j507j335N34J966Q76j234j867j25J676J123o48j393
5958f80k38R85R21l74j232m77P99J183L24j026j321j69J444J248l18j599q82Q46
5976e66J621O8j546r52J005J562K1j634j160P13J736O78j186j453j05J060J070
$$ plain form
5853 -1202 90 1262 1095 -297 -1319 -753 747 1243 279 -1157 -957 544 1372 240 -1262 -1223 424
5870 424 1599 782 -1063 -1591 -226 1214 1096 -216 -1089 -663 471 978 161 -781 -761 251 1113 704
5888 704 -764 -1487 -341 1405 1442 -312 -1697 -963 926 1549 196 -1222 -886 536 1143 281 -969
5905 -969 -1000 353 1303 780 -547 -1362 -655 825 1398 470 -1035 -1231 23 1251 706 -816 -1203 93
5923 93 1411 764 -954 -1571 -256 1403 1351 -330 -1490 -846 516 1196 459 -689 -914 -66 813 590
5941 590 -408 -949 -312 982 1254 -253 -1588 -1054 912 1788 554 -1313 -1438 238 1361 713 -680
5958 -680 -918 67 988 614 -618 -1095 -296 887 1211 185 -1136 -1305 139 1387 1069 -530 -1412 -566
5976 -566 1055 1123 -423 -1375 -370 1192 1213 -421 -1581 -868 868 1546 360 -1093 -1198 -138 932
5993I32j02r45p73L75J067K64p65j134J94J521Q90j057j831j88J653J587m88j846
6011f46q12J064J398j98j078o69O42J102Q0j009q62K18J044R24l48j423q97Q29
6029f41J600M92j306j422L11J614O37j231j319L96J652N57j063j582K4J464J098
6046A281m23j195q07M88J145M97o41j073j13R80Q99m61j406n18J408J448l94j791
6064f76j004J023J859K27j454j243N98J258M02q35r61J04J112N02m49j114l40
6081i91O43J242L74j238j300R9J562J023p35j636l03J414J128p37j501k34J315
6098A25J231m89j507p65R11J321K93q47j101j32Q99R78k57j036o12O95J289J2
6116A008j423j093R14J676L45j402j534M75J620Q20j013j295j1J105P04l19j050
$$ plain form
5993 932 830 -115 -888 -513 554 818 53 -1081 -887 634 1524 467 -1364 -1552 101 1688 1200 -646
6011 -646 -1458 -394 1004 806 -272 -941 -299 803 883 -126 -988 -770 274 1198 850 -573 -1470 -641
6029 -641 959 1451 145 -1277 -966 648 1285 54 -1265 -869 783 1340 277 -1305 -1281 183 1281
6046 1281 858 -337 -1144 -656 489 986 345 -728 -841 139 1038 577 -829 -1347 61 1509 1115 -676
6064 -676 -1680 -657 1202 1429 -25 -1268 -670 588 990 155 -806 -702 410 912 463 -651 -991
6081 -991 -348 894 1268 30 -1270 -1171 391 1414 679 -957 -1260 154 1282 545 -956 -1190 125
6098 125 1356 867 -640 -1405 -494 827 1120 273 -828 -960 -61 917 660 -376 -988 -293 996 1008
6116 1008 -415 -1508 -594 1082 1427 25 -1509 -1034 586 1406 393 -902 -913 192 896 577 -473
6133d73m52P89Q65K01r75r71R8J310R82p05j545m46J189J291j76j552o66J028
6151b08J313j48j471p60Q19J290K38j042j098K67R74Q42l49j033o85O17J192K37
6169I95j064j014K82J440O86j133j480J60J642R18p93j644k59J244J151l95j219
6186d83m93P01R67J43p91q81K13R10P77m13j345n94J013J434p8j392j045O97J623
6205I63K99j375j121M89J493L94r85j232K06J173P39m08j113m84O34R95L06q60
6223A13j042P4J286O88o15j408k69J289J163m89j613m71J164J310k10j396q07
6240a233P71J247J18r13q28R3R73O96l72j126m94P29J187J55j131j105N46J391
6258G04N78j136j405K38J509Q58r73j408r1J293R69n02j145n19P68R54J36p90
$$ plain form
6133 -473 -925 -136 729 930 -45 -1016 -918 392 1374 669 -876 -1322 -133 1158 982 -570 -1236 -208
6151 -208 1105 957 -514 -1274 -455 835 1073 31 -1067 -800 174 1016 667 -366 -1051 -434 758 995
6169 995 -69 -1083 -801 639 1325 192 -1288 -1128 514 1432 639 -1005 -1264 -20 1131 736 -483
6186 -483 -976 -275 692 835 44 -837 -624 286 1063 650 -695 -1289 -276 1158 1080 -312 -1357 -660 963
6205 963 1262 -113 -1234 -745 748 1142 157 -1075 -869 304 1043 635 -478 -962 -328 667 973 113
6223 113 -929 -855 431 1119 504 -904 -1173 116 1279 790 -823 -1294 -130 1180 970 -426 -1233
6240 -1233 -462 785 903 -10 -838 -745 228 924 552 -574 -1068 -339 848 1003 -128 -1233 -687 704
6258 704 1282 146 -1259 -1021 488 1346 373 -1035 -1126 167 1136 634 -511 -1030 -262 692 828 38
6276C8q56N7R85P97m75j294l87J061J185r0j489r24J017J388Q1j433q99O10J337
6295G09L63j051j003K07J144O02m52j082m25P21J078Q0q51j031K01J238P54p48
6313D54j480n3J362J061o72j550m62J279J303l72j426o32P40J234J64r20q78J72
6331f76R34N60l80j032l85Q50J060kj239r39O40J480M61j229j362L10J559O84
6349A294j003j182r8J328P48o20j155k54P98R97jr65p81R9J126P44n26j251l91
6368a093J031J183l33j441o07J020J330p8j449r08Q24J403K39j174r33K41J056
6385C11N81n32r65k23O95Q54O4r11r20M47J312N62j078j394J32J435R86p36j532
6404i12k35J176J053l35j364l56Q18J010j8j037p59L77J000O34o65j154k62Q97
$$ plain form
6276 38 -818 -761 224 1021 546 -748 -1135 -74 1111 1021 -468 -1392 -375 1013 1094 -339 -1238 -628 709
6295 709 1072 21 -982 -775 369 971 519 -563 -988 -267 811 891 40 -991 -790 448 1202 454
6313 454 -1026 -1079 283 1344 672 -878 -1340 -61 1242 870 -556 -1188 -448 786 950 30 -848 -676
6331 -676 258 818 438 -594 -979 -129 931 929 -310 -1249 -609 871 1332 103 -1259 -949 610 1294
6349 1294 291 -891 -989 339 1087 467 -688 -942 -144 853 852 -113 -894 -795 331 1075 549 -702 -1093
6368 -1093 -62 1121 788 -653 -1260 -240 1090 1012 -437 -1345 -521 882 1121 -53 -986 -745 311
6385 311 892 360 -605 -828 -133 721 785 -126 -1046 -599 713 1275 197 -1197 -1065 370 1356 620 -912
6404 -912 -1147 29 1082 747 -617 -973 -155 855 837 -200 -959 -582 418 1052 387 -767 -1029 -132
6422a32J073m9j258q39P01J347J61j237r71N87J390L98j135j204L25J252O54n76
6440D87j158k66Q44Q16o6q17o44K70J015M88p68j112q3J309R54o11j487m45J241
6459c3J243k72j457o34Q16J144M7j067p32M27J014M16n74j067j12P99R53o0j150
6478b99r04N64J393L87j104j186L39J421N75r97j235J04J278Q73p62j270k43R60
6496a06R70j13r65p31L86R83M00n89r61j93J024R89l22j407n50R99J308o6j444
6515c88r25P60J495J52j217q36L44J094M82p01j017J3P38Q12r4r64p29M34J168
6534F21M65q82j214L3J346R26p71j524j12J246J050m83j424l79R94J062j79j175
6552d00n74M55R88M15o25r61j76R52Q81k42j082p70P22J400L7j226j032N79J404
$$ plain form
6422 -132 941 892 -366 -1205 -504 843 1004 -233 -1204 -617 773 1171 36 -1168 -843 409 1063 487
6440 487 -671 -937 -93 723 657 -160 -804 -534 481 969 201 -911 -994 315 1269 658 -829 -1274 -33
6459 -33 1210 938 -519 -1153 -337 807 854 -213 -945 -518 496 912 338 -729 -841 -42 911 851 -299
6478 -299 -1203 -639 754 1141 37 -1149 -810 611 1186 189 -1046 -942 336 1209 447 -823 -1066 -106
6496 -106 864 751 -214 -945 -559 424 824 235 -726 -919 105 1094 772 -635 -1185 -186 1122 1056 -388
6515 -388 -1313 -553 942 1094 -123 -959 -615 479 961 260 -757 -744 -6 806 712 -252 -981 -547 621
6534 621 1086 204 -1010 -977 369 1295 524 -1000 -1112 134 1184 701 -723 -1102 -108 954 775 -400
6552 -400 -974 -519 469 884 259 -702 -878 74 955 713 -369 -1139 -417 983 1020 -206 -1238 -659 745
6571G45N10j160j260L55J437M75q10j070p1Q85Q48k18q99o22M01R37M90p14j195
6590i36J02J113Q71n52j312m93J186J254m20j474n47R14J214J4j223p32M65J172
6608F16K54p51q48J3Q69O65j41j090n95O30J108L61j073j121K56J461O21j029
6626B06j194O5J331P96q17j248r5J192P90l16j139n40N40J028K72p26q68q9R34
6645A22P34k47j188m42R69J078j34j345q62Q50J501J17j306j017N13J227M92q38
6663B24j002L2R29N84m39p48m08N16J136N2r13r84J85J289P61o58j513j92J316
6682A67R18m54j277l77J050J004l09j314m11P28J068J92q65r51m5J049P64l11
6700F26j067m70N80J088J28j113q41N77J278L85j232j196M23J467O24r28j165
$$ plain form
6571 745 1255 95 -1165 -810 627 1102 292 -778 -849 36 884 666 -233 -855 -454 483 973 259 -936
6590 -936 -834 279 1150 598 -714 -1207 -21 1233 813 -661 -1208 -294 920 934 -289 -1021 -556 616
6608 616 870 119 -729 -716 153 818 677 -413 -1008 -378 730 1091 18 -1103 -847 614 1235 206
6626 206 -988 -923 408 1204 387 -861 -956 236 1026 710 -429 -969 -429 599 871 145 -723 -812 122
6645 122 856 609 -579 -1021 -52 1026 892 -453 -1315 -465 1036 1153 -153 -1170 -657 570 1062 224
6663 224 -778 -746 183 767 328 -420 -828 -312 824 876 -37 -1021 -836 453 1214 556 -957 -1149 167
6682 167 1085 631 -646 -1023 27 1031 722 -592 -1003 -275 793 985 120 -831 -876 173 937 626
6700 626 -441 -911 -331 757 885 -228 -1069 -492 786 1171 -61 -1257 -834 633 1257 329 -836
6717h36j38J002Q38l04r38l99N84P21R9o75q25K31J117N93o31j277l53J080J289
6736A178k14j454o95Q17J259p4j106p60P57J042J32r97p83K77R44O85m12j031
6754d35n74O31J054L17r48r49J89J177N51q55j123J73J280Q08q69j441j32J203
6772E7R72j99j170o42N55Q82J94n72o96L5P88N48l97r96m11J004J037q3j270r20
6792a284O30J527K99j107j038L23J114M15p20r58K15R89M88n45r34k81N96R77
6810G06K71r08r19k1J065P63l87j102l46R75R39m78j280l66J012J194k36j394
6828e12o93P13J083L09o92q37r6Q49M98j41q16m32N52Q85J31j000r37N04J377
6847G45N13r94j329j7J403P79n80j158k44R74P13l51r25k41O37P90kq09o53l4
$$ plain form
6717 -836 -974 28 866 562 -376 -775 -191 530 629 -46 -871 -640 477 1070 439 -838 -1191 -111 1178
6736 1178 964 -490 -1185 -368 891 817 -289 -1049 -292 750 882 -115 -898 -621 323 1008 596 -435
6754 -435 -1009 -378 676 993 45 -904 -715 462 1013 158 -965 -792 488 1296 427 -1014 -1146 57
6772 57 1029 830 -340 -982 -427 455 649 77 -619 -584 204 752 355 -641 -1052 -48 989 906 -364 -1284
6792 -1284 -654 873 1172 65 -973 -650 464 879 159 -799 -584 405 893 348 -586 -867 -271 706
6810 706 977 69 -850 -871 194 957 570 -532 -878 97 1036 558 -722 -1088 -76 1118 882 -512
6828 -512 -1205 -492 591 900 208 -629 -725 124 622 481 -335 -767 -215 670 801 -199 -1136 -632 745
6847 745 1258 264 -1065 -1082 321 1100 520 -638 -882 92 805 454 -471 -712 -75 715 713 -96 -749 -783
6867g83R94Q74m10j166n43O41J223O0j139p99P40J141M3j088q87O08J216M10j064
6886G1j038P7R68P64k23q58m65L96O67L22n97q04P4R86O79o92j266j46J236J124
6906A275m48j478n56J019J074n4j047o01N57Q44N5p17n81K37P41M63k81r67m80
6925i45N11J184J92q55j031J91J196O03r43r55J17J214N69q03j131k2J123P67
6943I82m41r77m56N57Q45J99o29o49jO43O94l18r88l09P76R97j16j270p32Q19
6963c74J259J89j280q78O15R89L02p12p96J80Q06L87l85p45k15N25P60J79p89
6982A7q40J22J016O74n40j196j52J101P80m95j135k70R52R27m04j079m55Q15Q19
7001F57O5p10o67O1O98N16k33o61m00M04R40J29r18q31M59J191L61j037j088K75
$$ plain form
6867 -783 211 1085 675 -491 -1034 -393 830 890 -249 -1048 -308 833 876 -212 -1099 -491 725 1135 71
6886 71 -967 -890 78 842 619 -239 -704 -308 359 681 84 -720 -646 340 1019 327 -939 -1085 151 1275
6906 1275 827 -651 -1207 -188 886 832 -215 -816 -259 585 640 -77 -658 -421 320 783 502 -465 -945
6925 -945 -434 750 942 87 -944 -753 443 1046 103 -852 -735 479 1048 245 -886 -908 215 982
6943 982 541 -436 -892 -335 510 709 80 -569 -570 73 767 449 -539 -848 -72 925 809 -461 -1193 -374
6963 -374 885 1074 -206 -1084 -469 520 822 110 -686 -506 300 687 302 -443 -658 -133 627 806 17
6982 17 -823 -701 315 989 449 -747 -899 202 982 487 -648 -918 34 961 557 -522 -977 -162 657
7001 657 722 12 -655 -594 104 620 387 -274 -674 -270 670 799 -119 -950 -491 700 1061 24 -1064 -789
7021g89J235O14p09j090j6R29N67l13q54k36N85O24O6o43o38J21P75O05l40j067
7041e74l80P98J049j60j171o12P54J148r2j044o47N90J021J65q82p08J77P19N19
7060F70k23p85l59N17O86J51o52p87K12R21N85o99j060l8J128P17n39j156k11
7079i22J022Q17l81r05m27N94P68O0o79n78J31O71M49k33p56m32O25R27J9r57
7099a87p66M21J184K26r62r91M10J119M48p67r50O9R49N51l84p93j94M19P23M7
7119E72n77o44Q1Q20M95l43r74l58R28R36k07j205n28P83J084m6j073o67N75R46
7139E98J07p46o21J91P19M78m07o33l69M12Q30J08o78p36J85R85M63o24j005j5
7159g58J005P31o16j061j77R28Q07l55r39l82O12P53pm99n81O8O54M68k50q76
$$ plain form
7021 -789 446 1060 351 -739 -755 174 741 428 -426 -662 -77 547 613 -30 -668 -547 228 833 493 -574
7041 -574 -954 -156 893 733 -438 -1050 -296 852 760 -284 -931 -341 680 845 -37 -745 -568 151 670
7060 670 447 -338 -697 -180 506 657 5 -782 -570 351 936 237 -823 -861 267 984 445 -711 -922
7079 -922 100 917 536 -369 -796 -202 566 626 -53 -631 -500 171 620 387 -369 -801 -176 751 770 -187
7099 -187 -953 -532 652 878 -84 -1075 -665 454 902 135 -815 -746 203 754 370 -423 -617 -198 525 572
7119 572 -5 -649 -568 252 747 404 -570 -928 0 936 729 -476 -1004 -221 863 817 -256 -923 -348 598
7139 598 705 -41 -662 -471 248 726 319 -314 -683 -271 559 667 -11 -747 -562 423 886 262 -743 -758
7159 -758 247 978 362 -699 -876 52 859 504 -435 -817 -205 548 541 42 -539 -471 183 651 401 -475
7179d75k94O75Q69p5r79p89N93J198K29r97r38L92J115M05q56q29K38Q32M50m08
7199C56q34k37N83O71J71o69p16Q4Q47N47m15r62j50Q10P96l16j114m30R03J013
7219I38k45j131m71O08Q99J22p42o27J64O67L97k98o14l14M73Q38j12p71o35L58
7239d96J062L65p85j022J30J072N36o09q95m9Q56O42m66q42j31N78O45K9o71o17
7259f68J55O86N37l14q79l60Q01P91j76r48n10O10R51P6r49p53N38J054K24q73
7279gp20J24Q14N12m35p25j67N04N77O6n69o45J88R25L12n44q55j36R12Q94n30
7300D95j094k38P77Q02j46q87l94N13P96p4o36n03K06P14L40m05p23j44L70Q55
7320F24J1p64p17M42J010K06q49p93K97R76L68o48r40P4R37N52n05o79k90O15
$$ plain form
7179 -475 -769 -94 775 700 -279 -1068 -475 723 952 -45 -983 -591 524 929 73 -756 -518 314 764 356
7199 356 -478 -715 -132 539 710 41 -675 -591 256 803 388 -574 -724 86 882 566 -548 -978 -75 938
7219 938 693 -438 -909 -301 598 720 -22 -649 -485 182 579 281 -333 -647 -174 664 552 -219 -854 -496
7239 -496 566 931 146 -876 -746 326 862 253 -642 -691 165 807 341 -501 -632 -54 591 620 -51 -668
7259 -668 -513 173 710 396 -483 -843 -42 749 573 -375 -885 -275 676 752 -197 -950 -412 642 866 -7
7279 -7 -727 -603 211 723 288 -437 -604 -100 477 543 -26 -671 -483 442 754 210 -645 -781 131 1025 495
7300 495 -599 -837 -60 742 596 -291 -685 -172 624 550 -86 -589 -383 331 671 266 -457 -601 -231 624
7320 624 635 -129 -846 -404 606 812 -37 -830 -533 443 811 163 -777 -703 234 786 281 -398 -688 -73
7340g3O01k9n98m62J42O42M20l76q07k20Q63P39l13j015m35P48J036k12r72m91
7360h12N00R48O9p64n70J97P33L71m47o33k11N26P61q5o71o30K41Q84L88o27r24
7381g56O8R92N68o30r22m3Q61O48l40r43k13O46N85j2o86m67K09O52L81l65o48
7402d15k62N09Q73j63r24n12O40R57Q3r83o63M39J042J69q12o90K19Q02L76m31
7422B54p27l5M88N48L3n92n56J94P42M18n74p74j18Q25P19l31r92l64Q10Q28j97
7443E99r57m95O32Q52j5p26m73K07O77L03m01o05k14N42O19k2o48o01K79R25K53
7464G31n89q87J81R02M84n82r68O6R09M70l98p74j65N37P09p2p07l83J23O25L81
7485E93k98o68k80P03O40k07q35m98O69R64K1j064o57N30Q88K52p21p98K35Q13
$$ plain form
7340 -73 528 499 -99 -561 -419 223 643 267 -540 -760 103 842 529 -486 -921 -173 863 651 -321 -812
7360 -812 -312 636 705 -59 -629 -432 301 672 225 -408 -619 -93 668 583 -88 -718 -477 407 795 168 -756
7381 -756 -688 304 872 242 -680 -723 138 786 446 -497 -710 -64 521 509 -177 -644 -435 217 598 233 -415
7402 -415 -677 -168 705 542 -382 -894 -254 703 786 -197 -860 -421 621 790 -22 -712 -493 309 685 254
7422 254 -473 -508 -20 528 561 -31 -587 -393 349 767 193 -581 -699 126 845 514 -478 -842 -32 796 599
7443 599 -358 -853 -221 631 616 -110 -583 -376 301 604 203 -402 -616 -74 545 523 -125 -726 -447 478 731
7464 731 142 -745 -564 338 822 240 -728 -662 247 717 319 -455 -620 -83 626 554 -153 -536 -413 212 593
7485 593 295 -373 -653 50 690 483 -352 -850 -181 783 804 -260 -917 -387 501 753 32 -766 -531 282
7505B82L73m71n61q4M35N19o1n93m70K48P28M29n29q99p8R28O69m38r48j74P28
7526C3P29l04q61k95N73P00l2o96m44K87O09L84m20o25k42M88O39P4o67n45L06
7547c09Q40J47p63p57L75R51L94p74q25O0Q80N22l93p46j67N04N13n4n34l52J69
7568c19N56L22m53o37j03O60Q12k66j031m38O98R43j08r49m28N19P75M3p42m85
7588f31L02P36J97m12o24q6M37O34L1o86m30J44P10L46n17p58J02Q26M21n35q74
7609f67mQ76O65n25q07k16N79O83o7n90m36K35M56L36m26m57j69N80O03k73p14
7630c38m97N43J001O5q69p38L68R56K20o50p15K19P71K24m44o17L7N73N10k08
7650D11o15l68J83O48L81l59p37j61P24O14l17q59j83P11O66k82q85l16P08P03
$$ plain form
7505 282 655 184 -377 -461 -26 493 432 -161 -631 -383 345 774 245 -654 -732 196 865 427 -521 -695 33
7526 33 762 458 -403 -698 -125 575 543 -153 -597 -310 299 683 263 -362 -604 -116 523 597 -70 -615 -309
7547 -309 531 678 -85 -842 -467 484 878 104 -721 -661 219 741 348 -398 -565 -61 452 398 -136 -488 -319
7568 -319 237 559 106 -531 -634 26 838 572 -459 -897 -199 744 636 -313 -741 -222 553 596 -146 -631
7588 -631 -329 407 604 192 -432 -518 -81 553 584 -102 -532 -388 322 668 151 -607 -505 321 742 207 -667
7609 -667 -671 205 870 345 -462 -678 -99 584 517 -73 -509 -274 182 518 92 -365 -534 46 649 376 -338
7630 -338 -835 -292 709 774 -95 -833 -465 491 711 61 -654 -435 336 560 116 -501 -464 109 619 411
7650 411 -204 -572 -389 259 640 281 -456 -617 107 721 404 -455 -638 73 739 457 -428 -744 -36 667
7670F67m7p80m11J66O76K93l69n11q4L61M88p9n81l64L59P02K65p73q29K30J039
7691D18M74p04q04k3P70N78l89p11j10N82M09j86n41k99L05N43K52m07o29r8O07
7712C7O17j20q57l85N56P70q1q28m09M93Q11L2q55n58L37Q59J93l56o71r7M80
7733c2M16K6m69m55K97N86J59m35o98Q6Q03N22m84r31j76Q23P49k47r20l24N65
7754a39O77o8o82l58L63N41J74m43n64K3N06N42j83o26m59K96Q91K62p10p35K31
7775d61Q97L51p44q00K45Q49M34n76p35j5N90N54j26o36l46K68M33K55k50n00
7795c13j96N77N32k52p56l09N94Q43o6r90n38O09P21J87p22n84L05P13J99n32
7815B2m44O8M30L73n4o32l33L11N98L06n53p33M9Q54N23n31q11q5Q16O02m42q47
$$ plain form
7670 667 620 -160 -571 -405 271 564 195 -316 -400 -39 449 370 -211 -575 -216 486 751 -22 -851 -621 418
7691 418 892 188 -616 -639 131 709 320 -391 -501 81 490 304 -237 -536 -231 312 564 157 -472 -570 37
7712 37 654 534 -323 -708 -152 618 537 -291 -700 -207 604 636 -219 -777 -440 419 612 256 -415 -512 -32
7733 -32 384 410 -59 -514 -217 369 528 93 -605 -519 284 806 322 -609 -785 38 787 540 -380 -704 -139
7754 -139 538 470 -212 -570 -207 334 508 65 -499 -476 30 572 389 -237 -696 -400 491 753 43 -692 -461
7775 -461 436 787 43 -757 -512 337 771 195 -540 -555 35 589 463 -173 -519 -251 182 437 187 -313
7795 -313 -509 68 600 348 -408 -717 -123 720 654 -336 -874 -265 456 643 -79 -663 -358 355 554 22
7815 22 -422 -354 76 449 395 -237 -570 -259 339 645 92 -641 -592 262 785 254 -557 -642 174 776 334 -513
7837e13j60P00O87l08o91l16L38O64J12m15m39j11L71N94q4o27m19M44O95M7p00
7858a31o52L69R71K07p15p99L05P94K81n27o12mO09L63k91l81k43K57N52K03m52
7879A04o31O1N48N85k92p75l21O82P59k98p60l61N86O77n8p64m22M72O51P9n08
7900A4m24k3N24L98j56n55l41K77O53K03n30p10K00P84L94n67q16R7Q34M74m73
7921B57q04r5P00N16k10o22l28M37M53Q2l72m59k0N56L98j38o00l74M38P49%q01
7943b37n50N36Q04M4o71n95K84P60K40o18m80K6N93L01k02n27j35K10N85J04m68
7964Dn15L3O72M65l68p80j36P01N86k92q08k78P18O50j82p39k96M24N25J41m79
7985D6m57O2M69L44j92n47k78L60O68kn36n68K13Q75J95o20o33J52P55L68n17
$$ plain form
7837 -513 -673 27 714 406 -285 -601 -263 401 513 98 -341 -452 -81 513 429 -198 -617 -173 522 569 -131
7858 -131 -783 -414 557 764 49 -750 -445 349 630 103 -509 -513 96 459 168 -213 -456 -199 353 556 104
7879 104 -527 -466 82 667 375 -400 -721 -39 720 422 -338 -699 -113 564 506 -258 -680 -208 443 522 14
7900 14 -410 -433 91 489 333 -222 -563 -286 367 570 40 -670 -470 314 708 141 -675 -578 256 730 257
7921 257 -547 -642 58 574 364 -258 -586 -149 304 386 14 -445 -465 91 489 351 -249 -623 -185 564 564 -237
7943 -237 -787 -251 553 597 -74 -669 -385 375 615 -3 -483 -457 136 437 235 -292 -427 -217 368 472 4
7964 4 -511 -478 194 659 291 -489 -625 76 662 370 -438 -716 2 652 470 -269 -565 -141 384 525 46
7985 46 -411 -349 120 464 272 -275 -553 -193 475 473 -63 -631 -418 457 652 32 -601 -449 306 674 157
8006A57o92j5O48N04l38n43j97L65M50Q6m39m35J53M01L71k34n50k61M89O82r5
8027E07q12l77N10P70K5p84m67L77O13K20n76n17J05N88K75j80n74j51L08N01
8047C61J40n29n70K45N79L64l87p68j8P72M59l00p54k05O17O92k67p30k55M21
8067a33N52km55l88J03N29K39k52n18j59M41M78O1o53m82K93P99J50o45n77J55
8088d64Q31K47n07o10J02N87L56l87m87r4L11N01K4l85m52K1O81K23k96n62k20
8109e80O11N03j47o77l03N44N98j09o44l76L34O45J78n63m92J30N02K84k08m87
8129b57j22K76N18J9n44m83K47O66K92n81o10O9P27M65m49o39k36O83M64j91o12
8150b98k31L92N47L1n26l61J39M65L32k61n47j98M24O55q6p10l57M26O21Q4n90
$$ plain form
8006 157 -535 -550 98 602 264 -279 -476 -111 339 425 -14 -449 -296 105 476 242 -308 -569 -80 602 507
8027 507 -305 -682 -172 598 623 -161 -628 -251 362 582 6 -511 -406 182 457 277 -297 -448 -140 361
8047 361 501 -28 -598 -353 226 590 203 -565 -583 189 648 348 -406 -611 6 698 431 -299 -554 -133
8067 -133 419 417 -38 -426 -323 206 445 193 -325 -484 -43 435 496 -157 -639 -346 453 603 -42 -619 -464
8088 -464 367 614 107 -503 -401 186 542 155 -332 -426 -115 386 410 25 -427 -406 275 498 202 -360 -580
8109 -580 31 534 387 -290 -593 -49 549 440 -204 -580 -246 399 577 14 -478 -348 154 438 230 -257
8129 -257 -379 -103 415 434 -110 -593 -346 320 612 31 -579 -510 217 682 233 -406 -642 41 505 314 -298
8150 -298 -529 -137 410 441 -85 -446 -307 158 490 229 -318 -516 -92 563 477 -233 -590 -164 457 541 -49
8171d9n80L58O32K14n94m99R8N82L43k45n07k12K89M69P9l66n25K18N10K82
$$ plain form
8171 -49 -629 -271 361 575 -19 -518 -420 162 505 260 -247 -459 -170 299 378 12 -513 -295 215 497
8191D97
$$ Imaginary data points
##PAGE= N=2
##DATA TABLE= (X++(I..I)), XYDATA
0@%%%%%%%%%%%%%%%mJ2j6J6j6J6j6K0k4K5k9L3l7M1m5N2n7O3p0P7q5R3j03J15
39F1j26J37j54J73j90K11k38K64k94L33l80M38n13O09p38R22j197J643k448M176
59B689r241M8885K14925j33319k46149J8191J21523j806k0811M2823q805m7094
71a8189L6020L9994q2106p7466P6459J14221L174n7708n4089o8642j2338J28835
83B8165J26189p0618j66006j8326J22473N3803q2150p2980N6680J14200Q847j21642
95b1365j01886L3795J14655P6969j5451r0244q7458O326Q7707N5283k4095l5299
107a063n920m632L26J6623j8948m9524M5237J36278L131j92597j14139J33020
119e2208J68661q196j02036n5315l562L2590N3820j921o2535J690Q5947J6611
$$ plain form
0 0 0 0 0 0 0 0 0 0 0 0 0 0 0 0 0 -4 8 -8 8 -8 8 -8 12 -12 13 -16 17 -20 21 -24 28 -29 34 -36 41 -44 49 -54 61
39 61 -65 72 -82 91 -99 112 -126 138 -156 177 -203 235 -278 331 -407 515 -682 961 -1487 2689
59 2689 -6552 42333 257258 123939 -122210 -104019 17504 15698 -5113 37710 28905 -18189
71 -18189 17831 57825 -24281 -101747 -25288 88933 92107 34399 -19690 -88332 -100670 28165
83 28165 154354 83736 -82270 -100596 21877 75680 -6470 -79450 -22770 91430 100277 -21365
95 -21365 -123251 -89456 25199 102168 86717 -3527 -90985 -84659 3048 58331 34236 -1063
107 -1063 -6983 -11615 -11289 5334 -13614 -63138 -17901 118377 121508 -71089 -185228 -52208
119 -52208 116453 108257 6221 -49094 -52656 -20066 33754 31833 -30702 -29012 56935 73546
131G3546r8379o4032M4432O3238L3905K6416l2350j19474o0622J12737J36734
142A16151k9303j25553l3770P2267M9191l9307o6221M382Q6808O4086n2064j15278
154f8611m2982P4472J04346K6170o6659p7809j3035M2107M0493J1379j4129k6820
166a1078p344L3284K1018n6422o9649N0493J34394K4972j31485j07169M0823J04490
178B6327N1684k2603o6834m8842L1971O6504r962o7312Q44P4550K8466n1772n3150
191d0129j4174J4072N5599P2883j3044j17369p0976P4703J05904l067p6136l4085
203d5819L4353M4917m651n8494l9354N0560R1606R836r3441q1925K3137Q8415
215A9140N1312k4461n6209l4956O903L9427L3209j5886m5954j919N7685K9505
$$ plain form
131 73546 -24833 -88865 -44433 18805 52710 79126 46776 -72698 -133320 -20583 116151
142 116151 86848 -38705 -72475 -208 48983 9676 -56545 -52163 34645 98731 46667 -68611
154 -68611 -111593 -37121 67225 93395 26736 -51073 -64108 -22001 18492 29871 15742 -11078
166 -11078 -18422 14862 35880 -20542 -90191 -39698 94696 119668 -11817 -118986 -78163 26327
178 26327 78011 55408 -11426 -60268 -28297 38207 28245 -39067 -38223 36327 64793 13021 -40129
191 -40129 -54303 -40231 15368 88251 75207 -42162 -113138 -38435 67469 64402 -11734 -45819
203 -45819 -11466 33451 28800 -29694 -69048 -18488 73118 82954 -10487 -92412 -69275 19140
215 19140 70452 45991 -10218 -45174 -38271 1156 34365 18479 -27475 -29394 28291 57796
227E7796o2284p8011K3421J03974N0527n9879q9256k4450N2772P3581J7512o0523
239E180n6763K7261N9500o377n3920j3344L8346L6104O623k6183n5348l3344N1564
252b0701R3202J0366r2674o9118L7287P3939J5964m0382l8560N735M5321K6186
264D6565m3714o4395J2045Q3206M5222m9002p7390j8408M7198N5372J4488l4021
276A7166n0255j2686M5039M5097k2552o0088m998O3612M2481m0980p3945j3825
288f5934O2592O5581l407o6492n5989J7804P0435L2947m4649n1605J2606M5361
300A9250J1394k6754k9257o834K8777M7826O547o2891n9914K9226Q5346K8327
312G1043n9553o1602P594N1495L1582j8275m6336j7114M3335M8783k0887o7060
$$ plain form
227 57796 -4488 -82499 -59078 44896 95423 35544 -53712 -78162 -25390 48191 65703 5180
239 5180 -51583 -24322 35178 28801 -25119 -38463 -117 35987 42610 16427 -38921 -72265 -20701
252 -20701 72501 82867 -9807 -78925 -41638 32301 48265 7883 -30677 -24942 20379 46565
264 46565 2851 -61544 -49499 33707 78929 29927 -47463 -65871 -18673 36699 51187 17166
276 17166 -33089 -45775 -736 44361 21809 -38279 -43277 20335 62816 21836 -52109 -65934
288 -65934 -3342 62239 58832 -7660 -63649 -45845 24590 57537 12888 -38717 -26111 19250
300 19250 30644 3890 -25367 -32201 -3424 44402 50949 -11942 -71856 -42630 42716 71043
312 71043 11490 -50112 -42518 8977 40559 22284 -24052 -41166 2169 50952 30065 -36995
324c6995k0294N1371N3898l018m7511m1009K666M4599M3173j0712n8387l0636
336e2855M3416N6560j3539o2503k1684M5762N1719m556n5317m3618K0775O4584
348B8744L1503m1719o2624l926N5206L7796k3327m3695j0420K5617L2485P783
360C3423l4168m4123R087O3182L3532m6813o6332J530O3190M1854k6076n4842
372b6556j8740L4997M6543J137m9885l5746L0501N5421L489m8024l4665J4203
384b7325M0382K6092j3715m4378k7632K8409N6038R396n5401m4963K9161O0256
396C6320Q489m8784m0067J3932M9805K8984k9321n5994j0822N0630M5501j8109
408C0564n3431j9294L2362L8580L062k9881l2671j106M0351L7600k1587n9895
$$ plain form
324 -36995 -57289 -5918 47980 44962 -2549 -43558 -40892 3707 46880 36168 -22219 -52855
336 -52855 -9439 47121 33582 -28921 -50605 -4843 46876 42320 -12997 -56615 -35840 28744
348 28744 60247 18528 -44096 -48022 7184 44980 21653 -22042 -32462 -6845 25640 33423
360 33423 -745 -44868 -35781 27401 60933 14120 -52212 -50682 12508 54362 28286 -26556
372 -26556 -45296 -10299 36244 37381 -12504 -48250 -17749 37672 41161 -6863 -41528 -27325
384 -27325 13057 39149 25434 -18944 -46576 -18167 37871 47267 -8134 -53097 -23936 36320
396 36320 44809 -3975 -44042 -30110 19695 48679 19358 -36636 -47458 3172 48673 30564
408 30564 -22867 -42161 -9799 28781 31843 1962 -30709 -31815 8536 46136 24549 -35346
420c5346j4526N3547M7655j9764n7495k2684L6058M9113L768m5701l9969J6470
432b8874N4257K1343m1007m7036Q874M6267K2681k0045l4879j5965K0538M0425
444B6579J2550l8897m4619J1737N6960K5376m1355n1092O446N0635K9498k3325
456B0493m6866j6146L6934M6712o242n2637k6843L2617M4042R90l5994k8156O822
469b4274L2505K6383j0852m3526k4420L4171N1938m035n5346k9982L2060M8184
481C2806N900m0644l8736J0527M9379K6210l2849n0135j504M8157L3031k2369
493A9773m3035j0972K6170L1500O701k7620l6216K136M5647L0502k9048n1298
505c5760m610M7753L6688k0304m8388j6346L3326M2463R99m4373l5036K2661N0891
$$ plain form
420 -35346 -49872 3675 51330 31566 -25929 -48613 -12555 36558 40326 -5375 -45344 -28874
432 -28874 25383 46726 5719 -41317 -32443 13824 36505 16460 -18419 -34384 -13846 26579
444 26579 39129 232 -44387 -32650 24310 49686 8331 -42761 -36315 14320 43818 20493
456 20493 -26373 -42519 -5585 41127 34885 -17752 -44595 -11978 32064 33054 -2940 -31096 -24274
469 -24274 8231 34614 23762 -19764 -44184 -10013 41925 37890 -17456 -47438 -15378 32806
481 32806 38706 -1938 -40674 -30147 19232 45442 12593 -37542 -39046 9111 42142 19773
493 19773 -23262 -34234 -8064 23436 30137 2517 -33699 -31563 14084 44586 15538 -35760
505 -35760 -40370 7383 44071 23767 -24621 -40967 -7641 34822 35821 -8552 -43588 -20927 29964
518B9964R244m0883l2803J2438L4629J7943j3875l1910j7414K1443M0554P165
530C6495m2289l7336K1279N1548J1582m0381l8123Q082M2494K7857k2004m7950
542b8746j1515M2085L9111j5779m6265j5411L0328L3412j277k8848k4739L823
554b3821L2648K7877j6517m7065j5037M0161M1737j0771m6630k2571K7555M1937
566B9503M514l8459l3531J4446M6455J8751l5974m3704P246M5215K2931k1326
578A6067l3974j1884J8884L1983J0265k8077l4560O269M2140K1138l0979m1528
590c4256M158M2971K6651k0294m3013j6666L2147M4764q99m6829k8922K5219L9534
603B4565K489l0193k1848Q743K6582J5962j3560l3593j5018K9696M2748k043m7553
$$ plain form
518 29964 39208 -1675 -34478 -22040 12589 30532 16657 -15253 -32667 -11224 29330 36495
530 36495 -5794 -43130 -21851 29697 41279 898 -37225 -29143 13351 41208 19204 -28746
542 -28746 -40261 1824 40935 25156 -21109 -36520 -6192 27220 25943 -2905 -27644 -23821
554 -23821 8827 36704 20187 -26878 -41915 -1754 39983 29212 -17418 -39989 -12434 29503
566 29503 34017 -4442 -37973 -23527 22928 41679 5705 -37999 -30753 14462 37393 16067
578 16067 -17907 -29791 -10907 21076 31341 3264 -31296 -25027 17113 38251 7272 -34256
590 -34256 -30098 12873 39524 19230 -23783 -40449 -8302 36462 35563 -11266 -40188 -14969 24565
603 24565 27054 -3139 -24987 -16244 10338 26300 12740 -20853 -35871 -6175 36573 34530 -13023
616a3023l0818K3119M4317J2166l0704l5470L311L8182K2544k4753l9272N44M1540
629A1683K7588k3044m2839r858K9814L3117M822k6797l3137j774L5485K8636j7231
642A6465l9105o168L4761K7002j8242l9828r944L2976L8047j667m3023l5936J7447
655b7215M9653J7407l2294l3531M266K6219J4186r661k1188q521J8770K8194j174
668B5111l8645k9465K2846N0155J3904l7425m1037M05L6617L0232j0931l7122
680a5355j2378K9251K6783j5273l5369o246L1351L0247n546l3682k7098N786L5271
693G742L0530j0145m2554k2333K5586L6255j745l3138j5932K3815L1172o069l9582
706a6398k4240K3703M6912J5378l6208m5539r67L9131K7652r321k4283j2444O647
$$ plain form
616 -13023 -43841 -20722 23595 35761 5057 -30413 -27102 11080 33624 8871 -30401 -29857 11683
629 11683 39271 16227 -26612 -36470 -6656 26461 31283 4486 -28651 -30425 5060 33696 16465
642 16465 -22640 -28808 5953 32955 14713 -25115 -35059 -2083 35964 34297 -8726 -44662 -27215
655 -27215 22438 39845 7551 -25980 -21714 4505 18691 9030 -12158 -20679 -1909 26285 25111
668 25111 -13534 -42999 -20153 30002 43906 6481 -34556 -34151 2466 32698 21767 -15355
680 -15355 -27733 1518 28301 13028 -22341 -28587 2764 33011 27465 -6217 -33315 -27529 7742
693 7742 38272 28127 -14427 -36760 -11174 25081 23336 -9802 -25734 -1919 29253 23184 -16398
706 -16398 -40638 -16935 29977 45355 9147 -36392 -37359 1772 29424 20103 -4180 -16624 -9977
$$ [...]
8191d6
##END NTUPLES=NMR FID
##END=
