##TITLE=1H_CG-1107-b
 CDCl3, 8 sc, 
 5.6.2019
##JCAMPDX= 6.0         $$ Bruker NMR JCAMP-DX V2.0
##DATA TYPE= NMR FID
##DATA CLASS= NTUPLES
##ORIGIN= UXNMR, Bruker Analytische Messtechnik GmbH
##OWNER= root
$$ XWIN-NMR		Version 3.5
$$ Wed Jun  5 15:15:34 2019 Russian Standard Time (UT+4h)  she@DPX200
##.OBSERVE FREQUENCY= 200.13155
##.OBSERVE NUCLEUS= ^1H
##.DELAY= (6, 6)
##.ACQUISITION MODE= SIMULTANEOUS
##.ACQUISITION SCHEME= undefined
##.AVERAGES= 8
##.DIGITISER RES= 18
##SPECTROMETER/DATA SYSTEM= spect
##.PULSE SEQUENCE= zg30
##.SOLVENT NAME= DMSO
##.SHIFT REFERENCE= (INTERNAL, DMSO, 0, 15.7039)
##AUDIT TRAIL= $$ (NUMBER, WHEN, WHO, WHERE, WHAT)
$$ ##TITLE= Audit trail, XWIN-NMR		Version 3.5
$$ ##JCAMPDX= 5.01
$$ ##ORIGIN= Bruker BioSpin GmbH
$$ ##OWNER= she
$$ F:/spectra/data/she/nmr/H-F/1/audita.txt
$$ ##AUDIT TRAIL=  $$ (NUMBER, WHEN, WHO, WHERE, WHAT)
(   1,<2019-06-05 15:14:38.17 +0400>,<she>,<DPX200>,
      <created by zg, POWCHK disabled, PULCHK disabled
       configuration hash MD5:
       00 E9 B6 7A A2 85 ED C7 34 08 36 98 17 FE 4E 26
       data hash MD5: 16K
       A5 A6 1F F8 60 CA 12 47 A0 62 AF C2 26 EF 35 3E>)
$$ ##END=
$$ 
$$ hash MD5
$$ 3D 1F 28 1B FE AA E2 FB 4C 0E D3 4F B9 F1 14 26
##$RELAX= 
##$RELAX= 
##$RELAX= 
##$RELAX= 
##$RELAX= 
##$RELAX= 
$$ Bruker specific parameters
$$ --------------------------
##$DU= <F:/spectra>
##$EXPNO= 1
##$NAME= <H-F>
##$PROCNO= 1
##$TYPE= <nmr>
##$USER= <she>
##$AMP= (0..31)
100 100 100 100 100 100 100 100 100 100 100 100 100 100 100 100 100 100 
100 100 100 100 100 100 100 100 100 100 100 100 100 100 
##$AQSEQ= 0
##$AQ_mod= 1
##$AUNM= <au_zg>
##$AUTOPOS= <>
##$BF1= 200.13
##$BF2= 200.13
##$BF3= 200.13
##$BF4= 200.13
##$BF5= 200.13
##$BF6= 200.13
##$BF7= 200.13
##$BF8= 200.13
##$BYTORDA= 1
##$CFDGTYP= 0
##$CFRGTYP= 5
##$CHEMSTR= <none>
##$CNST= (0..31)
1 1 145 1 1 1 1 1 1 1 1 1 1 1 1 1 1 1 1 1 1 1 1 1 1 1 1 1 1 1 1 1 
##$CPDPRG= <>
##$CPDPRG1= <>
##$CPDPRG2= <>
##$CPDPRG3= <>
##$CPDPRG4= <mlev>
##$CPDPRG5= <mlev>
##$CPDPRG6= <mlev>
##$CPDPRG7= <mlev>
##$CPDPRG8= <mlev>
##$CPDPRGB= <>
##$CPDPRGT= <>
##$D= (0..31)
0 1.2 0 0 0 0 0 0 0 0 0 0.03 0 0 0 0 0 0 0 0 0 0 0 0 0 0 0 0 0 0 0 0 
##$DATE= 1559733277
##$DBL= (0..7)
120 120 120 120 120 120 120 120 
##$DBP= (0..7)
150 150 150 150 150 150 150 150 
##$DBP07= 0
##$DBPNAM0= <>
##$DBPNAM1= <>
##$DBPNAM2= <>
##$DBPNAM3= <>
##$DBPNAM4= <>
##$DBPNAM5= <>
##$DBPNAM6= <>
##$DBPNAM7= <>
##$DBPOAL= (0..7)
0.5 0.5 0.5 0.5 0.5 0.5 0.5 0.5 
##$DBPOFFS= (0..7)
0 0 0 0 0 0 0 0 
##$DE= 6
##$DECBNUC= <off>
##$DECIM= 24
##$DECNUC= <off>
##$DECSTAT= 4
##$DIGMOD= 1
##$DIGTYP= 9
##$DL= (0..7)
0 120 120 120 120 120 120 120 
##$DP= (0..7)
150 150 150 150 150 150 150 150 
##$DP07= 0
##$DPNAME0= <>
##$DPNAME1= <>
##$DPNAME2= <>
##$DPNAME3= <>
##$DPNAME4= <>
##$DPNAME5= <>
##$DPNAME6= <>
##$DPNAME7= <>
##$DPOAL= (0..7)
0.5 0.5 0.5 0.5 0.5 0.5 0.5 0.5 
##$DPOFFS= (0..7)
0 0 0 0 0 0 0 0 
##$DQDMODE= 0
##$DR= 18
##$DS= 0
##$DSLIST= <SSSSSSSSSSSSSSS>
##$DSPFIRM= 0
$$ [...]
##$SUBNAM2= <"">
##$SUBNAM3= <"">
##$SUBNAM4= <"">
##$SUBNAM5= <"">
##$SUBNAM6= <"">
##$SUBNAM7= <"">
##$SUBNAM8= <"">
##$SUBNAM9= <"">
##$SW= 24.9336996594482
##$SWIBOX= (0..15)
0 0 2 0 0 0 0 0 0 0 0 0 0 0 0 0 
##$SW_h= 4990.01996007984
##$TD= 16384
##$TD0= 1
##$TE= 0
##$TE2= 300
##$TE3= 300
##$TEG= 300
##$TL= (0..7)
0 120 120 120 120 120 120 120 
##$TP= (0..7)
150 150 150 150 150 150 150 150 
##$TP07= 0
##$TPNAME0= <>
##$TPNAME1= <>
##$TPNAME2= <>
##$TPNAME3= <>
##$TPNAME4= <>
##$TPNAME5= <>
##$TPNAME6= <>
##$TPNAME7= <>
##$TPOAL= (0..7)
0.5 0.5 0.5 0.5 0.5 0.5 0.5 0.5 
##$TPOFFS= (0..7)
0 0 0 0 0 0 0 0 
##$TUNHIN= 0
##$TUNHOUT= 0
##$TUNXOUT= 0
##$USERA1= <user>
##$USERA2= <user>
##$USERA3= <user>
##$USERA4= <user>
##$USERA5= <user>
##$V9= 5
##$VALIST= <valist>
##$VCLIST= <CCCCCCCCCCCCCCC>
##$VD= 0
##$VDLIST= <DDDDDDDDDDDDDDD>
##$VPLIST= <PPPPPPPPPPPPPPP>
##$VTLIST= <TTTTTTTTTTTTTTT>
##$WBST= 1024
##$WBSW= 4
##$XGAIN= (0..3)
0 0 0 0 
##$XL= 0
##$YL= 0
##$YMAX_a= 20996
##$YMIN_a= -30294
##$ZGOPTNS= <>
##$ZL1= 120
##$ZL2= 120
##$ZL3= 120
##$ZL4= 120
##$ABSF1= 10
##$ABSF2= 0
##$ABSG= 5
##$ABSL= 3
##$ALPHA= 0
##$AQORDER= 0
##$ASSFAC= 0
##$ASSFACI= 0
##$ASSFACX= 0
##$ASSWID= 0
##$AUNMP= <proc_1d>
##$AZFE= 0.1
##$AZFW= 0.1
##$BCFW= 1
##$BC_mod= 2
##$BYTORDP= 1
##$COROFFS= 0
##$CY= 11.3945322036743
##$DATMOD= 1
##$DC= 2
##$DFILT= <>
##$DTYPP= 0
##$F1P= 18.9103706918063
##$F2P= -1.10871071338519
##$FCOR= 0.5
##$FTSIZE= 0
##$FT_mod= 4
##$GAMMA= 1
##$GB= 0.15
##$INTBC= 1
##$INTSCL= 1
##$ISEN= 128
##$LB= 0.24
##$LEV0= 0
##$LPBIN= 0
##$MAXI= 10000
##$MC2= 0
##$MEAN= 0
##$ME_mod= 0
##$MI= 1.114404
##$NCOEF= 0
##$NC_proc= 0
##$NLEV= 6
##$NOISF1= 3.799351
##$NOISF2= 2.8
##$NSP= 1
##$NTH_PI= 0
##$NZP= 0
##$OFFSET= 15.70392
##$PC= 1
##$PHC0= -8663.688
##$PHC1= 23.40018
##$PH_mod= 1
##$PKNL= yes
##$PPARMOD= 0
##$PSCAL= 0
##$PSIGN= 0
##$REVERSE= no
##$SF= 200.130013532006
##$SI= 16384
##$SIGF1= 3
##$SIGF2= 2
##$SINO= 400
##$SIOLD= 16384
##$SREGLST= <1H.CDCl3>
##$SSB= 0
##$STSI= 0
##$STSR= 0
##$SW_p= 3612.71676300578
##$SYMM= 0
##$S_DEV= 0
##$TDeff= 0
##$TDoff= 0
##$TI= <>
##$TILT= no
##$TM1= 0
##$TM2= 0
##$TOPLEV= 0
##$USERP1= <user>
##$USERP2= <user>
##$USERP3= <user>
##$USERP4= <user>
##$USERP5= <user>
##$WDW= 1
##$XDIM= 8192
##$YMAX_p= 0
##$YMIN_p= 0
$$ End of Bruker specific parameters
$$ ---------------------------------
##NTUPLES= NMR FID
##VAR_NAME=  TIME,          FID/REAL,        FID/IMAG
##SYMBOL=    X,             R,               I
##VAR_TYPE=  INDEPENDENT,   DEPENDENT,       DEPENDENT
##VAR_FORM=  AFFN,          ASDF,            ASDF
##VAR_DIM=   8192,          8192,            8192
##UNITS=     SECONDS,       ARBITRARY UNITS, ARBITRARY UNITS
##FACTOR=    0.0002004,     1,               1
##FIRST=     0,             0,               0
##LAST=      1.6414764,     0,               0
##MIN=       0,             -30294,          0
##MAX=       1.6414764,     20996,           0
$$ Real data points
##PAGE= N=1
##DATA TABLE= (X++(R..R)), XYDATA
0@%%%%%%%%%%%%%%qJ6j6J6j6J6k1K9l2L2m0M8n2O0o9P7q8J00j11J25j40J57j74
$$ 0 0 0 0 0 0 0 0 0 0 0 0 0 0 0 -8 8 -8 8 -8 8 -13 16 -16 16 -24 24 -28 32 -37 40 -48 52 -59 66 -74 83 -91
37i1J91k14K37k62K94l25L57l94M38m86N41o05O76p59Q60r83J137j334J597j972
$$ -91 100 -114 123 -139 155 -170 187 -207 231 -255 286 -319 357 -402 458 -525 612 -722 875 -1097
57a097K552l584N967k2604n534L2488j094j8683j8705R867K0450R301j4246j4196
$$ -1097 1455 -2129 3838 -18766 -24300 8188 7094 -11589 -30294 -20427 23 9324 -4922 -19118
71a9118J673J5296Q371l509r636j782N726O553Q24j456k214r30J260M299K585
$$ -19118 -17445 -2149 6222 2713 -6923 -8705 -2979 3574 4398 2942 728 -202 1058 5357 7942
86G942j495m464j730L590N360p63n896k569M184M034k337o185j522N489L943n715
$$ 7942 6447 1983 253 3843 9203 8440 2544 -25 4159 8193 5856 -329 -1851 3638 7581 1866
102A866q432R64R087L725q108j0910Q64J2165O579r617j4055q3J3627R654p158
$$ 1866 -6566 -5602 3485 7210 -898 -11808 -10944 1221 7800 -1817 -15872 -15955 -2328 7326 168
117A68j5243l920J2459J2018l273j3060o020P445J1482K159q634p889J938Q287
$$ 168 -15075 -18995 -6536 5482 2209 -10851 -16871 -9426 2056 4215 -4419 -12308 -10370 -2083
131b083N538j468o246l978K915P120L906l032p172k989O134R027M94q835o967
$$ -2083 3455 1987 -4259 -8237 -5322 1798 5704 2672 -4500 -7489 -1355 7672 8166 -669 -7636
146g636L914J0316L818q072r535K208J0848M600p456r341Q33R770N187o747r025
$$ -7636 -3722 6594 10412 2340 -7195 -4987 5861 10461 3005 -6336 -5503 4267 9454 2707 -6318
161f318J337R007L779o239p823J108Q540M058o281p677J197P693L821m457o850
$$ -6318 -4981 4026 7805 1566 -6257 -5149 3391 7449 1168 -6509 -5312 2381 6202 1745 -5105
176e105m65O335M548k610n600j997K824M579J468l081m125r23L043M431J162m619
$$ -5105 -5570 765 5313 2703 -2897 -4894 -2070 2509 3977 896 -3229 -4152 -1109 3322 4484 -135
192a35n787Q55P365N142m007r080l039P908R360j889j1019n584P163J0733O61
$$ -135 -5922 -5067 2298 7440 3433 -5647 -8686 -778 8582 6693 -4326 -9910 -2747 7986 8647
207H647j0655q057N350J1592K399r022q034K829R681L784o453p532J503P600L468
$$ 8647 -2008 -10065 -4715 6877 9276 254 -7780 -4951 4730 8514 2061 -5471 -3968 3632 7100
222G100m003n490k98M837L462k078l757o79K244K313K33j976k212K26K292J796
$$ 7100 3097 -2393 -2691 2146 5608 3530 -227 -906 1338 3651 3884 1908 -304 -78 2214 4010
238D010l24k994k640J664M577J124m522m586J357O207L116n138p449M61Q216N041
$$ 4010 3686 692 -1948 -284 4293 5417 895 -3691 -2334 3873 6989 1851 -5598 -5137 3079 8120
254H120n085q884j263Q522P261m255r986k529Q209P883k196r369m378O293Q361
$$ 8120 3035 -5849 -7112 1410 8671 4416 -5570 -8099 110 7993 5797 -3572 -7950 -1657 6704
269F704l26p722m528L490O798J699m870m826J123M748K597j587l416j943J929
$$ 6704 6378 -1344 -5872 -2382 4416 6115 1245 -3581 -2458 2290 4887 3300 -116 -2059 -130
284a30L395J157k240l178q63K971L865n28m852l074K855N273J079n140n079K029
$$ -130 3265 4422 2182 -996 -1859 1112 4977 4449 -403 -3477 -622 4651 5730 590 -4489 -2460
300b460O901J950n858n919J703P230L250n479p089J037P651L569n010o960J16
$$ -2460 4441 6391 533 -5386 -3683 3547 6797 1318 -5771 -4734 2917 6486 1476 -5484 -5368
315e368P076M734m028o999p55N882M598k027n723k212L911M847k63m278k752J289
$$ -5368 1708 6442 2414 -4585 -5340 542 5140 3113 -2610 -4822 -911 3936 3673 -605 -3357 -2068
331b068L748K088j730l542j209K314L465R49k972m054K33M903L307k512n380j731
$$ -2068 1680 3768 2038 -1504 -2713 -399 3066 4015 1043 -3011 -2778 2125 5432 2920 -2460 -4191
347d191M556N611j120o891l376M528O504j17o554m719L655P185Q35o454m898K635
$$ -4191 365 5976 4856 -2035 -5411 -883 5621 5504 -1050 -5769 -2114 5071 5906 -548 -5446 -2811
363b811O348J928n057n183J391N822K083l729m442K16M093K893k041l924o97K484
$$ -2811 3537 5465 408 -4775 -3384 2438 4521 792 -3650 -3434 659 3552 1511 -2413 -3110 -626
379f26K492o7k431k148P25K700J612j186k742j498J799L671P58l636l315J278
$$ -626 1866 1799 -632 -2780 -2055 645 2257 1071 -1671 -3169 -1370 2301 3059 -577 -3892 -2614
395b614M716K416l459n238O1N782L960l158o138j168N534N340k150o884k215N169
$$ -2614 2102 4518 1059 -4179 -4118 1664 5624 2466 -3672 -4840 694 6034 3884 -3000 -5215 -46
411d6N745j027o153l425L711N987K02n295l681K334M805J408l486l935N56L897
$$ -46 5699 4672 -1481 -4906 -1195 4792 4994 -301 -3982 -1648 3157 4565 1079 -2856 -2300 1597
427A597K049j786l039j147J831K970K60k614k418M21K829K114j285l740j376K928
$$ 1597 3646 1860 -1179 -2326 -495 2475 2735 121 -2297 -1876 953 3067 1782 -1958 -3334 -406
443d06L537l40l953k961K252M959R26m675l939J844N422J957m002n058Q67N732
$$ -406 3131 2791 -1162 -4123 -1871 3088 4014 -661 -4600 -2756 2666 4623 621 -4437 -3570 2162
459B162K958l594n115r9N004L740k270n289j156M298L918j034m249k254K602M040
$$ 2162 5120 1526 -3589 -3688 1316 5056 2786 -2503 -3659 639 4557 3523 -726 -2980 -378 3662
475C662M33l278k648R01L074J887j408l153j081K265K817K24k573k850N35L712
$$ 3662 4095 817 -1831 -930 2144 4031 2623 -530 -1611 654 3471 3695 1122 -1728 -1193 2519
491B519K061k483l972o34L654L431j200n065k145L594M474n38m901l165K736N156
$$ 2519 4580 2097 -1875 -2509 1145 4576 3376 -1689 -3834 -240 4234 3696 -1205 -4370 -1634 3522
507C522O25m968l833K160M911J546l875m314R13M813K268l020m011J5L520K944
$$ 3522 4147 -821 -4654 -2494 2417 3963 88 -4226 -3313 1500 3768 748 -3263 -3248 272 3216
523C216j318l774j192K743K955j09k494k160R36L067J535j720k601n26K299K710
$$ 3216 1898 -1876 -3068 -325 2630 2521 27 -2133 -1197 1870 3405 1685 -916 -1442 857 3567
539C567j13l141k176J808L447J077k834l473N02M123K280k629m229n93L829L315
$$ 3567 3454 313 -1863 -55 3392 4469 1635 -1838 -1336 2787 5067 2438 -1791 -2384 1445 4760
555D760j629m617j853L508L831q89m310k513K268M122M69l848l042J358L725J272
$$ 4760 3131 -1486 -3339 169 4000 3111 -1199 -3712 -1444 2678 3147 -701 -3743 -2385 1340 2612
571B612k495l286k5L226K097j354k791j059J987K603K99k483k096R88K759J474
$$ 2612 117 -3169 -3194 32 2129 775 -2016 -3075 -1088 1515 1814 -669 -2765 -1777 982 2456
587B456j381k896o18K793K735p47l318j640K119L545M97l557k867J550L916J161
$$ 2456 1075 -1821 -2439 354 3089 2342 -976 -2616 -497 3048 3545 -12 -2879 -1329 2587 3748
603C748k920l629L85M048K257k726m107l07L315K878j474m100j454K804L279o65
$$ 3748 828 -2801 -2416 1632 3889 1163 -2944 -3251 64 2942 1468 -2632 -4086 -1282 1997 1332
619A332l399k165J539L328P80k787k478N43K816J647j203k893q11K345K626k17
$$ 1332 -2067 -4232 -2693 635 1415 -1372 -3850 -3307 -491 1156 -47 -2940 -3751 -1406 1220 1003
635A003k439j842J157L111J261k145k749K82L049K230j105l400j139K937L097
$$ 1003 -1436 -3278 -2121 990 2251 106 -2643 -2361 688 2918 1813 -1587 -2726 211 3308
650C308n95l528j888K015L622L88l425k887J321L601J135k776l361J58L372K089
$$ 3308 2713 -815 -2703 -688 2934 3322 -103 -2990 -1669 1932 3067 291 -3070 -2912 460 2549
666B549k144l473p76K518K510p85l270j692J831K858K17k551k394N84K910J547
$$ 2549 405 -3068 -3844 -1326 1184 399 -2871 -4563 -2732 126 343 -2208 -4602 -4018 -1108 439
682D39j780k757k87K445K412m77k908j572J987L231M51k588k341Q79L556J791
$$ 439 -1341 -4098 -4385 -1940 472 -5 -2913 -4485 -2498 733 1184 -1404 -3745 -2866 690 2481
698B481k269l185J86L375K409j251l466j101K977L093n73l394j777J887L270N20
$$ 2481 212 -2973 -2787 588 2997 1746 -1720 -2821 156 3249 2676 -718 -2495 -608 2662 3182
714C182l036k649J199L128J127k245k846j16K739J896j351k909q45J728K421n6
$$ 3182 146 -2503 -1304 1824 2951 706 -2140 -2256 483 2379 1028 -1881 -2726 -998 1423 1367
730A367k710j929J095K611P51j860k399j73K588J941j226k819r04K111K521r4
$$ 1367 -1343 -3272 -2177 434 1185 -675 -3074 -3247 -659 1282 56 -2763 -3667 -1556 965 871
746H71k845j963J581L076O61k366k484N07L083J741j962k953j76K747K312q25
$$ 871 -1974 -3937 -2356 720 1381 -985 -3469 -2962 121 1862 -100 -3053 -3229 -482 1830 1005
762A005k959j413K248K880j08k780j787J236K913J067k182k476L76K745J664j143
$$ 1005 -1954 -3367 -1119 1761 1653 -1127 -2914 -1678 1235 2302 120 -2356 -1980 765 2429 1286
778A286k556p99K204K448l98k483j440J377K588R19k272k353N51K832J348j411
$$ 1286 -1270 -2069 135 2583 2185 -298 -1738 -361 2227 3146 874 -1479 -928 1904 3252 1841
794A841k689n89K465K254q89k818j321J775K526K08k623k258R91K870P87k141
$$ 1841 -848 -1437 1028 3282 2393 -425 -1746 29 2555 2763 140 -2118 -1127 1743 2530 389
810C89k509j9K571J678j431k912n91K030J999k79k606j614J455K499L31j987j979
$$ 389 -2120 -2139 432 2110 679 -2233 -2824 -794 1205 926 -1680 -3294 -1839 660 991 -996 -2975
827b975L66K501J518j328k410l63K258K036l62k363j291J663K737K96k073j830
$$ -2975 -2609 -108 1410 82 -2328 -2691 -433 1603 1241 -1122 -2413 -750 1987 2283 210 -1620
843a620Q25K663J363j598k462J14K501J898r49k577j023K083K506k98k601j631
$$ -1620 -795 1868 3231 1633 -829 -715 1786 3684 2735 158 -865 1218 3724 3426 825 -806
859h06J250K537O59k262k423N48K552J234j650k647n53K214K068j009k757j116
$$ -806 444 2981 3640 1378 -1045 -497 2055 3289 1639 -1008 -1561 653 2721 1712 -1045 -2161
875b161J637K167J50k386k031R42K546Q42j854k267lK255J836j009k584o76J976
$$ -2161 -524 1643 1793 -593 -2624 -1682 864 1706 -148 -2415 -2418 -163 1673 664 -1920 -2596 -620
892f20K141k15k296j539J367K608O54j994j936N22K516J466j447k482l1K254J829
$$ -620 1521 1306 -990 -2529 -1162 1446 2100 106 -1830 -1308 1208 2674 1227 -1255 -1286 968 2797
909B797o18k341j145J622K413J0k270j549Q26K311Q88j691k264N4K365J410j090
$$ 2797 2179 -162 -1307 315 2728 2738 468 -1081 -255 2056 2944 1253 -1011 -957 1408 2818 1728
926A728k335r01J790K141m55k494j317J215K221M93j993k153M82K490J063j421
$$ 1728 -607 -1508 282 2423 1968 -526 -1843 -628 1593 2086 93 -2060 -1578 912 1975 554
942E54k224m67J968K031p95k479q88J546K128J99k108j822R39K433Q29j739j990
$$ 554 -1670 -2137 -169 1862 1067 -1412 -2300 -754 1374 1573 -535 -2357 -1418 1015 1844 105 -1885
959a885J11K153J651r85k416n09J795J967k19k158j418J261K315M10j955j726
$$ -1885 -1774 379 2030 1045 -1371 -1880 -85 1882 1663 -495 -1913 -652 1663 2073 118 -1608
975a608N80K141J218j269k289j90K086J541p22k111r60J440K171qk138j429R02
$$ -1608 -1028 1113 2331 1062 -1227 -1417 669 2210 1488 -623 -1583 -143 2028 2020 -118 -1547 -645
992f45J994Q13j592k086J45K138J237j039k066o79J547J998l23k248j171J144
$$ -645 1349 2162 570 -1516 -1371 767 2004 965 -1101 -1780 -233 1765 1442 -806 -1977 -833
1008h33J979N05j770j901M97K101J013j289j898l71J830J709n77k083r69J298
$$ -833 1146 1651 -119 -2020 -1523 578 1591 302 -1596 -1967 -137 1572 995 -1088 -2057 -759
1024g59J939K71j767j628P13K204Q18j430j834mJ868J561q44k176o38J767J752
$$ -759 1180 1451 -316 -1944 -1231 973 1791 361 -1473 -1477 391 1952 1108 -1068 -1706 61 1813
1041A813k28j849j340R48K215M73j707j678L18K032J135j078k145l23J882J581
$$ 1813 1585 -264 -1604 -656 1559 2032 325 -1353 -1035 997 2132 1054 -1091 -1414 468 2049
1057B049o97j953r82J245K064J77k046j490P08K008P89j371k081N1K023J293q99
$$ 2049 1352 -601 -1583 -338 1726 1903 -143 -1633 -925 1083 1872 501 -1580 -1529 494 1787 888
1074H88j989o48J444J963k20k115j185J090J848M96j508j755L48K060J100j256
$$ 888 -1101 -1749 -305 1658 1438 -677 -1862 -772 1076 1572 64 -1691 -1343 717 1817 561
1090E61j827k58J683J565m59j989r51J415J805Q3j654j485P04J981Q44j491j726
$$ 561 -1266 -1524 159 1724 1265 -724 -1675 -260 1545 1628 -26 -1511 -807 1174 2018 527 -1199
1107a199J43J675J475r04k004n64J552J678k53j731j255Q85K073M35j711j577
$$ -1199 -1056 619 2094 1190 -814 -1378 174 1852 1599 -132 -1387 -502 1571 2006 295 -1282
1123a282L76J816J083j076k001l21J829J398o08j889r08J231J864J18j868j418
$$ -1282 -906 910 1993 917 -1084 -1405 424 1822 1214 -675 -1583 -352 1512 1630 -238 -1656
1139a656Q11J878P02j319j843j9J919J249r48j808n99J502J712k06j923j125J106
$$ -1656 -845 1033 1735 416 -1427 -1446 473 1722 774 -1034 -1633 -131 1581 1375 -548 -1673 -567
1156e67J886L10j597j537M57J972Q50j196j674n0J507J434n66j868p73J292J639
$$ -567 1319 1629 32 -1505 -1048 924 1774 578 -1096 -1146 361 1795 1229 -639 -1412 -120 1519
1173A519o5j521j255O62J795O21j315j570J58J527J092o73j759n18J320J350j45
$$ 1519 1454 -67 -1322 -660 1135 1756 441 -1129 -971 556 1648 975 -784 -1302 18 1368 1223
1190A223j533j148O84J797M99j550j367L30J577R17q64j817l46J563J388n89j603
$$ 1223 -310 -1458 -774 1023 1522 -28 -1395 -1065 512 1429 565 -1252 -1598 -35 1353 764 -839
1207h39p62R56J740J31j612j243O22J577P45j162j554m8J630J257r02j509n60
$$ -839 -1601 -645 1095 1226 -386 -1629 -1007 570 1315 153 -1401 -1449 181 1438 536 -973 -1533
1224a533J104J558M1j691j149Q52J656L12j148j459J42J776R84j038j551k70J260
$$ -1533 -429 1129 1170 -521 -1670 -818 838 1150 2 -1457 -1315 461 1445 407 -1144 -1414 -154
1241a54J351k42j769p95J081J587M8j411j179M05J774P14j239j528O7J516J112
$$ -154 1197 955 -814 -1609 -528 1059 1107 -304 -1483 -1078 696 1410 171 -1357 -1290 226 1338
1258A338o24j717o44J335J482k66j453r38O47J550M19j307j364L22J477P64p19
$$ 1338 714 -1003 -1647 -312 1170 904 -549 -1487 -840 710 1129 -178 -1542 -1220 257 1021 302
1275C02j509m15J322J290m51j459p65Q32J471L24j448j268M02J500O90q56j494
$$ 302 -1207 -1622 -300 990 539 -920 -1685 -853 618 942 -506 -1774 -1372 128 818 -38 -1532
1292a532j97J530J174o22j596o10J102J571n0j574j096R26J659L57j308j309K51
$$ -1532 -1729 -199 975 353 -1243 -1853 -751 820 770 -804 -1900 -974 685 1042 -266 -1575 -1324
1309a324J627R87r96j511j21J230J263k60j626q30J060J562M4j367j137M48J537
$$ -1324 303 1290 294 -1217 -1338 -108 1155 895 -731 -1561 -501 1061 1105 -262 -1399 -951 586
1326E86P63j165j465J45J258J046n37j581n55J138J374j76j471q77N61J602M04
$$ 586 1349 184 -1281 -1136 122 1168 631 -950 -1505 -367 1007 831 -640 -1517 -956 646 1050
1343A050j302j254K92J433P54q14j484k94J435J174m41j575n70R79J399P9j407
$$ 1050 -252 -1506 -1214 219 973 159 -1325 -1619 -184 990 549 -1026 -1596 -617 782 861 -546
1360e46j061O93J555L36r92j286Q4J441R02p07j411k45J057J093j05j316r15Q61
$$ -546 -1607 -914 641 977 -15 -1301 -1217 224 1126 419 -992 -1237 -180 913 808 -508 -1423 -562
1378e62J337J65r89j118J14J352Q36p80j349j86J118J104l03j311q17Q57J386
$$ -562 775 940 -49 -1167 -1053 299 1135 355 -994 -1180 -62 1042 739 -572 -1389 -532 854
1395H54J17j191j048L82J411O89r02j382L5J362Q96n48j293n07J105J291k37j281
$$ 854 971 -220 -1268 -886 525 1214 312 -1070 -1035 327 1223 675 -618 -1125 -20 1271 1034 -247
1413b47p27O32J356K52j026j197M03J306N78p65j169k16J075J099n03j326m84
$$ -247 -974 -342 1014 1266 240 -957 -554 752 1330 565 -604 -820 255 1354 851 -475 -959
1430i59P15J154J67j207j005N10J241M53r32j095j26J125J020o49j283l89R05
$$ -959 -244 910 1077 -130 -1135 -625 616 1069 137 -958 -1084 41 1061 412 -871 -1260 -355
1447c55J111N1j275r11P02J391J63j007r87J87J287P92p46j252p2J115Q25k08
$$ -355 756 807 -468 -1379 -677 714 877 -130 -1117 -930 357 1149 403 -849 -921 194 1019 811
1465H11j084o14P91J234J20j043r04M01J146O25q72j151N9J144P37l77j175n27
$$ 811 -273 -887 -96 1138 1258 215 -689 -288 858 1483 611 -540 -481 663 1400 1023 -152 -679
1483f79R00J167j59j163p93N41J082N06j060j165K04J196P06p28j259l10J125
$$ -679 221 1388 1229 66 -727 -186 896 1402 342 -823 -619 577 1283 555 -704 -1014 111
1500A11J022l86j365n59Q11J188J00j200j024N47J327L10q51j106N0J134Q88n04
$$ 111 1133 747 -618 -1177 -366 822 922 -278 -1302 -755 572 882 31 -1075 -1025 109 997 493
1518D93j438j81J020R72j39j097o95O57J288J17r77q33K86J096O66o10j202q5
$$ 493 -945 -1126 -106 866 727 -370 -1065 -408 880 997 20 -813 -527 569 1235 625 -577 -662
1536f62J038Q74k62j128o42P58J246l3j039q20M11J066N21q06j163O8J153O68
$$ -662 376 1250 988 -140 -782 -24 1222 1189 150 -670 -259 807 1328 522 -641 -573 580 1248
1554A248n64j137l48Q63R82j74j187n98N46J124J67j024q96K57J223M52p31j055
$$ 1248 684 -453 -801 62 1044 870 -317 -915 -369 755 922 -102 -998 -741 482 934 203 -852
1572h52k11R91R28l55j215l92P38R73P0r98p59L58J193L72q22r26O5J058P66m96
$$ -852 -1063 -72 856 501 -714 -1106 -368 605 675 -323 -1082 -724 469 841 19 -907 -842 216 982 486
1592D86j197k67J026Q46j29j012o92P06J204R2j022p55K78J063N43o73j086p9
$$ 486 -711 -978 48 894 765 -247 -939 -233 971 1063 41 -714 -436 627 1170 497 -589 -668
1610f68J119N92l33r82m85P45R78j68r89n96M97Q94L00q09r08J25J005N09n29
$$ -668 451 1043 710 -272 -757 -12 966 798 -191 -787 -290 604 904 95 -813 -688 317 826 297
1629B97r70l13Q73Q32k33j037m75O24Q77K21q23q83K31J077M47o29r66J3P79Q76
$$ 297 -673 -986 -113 719 486 -551 -1026 -402 475 696 -127 -1010 -779 298 745 116 -850 -837 -58 818
1649H18l90j038l26P27Q48R6r08p76M69J087L59q96p57J55Q14P23m82j119j52
$$ 818 428 -610 -936 -209 639 735 -173 -949 -480 607 966 70 -687 -532 282 1005 523 -596 -748
1668g48R16P68k30q83n99N72J051J02r26p50K96Q69N28n80j025n1R68N87l89r09
$$ -748 168 936 706 -177 -776 -204 847 949 23 -727 -431 438 966 386 -639 -690 278 865 476 -433
1688d33m38O67R70r5r35o77N01R25L04p88r34J50J024O13o45r31k22P92R02k47
$$ -433 -871 -204 766 671 -264 -941 -440 485 789 1 -933 -783 241 854 209 -722 -944 -152 750 503
1708E03r74m64O17R21R8q00p89L27J064L61p44q14K4Q29P46l35j056k59P14Q45
$$ 503 -471 -935 -318 603 701 -99 -888 -561 503 864 120 -694 -670 159 905 570 -486 -745 -31 814
1728H14o8q37o86M48J080J97p90r08L06Q62N38n18j004j87R20O92k59q88m96N74
$$ 814 746 -91 -777 -329 751 948 158 -750 -444 418 956 438 -566 -753 167 859 600 -288 -784 -210
1748b10R17J53j016o24L25Q68M55o24r77j4R98N57m33q92l43O74R45j06j035n03
$$ -210 707 860 -156 -780 -455 413 868 244 -733 -747 251 808 375 -517 -860 -186 759 653 -382 -885
1768h85N53R18K15p31q45J54J005N15o27q38j55Q12P64k35r98m15N92R24Qq13
$$ -885 -332 586 801 70 -775 -621 384 899 272 -566 -721 91 855 620 -378 -793 -201 723 731 -82
1788h2o98L86R75K86p17q01Q9P45P04m26j007j53P06O84j82p31n26L95R61J31
$$ -82 -780 -394 581 867 150 -651 -562 183 887 461 -546 -699 7 691 509 -222 -748 -353 608 739
1808G39q85o04J98Q06M90n23q62m8P55O56l87p87l58N09R26L1p94o12L94P52L50
$$ 739 -146 -750 -552 254 744 221 -641 -689 66 722 335 -452 -810 -301 625 656 -138 -750 -356 396 746
1829G46n56p89q2R29N90m84p49l05O10P83kr54m76N68P71J03o31p30K13Q30M33
$$ 746 190 -599 -681 248 838 354 -395 -700 -90 693 691 -263 -739 -171 600 703 72 -658 -445 385 818
1850H18o12p63p5O78O57j83r47l69N90Q10j10o79n35J76R18L65p39p92J39P37
$$ 818 206 -557 -632 46 703 520 -427 -796 -206 604 494 -185 -720 -544 374 739 0 -792 -653 84
1870H4N66l65q44k81P15P24j48p92m31L07R07K03p38p00K56P76L52l30q90j51
$$ 84 650 285 -559 -840 -125 599 451 -341 -772 -465 442 645 -93 -793 -537 239 591 261 -629 -780
1890g80Q83N84k82p06l55M31Q06J56p98o51M02P43L32n23p87mQ17O13l82r24k06
$$ -780 103 687 405 -301 -656 -225 581 737 -61 -712 -310 433 765 242 -545 -549 268 881 499 -425 -631
1911f31N86P42n9q40n13M39P18K07n84p78J45P70M50n08p90k0N96O53j50r42l69
$$ -631 -45 697 638 -202 -715 -276 442 649 65 -713 -568 202 652 144 -646 -666 -70 583 433 -509 -878
1932h78N90P74K8p77n88K17R34K87o38p83J29P83M91l23q51k47P42P56k05o88
$$ -878 -288 486 514 -263 -851 -634 300 587 -51 -834 -705 78 569 246 -605 -852 -110 646 441 -247
1952b47m98M22Q33K08p64o68L47P74L24m23q31j20Q97N32l18p72k96N75O67N3
$$ -247 -745 -323 510 718 -46 -714 -367 407 731 308 -523 -643 254 786 468 -304 -600 -25 642 695
1972F95q05o00M43P29J58n07p06RQ32M65m29q12j35N89O28r3q22m89N35O98R5
$$ 695 -110 -710 -267 462 620 113 -593 -584 248 713 284 -528 -663 -74 554 461 -361 -850 -315 383 478
1993D78o24n72K06O88M41n71p23L0O69N55j91q73l32O66Q20j96o29n22L39P75
$$ 478 -146 -718 -512 176 617 46 -677 -647 22 577 386 -487 -819 -153 667 471 -158 -680 -341 434
2013D34K44o52p00K73O79M92l85q33j60O69N69j97o87l25M00O63K17p57o03K15
$$ 434 678 26 -674 -401 278 770 385 -448 -608 61 630 433 -254 -579 -179 484 701 -56 -659 -444
2033d44P46L30m47p47m6O65O26l71p11k13M40P24Pp68n42M28P32K03n65o07Q4
$$ -444 302 632 185 -562 -608 57 683 312 -399 -612 -172 552 559 -209 -751 -323 409 612 47 -560 -476
2054d76P81M64n69o87k0O28N58k14p41l35M81O51L1o74m24J93P07K96m78p31Q3
$$ -476 305 769 200 -487 -507 121 679 465 -276 -611 -130 521 552 -122 -546 -353 354 650 172 -559 -476
2075d76O20M00k31p18l17N81O46q0o03m29J72O76K86n31o71Q0P39L70k91p16k06
$$ -476 144 544 313 -405 -722 -141 505 425 -178 -607 -435 241 527 -4 -675 -595 144 514 223 -493 -699
2096f99O01O15j19o79l32L74P63M9n69n31K29P44K57n46n29o1O34N62l04o82k11
$$ -699 -98 517 398 -281 -613 -239 524 573 4 -527 -298 446 703 157 -372 -433 201 763 459 -223 -434
2117d34M93N26Lo70m46L97O27J16m54o05QN57N13m32o01j62M93N63j67o39m93
$$ -434 59 585 588 -82 -528 -131 496 612 158 -447 -439 118 631 199 -402 -564 -71 492 325 -314 -807
2138h07M61P07O6o15n13J45P11M11n44p52J62O23M43k82o68k62O44P09k17o73
$$ -807 -346 361 427 -188 -701 -556 155 566 22 -730 -568 55 498 216 -452 -714 -70 639 422 -251
2158b51l78L92P03J77n40o12K72O47K63l82o43n9N73M91k02o71j45K77O26R2n59
$$ -251 -629 -237 466 643 103 -509 -237 410 673 291 -352 -411 162 653 451 -220 -365 -88 538 630 71
2179G1n86K17O12K46m29o29j5N71N82l61o93k67M92O13k0o63m99L62P96L1n45
$$ 71 -515 -298 314 560 131 -498 -513 58 640 279 -414 -681 -189 424 404 -259 -758 -396 400 431 -114
2200a14o04K29O44M27n06o71rO78M40k78o24k72O14N59l0o31l66L50M36L40m42
$$ -114 -718 -489 155 582 76 -595 -604 74 514 236 -388 -660 -46 513 483 -148 -514 -164 272 612 170
2221A70n98J42N31K86k61n01j36L86M99k3o00l29K69N11J99m82o01J50P04K45
$$ 170 -428 -286 245 531 270 -231 -367 19 518 495 -105 -434 -165 346 545 63 -538 -388 316 561
2241E61l55o24j85O67N85k75o74l04M64N92l0n98n17L83O43R4m51m99Q7N70L24
$$ 561 206 -418 -603 64 649 374 -300 -604 -140 452 422 -176 -693 -310 333 427 -24 -523 -436 134 458
2262D58l22o09O0M46K95p8l83l25K40N66J5l80l62O2M06L73k58n50o2M29L46J05
$$ 458 136 -473 -413 33 328 250 -133 -458 -218 348 363 -17 -379 -317 89 462 204 -346 -408 21 367 472
2284D72n29l94K42N67J65m57n55J49N64L51l93p33O8P04L83l25n99k06N29O34
$$ 472 -57 -451 -209 358 523 66 -489 -340 224 575 182 -551 -483 221 604 279 -320 -526 3 637
2304F37k01p41k25M02N39J4n14m40K53N76J37m30m53J0M91K99j58n29j31L04L53
$$ 637 436 -305 -530 -128 411 425 -89 -529 -276 300 437 7 -446 -436 55 354 196 -333 -464 -160 193
2325A93J26m13l23L1N34K85l59m71p9M59N14j09p48j94M48N05O8n91n03L28P33
$$ 193 319 -94 -417 -386 148 433 74 -397 -476 -17 497 388 -360 -554 -106 399 467 -124 -627 -299 434
2346D34J09n28n36J59O51L53m68o42K1O94L23l17n30j59L89N68j32o20j51J99
$$ 434 543 15 -521 -362 289 642 174 -468 -447 247 570 253 -277 -436 -47 521 389 -231 -382 -183
2366a83M30J05m15l23J05M09J17j60l91j87L72M03k6m20l35J95M59K56l32o08
$$ -183 247 352 -63 -386 -281 128 245 85 -306 -493 -121 282 256 -164 -499 -304 155 411 79 -529
2386e29PO50L09k16o43j15N57N95k08o41l62M87O79p1n31m77K52P61Q9o15m03
$$ -529 -522 128 437 221 -422 -537 20 615 407 -234 -596 -109 570 499 -32 -509 -257 504 593 -22 -425
2407d25J84N51K80m60n04R3M59K48k08m06j74K83N01j00m32k11J35K43K35k05
$$ -425 -241 310 590 130 -374 -281 178 426 218 -188 -362 -79 422 322 -110 -321 -186 57 292 87
2427H7m29n0L00L72o7m13k73J63N81N1m05m26J44N66L56m70o08J4O54L58l16n85
$$ 87 -342 -392 -92 280 213 -200 -473 -310 271 322 -83 -509 -365 201 557 87 -521 -507 147 505 189 -396
2449c96r2N03N24k11o84j21N10M52j68m16l39L39M28M6l60k49J07L22J93k03l53
$$ -396 -488 15 539 328 -356 -477 33 485 317 -99 -438 -99 329 375 15 -234 -127 195 388 185 -168
2470a68l8J84K97l0k46k41M3L53K00j94l85n7L20L91p6n28k78L82N22l0m78m25
$$ -168 -206 -22 275 245 -1 -242 -199 154 354 160 -225 -282 38 429 353 -175 -453 -71 451 421 -57 -482
2492d82K37O77J34n81m94K46N68K33l95o33J12N87L75l87n71j9M58L97j79n46
$$ -482 -245 432 566 -15 -509 -263 305 538 143 -490 -378 209 584 197 -374 -393 65 462 283 -263
2512b63o5K79L51n8k76k17P5L37J90l14j43r1J82L30k5l45k16J34K80K48k52l43
$$ -263 -328 -49 302 244 -32 -249 -174 163 353 39 -104 -195 -13 317 292 -53 -269 -135 145 393 141 -202
2534b02j10M28M32k61m87j97M67M41j11o17l27N05N89q5n31l24K05O62Q8o50l28
$$ -202 -312 116 548 287 -200 -397 70 511 400 -217 -544 -39 550 465 -66 -390 -185 477 565 -85 -413
2555d13K46N22P4l07m79O0M54J82j52m79PK25K75k5k66j70J08L09N2j15k79j61
$$ -413 -167 355 429 122 -357 -297 157 339 187 -292 -285 -60 215 190 -76 -246 -138 171 223 108 -171 -332
2577c32K89L25m7l55k37J25M88K15m60m21J35N45K26l04n50j9O52L71m12n00r6
$$ -332 -43 282 235 -120 -357 -232 256 471 11 -410 -275 270 496 192 -358 -377 275 646 234 -266 -362
2598c62N24M16k02o32j33M91M97j73n48k52L15M41M3m63k79K32L03Q3k84k42O9
$$ -362 162 578 376 -256 -389 102 599 426 -122 -374 -59 382 425 -38 -317 -85 218 301 17 -225 -156
2619a56J91J58k9k27j30K5L09J35j52l39n6K28L22J7m77k64L14L83Q7m92l83K63
$$ -156 35 193 164 -63 -193 -168 141 276 124 -215 -271 -43 279 296 -181 -445 -131 252 339 -153 -536 -273
2641b73O22Q8n44m68K11N77J61k94n24NO54K22m20l88L7M18K99j51n44kM06L00
$$ -273 349 437 -107 -575 -364 213 374 80 -444 -439 215 437 17 -371 -334 84 383 232 -312 -314 92 392
2663C92j50l51n7N9L52O2k11k11Q1Q4K00M2k23k67J77J93J46j85l07LL14L67k97
$$ 392 242 -109 -166 -107 245 307 96 -115 -34 50 250 292 69 -198 -21 172 318 133 -174 -171 143 510 213
2686B13m97l6L47M03j79n43k94M53N04j86n08k32K97M59L2n35l25K89M22J01m54
$$ 213 -284 -320 27 430 251 -292 -586 -133 371 185 -323 -555 -258 201 233 -302 -627 -338 84 185 -269
2707b69l04J35M27J75k56l40J04K08K54n8l15j8J78J97L2m8j93m6J71K71n7k32
$$ -269 -573 -438 -11 164 -92 -432 -328 -120 134 76 -239 -257 -79 118 150 102 -91 -137 34 305 248 16
2729A6j22J00L76J66m09l72Q5N40J65k69n10J6M80K98l42n14p7M77K89j66n45
$$ 16 -106 -6 370 536 127 -245 -160 380 545 276 -234 -218 262 560 218 -296 -373 104 393 227 -318
2750c18j62M24M10k27n04j74L56L54k8m02k67K38L00N0k58j62l7L02J97j95j57
$$ -318 -480 -56 354 127 -377 -551 -195 159 131 -271 -538 -300 0 50 -208 -370 -407 -105 92 -103 -260
2771b60j08J76K24J21j82k69K6K67K01k0l29j47L42L37l0m16l01L24M57P9m25
$$ -260 -368 -192 32 153 -29 -298 -272 -5 196 176 -153 -300 42 379 349 -67 -368 -44 413 492 67
2792F7m24K32N17Q8l69m44O2N12K66l81n16O9M75K21k37m87j01M56K79j39l70
$$ 67 -357 -125 392 480 111 -333 -271 241 507 126 -390 -321 154 375 138 -349 -450 6 285 146 -224
2813b24q8J69K25%j21k36P8J56J37k2k24j37J38K97L5k50k08k6L58L42k52m62
$$ -224 -312 -143 82 82 -39 -275 -197 -41 96 74 -150 -287 -149 148 183 -67 -275 -301 57 399 147 -315
2835c15%L79K77j58m04k77M83M35k14l96k30L10M42K4m46l59L19L13J14l37l23
$$ -315 -315 64 341 183 -221 -498 -15 420 206 -190 -420 -110 332 356 -90 -449 -130 183 297 -40 -363
2856c63J35M13J78l35l18J01K90J23j26k34o0J68K27k0k14n0J1R2K46j40k30o5
$$ -363 -228 185 363 28 -290 -189 101 224 98 -136 -196 -28 199 179 -35 -85 -74 18 264 124 -106 -171
2878a71K14J87P5k99k54J04L81Q6k66l29L7M29K50l17m62kM41L01j95m90j47M28
$$ -171 43 230 305 6 -248 -144 237 323 57 -272 -235 194 444 127 -335 -337 104 405 210 -280 -427 1
2900AL50j78m68r3K97K50O5l62k77K26K77k4j53j50k7L08J46r6k26m1R0J89P4
$$ 1 351 173 -295 -388 -91 159 224 -138 -415 -189 88 64 -89 -239 -266 42 188 92 -134 -175 -85 104 178
2923A78j65j50M4K24J26q6l16j09K08L77mm20k13K97L02J20k96m91K54M82L5l54
$$ 178 13 -137 -93 131 257 171 -145 -254 -46 331 327 -93 -306 -9 293 413 117 -374 -120 362 397 43
2945D3k81M5M45K02m12l65M4M38J86j88l03k05L58K90j53k98j35J80L17k7k44
$$ 43 -238 -193 252 454 42 -323 -279 159 345 157 -146 -351 7 297 144 -154 -289 -109 208 181 -63
2966f3j83N2K36O1j16r1j55R5K60K0k69j71J46J73K07j48l78nL63J87j01l69j80
$$ -63 -246 -194 42 103 -13 -104 -259 -164 96 116 -153 -324 -178 -5 202 54 -324 -329 34 221 120 -249 -429
2989d29L41L95j11l67k43L64K60M6k83l55K38M16jk46k87J47L40J77k75k61J3
$$ -429 -88 307 196 -171 -414 -50 210 256 -27 -382 -144 272 271 25 -262 -115 225 402 127 -134 -121
3010a21L25O8l5k54j08J97K95j11j91j39L1J73J76j54k81rJ10K44Jl07k12J21
$$ -121 204 272 237 -17 -125 72 367 256 65 -74 -43 130 306 152 -129 -138 -28 216 217 -90 -302 -181
3032a81L46N0l13k54N8K94K16k50l83K9L62K00j62l62j22M17L00j88l12k08L15
$$ -181 165 215 -98 -352 -294 0 216 -34 -417 -388 -26 174 12 -350 -472 -55 245 57 -255 -463 -148
3053a48L19jk82k37K16L09Q6k67k16P3K46J77j38l16O7K08J54J1j51k00K9K93
$$ -148 171 170 -112 -349 -133 176 262 -5 -221 -148 98 275 137 -179 -112 96 250 261 110 -90 -61 232
3075B32J16j61k24l2K37K04j23l25j52J97K59R0k94l48K10L31L3l56k18N9L66
$$ 232 348 187 -37 -69 168 372 249 -76 -228 -31 228 318 24 -324 -114 217 250 -106 -324 -265 101
3096A01J96l16l48qM47J40j91k37o1K37K46p4l57o1K59K48p4j41k41J01K85P1
$$ 101 297 -19 -367 -375 72 212 21 -216 -277 -40 206 132 -225 -286 -27 221 147 6 -235 -134 151 222
3118B22j76j06o9J64K58n8k39j79J89J36J60k16k91PK92J33q9l38j7K33K99k04
$$ 222 46 -60 -129 35 293 235 -4 -183 6 142 302 86 -205 -198 94 227 138 -200 -217 16 315 111
3140A11k94j71K86L00p4k49k39J47L58R1l57j95O6L15J63j36k91q1L27J46q2k34
$$ 111 -183 -354 -68 232 158 -91 -330 -183 175 266 -91 -286 -220 95 258 122 -169 -250 77 223 141 -93
3162i3m0J22K93%k55j89J66J59J23j06k90M0K20J70p7j59j99J37J78Q2k91j98
$$ -93 -133 -11 282 282 27 -162 4 163 286 180 -110 -70 150 320 243 84 -115 22 200 282 -9 -207
3184b07J14K38J66k63l50ML56J78j27l04q0K37K64n5m16j54K94K22M0k22k64J59
$$ -207 -93 145 311 48 -302 -298 58 236 109 -195 -275 -38 226 171 -245 -399 -105 117 157 -65 -329 -170
3206a70K35J57k55k46O7K33J68p0l01k4K26J87q7j35j18Q0K43O6j11k75M2K30
$$ -170 65 222 -33 -279 -212 21 189 119 -182 -206 20 207 120 -15 -133 -53 190 256 145 -130 -88 142
3228A42J10k6k71j42K81K33o1k33j98P3L95L1l49k09M2L30J62k26l24NL49J20
$$ 142 252 226 -45 -187 94 327 266 33 -165 -92 303 334 -15 -224 -182 148 310 84 -240 -235 114 234
3250B34j52k74j24K66K42j19k08j71K01K08Q3k18k33J01K62Q8j75j48j11J71K20
$$ 234 82 -192 -316 -50 192 73 -135 -306 -105 103 186 -32 -265 -164 98 186 11 -137 -248 -77 143
3271A43rk18k11K17K24J1k27r6Q1K27J40j79j37r4J41K49m0k81j22K08K66p2k42
$$ 143 134 -84 -295 -78 146 157 -70 -166 -85 142 282 103 -34 -128 13 262 222 -59 -181 27 293 221 -21
3294b1j75J41K94%j43l46J48K51J08j36k86J5J74K57k41j99JO9K23k1k21j11P4
$$ -21 -196 -55 239 239 96 -250 -102 149 257 121 -165 -150 24 281 40 -159 -158 -89 134 113 -108 -219 -145
3317a45J86J49k05k35M9J13K32j79j16m3R9K06Q6k83j71J18K77J2j70j64lK74
$$ -145 41 190 -15 -250 -201 -88 144 -35 -151 -194 -95 111 197 -86 -257 -139 138 150 -20 -184 -187 87
3339H7K26j80k79q6K74J49Rl00p8K28K05k4k62j01L3K08R9j41k96J62J97Q1J3
$$ 87 313 133 -146 -232 42 191 200 -100 -178 50 255 231 -31 -132 -99 109 208 67 -229 -67 130 211 224
3362B24l64m1J62J77Mk35j06K0K50O1j69k43R5J79J11p4k41j08K71J06Rl09p3
$$ 224 -140 -181 -19 158 162 -73 -179 -159 91 152 -17 -260 -165 14 125 51 -190 -298 -27 79 88 -221 -294
3385b94J58K46Nk21j82J15K25J18j19k35m1K45K01j48j43j01K08J47j7k22r8J43
$$ -294 -136 110 115 -106 -288 -173 52 170 51 -184 -225 20 221 73 -70 -171 37 184 167 -55 -153 -10
3407a0J74J02k49j72M2K55R5j38k53J0J95J91o0k46j16J71K11l2j66j61MK42J39
$$ -10 164 266 17 -155 -113 142 237 99 -154 -144 51 242 182 -64 -180 -9 202 170 4 -157 -153 89 228
3430B28k46k30R3K40J12n4l12p6K10K80q8k15j32J34J68P2j90j98J13J83R2j45
$$ 228 -18 -248 -155 85 197 143 -169 -245 -35 245 157 -58 -190 -56 112 184 -6 -204 -91 92 184 39
3452C9k68j5K54J84r0k18n7J74K12n8k57j23J29J70Q9j62j48o4J53K00m5k64r1
$$ 39 -229 -244 10 194 104 -114 -171 3 215 157 -100 -223 -94 76 165 3 -145 -209 -56 144 99 -165 -256
3475b56K34J51L3l03o2J83J69j1j34j83K7L20Q8k12j55o1K64J19Rk87j00J98K25
$$ -256 -22 129 162 -141 -203 -20 149 138 4 -179 -152 168 256 44 -111 -172 92 211 220 -67 -167 31 256
3498B56mk45j31R9K17R5k83j93J36J41P8j03k05K3R5J69l8j41j10M0J83M9j07
$$ 256 252 7 -124 -25 192 287 4 -189 -53 88 166 63 -142 -119 -24 145 107 -34 -144 -104 79 128 21
3521B1l08J06K19M2m3k77l5K70J13m8k54KJ39J14L4j47j64K8K61N7j28j19rJ39
$$ 21 -287 -181 38 80 37 -240 -275 -5 108 60 -194 -192 -53 61 95 -52 -216 -188 73 130 2 -117 -126 13
3545A3J82r1k13jJ51J77l7k30j38J92K17k7j53j00l8K16J73k13j85L9J71N7j8
$$ 13 195 104 -109 -110 41 218 181 -49 -187 5 222 195 42 -58 -96 120 293 80 -105 -66 105 162 144
3568A44j68j33J44J85j5k01j82J30K39O1j68k21R7J16P0l2l24M7R8K39r8j54k2
$$ 144 -24 -157 -13 172 157 -44 -226 -96 143 204 36 -185 -88 28 98 66 -258 -211 -113 126 28 -126 -148
3591a48lJ48N4j14j16M1J73Q9j55k10N3J65J82j95j25j2O5J93N2j45j99R1L03
$$ -148 -151 -3 51 -63 -179 -138 35 124 -31 -241 -188 -23 159 -36 -161 -173 -108 85 137 -8 -207 -116 187
3614A87o0o6j26o5K65J33j68j71N0J28J26n7j71j20K16J59Pj76j39RJ92J03j10
$$ 187 127 61 -65 -130 135 268 100 -71 -21 107 233 176 5 -115 101 260 267 91 -48 -39 153 256 146
3637A46k41PK33J16j40j54j60J73J51Oj81j86R5J89M1r1k77N7J58J15r7j43j02
$$ 146 -95 -88 145 261 121 -33 -193 -20 131 137 -44 -230 -135 54 95 4 -273 -216 -58 57 -40 -183 -285
3660b85J54J93j27j32o1J05J85K9j95r8L5K19Q2j02k21P9J32K27j28j46j26J93
$$ -285 -131 62 -65 -197 -258 -153 32 61 -134 -232 -197 22 104 2 -219 -140 -8 219 91 -55 -181 12
3682A2J33N4j54j28Q5J87O5j68j65O7K26P4o6k16rK00J61j66j20p7N6J54Qj81
$$ 12 145 199 45 -83 2 189 254 86 -79 -12 214 288 222 6 -3 197 358 192 72 -5 51 205 213 32
3706C2o8l7J88R1k15j37kK20O9j31j31o9J31K25n3k22j05R4J42O2n5k27J5K79
$$ 32 -36 -73 115 206 -9 -146 -148 72 141 10 -121 -190 -59 166 113 -109 -214 -120 22 84 29 -198 -183 96
3730I6J0j32j34j1P2K12m2j88rP7J08O2j67r1N6J52Q5j93n0K9P8J61j30j98P8
$$ 96 106 -26 -160 -171 -99 113 71 -117 -126 -49 59 121 -46 -137 -81 71 156 -37 -87 -58 20 181 51 -147 -69
3755f9R1J09L8j98j07N1K32J9j15j65M4R3K05j79j91O5J42R2j2j80l3O0J84l4
$$ -69 22 131 169 -29 -136 -85 147 166 51 -114 -70 23 228 49 -142 -77 65 157 145 -35 -68 -8 176 142
3779A42j57m6M1J40R8r2j86O4L3J83l3k17q4J64P3Qj34p7K7K05L7j74j77j2K34
$$ 142 -15 -61 -20 120 218 126 -60 4 37 220 187 -30 -114 50 123 131 -3 -80 -53 152 189 15 -162 -174 60
3804F0Q1j18j81k1R0J35k6k07j50K83J50Lj87j30O8K52m0j29k7k0J62J28j01k10
$$ 60 141 23 -158 -179 -89 46 20 -187 -337 -54 96 99 -88 -218 -150 102 62 -67 -94 -114 48 176 75 -135
3828a35OJ47Q1N3j56j19P9K11J1j69q5O0J44J00p4k51R6J08P8kj79o8L1K03K8
$$ -135 -129 18 99 152 -4 -123 -44 167 178 9 -76 -16 128 228 154 -97 -1 107 185 183 4 -64 -33 170 198
3853A98k11o2M2R1J50j17k10k6J39J80j25j77mO0J72r7j36n2R9R0M1p5j54K6J46
$$ 198 -13 -75 -33 58 208 91 -119 -145 -6 174 49 -128 -132 -72 100 3 -133 -185 -86 4 45 -30 -184 -158 -12
3878a2J01r4j45m6J61J34q3j60p0K36P8Pj41j22M2K03J9n3j82R2Q8J60j41j38
$$ -12 89 -5 -150 -196 -35 99 16 -144 -214 22 100 107 -34 -156 -114 89 108 55 -127 -35 53 213 72 -66
3902f6o7J56J24o7j28j44J81K37o0j39j84M3K09P4j11j34m8J66J71j43j38j02
$$ -66 -133 23 147 80 -48 -192 -11 226 166 27 -157 -114 95 169 58 -76 -124 42 213 70 -68 -170
3924a70J07J80k7j50r7J10J76L7j70j20J4K25L9j04j38j03J64K21o0k20p1J13
$$ -170 -63 117 90 -60 -157 -47 129 166 -4 -124 -110 115 154 50 -88 -191 -27 194 134 -86 -157 -44
3946d4J59J3j47l4m5K05K1q8j52J6R0J55j2k34j9R9J58k6j84j6MJ59O4j03j46
$$ -44 115 128 -19 -53 -98 107 128 40 -112 -96 -6 149 137 -97 -116 -17 141 115 -69 -85 -81 78 142 39 -107
3971a07P1J15J05r2k00o4K41P6o5j85JJ05J30O3j54k35J77R0M7j07j23LJ25J58
$$ -107 -36 79 184 92 -108 -172 69 145 80 -105 -104 1 131 194 40 -195 -18 72 119 12 -111 -108 17 175
3995A75p7j78q7J14K29p7j04j76J03J89N6j38j17J4J44K3n1j59n1J80J08K1k30
$$ 175 98 -80 -167 -53 176 99 -5 -181 -78 111 167 29 -88 -74 70 93 42 -117 -168 12 120 141 -89
4018h9n7J43O7J1j07j09M3K25K2j18j30K6Q2J11j6j90m3O4K45r0j07r0J15J51
$$ -89 -146 -3 64 75 -32 -141 -98 127 149 31 -99 -73 9 120 104 -86 -129 -65 180 90 -17 -107 8 159
4042A59K2j23j75N9P4R0l1j35r3J95J17o9n4j48Q8J38K8j81j06O3J39J09j48j06
$$ 159 181 58 -117 -58 16 106 75 -60 -153 42 159 90 36 -112 -24 114 142 -39 -145 -82 57 166 18 -88
4066h8m9J29J25o2j92J2J32J10%k53k4J06O9N4mj86MJ51Q9m4j75j4J17J45l2j61
$$ -88 -137 -8 117 55 -137 -125 7 117 117 -136 -160 -54 15 69 65 -121 -117 34 123 79 -96 -110 7 152 120 -41
4092d1j01Q0K17K3j77j79L6J79Q7j34j23O3J18Q6o1j62m6J37Q7m2p7j29J11R6
$$ -41 -142 -62 155 178 1 -178 -142 37 124 -10 -133 -70 48 134 73 -89 -135 2 89 47 -30 -159 -48 48
4116D8Q0j07j50O2J33R0j21j37o6J96J21o1k19jJ27J43p0j79pL7J09O6m3j47k4
$$ 48 128 21 -129 -67 66 156 35 -102 -168 28 149 88 -131 -132 -5 138 68 -111 -118 -81 28 94 51 -96 -120
4141a20J51J08j03j67K1oK14K6k19m9J16J13J3j19o9n5K19P2j24q1m9J09J17j4
$$ -120 31 139 36 -131 -110 -116 98 124 -95 -144 -28 85 98 -21 -90 -145 74 146 22 -59 -108 1 118 104
4165A04j04j12P9J56n0k0j09J0J18O4j09j13O2J01O7m5j68kJ13R4K4k09m1P7J20
$$ 104 0 -112 -33 123 73 53 -56 -46 72 136 27 -86 -24 77 144 99 -69 -71 42 136 160 -49 -90 -13 107
4190A07M2j73j33J17L5Q7l9j28r3J81J01m8j51j15J85R1Rj45l1OJ47k1j8j23j6
$$ 107 149 -24 -157 -40 -5 82 43 -85 -178 3 104 56 -95 -210 -25 66 75 -70 -101 -95 52 31 13 -110 -126
4215a26J51Q2o3j04j10J55R8L7k02j09J94Q7R0j56j19o9K43N4l3j81JQ7J07O5
$$ -126 25 107 44 -60 -170 -15 83 120 -82 -191 3 90 180 24 -95 -164 79 133 100 -81 -80 7 114 179
4239A79j51r7J22L7N2j67m3J4J79R0r5j91K2J28N8j8j72mJ05Q6Kj79n6O4Q5M5
$$ 179 28 -69 53 90 142 -25 -68 -54 125 215 120 -71 -49 79 137 119 -53 -57 48 134 136 -43 -99 -35 50 95
4265I5r7j13k0J29M5j6j00j27J14J41j1j14r3P9J03qm8j44N6J38J02j41j04lJ22
$$ 95 -2 -115 -135 -6 39 23 -77 -204 -90 51 40 -74 -167 -88 15 7 -41 -185 -129 9 111 -30 -134 -137 -15
4290a5J25j23j02k1J46P0Oq4j16P1J20Oqn4m3J32N2j27n7j2R5J04n4n4j46J50
$$ -15 110 -13 -115 -136 10 80 86 2 -114 -43 77 83 75 21 -22 110 162 35 -22 -34 61 165 111 57 -89 61
4316F1J41o2r2n0m8J44J06j07j33K6L9Q5Rk00j7O5J52o6r1r3L7J17N8q6j35J2
$$ 61 202 140 48 -2 -50 94 200 93 -40 -14 25 110 119 -81 -98 -33 119 53 -38 -131 -94 23 81 -5 -140 -128
4342a28N7J46k6j26j06J47J10r3j13jM9J69m6n7j27Q9J03Lrj08j34J75J10p1o5
$$ -128 -71 75 49 -77 -183 -36 74 -19 -132 -133 -84 85 39 -18 -145 -56 47 50 41 -67 -201 -26 84 13 -52
4367e2n1R2J22K5j85rL7J38l9r3l8rR6P0m0q6m1J28K9jj40q0P6J81p2l1j12QJ84
$$ -52 -103 -11 111 136 -49 -58 -21 117 78 -15 -53 -62 34 104 64 -22 -63 65 94 93 -47 -127 -51 130 58 27 -85 -77 107
4396A07M9j16j57P7M1J07l8r7m1N4J03lj12r0Q2Q7J00j36j37P9O0L1j0j69QP4
$$ 107 156 40 -117 -40 1 108 70 -27 -68 -14 89 86 -26 -116 -34 53 153 17 -120 -41 19 50 40 -129 -121 -47
4422d7J30j6j82K3J8N8N2j29j18J27J42K6j54l7k8O7J30j4j90%J78J3M4j30j13
$$ -47 83 67 -115 -92 -74 -16 36 -93 -211 -84 58 84 -70 -107 -135 -68 62 48 -142 -142 36 49 93 -37 -150
4447a50P4R3Q5q2m6oJ14J05o0k35N7J15J11o3p0j19J20O3kj13n5L4J05L6n3j29
$$ -150 -76 17 102 20 -26 -32 82 187 127 -108 -51 64 175 112 42 -77 43 106 104 -9 -64 -30 75 111 58 -71
4473g1J24O6m0k1j58QO3J24n0j26%K8J09J2j16j12n0K21M5j4j51J1R8O2o5j18
$$ -71 53 119 79 58 -100 -92 -29 95 45 -81 -81 -53 56 68 -48 -160 -210 11 56 42 -109 -98 0 62 -3 -121
4499a21K5K6J08L1q9j35jJ70N7o5j43M7J31K3l9j67j0J16J38o6j27LL8J26Q2j48
$$ -121 -96 -70 38 69 -20 -155 -156 14 71 6 -137 -90 41 64 25 -142 -152 -36 102 36 -91 -88 -50 76 158 10
4525A0j09J02L6Ppq2MJ26K0n2n8n9R3Q8J5j83o6R4Q3O2j35m0LJ06Rm5l3n4j3J71
$$ 10 -99 3 39 46 39 -43 -39 87 107 55 -3 -62 31 119 134 -49 -115 -21 62 124 -11 -51 -48 58 67 22 -11 -65 -78 93
4555I3j4q9j20O9J00J00j61m3K5N1P5j57jo8J11J39p8n2q3N2N4P3q1j29K6K06
$$ 93 79 -10 -130 -61 39 139 -22 -65 -40 11 86 -71 -72 -140 -29 110 32 -20 -103 -51 3 76 -5 -134 -108 98
4581I8J8j00o3K5J42J4p8r1l2J48O6n3o4p8M6O2Q7j00m3j5K1J70j32p6J2j2J05
$$ 98 116 16 -47 -22 120 134 56 -35 -67 81 147 94 30 -48 -2 60 147 47 4 -11 10 180 48 -28 -16 -28 77
4608G7j7j08lR9N9k6j19n7R8L6k3N0j04K6m5J30q0n9K8j4J41K6j59l0M1J15M3
$$ 77 60 -48 -51 48 107 81 -38 -95 3 39 16 66 -38 -12 -57 73 -7 -66 -38 -52 89 115 -44 -74 -33 82 125
4635A25j57n9J7J22J8l9j28L7Q2N9Rj71k1P8R4K3q8j49J31R5Ro2p7M5M1J13j20
$$ 125 -32 -91 -74 48 66 27 -101 -64 18 77 86 -85 -106 -28 66 89 1 -148 -17 78 87 25 -52 -7 34 147 27
4662B7on3P8K4k8m6j00J61M5k2r2k5J2N7Q7m7j23j8Q1M9k5l3m8%K02j26m8r4J20
$$ 27 21 -32 46 70 42 -4 -104 57 102 80 -12 -37 -25 32 119 72 -51 -69 12 61 36 3 -45 -45 157 31 -17 -111 9
4691Il1P7K5j87kK06O0j29j10KK9K18j11l7j24J33P3m0p3m8R4Q8L5j66q1O7O6
$$ 9 -22 55 80 -107 -109 97 157 28 -82 -80 -51 167 56 19 -105 28 101 61 -12 -60 34 122 157 -9 -90 -23 43
4718D3L7M6j85K1K8J31q7K0j32Q5N0J3j2j08j2J05K3q7l7rPJ81q5m2p3O1J22%
$$ 43 80 126 -59 -38 -10 121 34 54 -78 7 57 70 58 -50 -62 43 66 -21 -58 -67 -60 121 36 -6 -79 -18 104 104
4746A04j37l4L8N7R8j59j14M1J04P4p9j7n9L0P0O3j48j7J6M2J19n4q7q4J70Ol0
$$ 104 -33 -67 -29 28 126 -33 -147 -106 -2 72 -7 -24 -83 -53 17 80 -68 -85 -69 -27 92 38 -49 -133 37 43 13
4773A3m9p0J13J13l4n6r9N0J02k0j28k3qJ55R2j25p9QJ07J0j6j27N0O5L4k0r9
$$ 13 -36 -106 7 120 86 30 -69 -19 83 63 -65 -88 -96 59 151 26 -53 -45 62 72 56 -71 -21 44 78 58 -41
4800d1l6KJ76j7j07o9l5J20O5p3p4K7N0O3k4n9q3R1M3P0n8j44N9N7Q9m5j21j3
$$ -41 -77 -75 101 84 -23 -92 -127 -7 58 -15 -89 -62 -12 51 27 -32 -115 -24 19 89 31 -113 -54 3 92 47 -74 -87
4828h7J47M4l6j07n5N0J58m0j11j20K02K6o7m0o8R0L5N8p2m7pN0J27p1o5j8R2
$$ -87 60 104 68 -39 -94 -44 114 74 -37 -157 45 71 4 -36 -104 -14 21 79 7 -40 -47 3 130 59 -6 -24 68
4855F8j8n9L5j04L0J35M6j78n3Q9J9N9j1n8p8J15P1q9o3m4N9M8L8m7p5L9M6O5
$$ 68 50 -9 26 -78 -48 87 133 -45 -98 -9 10 69 58 0 -78 37 108 19 -44 -88 -29 19 57 10 -65 -26 20 85
4883H5l3j40j4J00R8o9p1k9N2P5qp7q3M8R8L3j06k4RQ7N0r0n9L5P3P5l1r7o5K9
$$ 85 52 -88 -102 -2 96 27 -44 -73 -21 54 46 -31 -114 -66 32 65 -41 -65 -56 31 81 -9 -68 -33 40 115 84 -13 -78 -49
4913d9N6J10p5q1l7J14J7K6q7qL6R5n7j04m2R4M5M2m3k5J4K8M7j39p2O2R3k6L3
$$ -49 7 117 42 -39 -76 38 55 81 -6 -14 22 117 60 -44 -86 8 53 95 52 27 41 69 116 -23 -95 -33 60 34 67
4942F7j06J5MM7m4M9j21O3P3J9j19l0Q1N9M8m6j28J09j7MJ2r9K4m6O0P8n7j24
$$ 67 -39 -24 -20 27 -17 32 -89 -26 47 66 -53 -83 -2 57 105 59 -69 40 23 27 39 -60 -36 -82 -22 56 -1 -125
4970a25L0R9L5j03L1p6J01J36j47n3M1J7M5ko9QP3M8r4N9r3l8J47O6j26p0j7J36
$$ -125 -95 4 39 -64 -33 -109 -8 128 -19 -72 -31 -14 31 29 -40 -32 41 89 -5 54 -39 -77 70 136 10 -60 -77 59
4998E9K5j26j6L8N7L5nMj09O1K0P3k20L0P4M4J7M1j69J4R5k1P5q4r8L1O4L0j4
$$ 59 84 -42 -58 -20 37 72 67 71 -38 23 43 116 -104 -74 0 44 61 102 -67 -53 42 21 96 12 -86 -55 9 39 25
5027B5j56K1J38K6k4o7m1P6K3l3o0n0R5J05P7j48j36O6Q6M2p4j03O8Q3j0j8r9
$$ 25 -131 -110 28 54 30 -37 -78 -2 21 -12 -72 -122 -27 78 155 7 -129 -63 23 65 -9 -112 -44 39 29 11 -88
5054h8O5J1P2m4k6rLN0k6q9O6J0J1J10r1j39L8J14J9pn5r8Q2P8j4kj29L5J08K6
$$ -88 -23 -12 60 16 -10 -19 -16 34 8 -81 -15 -5 6 116 25 -114 -76 38 57 50 -5 -103 -21 57 43 41 -88 -53 55 81
5084H1k2j23J8R8l0M2o8n3J21Jn2p7L1K2J9O0p1o6L0P0o2L9r5rN5J08j47m4N1
$$ 81 59 -64 -46 52 22 64 -4 -57 64 65 13 -64 -33 -11 8 68 -3 -69 -39 31 -31 8 -87 -96 -41 67 -80 -124 -73
5113g3PJ15k8o5q9K3J38k1K0j20m0P6J54j20r9Q4lJ06J0o8r7N0J04K6q6j5K8L9
$$ -73 -66 49 21 -44 -133 -110 28 7 27 -93 -133 -57 97 -23 -122 -38 -41 65 75 7 -90 -40 64 90 4 -11 17 56
5141E6Lmn0k8M8J32q4m8l5JJ28n2n3J1K2n7J11k0j41K7N2N9l4j23O9o4L8K7o7
$$ 56 59 55 5 -23 25 157 73 25 -10 -9 119 67 14 25 47 -10 101 81 -60 -33 19 78 44 -79 -10 -74 -36 -9 -76
5170g6l9O4P5Q4r4q4K6K3L1k7j06K8R1O1o5r6%J20NJ5j67Q2K4R7kp6nJ1O8JK4
$$ -76 -115 -51 24 108 14 -70 -44 -21 10 -17 -123 -95 -4 57 -8 -104 -104 16 21 36 -131 -49 -25 72 70 -6 -11 0 68 69 93
5201I3j45L4J7O9M9p8m9N0k2Q2o4k8k7kP7j0p5j2J05K6M1p0j39O8P2m4O3j57P0
$$ 93 -52 -18 -1 68 117 39 -10 40 18 100 36 8 -19 -21 56 46 -29 -41 64 90 131 61 -78 -10 62 18 81 -76 -6
5230fL7N4p7j14%J33k4L0j16O6J8N5m8p5M5J6O8p0J8l4NO0L5p3ql0R9n9L6k7j17
$$ -6 31 85 8 -106 -106 27 3 33 -83 -17 1 56 8 -67 -22 -6 62 -8 10 -24 -19 41 76 3 -5 -35 64 5 41 14 -103
5261a03J27K1P0l6j66nJ68lq5r8J20PNj2l5m1K3J17j2j09n7J08N8K8m7j11Q6M9
$$ -103 24 45 115 79 -87 -92 76 73 -12 -110 10 17 22 10 -25 -66 -43 74 62 -47 -104 4 62 90 43 -68 18 67
5289F7L4m5j04M3N3O6m2j17Q8m5P7o9qo1P1M6L3r7p4KJ34K3o6m5l5L1J16nn9l8
$$ 67 101 56 -48 -5 48 114 72 -45 43 -2 75 6 -2 -63 8 54 87 -10 -84 -82 52 75 9 -36 -71 -40 76 71 12 -26
5319b6l6J24j2q1k3j8J19L0p6o4L1P3l2k2J0r0O1J32k8j48j4J18MM5m4j17J03
$$ -26 -62 62 50 -31 -54 -72 47 77 1 -63 -32 41 9 -13 -3 -93 -32 100 72 -76 -90 28 32 77 33 -84 19
5346A9O5nq5j2n0J45L8o6q3j5L4P6K1n0j47J31K3P6k2j48j5O1M9p3L0m6J9Q9q
$$ 19 84 79 -6 -18 -68 77 115 49 -34 -49 -15 61 82 32 -115 16 39 115 93 -55 -70 -9 40 -33 -3 -49 -30 59 51
5375E1q9j1J1J01Nr0km9O8k2K1n7j0O7Q7n4r3rJ9J46n0q9n3K3J61m5k9o5J9R5
$$ 51 -38 -49 -38 63 68 -22 -24 -73 -5 -27 -6 -63 -73 -6 81 27 -66 -75 -56 90 40 -49 -102 -79 82 37 8 -57 -38 57
5405E7%K1n6m7J9P4j7K0r1JO5J2J3q5K9O0N0o3j57N1Q1j9l0j7o7P1L2M8r6n4P6
$$ 57 57 78 22 -25 -6 68 51 71 -20 -19 46 58 71 -14 15 75 125 62 -95 -44 37 18 -12 -29 -96 -25 7 55 -41 -95 -19
5436a9OM5n7n7Q4l8J11r6o0P0j5N6Jk2l6j8K3P6j11N0o9R6l5J7o2M5J02o5L4r4
$$ -19 -13 32 -25 -82 2 -36 75 -21 -81 -11 -26 30 31 9 -27 -45 -22 54 -57 -7 -76 20 -15 2 -60 -15 87 22 56 -38
5466c8J7L8L7j8m1l0k5J74o1Jp1l4Q0P3m2o2p0J46Mo3Mr5P1L7nK3j09QP0j0J2
$$ -38 -21 17 54 36 -5 -35 -60 114 53 54 -17 -51 29 102 60 -2 -72 74 78 15 19 -76 -5 32 27 50 -59 -51 19 9 21
5497B1n7o4M0R5n9lLn5Q7K3k4r4O4MK9J0j2q7P7Q5m2rr4K3J75n8n4pj4L4M9j33
$$ 21 -36 -100 -60 35 -24 -27 -24 -79 8 31 7 -87 -23 -19 10 20 8 -79 -2 83 41 32 -62 -39 136 78 24 17 3 37 86 -47
5529d7O0m5J27L6p8r5L2O0M8p4l8j8l4J33k6n4k0J8M6K6p9M5m5K0M3j0k5k3L2
$$ -47 13 -32 95 131 53 -42 -10 50 98 24 -14 -32 -66 67 41 -13 -33 -15 31 57 -22 23 -22 -2 41 31 6 -17 15
5558A5L6p8l0N3j8MQP5j25l2N7N5k0j9l0J8Q5K2r3J0j5M1M1n6n9K4K9Q4p0l0n0
$$ 15 51 -27 -57 -4 -22 -18 -10 65 -60 -92 -35 20 0 -19 -49 -31 54 76 -17 -7 -22 19 60 4 -55 -31 -2 82 12 -18 -68
5589f8J11J2m4n3J1J01k5n5K0l0J9O0l2M4j18L3MM3L1m6o6P2M3p6Kl7M6J2L4j9
$$ -68 43 55 11 -42 -31 70 45 -10 10 -20 -1 59 27 71 -47 -14 -10 33 64 18 -48 24 67 -9 -7 -44 2 14 48 29
5619B9j9o5M9Op6J3L9M9K9j12J2J8O0j8l0n1M2K5qL8Op1K9N1o0J6k6l0J09J1l3
$$ 29 10 -55 -6 0 -76 -63 -24 25 54 -58 -46 -28 32 14 -16 -67 -25 0 -8 30 36 -35 -6 45 -15 1 -25 -55 54 65 32
5650C2l4MN2Nk6l5j9K9LL8J6o1r5M1J05J1n9n3K9P9j2j07k3R2N0qm5n7N1m1O5
$$ 32 -2 2 54 59 33 -2 -21 8 11 49 65 4 -91 -50 55 66 7 -46 -17 62 50 -57 -80 12 62 54 9 -48 3 -38 27
5681B7j4p0k1O3mL1p3n4P3M8k7K6o2L1l2J16r1l3Q3K0K9p0L9o3K8l8L0%Qj3J35
$$ 27 13 -57 -78 -15 -19 12 -61 -115 -42 6 -21 5 -57 -26 -58 58 -33 -66 17 37 66 -4 35 -28 0 -38 -8 -8 0 -13 122
5712A22p8lo0M8L0J04r9k1l3K0P2p6n9P1K4l1N4j04m7N5L4K0p8l0mM6K1j3j00
$$ 122 44 41 -19 29 59 163 64 43 10 30 102 26 -33 38 62 31 85 -19 -66 -11 23 43 -35 -65 -69 -23 -2 -15 -115
5741a15K6R9m8J6l7n1M3o6Q0O1l4o6M1N6l3m0M1j1RL3k3mN3M1p4n3L5PL7N5q2
$$ -115 -89 10 -38 -22 -59 -110 -67 -133 -53 8 -26 -92 -51 5 -28 -68 -27 -38 -29 4 -19 -23 30 71 -3 -56 -21 -14 23 78 -4
5772dMPO9l9k1K0r2PJ78j60JmJ8L4k8K7o6K5O6r7P1j0q4K3M9k4m0M6r2R3P6r8
$$ -4 0 7 76 37 16 36 -56 -49 129 -31 -30 -34 -16 18 -10 17 -49 -24 42 -55 16 6 -78 -55 -6 -30 -70 -24 -116 -23 53 -45
5804d5oN1mPMr1K6N1R7r0k9K9Nk4J00m4k5J2NL7l5J8l8J3J17j11m7o8J49n0K1
$$ -45 -51 0 -4 3 7 -84 -58 -7 90 0 -29 0 5 -19 81 37 12 24 29 66 31 49 11 24 141 30 -17 -85 64 14 35
5835C5j18jJ53k5k6m1p8J04k3Q5r0K8q6M6O0j0n2kP0J7m8j7n4M8R2n4nj11N1R5
$$ 35 -83 -84 69 44 18 -23 -101 3 -20 65 -25 3 -83 -37 23 13 -39 -41 29 46 -2 -19 -73 -25 67 13 8 -103 -52 43
5865D3MK0o5M7p2O1Mj09J2Q8L2l5n0K3q7J29n5lL6k4M7%j6p9N7j8k1M2m3k0Q2
$$ 43 47 67 2 49 -23 38 42 -67 -55 33 65 30 -20 3 -84 45 -10 -13 23 -1 46 46 30 -49 8 -10 -31 11 -32 -52 30
5896C0PM2j25k5L3J12m7j2m4K8j8O6Pj33J01jK5knk4j8Q4j6p5j6L6J5M2k9L3j16
$$ 30 37 79 -46 -71 -38 74 27 15 -29 -1 -19 47 54 -79 22 21 46 44 39 15 -3 81 65 -10 -26 10 25 67 38 71 -45
5927d5L4J39j26mK1j2K4M6q4k4RN0N0o2n4kL0Po4J9J8K4L5l2ll4r2J35on5O7n5
$$ -45 -11 128 2 -2 19 7 31 77 -7 -31 -22 28 78 16 -38 -40 -10 -3 -67 -48 -30 -6 29 -3 -6 -40 -132 3 -3 -58 9 -46
5959d6N7J3n4pJ8Q2M6p0m0k6J8O4j9l0m1J5J6R2m7n1j1R8p6L8m1k1qQ5m0m5K7
$$ -46 11 24 -30 -37 -19 63 109 39 -1 -27 -9 55 36 6 -35 -20 -4 88 41 -10 -21 77 1 39 -2 -23 -31 54 14 -31 -4
5990dj0M3rj3o3K1P1pj4k7k2L1O7j05k7K3N3k7L9Kj00Q1k9Q9l7j1ql3Q5K4r1J8
$$ -4 -14 29 20 7 -56 -35 36 29 15 -12 -34 -3 64 -41 -68 -45 8 -19 20 22 -78 3 -26 63 26 15 7 -26 59 83 -8 10
6022A0j8lQ6j27mLJ44m3m7L2k9K5Pl8l4j3N9k2J9J8p9J2O6j0o0M2kL3Ojk3j02
$$ 10 -8 -11 75 -52 -56 -53 91 48 1 33 4 29 36 -2 -36 -49 10 -12 7 25 -54 -42 24 14 -46 -4 -6 27 33 32 9 -93
6054i3Q9LL8l6p9O9J17m2r4j3L8qK7oj7KnK6l7m8J2Q0j9N6p9n6P5K9J5o3L2p1
$$ -93 -4 -1 37 1 -78 -9 108 66 -28 -41 -3 -11 16 10 -7 -5 -10 16 -21 -69 -57 23 4 60 -19 -75 0 29 44 -19 13 -58
6086e8O5l2J7m2p7J37K6l2n5K6O4M3Oj07j06J34Ql5j4K8J8Kk9M9Kp6R5rk1p1R
$$ -58 7 -25 -8 -50 -127 10 36 4 -51 -25 39 82 88 -19 -125 9 17 -18 -32 -4 14 16 -13 36 38 -38 57 48 27 -44 -35
6117c5P0MJ9q0%PK6kJo3O9l4O8k9m6QM1j5oJ6o7J4P1k8n0jmK8M0m0J1l7j4M1O7
$$ -35 35 39 58 -22 -22 -15 11 9 10 -53 16 -18 50 21 -25 -17 24 9 3 19 -48 -34 37 9 -41 -42 -46 -18 22 -18 -7 -44 -58 -17 50
6152E0r1M4L1M0m0k3j4m8R3qj9m3J8jL5ol3N1l4K5M2o4l4L6L2J5m0l7K7LL5j13
$$ 50 -41 3 34 74 34 11 -3 -51 42 34 15 -28 -10 -11 24 18 -15 36 2 27 69 5 -29 7 39 54 14 -23 4 7 42 -71
6184g1M4O8m9R3q1Kk1J2J1K5j0j09J16j7J3j2p1L9L0Ok8o9J1L7LQ4j03k1M7j0
$$ -71 -27 41 -8 85 4 6 -15 -3 8 33 23 -86 30 13 26 14 -57 -18 12 18 -10 -79 -68 -31 -28 56 -47 -68 -21 -31
6214c1J1M4o1K7pJ07p6jq6M8Q1j6r2L1O0n3N1L5n2p7R0qLn7K9K4L1l8k8PM4n1
$$ -31 -20 24 -37 -10 -17 90 14 13 -73 -25 56 40 -52 -21 39 -14 37 72 20 -57 33 25 28 -29 0 24 55 17 -11 -4 40 -11
6246a1K1j6K2n3K6l0L8l6M4Qp1N3K9k6j2rJ2K7r0N1Q9p6J2ll0P5o7K2mJ0JO4n7
$$ -11 10 -6 16 -37 -11 -41 -3 -39 5 13 -58 -5 24 -2 -14 -23 -11 16 -74 -23 66 -10 2 -1 -31 44 -23 -1 -5 5 6 70 13
6279A3n1O6p7R8o0J3%L7m6O5o0PK8n3O2k9p7R3K4l2l8J5q7J18K3j5l7m1P4o5Q0
$$ 13 -38 28 -49 49 -11 2 2 39 -7 58 -2 5 33 -20 42 13 -64 29 53 21 -17 -2 -89 29 52 37 0 -41 33 -32 48
6310D8n1%l2M2J5kp0L5J7M4k0oj9RK6j3j8k4K6J2lk1PL6j7J7oq1J3K9O1K0o9j2
$$ 48 -3 -3 -35 7 22 20 -50 -15 2 46 26 20 1 10 36 23 5 -19 7 19 16 -5 2 38 21 38 32 -49 -36 -7 54 74 5 -7
6344gM1l1N5k8o3n2R8Q5p4K5m2j4RL1m0Mmj2j8J5m6P3q7J15K4l4j9j1rL1j1Km4
$$ -7 34 3 58 30 -33 -85 13 98 24 49 7 -7 2 33 -7 -3 -7 -19 -37 -22 -68 5 -82 33 57 23 4 -7 -16 15 4 6 -38
6377c8M7J11j42j0N1m7K9n1J8M7Km0N8r1L6Q2q0Ql5J4l1O1O0k9m7k9M0L2l9k8
$$ -38 9 120 -22 -32 19 -28 1 -50 -32 15 17 -23 35 -56 -20 62 -18 -10 -45 -31 -62 -1 59 30 -17 -46 -6 26 -13 -41
6407d1nJ3P2M2r2o2O6P8q4r%Q5n8l7O1n4n2J05p2N3L4o4L9N5m3o9M9j6MJ9l6k7
$$ -41 -46 -33 39 81 -11 -73 -7 71 -13 -22 -22 63 5 -32 29 -25 -77 28 -44 9 43 -21 18 73 30 -39 10 -6 -2 17 -19 -46
6439d6O2Lk1J7Nk4%Mn1M5M7p0O3Lk2r9j4P6Q1l3j9k5Jo0L7k6OPK9P0p7P2J4j01
$$ -46 16 19 -2 15 20 -4 -4 0 -51 -6 41 -29 34 37 15 -84 -98 -22 59 26 7 -18 -17 -77 -40 -66 -60 -53 -24 46 -31 41 55 -46
6473d6Npm2N9j7O9n2k4K6K5L6k1j8k3pJ01m8L0j14P9M4q3O7n2%K3J3L8m7lk9L
$$ -46 -41 -48 -90 -31 -48 21 -31 -55 -29 -4 32 11 -7 -30 -37 64 16 46 -68 11 55 -28 39 -13 -13 10 23 61 14 11 -18 -15
6505a5J9m2j2M7l3K7J9n8j7L3lK6Pp3Q4Lpl0l1l6Q2nm5Oj2R1oMj09O4M9%l3j1
$$ -15 4 -38 -50 -3 -36 -9 10 -48 -65 -32 -35 -9 -2 -75 9 12 5 -25 -56 -92 -10 -15 -60 -54 -66 25 19 23 -86 -22 27 27 -6 -17
6539a7l0P8M9m2k5pj8M7k9K5k2J6Qk3m7J4N7r3J39j5k9k1n0j7J7QM9k3k3J7L9
$$ -17 -47 31 80 38 13 6 -12 35 6 31 9 25 33 10 -37 -23 34 -59 80 65 36 15 -35 -52 -35 -27 22 -1 -24 -7 32
6570C2r9L3l9J23j1j4m3Pj8O2j02J2N0L0m6j9j2P5j2l5N4j5kM0p5J2K1Jj0J6j07
$$ 32 -67 -34 -73 50 39 25 -18 -11 -29 33 -69 -57 -7 23 -23 -42 -54 21 9 -26 28 13 11 51 -24 -12 9 10 0 16 -91
6601i1J17p4O2L1Ko7N6p9M0M2l2jk2L4ML0o8j4qR4m6lk5k4O6K3o4J0LM3J6k9j8
$$ -91 26 -48 14 45 47 -20 36 -43 -3 39 7 6 -16 18 22 52 -16 -30 -38 56 10 7 -18 -42 24 47 -17 -7 -4 39 55 26 8
6634Hl1J8J1mrm0rQ0j5l4J4m1J14j8k0k9lM5rj9l3n4Q4N5o8K5o9Q0k8Kj9L9q8
$$ 8 -23 -5 6 2 -7 -47 -56 24 9 -25 -11 -52 62 44 24 -5 -8 37 28 9 -24 -78 6 61 -7 18 -51 29 1 3 -16 23 -65
6667f5N0K3J1M6r7N1Mql8J8M3j6N2n5J5j3Pl2kO3k1M5pj6J7m0J5n4J1k7K4Q4j15
$$ -65 -15 8 19 65 -32 19 23 15 -23 -5 38 22 74 19 34 21 28 -4 -6 57 36 81 74 58 75 35 50 -4 7 -20 4 88 -27
6700b7M0k7J4M9j51J10N0r5K0Lj7ll0N7m6P2P6j13pk9L5N8j06J5J0j6L5j5L4k6
$$ -27 13 -14 0 49 -102 8 58 -37 -17 -14 -31 -34 -64 -7 -53 19 95 -18 -25 -54 -19 39 -67 -52 -42 -58 -23 -38 -4 -30
6730c0nO5p9J6P5J0q2L7kl6N2JRo1P3l5Mk3K6J1n6N7%K1q3J9J10n2m3K3j1l9J8
$$ -30 -35 30 -49 -33 42 52 -30 7 5 -31 21 22 31 -30 43 8 12 -11 15 26 -30 27 27 48 -35 -16 94 42 -1 22 11 -28 -10
6763a0M9m2m2k9L6L6rLml3J05o3l2j5j2M9K9L2k4m5nj1K2M6Lj11J08Nm6k0N1o7
$$ -10 39 -3 -45 -74 -38 -2 -11 -8 -12 -45 60 -3 -35 -50 -62 -13 16 48 24 -21 -26 -37 -15 31 34 -77 31 36 -10 -30 21 -46
6795d6O5K4j3k9qRK6k5m6N7Ok0j8P6qn1O6l9m3l4M3L6Ml1M1m7k0P2n4J0k7K3r
$$ -46 19 43 30 1 -7 2 28 3 -43 14 20 0 -18 58 50 -1 65 26 -17 -51 -8 28 32 1 42 -5 -25 47 -7 3 -24 -1 -10
6828a0N1p3N8o6J7J5Mrj5J8j7p4RJ21n2J05r2P1o8J9k0j2J2L1k3M7n0K4m5J7O4
$$ -10 41 -32 26 -40 -23 -8 -4 -13 -28 -10 -27 -101 -92 29 -23 82 -10 61 -7 12 -8 -20 -8 23 0 47 -3 21 -24 -7 57
6859E7p3nj0M8ml9M4J4K2m5LJ6nj1k9O6k8mk5mM4kn8m1K3Q0m7K3lJ6l4L6m7O5
$$ 57 -16 -21 -31 17 13 -26 18 32 54 9 12 28 23 12 -17 49 21 17 -8 -12 32 30 -28 -69 -46 34 -13 10 7 23 -11 25 -22 43
6893D3r4N7k6M3m2p7R5l1L3o2N2l4L4O7m8J8jnk6J6K8l1l0M7l4L4nq1O4L6l1m2
$$ 43 -51 6 -20 23 -19 -96 -1 -32 1 -61 -9 -43 -9 58 10 28 27 22 -4 12 40 9 -21 26 -8 26 21 -60 4 40 9 -33
6925c3N1q3J38ln2l3J00m9l4k2K6L7l2L0j05O8k0R4p4J2km3Q1j6k3jJ7k9K1n1
$$ -33 18 -65 73 70 18 -15 85 36 2 -20 6 43 11 41 -64 4 -16 78 4 16 14 -29 52 36 13 12 29 0 21 -30
6955c0L5q8R4k9K6l8kk8R8Kj16M7M1m9oJ08p6MR4o6M9q3k5L7M7l2j3P0n7K3p0
$$ -30 5 -83 11 -18 8 -30 -32 -60 38 40 -76 -29 12 -37 -43 65 -11 -7 87 21 70 -13 -38 -1 46 14 1 71 14 37 -33
6986c3KM0O0q7K6J4lM6m5M2m7j4J1j7J0O7n2Pj26K11j38K3J9J8l6M5k4k8K0J4
$$ -33 -31 9 69 -18 8 22 19 65 20 62 15 1 12 -5 5 72 20 27 -99 112 -26 -3 16 34 -2 43 19 -9 11 25
7016B5n4R8l5k1j0l4M9k1m2k5M7N9N6j6j36L4K6n8J12q6pO0m9qO8p1K8o8J03l9
$$ 25 -29 69 34 13 3 -31 18 -3 -45 -70 -23 36 92 76 -60 -26 0 -58 54 -32 -39 21 -28 -36 32 -39 -11 -79 24 -15
7046a5m3O9qO2o0N%K0K8k8Jl9k6K8K6%o2J1J6M1qlN3j4m7L1q7R3rj5m2j6N1m3
$$ -15 -58 11 3 65 5 10 10 30 58 30 31 -8 -34 -6 20 20 -42 -31 -15 26 18 15 68 54 7 38 -49 44 35 20 -22 -38 13 -30
7080c0N2k1J3m6L1l4OL5o7M0K3m8L2jM3k9l2J6O0l1nk5K5MqMM5j8l0Kj6PJ2Rn
$$ -30 22 1 14 -32 -1 -35 -29 6 -61 -21 2 -46 -14 -15 28 -1 -33 -17 43 12 7 -18 7 11 3 7 52 34 4 6 -10 -3 9 18 13
7115A3n7N7l4N8J6m2n7O7l1n2K4J5J9Lk3L2Qn8M2k4M3q4K8poR8q9M2r3P7Nmj3
$$ 13 -44 13 -21 37 53 11 -46 21 -10 -62 -38 -23 -4 -1 -24 8 16 -42 0 -24 19 -65 -37 -44 -50 48 -41 1 -92 -15 -10 -14 -27
7148b7PN0rr9J01J0j17R9K4q6Q0m8N9j8o3K5O7Lm0o0j7J20j33R8l9J2k5N8ok9
$$ -27 -20 30 21 -78 23 33 -84 15 39 -47 33 -15 44 26 -37 -12 55 58 18 -42 -59 61 -72 26 -13 -1 -26 32 26 -3
7178ck1K8j5L9n8J9j5N2j9J9n3K9j4J5O9j19j0N4k2ON9q8J5Q4p6m4pP6K2n8L6
$$ -3 -24 4 -11 28 -30 -11 -26 26 7 26 -27 2 -12 3 72 -47 -57 -3 -25 -19 40 -48 -33 51 -25 -69 -76 0 22 -36 0
7209@JJ0m6O1p1MK2j6lO2Kj3l0N5K1m7m5n7P6M6o5K9m5J02j06J4O1n1L2jk3l8
$$ 0 1 11 -35 26 -45 -41 -19 -35 -38 24 26 13 -17 38 59 12 -33 -90 -14 32 -33 -4 -49 53 -53 -39 22 -29 3 2 -21 -59
7241e9P1k6J0l5k8L2M5l3M7k6jk9K6j6r3M2M7N1p8R3q0N9m0l1Pj1k%K7K6m0M4
$$ -59 12 -14 -4 -39 -67 -35 10 -23 24 -2 -3 -32 -6 -22 -115 -73 -26 25 -53 40 -40 19 -21 -52 -45 -56 -58 -58 -31 -5 -45 -1
7273aj9nL5l7L8m9K4L6J3qp3N5kqO5j6n4RM9K3n8K2o3j1N9k1M3m1N8n7l7M9o0
$$ -1 -20 -25 10 -27 11 -38 -14 22 35 27 -46 9 7 -1 64 48 -6 3 52 75 17 39 -24 -35 24 3 46 5 63 6 -31 18 -42
7306d2L7MM2j4m4j7O2k6M0qm4k8R7q2O7q0K1O2j22L4kN0qQm3PN1l7K5no1K3L6
$$ -42 -5 -1 41 27 -17 -34 28 2 42 34 -10 -38 59 -23 44 -36 -15 47 -75 -41 -43 7 -1 7 -36 -29 22 -15 10 5 -56 -33 3
7339CLj04R5l6K4O6k2j6k9O0k7ko1Q3nk0qK7m6L5Mk5J1L9r2J6l0N1Q1m5M0r3R3
$$ 3 6 -98 -3 -39 -15 51 29 13 -16 44 17 15 -46 37 32 12 4 31 -15 20 24 -1 10 49 -43 -27 -57 -6 75 30 70 -23 70
7372G0j40J04J1j04Q8j0M0m4Pj0lnj5N1l6L1n4m5M9JmL5p2O3kl9m4Q2j4nmM1p6
$$ 70 -70 34 45 -59 29 19 59 15 22 12 9 4 -11 40 4 35 -19 -64 -15 -14 -18 17 -55 8 6 -33 -77 5 -9 -14 -18 23 -53
7405e3P0k5rN6o2M6l8NL3k7l3O2p3N8j2J1M3p2qM4%lPJ4j8m3l7L8K7l4J01j37
$$ -53 17 -8 -17 39 -23 23 -15 -10 23 -4 -37 25 -48 10 -2 9 52 -20 -28 16 16 13 20 34 16 -27 -64 -26 1 -33 68 -69
7437f9M5O0n5N3m5M9Kl6j6k3mM7%J2K0j6pJ4k6J8%Kj6k4l1J7K8N0o0N5pm5o3L4
$$ -69 -24 36 -19 34 -11 38 40 4 -12 -35 -39 8 8 20 40 24 17 31 5 23 23 25 9 -15 -46 -29 -1 49 -11 44 37 -8 -71 -37
7471c7P7r5N1%N6l0lqk6M2j3o8O7k0k6L7M6m0nK9k3j9Q1j34M0O9n4K9k1j0M4N4
$$ -37 40 -55 -4 -4 52 22 19 11 -15 27 14 -54 13 -7 -33 4 50 10 5 34 11 -8 73 -61 -21 48 -6 23 2 -8 36 90
7503I0j01k3Q2j08J3J10m4M1n1k1K2L1n9k1K7R5r7P4M0p0l8Nqj8j2J19p9j6P4
$$ 90 -11 -34 48 -60 -47 63 19 60 9 -12 10 41 -18 -39 -12 83 -14 60 100 30 -8 -3 -11 -29 -41 78 -1 -17 57
7532E7J1q7Q0n7K1l9NM4K1r6j3R4Lj13O1K8j0l9L1M9o2K6l9L8Onp1K9Q7p2K8N
$$ 57 68 -19 61 4 25 -14 -9 35 56 -40 -53 41 44 -69 -8 20 10 -29 2 51 -11 15 -24 14 20 15 -56 -27 60 -12 16 21
7564B1ll5K9j1N0lo5P6p0M4ro4O3l6K4M4j15K1O5OJl1L8p4M4n0P4ok8J1J0o8K1
$$ 21 18 -17 12 1 51 48 -17 59 -11 33 24 -40 23 -13 11 55 -60 -39 26 32 33 2 40 -34 10 -40 34 28 0 11 21 -47 -26
7597b6M5l3j4L8l7L2j0j2k3O4J9j7l4rj3J1L2m1R6p1N8m9%moj9kM7J7l3J3k9L
$$ -26 19 -14 -28 10 -27 5 -5 -17 -40 24 43 26 -8 -17 -30 -19 13 -28 68 -3 55 6 6 2 -4 -23 -25 22 39 6 19 -10 -7
7630gK4K8K4o5k4Q6o2J4J6l4k4K8K6k6j0Ol6M3J5p5Q5J4mp1K8Mm0J12j11M5LK8
$$ -7 17 45 69 4 -20 66 4 18 34 0 -24 4 30 4 -6 0 -36 7 22 -53 32 46 42 -29 -1 3 -37 75 -36 9 12 40
7662D0K1o7M0pm4J3N7m8k2K0J3l2oL0j2nk1J3L8j8P3p8J4k0L0k8o8J47j03o2R0
$$ 40 61 -6 34 27 -17 -4 53 5 -17 3 16 -16 -22 8 -4 -9 -30 -17 21 3 76 -2 12 -8 22 -6 -74 73 -30 -92 -2
7693bN0q3K5L8l6J1kl9L9L4k9K5k2J1k1orM0j5jm7lM9m2j4N3l4J0L0mk1k4Q8p6
$$ -2 48 -35 -10 28 -8 3 1 -38 1 35 6 31 9 20 -1 -7 -16 24 9 8 -39 -42 7 -35 -49 4 -30 -20 10 6 -15 -39 49 -27
7727b7j4O6Mm4K0K9n1L8m6j2Q7m6J8n3K1M0k6rl3Q3m8m3J1L0L8NK7r2qJ9K3L3
$$ -27 -41 25 29 -15 5 34 -17 21 -25 -37 50 4 22 -31 -10 30 4 -5 -38 45 -3 -46 -35 -5 33 38 65 -27 -35 -16 7 40
7759D0j39J03K2m3k3O6n5P0o3L0m5K7MLrj9L8OQl1L2k6P9n3p3M3k7N3k5k9K2J7
$$ 40 -99 4 26 -17 -40 26 -29 41 -22 8 -37 -10 -6 -3 -12 -31 7 13 21 -10 22 -4 75 22 -51 -8 -35 18 -7 -36 -14 3
7791CJ4J4m3k7M2K6m8M0o1L3k8K6L2l3j0OQ5o3k3J3k6K5k7L2k2M4m9K0m3K0Nk1
$$ 3 17 31 -12 -39 3 29 -19 21 -40 -7 -35 -9 23 -10 -20 -14 71 8 -15 -2 -28 -3 -30 2 -20 24 -25 -5 -48 -28 -23 -44
7823d4K9o8P1k1L9o5K0LO0l7K2J5m1qj9QK0jJ5K6rj5k6J1J5k6Nm6N8K6J5m8J0
$$ -44 -15 -83 -12 -33 6 -59 -39 -36 24 -13 9 24 -17 -25 -44 -36 -16 -17 -2 24 15 0 -26 -15 0 -26 -21 -67 -9 17 32 -16 -6
7856fL0Oj6kj2Jk7P0o2p4R4J3n2k4J31n6k7l6P5J6p0nM0RL0j03R0o9J5m2k3J01
$$ -6 24 30 14 12 0 1 -26 44 -18 -92 2 15 -37 -61 70 14 -13 -49 26 42 -28 -33 7 16 46 -57 33 -36 -21 -63 -86 15
7888A5j0k3M8K9n4K6M3n6K2q2O9j0Ql1L3J6m1J1RJ3j8m5Q4k5k4m3jK1KOj7oP5
$$ 15 5 -18 30 59 5 31 74 18 40 -42 27 17 25 -6 27 43 2 13 22 35 17 -28 56 31 7 -36 -37 -16 -14 -8 -25 -31 44
7921D4p5L2rL8L6l7o5O8%lk9l9%j2jP3J1Lk7m6R2p0J2k6K7lM3m6j6N1%n3J0N0
$$ 44 -31 1 -8 30 66 29 -36 32 32 29 0 -39 -39 -51 -52 21 32 35 8 -38 54 -16 -4 -30 -3 -6 37 -9 -25 26 26 -27 -17 33
7955C3j6j8kl7M5j6Oj4J4o9N6J8k8J8L0l1rL9M1j3n2O1J8q7L2Lj2L0l7m1R4l1
$$ 33 17 -1 -3 -40 5 -11 -5 -19 -5 -74 -18 0 -28 -10 20 -11 -20 19 60 47 -5 56 74 -13 19 22 10 40 3 -38 56 25
7987B5j6k9L8J6n5K3k2l5Q4L7o9l7L9N2r4Q6K4p2rk6O3jJ1r6P2j1m0N4Qq8mJ00
$$ 25 9 -20 18 34 -21 2 -20 -55 29 66 -3 -40 -1 51 -43 43 67 -5 -14 -40 23 22 33 -63 9 -2 -42 12 20 -68 -72 28
8019B8j9%Rl5k5O3rK5m6L6q3O5K5q3M1J6Rj1k3J3l0N9j6PM5n9k3L3l8L8M1pm5
$$ 28 9 9 18 -17 -42 21 12 37 -9 27 -56 9 34 -49 -8 8 17 6 -17 -4 -34 25 9 16 61 2 -21 12 -26 12 53 46 1
8052AM1m3lL6j1RL9l8j1pj6N5k0o9M2k2K6J0j0k7P2j07O3NPl0K3k3m3RQ3Rq3L9
$$ 1 42 -1 -4 32 21 30 69 31 20 13 -3 52 32 -37 5 -17 9 19 9 -18 54 -53 10 15 22 -8 15 -8 -51 -42 41 50 -33 6
8086FqN2j0or3J31j23K2L8M6q6N3m3N7ml1l9O5KK5j7q7P5K3n5j7J6j9j5P4Pq4
$$ 6 -2 50 40 34 -59 72 -51 -29 9 55 -31 22 -21 36 32 1 -38 27 29 54 37 -50 25 48 -7 -24 -8 -27 -42 32 39 -45
8118d5P2k5J0j%k5QrL2r3L6J2J05p3kL4jk7J4%k2N7l2P0q2PJ5l4k8O7o2J2L3J9
$$ -45 27 2 12 11 11 -14 -6 -15 17 -76 -40 -28 77 4 2 36 35 8 22 22 0 57 25 95 13 20 35 1 -27 40 -22 -10 23 42
8152D2j7pQk3J4j8l3MJ3M0m2O%O4Op0l6L0L6k8P6p6L4p5P4J3K5k8mQm9J2J5KL0
$$ 42 25 18 26 3 17 -1 -34 -30 -17 23 -19 -13 -13 51 57 -13 -49 -19 17 -11 65 -11 23 -52 22 35 60 32 28 36 -13 -1 14 16 46
8187D6m8mK3m1
$$ 46 -2 -6 17 -24
8191b4
$$ Imaginary data points
##PAGE= N=2
##DATA TABLE= (X++(I..I)), XYDATA
0@%%%%%%%%%%%%%%%%%%%%%%%%%%KnQj1J2j4J6j6J6j6J9k2K4k7K8l3L8m0M5m9N5
$$ 0 0 0 0 0 0 0 0 0 0 0 0 0 0 0 0 0 0 0 0 0 0 0 0 0 0 0 2 -3 5 -6 6 -8 8 -8 8 -8 11 -11 13 -14 14 -19 19 -21 24 -25 30
47C0o3O9p6Q6j00J17j36J61j98K57l51N33j028M198J7497n743j8620q917J1422
$$ 30 -33 36 -40 46 -54 63 -73 88 -110 147 -204 329 -699 3499 20996 15253 -3367 -12284 -862
66h62J7732L804j3745j2806L679J4605P716o545j1896l387P756Q323q76p211n254
$$ -862 16870 20674 6929 -5877 -2198 12407 20123 13578 1682 -1705 6051 14374 13498 6287 1033
81A033O61M587K903k606n650k810J712L161O29l651m683j23L434P56l670l818
$$ 1033 1694 6281 9184 6578 928 -1882 -170 2991 3620 -31 -4714 -4837 -1403 -647 -4317 -8135
97h135P34M028Q08n414m917L720P472L02q208o333M690J1023K791j0356r864M916
$$ -8135 -7401 -3373 -2565 -7979 -12896 -9176 -1704 -1402 -9610 -15943 -11253 -230 2561 -7795 -17659 -12743
113a2743J4050N647r630j2662J284J4702R478p062j3008k060J0905J0537j656
$$ -12743 1307 6954 -2676 -15338 -14054 648 10126 3064 -9944 -12004 -1099 9438 7782
126G782j0927o225N830R784K856n608p055j361N773O276M8o217n832M49P203N916
$$ 7782 -3145 -9370 -3540 6244 9100 3492 -3563 -4924 849 7125 7173 956 -4876 -4427 2776 8692
142H692l577r578l900O699Q634l41r709p135M952J0329J226r461p575L968R718
$$ 8692 5115 -4463 -8363 -1664 6970 6629 -3080 -10215 -5263 5066 6292 -3169 -10744 -6776 2942
157B942K426q440p611L777R250J479p743o263L570Q694J736p705o339L851Q247
$$ 2942 5368 -3072 -10683 -6906 2344 3823 -3920 -10183 -6613 2081 3817 -3888 -10227 -6376 1871
172A871J688o426n805K038P228K992m891n546J72M787L841o07m331l230J318M190
$$ 1871 3559 -2867 -8672 -6634 594 3586 -1305 -6851 -6679 -1892 1949 1342 -2989 -6219 -4901 -711
188g11K962j321m843l645L288P156K064o220p457Q28R135O553n152j0817j851
$$ -711 2251 930 -3913 -7558 -4270 2886 4950 -1270 -8727 -7899 1236 7789 2637 -8180 -10031
203a0031R733Q782l408j1302m635Q555J0658j429j0870n663O171R555P38q513
$$ -10031 -298 8484 5076 -6226 -10861 -2306 8352 6923 -3947 -9610 -3439 6116 6854 -1659
217a659o155M169Q122J182o168m890J790N579J990l597l975O18L113J606j094
$$ -1659 -7814 -3645 4477 5659 -509 -5399 -3609 1970 3960 363 -3612 -2994 119 1725 631
232F31k405j474J221K431Q54j685k651j169K595L729m80m901k750L141N617Q11
$$ 631 -1774 -3248 -2027 404 1258 -427 -3078 -4247 -1652 2077 1597 -3304 -6054 -2913 2704 3515
248C515o007n544L191Q475K247p021p241K195R346M549o646r226J076R850N693
$$ 3515 -2492 -8036 -4845 3630 5877 -1144 -8385 -6190 3156 7705 1059 -8167 -7091 2759 8452
263H452n463r177j175Q438O918l330q539k367N993O099p89o110l744L155N215
$$ 8452 2989 -6188 -7363 1075 7993 4663 -3876 -6243 -250 5849 5060 -1050 -4794 -1639 3576
278C576Q91l356l484k48K828K921l76l172k446P17L371K427j999m820j380M165
$$ 3576 4467 1111 -2373 -2621 207 3128 2752 -420 -2866 -2149 1222 3649 1650 -3170 -4550 -385
294c85M417j039n549l217L796O257j29o733m075M038O934Q85o646n533L492P844
$$ -385 4032 2993 -2556 -5773 -1977 4280 4151 -2582 -6657 -2619 4315 5200 -1446 -6979 -3487 4357
310D357J464o670n630K884P479K549n787o355J786O956K903m035n523j45N255
$$ 4357 5821 -849 -6479 -3595 3884 6433 646 -5709 -3923 3033 5936 1901 -3622 -3767 1488
325A488L837k207m832j480L047L524N34k927l193J77L456K358p84l530k760J833
$$ 1488 5325 3118 -1714 -3194 -147 3377 3911 984 -2209 -2032 1424 3782 2998 -532 -3292 -1459
341a459M764J486m093m636M40N426L742l182o688j178O062N166k471p009k493
$$ -1459 3305 4791 698 -3938 -3498 1928 5670 2488 -4200 -5378 684 5850 3379 -3630 -6123
356f123N465O197j400p281l162M769O052l84o016l877L400N973L31n046l506K055
$$ -6123 -658 5539 4139 -3142 -6304 -1535 4517 4133 -1883 -5760 -2360 3613 3944 -1102 -4608 -2553
372b553M625J501l319l571O75L442J798j350k656j149J735K768M91k155k418l4
$$ -2553 2072 3573 254 -3317 -2642 800 2598 1248 -1408 -2557 -822 1946 2437 282 -2136 -2170
388b170K506K860o90l895k117K658M374N04m419l950J839O028J910m772n396J094
$$ -2170 336 3196 2506 -1389 -3506 -848 3526 4030 -389 -4339 -2500 3528 5438 666 -4730 -3636
404c636O201L382l994o593j15O429M218l364o388j313N224M973j931o014k123
$$ -3636 2565 5947 1953 -4640 -4755 1674 5892 2528 -3860 -5173 51 5024 3093 -2921 -5044
419e044L980M495m60m436k903K154M117P72k908k943K69K662K322r19l047j462
$$ -5044 -1064 3431 2971 -1465 -4368 -2214 1903 2675 -233 -3176 -2907 -245 2077 1158 -1889 -3351
435c351J711K817R39k206l161K3L703K650j818m015j257L375M237o38n134k520
$$ -3351 -1640 1177 2116 -90 -3251 -3228 475 3125 1307 -2708 -3965 -590 3647 3009 -2125 -4645
451d645L560M998J12m961l722K629N816J147m989m250J813N484K141l839m958
$$ -4645 -1085 3913 4025 -936 -4658 -2029 3787 4934 -55 -4305 -2492 2992 5133 1294 -3664
466c664O74N184K611k784m356p24L639L321j073l906j828K248L028N54k528k767
$$ -3664 -2990 2194 4805 2021 -2335 -3059 580 3901 2828 -1078 -2906 -658 2370 2924 396 -2371
482b371O3K954K111j191l058j692J772L435P56l355l401J082M090K143k672m541
$$ -2371 -2308 646 2757 1566 -1492 -3184 -1412 2023 2779 -576 -3977 -2895 1195 3338 666 -3875
498c875m65M658L493k280m927j319M098M474j090n309k279L794M698k12m597l023
$$ -3875 -4340 318 3811 1531 -3396 -4715 -617 3857 2767 -2542 -4821 -1027 3671 3459 -1138 -4161
514d161K573M960Q18m101l189J608M101J736k568l505J17L504K211j325k863j151
$$ -4161 -1588 3372 4190 89 -3100 -1492 2609 4345 1777 -1728 -1611 1893 4104 2779 -84 -1235
530a235J852K783L92k588k316O42K699J730j386l315j155K717K919n10l462k430
$$ -1235 617 3400 3792 1204 -1112 -470 2229 3959 2573 -742 -1897 820 3739 3229 -233 -2663
546b663J647M001R72l687l652J038M270K018k853m406j65M382L005k226m392r64
$$ -2663 -1016 2985 3957 270 -3382 -2344 1926 3944 1091 -3315 -3480 902 3907 1681 -2711 -3675
562c675L514L691q45m353j876K965L673K2l254k362J426L549J250k287k706K67
$$ -3675 -161 3530 2685 -1668 -3544 -579 3094 3116 -138 -2500 -1074 2475 3725 1438 -1268 -1001
578a001K580K093o80k825j332K031K575L34k251k362M46L002J818j989l192n25
$$ -1001 1579 3672 2992 167 -1165 866 3441 3775 1524 -838 -392 2610 4428 2439 -753 -1278
594a278K809K708r52l878j960K722L533k96l754k663J741M057R52l667l518J273
$$ -1278 1531 4239 3287 -591 -2551 171 3704 3408 -346 -3009 -1268 2789 3741 74 -3444 -2171
610b171L947J705k587l732k2L762K514j844l412q67K713L131k55l285j771J901
$$ -2171 1776 3481 894 -2838 -2860 902 3416 1572 -1840 -2707 6 3137 2882 -403 -2174 -273
626b73K969P09k067k368K85K876J963j314k716p93J930K536J39k902k164J342
$$ -273 2696 3405 1338 -1030 -745 2131 4094 2780 64 -729 1201 3737 3876 974 -1190 152
642A52L114R29k402l071K4L161K180k005l759p95K887K839r82l858j985K491L361
$$ 152 3266 4195 1793 -1278 -1254 1907 4087 2082 -1677 -2472 415 3254 2272 -1586 -3571 -1080 2281
659B281l27l332k517J440L498J106l034k984P12L198J805j720l035n43K849K652
$$ 2281 1954 -1378 -3895 -2455 1043 2149 -885 -3869 -3157 41 1846 126 -2909 -3452 -603 2049
675B049r34k766j317J810K977P22k389k354R09K932J536j359k850n62K830K611
$$ 2049 1115 -1651 -2968 -1158 1819 2541 152 -2202 -1293 1639 3175 1816 -1034 -1596 1234 3845
691C845q23l041j486J919L121L72l010k810J391L376J202k604l300l4L381K174
$$ 3845 3022 -19 -1505 414 3535 3907 897 -1913 -522 2854 4056 1452 -1848 -1882 1499 3673
707C673k039l574p38K712K620r09l568j769K112L045j07k919k228R59K965J134
$$ 3673 1634 -1940 -2678 34 2654 1745 -1823 -3592 -1480 1565 1458 -1461 -3689 -2730 235 1369
723A369k342k615K13K504J753j081k548j120K087K556j93k396j708R98K660J296
$$ 1369 -973 -3588 -3375 -871 882 -199 -2747 -3867 -1780 776 583 -1813 -3521 -2523 137 1433
739A433k040k522L10K591J967j111k881r49K376K792m86k836j693J556L069P16
$$ 1433 -607 -3129 -2819 -228 1739 628 -2253 -3202 -826 1966 1480 -1356 -3049 -1493 1576 2292
755B292k640k552Q99L218J333j885k814k94K853K232j269k851r93K063K655n1
$$ 2292 -348 -2900 -2001 1217 2550 665 -2149 -2443 410 2642 1373 -1478 -2471 -408 2247 2196
771B196k717j992J385K776P30k130k278J77K563J745j419k769o35K041K259l64
$$ 2196 -521 -2513 -1128 1648 2378 248 -2030 -1853 710 2455 1036 -1733 -2368 -327 1932 1568
787A568k726j804J459K777L31k297k346M18K725J436j887k783l31K484J933q43
$$ 1568 -1158 -2962 -1503 1274 1605 -692 -3038 -2620 105 1541 -346 -3129 -3460 -976 957 114
803A14k869j332K025K555j66k566j832J143K736R55k053k457N48K635J573j232
$$ 114 -2755 -4087 -2062 493 327 -2239 -4071 -2928 -192 763 -1290 -3747 -3199 -564 1009 -223
819b23k433n01K228K338m93k430j066J487K405P38j916k119P07K590J315j309
$$ -223 -2656 -3157 -929 1409 916 -1514 -2580 -1093 1312 2050 134 -1985 -1278 1312 2627 1318
835A318k243m56K284K136p15k631j156J665K280L02k329k085Q73K627Q60j919
$$ 1318 -925 -1381 903 3039 2324 -307 -1463 202 2482 2784 455 -1630 -757 1870 2730 811
851H11k595r9K420J840j429k892p64J975K200l95k701j763J434K641K98k305k036
$$ 811 -1784 -1883 537 2377 948 -1944 -2708 -733 1467 1072 -1629 -3392 -1958 683 981 -1324 -3360
868c360N01K577J466j723k616n0K301J916o71k455j070J851K547K9k257j588J039
$$ -3360 -2859 -282 1184 -539 -3155 -3205 -904 1012 341 -2114 -3184 -1333 1214 1243 -1014 -2602 -1563
885a563K556J108j691k354L55K513J597j103k303p00K088K282l32k485j375J373
$$ -1563 993 2101 410 -1944 -1589 924 2521 1418 -885 -1585 503 2785 2453 -32 -1407 -34
901c4K316N56k112k048O35K540J012j620k323l68K130J911r56k586r22J649K068
$$ -34 2282 2838 726 -1322 -687 1853 2865 1245 -1078 -1446 684 2595 1639 -947 -1869 -220 1848
918A848j3k201j889R58K481O58j897k106J60K197J569j157k535m49J870J995l32
$$ 1848 1835 -366 -2255 -1297 1184 1842 -55 -2161 -2001 196 1765 608 -1927 -2376 -506 1489 1157
935A157k315j388J358K479L83k101j693N12K318J360j450k368j04K285J622o45
$$ 1157 -1158 -2546 -1188 1291 1674 -427 -2120 -1608 710 2070 620 -1748 -1852 433 2055 1410
951A410k300r80J581K350J0k187j547R82K283Q33j703k154K64K295J363j122k253
$$ 1410 -890 -1870 -289 2061 2071 -116 -1663 -681 1602 2435 732 -1422 -1158 1137 2500 1378 -875
968h75o12J759J993m00k358j078J270K037L99j926j832N40K257R20j487k014j37
$$ -875 -1487 272 2265 1865 -493 -1571 -301 1736 2135 209 -1623 -1083 1174 2094 607 -1407 -1544
985a544J824J705q62k292p73J536J929p9j966j580R41K188O26j725j802J94K016
$$ -1544 280 1985 1123 -1169 -1942 -406 1523 1444 -522 -2102 -1161 1027 1653 -72 -1874 -1680 336
1002C36J380j075k170m69J779J711l99j867j331J171K199L47j814j553M58K047
$$ 336 1716 641 -1529 -1998 -219 1492 1093 -774 -2105 -934 1265 1612 -202 -1755 -1297 750
1018G50J141j132k125k13J926J542o29j927r96J371K062R9k008j412Q47J942Q61
$$ 750 1891 759 -1366 -1579 347 1889 1260 -667 -1663 -292 1770 1869 -139 -1551 -704 1238 2099
1035B099j464k042J03K103J277r94k063o24J589J917l68k130j217J140J931M28
$$ 2099 635 -1407 -1304 799 2076 1082 -981 -1605 -16 1901 1533 -597 -1814 -674 1257 1685
1051A685j715j729M06K156R82j425j916k44J716J625o05k152q50J436J911nj858
$$ 1685 -30 -1759 -1353 803 1785 360 -1556 -1800 -84 1541 936 -1216 -2066 -630 1281 1276 -582
1068e82j480P51K181P35j630j763K26J825J408q42k170m97J731J694l50j870j146
$$ -582 -2062 -1311 870 1605 -25 -1788 -1562 263 1671 829 -1341 -1838 -107 1587 1237 -633 -1779
1085a779J066K124K83j709j514M97J835J078j067j935l24J875J440o11j889q78
$$ -1779 -713 1411 1694 -15 -1529 -1032 803 1881 814 -1121 -1445 430 1870 1259 -630 -1508
1101a508J220J971M8j951j380Q90J858O45j319j905J13J891J273r65j893n91J481
$$ -1508 -288 1683 1731 -220 -1600 -710 1148 1793 474 -1431 -1318 573 1846 881 -1012 -1603 -122
1118a22J721k24k096j053J142J852L10j544j693M87K012J004j321j803j80J649
$$ -122 1599 1375 -721 -1774 -632 1220 1530 -14 -1707 -1220 792 1796 475 -1328 -1508 141
1134A41J575o21j987q45J446J790j3j684j393P14K060O71j526j651K86J685J295
$$ 141 1716 1095 -892 -1737 -291 1499 1486 -198 -1591 -877 1183 1854 328 -1323 -1037 648 1943
1151A943r07j975l40J606J567m08j836r79R91J961J94j707j333N82J726Q42j080
$$ 1943 1036 -939 -1279 327 1894 1486 -350 -1329 -338 1623 1817 110 -1223 -641 1085 1927 847
1168H47j804j20J721J172p32j601p16J110J608J34j773j213Q54J557O45j291j572
$$ 847 -957 -1077 644 1816 1084 -517 -1233 -123 1485 1619 -154 -1367 -513 1044 1689 398 -1174
1185a174P3J698J074r26j593m36J306J462j58j665j059R62J607M08j365j396K44
$$ -1174 -1101 597 1671 745 -848 -1284 22 1484 1326 -339 -1398 -436 1171 1579 214 -1182 -938
1202i38J819Q54j052j633j35J398J428l84j772q59J225J652rj482j264N82J781
$$ -938 881 1735 683 -950 -1085 313 1741 1357 -415 -1274 -49 1603 1594 112 -1152 -570 1211
1219A211P01j358j515K14J434J118o59j786m92J362J469l00j513j002P75J748
$$ 1211 1912 554 -961 -747 687 1805 1146 -640 -1132 230 1699 1399 -114 -1116 -341 1407
1235A407L39j417j380L76J508R04q51j685l01J532J317o26j521p59R93J549K23
$$ 1407 1746 329 -1051 -675 833 1737 886 -799 -1100 432 1749 1123 -398 -1157 -164 1385 1608
1252A608j620j262P17J548N81j134j467r6J613J153q72j563m57J119J388j12j652
$$ 1608 -12 -1274 -557 991 1572 438 -1029 -1125 488 1641 769 -794 -1251 -132 1256 1144 -508
1269e08r17Q52J464L17j159j305J85J570R05j028j434j08J200J100k03j548q56
$$ -508 -1425 -573 891 1208 49 -1256 -1071 499 1404 376 -1058 -1166 34 1134 931 -617 -1473
1286a473J158J454P9j279j244M66J647P56j204j532J58J487J084n82j597o50J312
$$ -1473 -315 1139 1218 -61 -1305 -839 808 1564 360 -1172 -1014 473 1557 975 -622 -1272 40
1303D0J479k48j492r39O76J610M96j463j352M29J525P17r12j506k90J366J236
$$ 40 1519 1271 -221 -1160 -484 1126 1622 159 -1193 -764 761 1478 566 -940 -1230 136 1372
1320A372o09j550n64Q61J462M2j392j172O38J463N00j033j391MJ416J060p85j441
$$ 1372 763 -787 -1351 -490 972 1014 -378 -1550 -912 551 1051 18 -1373 -1369 47 1107 322 -1119
1338a119l81J112J302j18j528r36Q75J533K00j154j173K34J480Q82j003j463l
$$ -1119 -1500 -388 914 796 -732 -1668 -793 740 940 -214 -1387 -1153 327 1209 206 -1257 -1260
1355a260J308J096n05j485o03J105J396j61j369q72O07J356N40j184j316K24J449
$$ -1260 48 1144 639 -846 -1449 -344 1052 891 -478 -1350 -743 613 1153 -31 -1347 -1123 326
1372C26O13o20j273m49J140J205k92j244q22P30J305L30j140j261L77J353O70
$$ 326 939 319 -954 -1403 -263 942 650 -594 -1416 -686 619 949 -191 -1452 -1075 278 948
1389I48p21j251l15J242J170m43j405o72R52J320J57j277j073N50J478M28r43
$$ 948 227 -1024 -1339 -97 1073 630 -775 -1447 -495 825 982 -295 -1368 -818 660 1088 145
1406A45j271j4J344R88p66j458j96J054J049k22j292q14P94J331Q1j203q86K22
$$ 145 -1126 -1140 204 1192 426 -1032 -1228 -174 875 653 -639 -1453 -659 672 753 -450 -1336 -1114
1424a114J202P00q61j184k1J002Q30k89j173o77Q73J351j19j158p72L75J258O53
$$ -1114 88 788 -73 -1257 -1278 -276 554 265 -908 -1585 -712 639 520 -638 -1410 -1035 223 876
1442H76r70j193J34J278P47n00j242m13J061J277k43j246o30O32J207L70j012
$$ 876 -94 -1287 -1153 125 872 372 -870 -1283 -222 1055 812 -434 -1064 -432 775 1145 133
1459A33j076L52J291N02p07j090k75J150R97m59j188n59P97J051J09j060j010
$$ 133 -943 -591 700 1202 495 -595 -870 280 1277 818 -370 -929 -132 919 1028 -32 -1042
1476a042M19J286K87q41j051p4J071Q32n03j328l17Q84J030o3j192q81O82J284
$$ -1042 -623 663 950 109 -942 -1016 55 887 384 -944 -1261 -377 653 590 -602 -1483 -801 483
1494D83J95j041r60J54J340P35q50j245q1J187R43l52j239n53R01J283m8j236
$$ 483 678 -363 -1323 -1169 171 906 56 -1189 -1270 -83 860 508 -731 -1284 -383 900 852 -384
1512c84o80N53J211M36r14j113K64J123P63n72j132l10R00J138l07j116n88O14
$$ -384 -1064 -511 700 1136 222 -891 -627 496 1259 687 -445 -755 145 1283 976 -140 -728 -114
1530a14J052K74q86j051K38J234N36q30j011k16R37R35l62j242m80Q19J035M2
$$ -114 938 1212 326 -725 -487 747 1283 453 -558 -774 163 1098 736 -506 -986 -167 868 910
1548I10j086r47M80J200L36r19r55l0J133Q27o51j233j60R66Q39j63j096o35O38
$$ 910 -176 -1123 -643 557 893 -26 -981 -1011 122 949 298 -935 -1095 -129 710 547 -549 -1184 -546
1567e46J205J30j001q31L71J040O70p57j127lJ096P55l56j069m57P27J156j3j037
$$ -546 659 789 -212 -1043 -672 368 1038 281 -846 -849 247 1002 646 -423 -880 -153 1003 990 -47
1586d7p73N01J128L62q27j059K04J095O38n81j067k76R23R90m03j096n27O48J032
$$ -47 -820 -319 809 1171 344 -715 -511 584 1222 641 -426 -702 221 1211 808 -288 -815 -167 865
1605H65J03r94q92L56J178L39q46q99QR29P59m87j075l39Q53P75n4r59o63M53
$$ 865 968 -26 -918 -562 616 955 109 -790 -782 147 906 419 -656 -995 -142 633 579 -380 -1043 -590
1625e90J081K43q83o76O0R07O54m87j077j28Q09P92r8r53n71N85R57J95r34o97
$$ -590 491 734 -149 -825 -765 142 796 309 -768 -896 -87 705 607 -346 -917 -332 625 820 -114 -811
1645h11L63R10N78n64j125l6J015P32m40r01m28P13R56p8j080n36M89R60K57p36
$$ -811 -448 462 1040 476 -649 -685 330 1062 622 -279 -707 6 962 884 -196 -732 -243 717 974 238
1665B38r73J89R73N34n60r39k36P66Q85k30j156m07O13Q95O3q25q03K59J150L06
$$ 238 -735 -546 427 961 401 -538 -774 -8 877 647 -509 -916 -303 592 655 -170 -973 -714 436 742
1685G42p25q32n2R01P63m03j053l46P76Q70j07q54o36N00J062J85q43q08K23R59
$$ 742 17 -815 -867 34 797 394 -659 -1005 -229 641 534 -320 -956 -456 606 791 -52 -860 -637 322
1705C22N29m75r56j54Q89P04k84r13m71O26J053m6r29n89K86R02M28o28r69M1
$$ 322 851 376 -580 -734 155 859 575 -338 -809 -183 870 824 -105 -694 -408 494 922 294 -675 -634
1725f34R41N86l86r59k62O30R14j06r90n87N36Q73K70p23r42J70J055M79o59q50
$$ -634 307 893 507 -452 -714 -84 830 724 -266 -853 -317 556 826 103 -839 -669 386 865 206 -644
1745f44j77P45R05k71j104l79O43R24M1q21p73L83J032L74p86p00o2Q04P36m09
$$ -644 -821 -76 829 558 -546 -925 -282 642 683 -138 -911 -528 504 878 92 -608 -670 134 870 461
1765D61j017k47Q07Q00j76q37o05M44J011J94r37o88L87P87M59m97r73m9Q50O48
$$ 461 -556 -803 4 804 628 -209 -814 -370 641 835 -102 -790 -403 384 843 346 -627 -676 174 822
1785H22l69q15m15N63Q95J9r28o01M17Q45L63p00p97QR42N41m79q70j39O32Q18
$$ 822 453 -362 -777 -214 681 700 -228 -829 -412 433 796 96 -701 -693 249 790 311 -559 -698 -66 752
1806G52j22r58l83M79Q71Q4o94p41K51R30L34n18p66o9O95P00k51r57k92O30Q27
$$ 752 630 -328 -711 -232 639 723 29 -712 -461 469 803 285 -481 -550 145 845 594 -363 -655 -25 802
1827H02j46o41o73K58R35K89o80p74J24Q07M75l43r02j78O59P18j97p05n22L40
$$ 802 656 15 -658 -400 535 824 144 -630 -506 301 776 433 -469 -647 12 730 533 -172 -694 -354
1847c54R44J04p92o49K49P93M43n51q29p0Q35N83l11q08l41M86Q20J23q79n96
$$ -354 590 694 -98 -747 -498 295 738 187 -642 -712 123 706 395 -413 -754 -268 552 675 -204 -800
1867h00M72Q05K53n58q34L9R15N46n04q28r1N65P37q3q58m69N26P75K11p33o95
$$ -800 -328 477 730 172 -662 -623 292 838 334 -494 -585 -20 717 634 -224 -693 -167 608 819 86 -609
1888f09K16Q64M69o36p94n2O75O51j84r33l95O95P03op00o10K67Q70K67o82p39
$$ -609 -393 471 940 304 -490 -542 133 784 600 -333 -728 -33 670 664 -36 -646 -379 491 758 76 -663
1909f63J23O76N58l34q71k47P03O69k49o75m46L50Q43J56p45o79K72Q17L49m53
$$ -663 -540 136 694 360 -511 -758 -55 614 365 -310 -756 -406 437 593 -152 -831 -559 258 607 154
1929A54q23p5Q46O38l73p51l39N68P69R9q10o01L93Q18K66n59q27J03Q39N79n06
$$ 154 -669 -744 102 740 367 -384 -723 -155 614 713 -97 -698 -305 513 779 220 -607 -504 335 914 408
1950D08q86p6O82O32j37q73m90O39P79Jp16o44K46Q31M13o05q15M6O56N80l12
$$ 408 -478 -554 128 760 623 -250 -740 -101 678 679 -37 -681 -435 396 809 204 -611 -565 91 671 359
1971C59q84k75O57N72M5p44m80L03P89K84p50o65J33P48N25m35p57j25O89O40
$$ 359 -525 -800 -143 429 474 -270 -750 -447 342 626 -124 -789 -656 92 617 182 -575 -700 -11 629
1991F29k27p90l20M32Q08J07o94o39K91Q07K69m79q01N7P78N62m17p78j78N43
$$ 629 402 -388 -708 -276 532 639 -55 -694 -403 404 673 194 -607 -550 228 790 373 -405 -583 -40
2011d0P42q1p80n22M11P72N6m98n70K0O91M43m98p10j7N72N73j48p10m87O06O87
$$ -40 702 621 -159 -681 -270 502 558 60 -510 -490 201 644 146 -564 -581 -9 564 416 -294 -781 -175 512
2033E12m4n75m88Q2Q38M20n91p29NO73N51k67p86k81O83O85k09o65m70M05P17
$$ 512 468 -107 -595 -513 325 745 154 -575 -570 103 654 387 -399 -680 3 688 479 -186 -656 -251 466
2054D66J95o72o79K89O78L10l46p88n8O38N61k74p20j48K70P29M0o68n24K92O94
$$ 466 661 -11 -690 -401 277 587 241 -547 -605 33 594 320 -400 -548 -278 451 491 -177 -701 -409 285
2075B85J78m17n45n8O24N19l17o95k11N23O16j3o42m19L32O81K57n63o37R3P23
$$ 285 463 46 -499 -557 67 586 269 -426 -637 -114 502 489 -153 -572 -240 441 698 135 -502 -409 314
2096C14M80m24p35j23O34N72j92o65l72M82O82K7p16n11K77O29L06n07p15Q5O76
$$ 314 794 370 -365 -488 146 718 526 -139 -511 -29 653 680 -36 -547 -270 359 665 158 -557 -472 204
2117B04L54l05o92k42O19N06j34o12l65J89O70K43n38o15J62O04L86j82p36k25
$$ 204 558 253 -439 -681 -62 444 310 -302 -667 -478 192 435 -103 -718 -556 48 434 252 -484 -709
2137g09N64P20k29o99l05N13O57J58o83n79L04P31L05n72n83j9P69M62m16p18
$$ -709 -145 575 346 -353 -658 -145 512 670 -13 -592 -288 443 748 176 -407 -426 343 805 389 -329
2157c29r1N78N76j31p26m21M48O45J4n26m77J07N53L59m88n68j5M25M20m7o56
$$ -329 -420 158 734 603 -123 -544 -96 549 563 37 -440 -333 220 579 91 -477 -492 -67 353 306 -350
2178c50k32L64N21P3n59m87J72O74L55n62n82RO65M50k91o34k68N90O57j42p04
$$ -350 -582 -218 303 376 -183 -670 -498 176 531 -31 -613 -604 61 511 220 -414 -682 -92 565 423 -281
2199b81l02M33O25J08n66o07K64P55J77l76o49J4O57M64l78n91r0L92M07L9n29
$$ -281 -583 -150 475 583 17 -590 -326 429 606 230 -419 -405 252 716 338 -253 -343 49 456 495 -34
2220c4m46K73O25O1n00l51m7N09M57k90o23j93M47N06k7n74m47L49O59R8n70m44
$$ -34 -480 -207 418 479 -21 -372 -419 90 547 257 -366 -559 -112 394 367 -207 -654 -305 354 452 -118 -562
2242e62J01O92L51m97o61M1O31M10k22o59l26O12O56j46p09l30L98O09J30n78
$$ -562 -461 231 582 85 -576 -535 96 506 284 -375 -701 -89 567 421 -288 -618 -220 389 519 -59
2262e9m49K30N07K68l44n04l8M32M33j25m91j77J85M22K07m36m43P7M53L40k18
$$ -59 -508 -278 229 497 153 -351 -389 43 476 351 -140 -317 -132 290 497 61 -382 -305 148 488 270
2283B70n10k10L67N93j27o06l15L69O21N6n26n73K27P10K22m78n68l6O85M44m26
$$ 270 -240 -450 -83 510 383 -223 -538 -169 452 508 -18 -591 -364 346 568 90 -478 -514 171 615 189
2304A89o85o4N83M43k20n62k32L79N72q0m81k91J76M68K35l34n23J3M59L49j26
$$ 189 -496 -560 23 466 246 -316 -548 -169 403 323 -158 -449 -273 195 430 96 -427 -414 45 394 268
2325B68l58l08K37N27O8m42m00Q3N39L13k42o63l9O13L13j55o15k57M20P60k45
$$ 268 -90 -398 -161 366 434 -8 -408 -325 214 527 285 -378 -417 196 509 354 -261 -518 -98 662 417
2346D17o02l89L89O87K5n75o13L15O44K70n36n05L2N42L55l48n14l3M09L11j53
$$ 417 -185 -574 -185 502 527 -48 -661 -346 298 568 32 -473 -441 101 456 108 -406 -439 -30 281 128
2367A28l45k74K38M60O8k72l13k8L12L82j19n19j15L73M01K1m36l70J72N58K49
$$ 128 -217 -491 -253 207 275 3 -310 -338 -26 356 237 -282 -397 -24 377 398 -38 -408 -236 322 571
2388E71m98m25jO13L34l31p21J7O21M22k75o07k65N30O27j88o67l35M18N26N8
$$ 571 73 -352 -353 260 594 263 -458 -441 180 602 327 -280 -545 -15 612 424 -243 -578 -160 366 424
2409D24m80n06J91O13J34m40l76Q3L53K24j65m51j6K54K48J25l19l10N9M30K19
$$ 424 -56 -562 -371 242 376 -64 -440 -357 -4 220 55 -396 -412 -158 90 215 -104 -414 -355 75 294
2430B94j70m81l7K97M33m1n06l19M03N49J5m93m63K48O11K55n30n37J20N73L55
$$ 294 124 -357 -394 -97 336 295 -211 -530 -127 422 437 -56 -519 -271 340 595 65 -472 -352 221 576
2451E76l27o93NO65K87k85n56j09M29M62j92n20q2K37L32K7k49l63O1M22Kkl43
$$ 576 249 -444 -439 226 513 228 -328 -437 -8 454 262 -258 -340 -103 229 256 7 -356 -295 127 129 127 -216
2474b16j38K00L76Ql05l27J27L67K32j77m78j02N12L68k69m81k26M17N56k0o78
$$ -216 -354 -154 222 230 -75 -402 -275 92 324 147 -331 -433 79 447 178 -303 -529 -112 444 424 -254
2495b54l37L84O36m8m62m79K36P14J65o08l87J55L95K91l05n32N6N30K32k21l40
$$ -254 -591 -207 429 381 -81 -560 -324 390 555 -53 -440 -285 110 401 96 -436 -380 150 382 161 -179
2516a79j45K61K91N1k95k14Q6K10J76p5l06j59K95K22J05l13l78J86M46J44l14
$$ -179 -324 -63 228 279 -16 -230 -144 66 242 167 -139 -298 -3 219 324 11 -367 -181 265 409 95
2537I5n61J31M88L45k39o60j11N68M59k79n71k08M73N50j81o33k45N21M05m7m66
$$ 95 -466 -335 153 498 259 -401 -512 56 515 236 -335 -543 -70 480 299 -334 -579 -58 347 300 -166
2558a66k72K04M86Q2m32j74L5L25K00j74k48j67K94J81k7p2k10p5L49K33j41l94
$$ -166 -438 -234 252 334 -98 -272 -237 88 288 114 -134 -301 -7 174 147 75 -135 -210 139 372 231 -163
2580a63q2J93M34P1n63k89L55M78Q8m92m95K15O12K73n34n51J27O51K05l78n96
$$ -163 -245 -52 382 453 -110 -399 -44 434 522 30 -465 -250 362 635 101 -450 -323 328 533 155 -441
2601d41OO45L59l70n45LL62M33k46m82j69L69L31ml10k59J39L68m2p3k69M1J21
$$ -441 -435 210 569 199 -346 -343 19 452 206 -276 -445 -76 255 251 -59 -318 -179 189 147 74 -195 -154 -33
2624c3K12O9l28k16J56K53J74j29m30p3M47L99k64l85j91L26M66k8n87k61L76
$$ -33 179 248 -80 -296 -140 113 287 158 -272 -345 102 501 237 -148 -339 -13 453 425 -162 -423 -47
2645d7N47n9m78l07K00N57J38m52m20K41M62J22l56l19lM40K52k51m11j0K36K17
$$ -47 500 441 -37 -344 -144 413 551 99 -321 -80 382 504 148 -171 -174 266 518 267 -144 -154 82 299
2667B99k5k67j06k3K74O6j25j03k06K27J80j7k86k13J01L90J34m03l10R6L53K18
$$ 299 274 7 -99 -122 152 218 93 -10 -216 11 191 174 -112 -325 -224 166 300 -103 -413 -317 36 254
2689B54j96n01j01N20L88k42n61m3M73M62j71n19k70M39M21j24l12k26K67L86
$$ 254 58 -443 -544 -24 364 122 -439 -482 -9 453 282 -237 -507 -68 353 229 -83 -309 -42 344
2709C44P2l58k50K07L41J3p1k62NK45J26j18j33j21O8J34J69j47l21p2J67L17
$$ 344 416 58 -192 15 356 369 298 36 41 286 412 294 161 40 108 242 411 264 -57 -129 38 355
2731C55jm14l25K71L80M9m49l10J22N07J26m06n04J32N32K28l16n66N7M82L00
$$ 355 354 -60 -385 -114 266 315 -134 -444 -322 185 311 -95 -599 -467 65 293 -23 -589 -532 -50 250
2752B50k69m52o3M37L41j83l91j06L87K87p1k59j04N0L70R9k02k53Q8J60J08Q3
$$ 250 -19 -471 -534 -97 244 61 -330 -436 -49 238 167 -92 -196 -146 224 323 121 -132 -44 116 224 307
2774C07j58k80J24K99Q4j11l97o0L07L49j58m89o7K74M01j26m23l72M17M86j08
$$ 307 149 -131 -7 292 376 265 -132 -192 115 464 306 -183 -250 24 425 299 -124 -496 -79 407 299
2795B99m96k73K16N86N0n85l52L02M54O8l20m11P5M26L05l93l05M9K54L14j32
$$ 299 -197 -470 -254 332 382 -203 -555 -253 201 269 -51 -462 -387 39 344 -49 -354 -305 -51 263 131
2816A31k93j48J84K55O5j36j78n7J63K24m6k16k04J62L76j6l03k53J13L94K12
$$ 131 -162 -310 -126 129 194 58 -120 -177 -14 210 164 -52 -256 -94 282 266 -37 -290 -177 217 429
2837D29k98l90n5M14M40l98m64m0M17L13j53n24j75M81L88j73l99j70K57M21q
$$ 429 131 -259 -314 100 540 142 -322 -362 55 368 215 -309 -484 -3 385 212 -187 -357 -100 321 313
2858C13m76k01K61L41k5j93j95l4K73J81j61j97n8J15J64Q0k06j78J3K27J34l6
$$ 313 -163 -364 -103 238 213 20 -175 -209 64 245 84 -113 -171 -56 108 188 -18 -196 -183 44 178 142
2880A42k66k51L02L53r4l14k51J87L60J19l31l44N2N15J28l29l86%M86L17l36
$$ 142 -124 -375 -73 280 186 -128 -379 -192 168 287 -44 -388 -336 179 307 -22 -408 -408 78 395 59
2901E9m26OM66J78j04l79j31L64K58j12k32j35J57K12R1j78k27O1J73J19O1k14
$$ 59 -367 -361 105 283 179 -200 -331 33 291 179 -53 -188 -31 181 272 94 -133 -72 101 220 281 67
2923F7j87Q5L11j8j61k32o0L59J76j17m22j0K54K91j48l10k30K54M57r3m48j96
$$ 67 -120 -35 276 258 97 -135 -195 164 340 223 -199 -209 45 336 188 -122 -352 -98 359 266 -182 -378
2945c78J84M12J17l38m27J37M63M3k51l11J2M02K30k85l05JK72J96j68j59j42
$$ -378 -194 218 335 -3 -430 -293 170 213 -38 -349 -337 65 295 10 -295 -294 -22 174 6 -153 -295
2966b95J33K60j6j66r5L0J45J49l4k32j04J39K92m8j60l08J12L61N8j64k21j09
$$ -295 -162 98 82 -84 -179 -149 -4 145 111 -121 -225 -86 206 158 -2 -310 -198 163 221 57 -164 -273
2988b73M57K00j72m50k7L77K75j13m24j79L97L67n0n29j35K55L16R8l90k79J53
$$ -273 184 384 212 -238 -265 112 387 274 -150 -329 68 435 385 -144 -279 -24 292 390 0 -279 -126
3009a26L77M0k18k33l1K27K17j37l28J4O0J48P7j57k36lK42J51r9k81n5J79K79
$$ -126 251 291 73 -160 -191 36 253 116 -212 -198 -138 10 87 -70 -306 -309 -67 84 -15 -296 -351 -172 107
3032A07p3k66k15J50L64J41l30l13J08M74J32l51k13K5L99K73l43l16K5L75J65
$$ 107 34 -232 -447 -297 67 208 -122 -435 -327 147 279 -72 -285 -260 139 412 69 -247 -222 153 318
3053C18j30l22j47L91L20j85l13r4J47K13P1k43j58K8J73J97j59k36n0J41J92
$$ 318 188 -134 -281 110 430 245 -68 -162 -15 198 269 26 -132 -104 69 266 107 -129 -179 -38 154
3074A54k2j96j22pK58P2j24k79q2K37K35j32k55k41K65M52n3m13k05K74K87P0
$$ 154 132 -64 -186 -193 65 137 13 -266 -348 -111 124 -8 -263 -504 -239 213 160 -253 -458 -184 103 173
3096A73k88l23K01M16O7k70k54J27J94K63j91l84O0K16K06r1j45j74J21K70j8
$$ 173 -115 -438 -237 179 246 -24 -278 -151 43 306 115 -269 -209 7 213 122 -23 -197 -76 194 176
3117A76k06p3l1K00R1p4j68j27J64K31j9k96j79J26L22J17l26j99kK90K12r1m16
$$ 176 -30 -103 -134 66 157 83 -85 -212 -48 183 164 -132 -311 -185 137 254 -72 -271 -273 17 229 138 -278
3140b78p1L33L16j83l20j26K96L54p5m05j05K59K98J0k18l49J81K98Q6k54j76
$$ -278 -349 -16 300 117 -203 -329 -33 321 246 -159 -264 -5 293 303 85 -264 -83 215 301 47 -129
3161a29K4K34K37j76k54n5J71J23k4j87o7j8K46J06j62k20q3K76R7j9l36j16K44
$$ -129 -105 129 366 190 -64 -119 52 175 151 -36 -103 -121 125 231 69 -151 -234 42 139 120 -216 -332 -88
3184h8J73L4k39j88O5K99J24k36k41O2K89K20k71k84j7K96K51r3l05j11K32L44
$$ -88 85 119 -120 -308 -243 56 180 -56 -297 -235 54 274 3 -281 -298 -2 249 156 -149 -260 -28 316
3206C16ll75o0J63J99J16k31k08k8K91J24j41k59%J54K17lk79j23L0K63M9k10
$$ 316 313 -62 -122 41 240 356 125 -83 -111 180 304 163 -96 -96 58 275 272 -7 -130 -100 163 212 2
3229Bj98j1L14J56k04j94j21K62K50j01l21j74K42K90mk56k28R3L53K5k50j67
$$ 2 -196 -207 107 263 59 -135 -256 6 256 155 -166 -340 -98 192 188 -68 -296 -203 150 175 -75 -242
3251b42QK84J95j93k33qJ62K19o7k04j27J89K58%k39j30P7J46J48o5k13n1J93
$$ -242 -234 50 245 52 -181 -189 -27 192 125 -79 -206 -17 241 241 2 -128 -51 95 243 178 -35 -86 107
3274A07J59q2k17q2J18K37N7k22l04J44K61Q0q8l28r5L38K14k16j91q4J37K97
$$ 107 266 184 -33 -115 3 240 297 75 -229 -85 176 256 168 -160 -255 83 297 81 -110 -194 -57 240
3296B40o9k77j48K13J58N8k66j40P7K14J59k74k09J16K10J51q4k74n9K15J03j3
$$ 240 171 -106 -254 -41 117 175 -91 -231 -154 60 219 -55 -264 -148 62 213 129 -145 -204 11 114 101
3318A01j40j43M9K30J43k40j10l4J49J83M0k37j19K40J35o6j71j51J14K05J55
$$ 101 -39 -182 -133 97 240 0 -110 -144 5 188 228 -9 -128 112 247 181 10 -141 -27 178 333
3339C33k95j52P3J74R3j16j73j40K77J44p6k51o8J38K09M3k45k26J79J56J10k31
$$ 333 38 -114 -41 133 226 110 -63 -203 74 218 142 -109 -177 -39 170 213 -32 -258 -79 77 187 -44
3361d4j78l0K41J66j29k44nJ62J56o0k34n5J23K25P3k22j58RK84J52j93k01j07
$$ -44 -222 -252 -11 155 26 -218 -223 -61 95 35 -199 -254 -131 94 167 -55 -213 -204 80 232 39 -162 -269
3384b69K33L10o9l14j44K53K20j5k26j65R4L43J6k03k44L6K33J49p2k45p9K41
$$ -269 -36 274 205 -109 -253 0 220 205 -21 -186 -92 251 267 64 -180 -144 89 238 166 -79 -158 83
3406H3J97n8l39q9J57K28Qk81j47J10K14P1j02k46M4K08J08j51j25p5J16J70R3
$$ 83 280 222 -117 -206 -49 179 187 -94 -241 -131 83 154 52 -194 -150 58 166 15 -110 -185 -69 101 194
3429A94k41k37J25K45O8j25j89l9K40J32l4k54pJ04J88L6k88j35J26J73L0j01
$$ 194 -47 -284 -159 86 154 29 -160 -199 41 173 139 -115 -122 -18 170 206 -82 -217 -91 82 112 11
3451A1k14L9K97P3j92j61pJ88J78p8k49r8J26K64o7j68j45J03K23R1j69k13k5
$$ 11 -203 -164 133 206 14 -147 -154 34 212 134 -115 -213 -87 177 110 -58 -203 -100 123 214 45 -168 -193
3474a93K73R1j76j38o9L03M9lj90r1J06K08M8j65j70N2J90R9j99j08l4J87J46
$$ -193 80 171 -5 -143 -212 91 140 137 -53 -144 -38 170 218 53 -117 -65 125 224 25 -83 -117 70 216
3497B16j54k17k6J13J39P5j98j57J52J55j1j45k35J09J87J03r5j88m2J18J65J4
$$ 216 62 -155 -181 -68 71 146 -52 -209 -57 98 87 -58 -293 -184 3 106 11 -177 -219 -101 64 78
3519G8j76j25R0J84N4j47r8j6K26J35k08j38j1K76O3j8k65l7J70K71p0j83j45
$$ 78 -98 -223 -133 51 105 -42 -140 -156 70 205 -3 -141 -152 124 187 169 -96 -133 37 308 238 55 -90
3542i0M0K46K6k10j23O9J80R2j10j54q9J35K45j76j78j19J92J28N9k44j13J22
$$ -90 -50 196 222 12 -111 -42 138 230 120 -34 -123 12 257 81 -97 -216 -24 104 163 -81 -194 -72
3564g2J41J06j90k05j0K27P5k7k75L1R7J47L8j84j58J68J90nj46j44N7J58J31
$$ -72 69 175 -15 -220 -230 -3 72 45 -230 -199 -102 45 83 -101 -259 -91 99 94 -52 -196 -139 19 150
3587A50j02k04m8J94J77m7k17l9J06K12k6k04p3P4J38J52j62j87L9J74J25j3k81
$$ 150 48 -156 -204 -10 167 120 -97 -136 -30 182 156 -48 -121 -47 91 243 81 -106 -67 107 232 219 -62
3610f2J0J29J07j7j60j22J17J80M3j02l08J75J41J23j91j51o4J91J82p4k48j01
$$ -62 -52 77 184 167 7 -115 2 182 225 123 -185 -10 131 254 63 -88 -152 39 221 147 -101 -202
3632b02J43J12R8k50j54R1J45O9q1k06j0J81J08j63j51r6K08J65L9k81m3P4K32
$$ -202 -59 53 151 -99 -253 -162 -17 52 -29 -235 -245 -64 44 -119 -270 -366 -158 7 46 -235 -278 -204 28
3655B8N0k13n9j2K48J00r4k28N8J71J10J8j64p8J16J36m2J7k32R4J79N6o6r3r3
$$ 28 78 -135 -194 -206 42 142 48 -180 -122 49 159 177 13 -65 51 187 145 162 -70 24 203 259 193 100 7
3680GJ17J15r6j58l3J52J78r8j82o3L9K27m3p3k57O4J65R6j40j85K2Q4J42r0k31
$$ 7 124 239 143 -15 -48 104 282 184 2 -61 -22 205 162 89 -168 -104 61 157 17 -168 -146 -62 80 -10 -241
3705b41J4J10J24L4j89j32J40J55N2j31j17l4J41J65j2k17m7J66J56q1q5j62J33
$$ -241 -227 -117 7 41 -148 -280 -140 15 67 -64 -181 -215 -74 91 79 -138 -185 -19 137 56 -29 -191 -58
3728e8J71P0k08j15Q2J49L3k7j69J5J19J28Mj99r4J08J56mj60o5N4J12R2j14k28
$$ -58 113 183 -25 -140 -58 91 124 97 -72 -57 62 190 194 -5 -99 9 165 161 1 -64 -10 102 194 80 -148
3753a48M9K37P4j24k10l6J43J46m0j01j35J12K08Lj30j87R3K37j1j90r7K2J08
$$ -148 -99 138 212 88 -122 -158 -15 131 91 -10 -145 -33 175 178 48 -139 -46 191 180 -10 -107 -85 23
3776B3K13j30k06j07J53J84m4j21j13K5J83M6j60j14L8J36J16j28j89m5J46J55
$$ 23 236 106 -100 -207 -54 130 86 -35 -148 -123 60 106 -54 -168 -130 6 122 -6 -195 -240 -94 61
3798F1n1j04j39J24J77j7j52r3M7J52J01p1j34m5J67J18m1j40o6P4K26K4k02j05
$$ 61 10 -94 -233 -109 68 51 -101 -194 -147 5 106 35 -99 -144 23 141 100 -40 -106 -32 194 218 16 -89
3822h9Q8J89Jq1j59L3J92rp1o5q0J19J58k8k07p3O6J36Q5r2k41%K21R4j11j82
$$ -89 -1 188 189 108 -51 -18 174 165 94 29 -51 68 226 198 -9 -82 -16 120 205 113 -128 -128 93 187 76 -106
3848a06L0K3J41o5k20M1J20J96q1j88q8K1J99P2j37j68j3J32J74j3k62QJ53J94
$$ -106 -76 -53 88 23 -197 -156 -36 160 79 -109 -197 -176 23 95 -42 -210 -223 -91 83 70 -192 -184 -31 163
3872A63q9j57j6N4J99l5j39j05Q6O7R9Jk23m1K16J13q0j33p4P1J85N3k30j26J04
$$ 163 74 -83 -99 -45 154 119 -20 -125 -39 28 127 128 -95 -136 80 193 113 -20 -94 -23 162 215 -15 -141 -37
3897c7K00n1l0j56k3J30Q0j7k57K6Q2K01qk58m7J16Q3%o6p9mJ99N9j03j10r1J55
$$ -37 163 112 82 -74 -97 33 113 96 -161 -135 -53 148 140 -118 -165 -49 34 34 -32 -111 -115 84 143 40 -70 -161 -6
3924fJ10J0k14q2K06J27r0r3p2L6J24Q1k08n2RK14J05j07j92J7O5J47l7j18j50
$$ -6 104 114 -100 -182 24 151 61 -32 -104 -68 56 137 -71 -123 -114 100 205 98 -94 -77 -12 135 98 -20 -170
3949a70R0K08jj98l5J23P8P2j57j21j1J29J43j01j25j58K34J09M4j59j23J20N1
$$ -170 -80 128 127 -71 -106 17 95 167 10 -111 -122 7 150 49 -76 -234 0 109 153 -6 -129 -9 42
3972D2N5n0j72j2J64J30j08j11m0O9J40N4k48l9O9J41m5j16j17J32J21J58k14
$$ 42 97 47 -125 -137 27 157 49 -62 -102 -33 107 161 -87 -126 -57 84 39 -77 -194 -62 59 217 3
3995Cj96Q9J31Q0l1p9j68J60J69q3j24j24L0K09K5j27r0N2J02J03p5k00k3J68
$$ 3 -193 -104 27 107 76 -3 -171 -11 158 75 -49 -173 -143 66 91 -36 -126 -74 28 131 56 -144 -167 1
4019AJ26p7j70qJ05N8P9j55j19R5J05R8q3j74k6K15J06r1j28r0J46J48m8j45j02
$$ 1 127 50 -120 -128 -23 35 114 -41 -160 -65 40 138 55 -119 -145 70 176 85 -43 -133 13 161 113 -32 -134
4044a34R7J75q7m7p4l4J90J33k26j45N6J35R4m3j31j19J09J66Oj26j50J00J11
$$ -134 -37 138 51 4 -70 -104 86 219 -7 -152 -96 39 133 90 -41 -160 -51 115 121 -5 -155 -55 56
4067E6P3j57j27K9J83L7p6r8j17K16N8R2k32q2J46J02L4k20m2P4J45N4r0j73N0
$$ 56 129 -28 -155 -126 57 94 18 -80 -197 19 77 169 -63 -145 1 103 137 -83 -125 -51 94 148 58 -115 -65
$$ [...]
8191e6
##END NTUPLES=NMR FID
##END=
