##TITLE=1H_CG-1107-a
 CDCl3, 8 sc, 
 3.6.2019
##JCAMPDX= 6.0         $$ Bruker NMR JCAMP-DX V2.0
##DATA TYPE= NMR FID
##DATA CLASS= NTUPLES
##ORIGIN= UXNMR, Bruker Analytische Messtechnik GmbH
##OWNER= root
$$ XWIN-NMR		Version 3.5
$$ Mon Jun  3 13:59:14 2019 Russian Standard Time (UT+4h)  she@DPX200
##.OBSERVE FREQUENCY= 200.13155
##.OBSERVE NUCLEUS= ^1H
##.DELAY= (6, 6)
##.ACQUISITION MODE= SIMULTANEOUS
##.ACQUISITION SCHEME= undefined
##.AVERAGES= 8
##.DIGITISER RES= 18
##SPECTROMETER/DATA SYSTEM= spect
##.PULSE SEQUENCE= zg30
##.SOLVENT NAME= CDCl3
##.SHIFT REFERENCE= (INTERNAL, CDCl3, 0, 15.7039)
##AUDIT TRAIL= $$ (NUMBER, WHEN, WHO, WHERE, WHAT)
$$ ##TITLE= Audit trail, XWIN-NMR		Version 3.5
$$ ##JCAMPDX= 5.01
$$ ##ORIGIN= Bruker BioSpin GmbH
$$ ##OWNER= she
$$ F:/spectra/data/she/nmr/H-F/1/audita.txt
$$ ##AUDIT TRAIL=  $$ (NUMBER, WHEN, WHO, WHERE, WHAT)
(   1,<2019-06-03 13:57:45.95 +0400>,<she>,<DPX200>,
      <created by zg, POWCHK disabled, PULCHK disabled
       configuration hash MD5:
       00 E9 B6 7A A2 85 ED C7 34 08 36 98 17 FE 4E 26
       data hash MD5: 16K
       4A 89 D8 5C 73 74 F0 1E 2E 1C AF 52 FB F0 B4 96>)
$$ ##END=
$$ 
$$ hash MD5
$$ B2 5D F0 5C 87 37 0D 8B 65 A7 4A 67 EA 84 BA 30
##$RELAX= 
##$RELAX= 
##$RELAX= 
##$RELAX= 
##$RELAX= 
##$RELAX= 
$$ Bruker specific parameters
$$ --------------------------
##$DU= <F:/spectra>
##$EXPNO= 1
##$NAME= <H-F>
##$PROCNO= 1
##$TYPE= <nmr>
##$USER= <she>
##$AMP= (0..31)
100 100 100 100 100 100 100 100 100 100 100 100 100 100 100 100 100 100 
100 100 100 100 100 100 100 100 100 100 100 100 100 100 
##$AQSEQ= 0
##$AQ_mod= 1
##$AUNM= <au_zg>
##$AUTOPOS= <>
##$BF1= 200.13
##$BF2= 200.13
##$BF3= 200.13
##$BF4= 200.13
##$BF5= 200.13
##$BF6= 200.13
##$BF7= 200.13
##$BF8= 200.13
##$BYTORDA= 1
##$CFDGTYP= 0
##$CFRGTYP= 5
##$CHEMSTR= <none>
##$CNST= (0..31)
1 1 145 1 1 1 1 1 1 1 1 1 1 1 1 1 1 1 1 1 1 1 1 1 1 1 1 1 1 1 1 1 
##$CPDPRG= <>
##$CPDPRG1= <>
##$CPDPRG2= <>
##$CPDPRG3= <>
##$CPDPRG4= <mlev>
##$CPDPRG5= <mlev>
##$CPDPRG6= <mlev>
##$CPDPRG7= <mlev>
##$CPDPRG8= <mlev>
##$CPDPRGB= <>
##$CPDPRGT= <>
##$D= (0..31)
0 1.2 0 0 0 0 0 0 0 0 0 0.03 0 0 0 0 0 0 0 0 0 0 0 0 0 0 0 0 0 0 0 0 
##$DATE= 1559555865
##$DBL= (0..7)
120 120 120 120 120 120 120 120 
##$DBP= (0..7)
150 150 150 150 150 150 150 150 
##$DBP07= 0
##$DBPNAM0= <>
##$DBPNAM1= <>
##$DBPNAM2= <>
##$DBPNAM3= <>
##$DBPNAM4= <>
##$DBPNAM5= <>
##$DBPNAM6= <>
##$DBPNAM7= <>
##$DBPOAL= (0..7)
0.5 0.5 0.5 0.5 0.5 0.5 0.5 0.5 
##$DBPOFFS= (0..7)
0 0 0 0 0 0 0 0 
##$DE= 6
##$DECBNUC= <off>
##$DECIM= 24
##$DECNUC= <off>
##$DECSTAT= 4
##$DIGMOD= 1
##$DIGTYP= 9
##$DL= (0..7)
0 120 120 120 120 120 120 120 
##$DP= (0..7)
150 150 150 150 150 150 150 150 
##$DP07= 0
##$DPNAME0= <>
##$DPNAME1= <>
##$DPNAME2= <>
##$DPNAME3= <>
##$DPNAME4= <>
##$DPNAME5= <>
##$DPNAME6= <>
##$DPNAME7= <>
##$DPOAL= (0..7)
0.5 0.5 0.5 0.5 0.5 0.5 0.5 0.5 
##$DPOFFS= (0..7)
0 0 0 0 0 0 0 0 
##$DQDMODE= 0
##$DR= 18
##$DS= 0
##$DSLIST= <SSSSSSSSSSSSSSS>
##$DSPFIRM= 0
$$ [...]
##$SUBNAM2= <"">
##$SUBNAM3= <"">
##$SUBNAM4= <"">
##$SUBNAM5= <"">
##$SUBNAM6= <"">
##$SUBNAM7= <"">
##$SUBNAM8= <"">
##$SUBNAM9= <"">
##$SW= 24.9336996594482
##$SWIBOX= (0..15)
0 0 2 0 0 0 0 0 0 0 0 0 0 0 0 0 
##$SW_h= 4990.01996007984
##$TD= 16384
##$TD0= 1
##$TE= 0
##$TE2= 300
##$TE3= 300
##$TEG= 300
##$TL= (0..7)
0 120 120 120 120 120 120 120 
##$TP= (0..7)
150 150 150 150 150 150 150 150 
##$TP07= 0
##$TPNAME0= <>
##$TPNAME1= <>
##$TPNAME2= <>
##$TPNAME3= <>
##$TPNAME4= <>
##$TPNAME5= <>
##$TPNAME6= <>
##$TPNAME7= <>
##$TPOAL= (0..7)
0.5 0.5 0.5 0.5 0.5 0.5 0.5 0.5 
##$TPOFFS= (0..7)
0 0 0 0 0 0 0 0 
##$TUNHIN= 0
##$TUNHOUT= 0
##$TUNXOUT= 0
##$USERA1= <user>
##$USERA2= <user>
##$USERA3= <user>
##$USERA4= <user>
##$USERA5= <user>
##$V9= 5
##$VALIST= <valist>
##$VCLIST= <CCCCCCCCCCCCCCC>
##$VD= 0
##$VDLIST= <DDDDDDDDDDDDDDD>
##$VPLIST= <PPPPPPPPPPPPPPP>
##$VTLIST= <TTTTTTTTTTTTTTT>
##$WBST= 1024
##$WBSW= 4
##$XGAIN= (0..3)
0 0 0 0 
##$XL= 0
##$YL= 0
##$YMAX_a= 690324
##$YMIN_a= -404632
##$ZGOPTNS= <>
##$ZL1= 120
##$ZL2= 120
##$ZL3= 120
##$ZL4= 120
##$ABSF1= 10
##$ABSF2= 0
##$ABSG= 5
##$ABSL= 3
##$ALPHA= 0
##$AQORDER= 0
##$ASSFAC= 0
##$ASSFACI= 0
##$ASSFACX= 0
##$ASSWID= 0
##$AUNMP= <proc_1d>
##$AZFE= 0.1
##$AZFW= 0.1
##$BCFW= 1
##$BC_mod= 2
##$BYTORDP= 1
##$COROFFS= 0
##$CY= 11.3945322036743
##$DATMOD= 1
##$DC= 2
##$DFILT= <>
##$DTYPP= 0
##$F1P= 18.9103706918063
##$F2P= -1.10871071338519
##$FCOR= 0.5
##$FTSIZE= 0
##$FT_mod= 4
##$GAMMA= 1
##$GB= 0.15
##$INTBC= 1
##$INTSCL= 1
##$ISEN= 128
##$LB= 0.24
##$LEV0= 0
##$LPBIN= 0
##$MAXI= 10000
##$MC2= 0
##$MEAN= 0
##$ME_mod= 0
##$MI= 1.114404
##$NCOEF= 0
##$NC_proc= 0
##$NLEV= 6
##$NOISF1= 3.799351
##$NOISF2= 2.8
##$NSP= 1
##$NTH_PI= 0
##$NZP= 0
##$OFFSET= 15.70392
##$PC= 1
##$PHC0= -8666.064
##$PHC1= 25.60022
##$PH_mod= 1
##$PKNL= yes
##$PPARMOD= 0
##$PSCAL= 0
##$PSIGN= 0
##$REVERSE= no
##$SF= 200.130013532006
##$SI= 16384
##$SIGF1= 3
##$SIGF2= 2
##$SINO= 400
##$SIOLD= 16384
##$SREGLST= <1H.CDCl3>
##$SSB= 0
##$STSI= 0
##$STSR= 0
##$SW_p= 3612.71676300578
##$SYMM= 0
##$S_DEV= 0
##$TDeff= 0
##$TDoff= 0
##$TI= <>
##$TILT= no
##$TM1= 0
##$TM2= 0
##$TOPLEV= 0
##$USERP1= <user>
##$USERP2= <user>
##$USERP3= <user>
##$USERP4= <user>
##$USERP5= <user>
##$WDW= 1
##$XDIM= 8192
##$YMAX_p= 0
##$YMIN_p= 0
$$ End of Bruker specific parameters
$$ ---------------------------------
##NTUPLES= NMR FID
##VAR_NAME=  TIME,          FID/REAL,        FID/IMAG
##SYMBOL=    X,             R,               I
##VAR_TYPE=  INDEPENDENT,   DEPENDENT,       DEPENDENT
##VAR_FORM=  AFFN,          ASDF,            ASDF
##VAR_DIM=   8192,          8192,            8192
##UNITS=     SECONDS,       ARBITRARY UNITS, ARBITRARY UNITS
##FACTOR=    0.0002004,     1,               1
##FIRST=     0,             0,               0
##LAST=      1.6414764,     0,               0
##MIN=       0,             -404632,         0
##MAX=       1.6414764,     690324,          0
$$ Real data points
##PAGE= N=1
##DATA TABLE= (X++(R..R)), XYDATA
$$ plain form
0 0 0 0 0 8 -8 8 -8 16 -24 28 -40 48 -56 72 -88 104 -124 150 -176 206 -241 281 -325 377 -432 495 -567
27 -567 644 -726 824 -928 1043 -1166 1308 -1459 1625 -1809 2009 -2226 2472 -2737 3026 -3354
43 -3354 3715 -4112 4564 -5073 5647 -6310 7082 -7990 9081 -10416 12102 -14301 17308
56 17308 -21687 28685 -41681 73984 -317698 -309368 531663 387583 -67034 -262551 -88678
67 -88678 -42373 6813 29759 9283 -36488 80315 114271 -54330 -235457 -137427 99105
78 99105 271642 222170 -46841 -339908 -257044 158115 379442 112523 -207820 -147920 120088
89 120088 141221 -95172 -209469 12637 291883 251600 -86878 -329427 -222872 104566
99 104566 326672 235680 -86538 -305278 -191797 86253 196121 87030 -40421 -64804
$$ packed form
0@%%%Qj6J6j6K4m0N2o8Q8j04J28j60J92k28K74l26L82m47N22o06P02q09R27j062
27e67J211j370J550j752J971k209K474k767L084l434L818m235M698n209N763o380
43c354P069p827Q676r637J0720j1957J3392j5072J7071j9497K2518k6403L1609
56A7308l8995N0372p0366J15665l91682Q330Q41031j44080m54617j95517J73873
67h8678M6305M9186K2946k0476m5771J16803L3956j68601j81127R8030K36532
78I9105J72537m9472k69011k93067Q2864M15159K21327k66919l20343N9900K68008
89A20088K1133k36393j14297K22106K79246m0283l38478k42549J06555L27438
99A04566K22106r0992l22218k18740J13481K78050J09868j09091j27451k4383
$$ plain form
109 -64804 -16849 28435 -23389 -152955 -118510 176555 342163 33552 -387862 -333352 106902
120 106902 352477 186342 -108572 -229164 -109360 89913 118038 -39571 -93502 73632
130 73632 174279 12917 -183559 -169799 -6991 161603 248048 119361 -203050 -348392
140 -348392 -63228 306033 271741 -69309 -228736 -58209 129077 74112 -99722 -109410 84561
151 84561 215436 74386 -189229 -255363 -40036 218004 245724 27388 -197523 -203653 -18314
162 -18314 141286 128672 -3714 -96670 -50699 62444 58248 -98302 -166066 35064 265785
173 265785 164676 -177420 -317745 -93449 204122 258301 52140 -185229 -204949 663
183 663 155159 65360 -87732 -54387 79648 78882 -51989 -133852 -88760 44076 176666 158536
$$ packed form
109f4804M7955M5284n1824j29566L4445K95065J65608l08611m21414N4510M40254
120A06902K45575j66135k94914j20592J19804J99273K8125j57609n3931J67134
130G3632J00647j61362j96476J3760J62808J68594Q6445j28687l22411j45342
140c48392K85164L69261l4292l41050j59427J70527J87286n4965j73834r688J93971
151H4561J30875j41050k63615o6134K15327K58040K7720k18336k24911o130J85339
162a8314J59600j2614j32386r2956M5971J13143m196j56550o7764K01130K30721
173B65785j01109l42096j40325K24296K97571N4179k06161k37369j9720K05612
183F63J54496q9799j53092L3345J34035p66j30871q1863M5092J32836J32590j8130
$$ plain form
195 158536 -68802 -270318 -161106 146196 257968 57460 -163596 -144259 33997 117297
205 117297 11481 -114293 -56280 126810 168138 -25818 -217879 -157757 85299 229524
215 229524 129957 -85888 -194943 -106151 77352 167045 72803 -89091 -114722 21834 112252
226 112252 10266 -130423 -72833 127344 183053 -1517 -195263 -163951 47356 203071
236 203071 138493 -74600 -190163 -72521 111251 117756 -25324 -93717 -13775 75811 56057
247 56057 -45971 -117526 -59032 103902 183780 39894 -180558 -193861 24233 199096 134927
258 134927 -59152 -152753 -63839 82410 103587 -20607 -105383 -13707 124432 91893 -83773
269 -83773 -164298 -38638 137277 158454 13057 -135909 -136748 5628 136634 107411 -46176
$$ packed form
195A58536k27338k01516J09212L07302J11772k00508k21056J9337J78256Q3300
205A17297j05816j25774N8013J83090M1328j93956j92061O0122K43056J44225
215B29524r9567k15845j09055Q8792J83503Q9693r4242j61894k5631J36556R0418
226A12252j01986j40689N7590K00177N5709j84570j93746L1312K11307J55715
236B03071o4578k13093j15563J17642J83772O505j43080o8393P9942Q9586j9754
247E6057j02028p1555N8494J62934P9878j43886k20452j3303K18094J74863o4169
258A34927j94079r3601Q8914J46249K1177j24194q4776R1676J38139l2539j75666
269h3773q0525J25660J75915K1177j45397j48966q39J42376J31006k9223j53587
$$ plain form
280 -46176 -127039 -30943 100884 77030 -67647 -121856 -379 136373 103080 -68093 -171020
291 -171020 -77259 110439 170803 27175 -144372 -132446 29977 124599 52562 -65459 -84177
302 -84177 234 78952 52229 -59410 -111271 -8489 130567 107748 -65538 -164443 -61659
313 -61659 107405 142163 20542 -109216 -105892 20841 114737 52023 -82240 -94039 37822
324 37822 123631 39847 -100163 -113802 13539 127923 97168 -45374 -138775 -70788 83360
335 83360 135164 19709 -110231 -87622 43574 102767 20596 -86566 -79141 35659 114466
346 114466 48502 -91582 -126959 -105 131864 95926 -60339 -133697 -40628 87731 97648
357 97648 -5631 -93418 -65564 45220 100597 18714 -99562 -88319 47520 126591 41886
$$ packed form
280d6176q0863R6096J31827k3854j44677n4209J21477J36752l3293j71173j02927
291a71020R3761J87698O0364j43628j71547J1926J62423R4622p2037j18021j8718
302h4177Q4411P8718k6723j11639n1861J02782J39056k2819j73286r8905J02784
313f1659J69064L4758j21621j29758L324J26733R3896o2714j34263j1799J31861
324C7822Q5809q3784j40010j3639J27341J14384l0755j42542r3401O7987J54148
335H3360N1804j15455j29940K2609J31196N9193q2171j07162P425J14800P8807
346A14466o5964j40084l5377J26854J31969l5938j56265p3358R3069J28359R917
357I7648j03279q7787K7854J10784N5377q1883j18276J1243J35839P9071q4705
$$ plain form
368 41886 -94997 -110870 7121 111984 82588 -43308 -115595 -44238 83992 102330 -12848
379 -12848 -103100 -49179 67765 91337 -2423 -92500 -69358 42146 110426 46094 -80186
390 -80186 -108894 3400 111852 72462 -58888 -106929 -17870 85773 78551 -22935 -95533
401 -95533 -50181 62322 98304 1745 -105176 -76435 53337 112831 27543 -87660 -90803
412 -90803 12350 93467 58895 -49359 -99324 -22127 88090 83046 -34298 -105862 -37806
423 -37806 75884 88983 -9375 -94504 -63060 47180 101871 29737 -82322 -88819 22288
434 22288 104019 47629 -67829 -90447 1312 87730 67093 -32013 -92028 -38276 67247 89912
446 89912 -5338 -95669 -58586 57701 98121 12893 -83534 -71940 25778 89011 43190 -57619
$$ packed form
368D1886j36883j5873J17991J04863k9396j25896p2287P1357J28230J8338j15178
379a2848r0252N3921J16944K3572r3760r0077K3142J11504O8280o4332j26280
390h0186k8708J12294J08452l9390j31350m8041Q9059J03643p222j01486p2598
401i5533M5352J12503L5982r6559j06921K8741J29772N9494q5288j15203l143
412i0803J03153Q1117l4572j08254m9965P7197J10217n044j17344p1564O8056
423c7806J13690J3099r8358q5129L1444J10240N4691p2134j12059o497J11107
434B2288Q1731n6390j15458k2618R1759Q6418k0637r9106o0015N3752J05523K2665
446H9912r5250r0331L7083J16287M0420q5228r6427J1594R7718O3233m5821j00809
$$ plain form
458 -57619 -87991 -2790 90810 66230 -45777 -96177 -22558 74521 73884 -16510 -83341 -47297
470 -47297 48804 87794 14749 -83670 -76890 31834 98528 35469 -70108 -82136 7409 83940
482 83940 56063 -41972 -90689 -25978 74021 79265 -20463 -93780 -42846 62765 83021 -3330
494 -3330 -82362 -58908 34114 85016 31916 -63362 -80470 7818 87714 51738 -53176 -88030
506 -88030 -9823 77402 64699 -26660 -82286 -35765 56192 79095 -876 -84417 -58945 44448
518 44448 87863 16751 -71195 -65767 18817 76593 40031 -47552 -80434 -13480 73543 67187
530 67187 -28133 -86428 -30068 62504 68721 -13624 -77005 -45372 41808 79771 18211 -70141
542 -70141 -70392 22546 86686 36490 -60821 -77670 3784 77200 54550 -31002 -75092 -25725
$$ packed form
458e7619l0372Q5201R3600k4580j12007n0400P3619R7079o37r0394o6831L6044
470d7297R6101L8990p3045r8419O780J08724O6694o3059j05577j2028Q9545P6531
482H3940k7877r8035m8717O4711R9999N244r9728p3317N0934J05611K0256q6351
494c330p9032K3454R3022N0902n3100r5278j7108Q8288P9896l5976j04914l4854
506h8030P8207Q7225j2703r1359n5626M6521R1957K2903p9971q3541K5472J03393
518D4448M3415p1112q7946N428Q4584N7776l6562q7583l2882O6954Q7023o356
530F7187r5320n8295N6360R2572O217q2345o3381L1633Q7180L7963o1560q8352
542g0141k51R2938O4140n0196r7311j6849Q1454P3416k2650q5552m4090M9367
$$ plain form
554 -25725 57521 69444 -10390 -79297 -41864 55260 83123 5905 -75777 -60822 28627 82251
566 82251 36688 -52286 -75478 -2361 75650 56097 -36273 -77169 -13042 66043 55684 -25587
578 -25587 -73356 -30424 52049 75052 5734 -75541 -65229 27795 84901 32661 -58335 -70295
590 -70295 5672 67862 41412 -35743 -66886 -11413 63285 57607 -28545 -82614 -28580 65175
602 65175 77938 -3748 -76725 -55510 29089 75381 30561 -48393 -62292 6985 67405 35442
614 35442 -46065 -64534 5776 70684 45994 -37576 -78350 -25743 61193 77627 -806 -80507
626 -80507 -61757 31183 78136 22034 -57055 -55344 16813 59401 18762 -51560 -61067 8242
638 8242 74325 49661 -43049 -89003 -28758 62257 73468 -2008 -68524 -51172 21489 60438
$$ packed form
554b5725Q3246J1923p9834o8907L7433R7124K7863p7218q1682J4955Q9449N3624
566H2251m5563q8974k3192P3117P8011j9553r2370m0896O4127P9085j0359q1271
578b5587m7769M2932Q2473K3003o9318q1275J0312R3024N7106n2240r0996j1960
590g0295P5967O2190k6450p7155l1143N5473P4698n678q6152n4069N4034R3755
602F5175J2763q1686p2977K1215Q4599M6292m4820p8954j3899O9277O0420l1963
614C5442q1507j8469P0310O4908k4690q3570m0774N2607Q6936J6434p8433p9701
626h0507J8750R2940M6953n6102p9089J711P2157M2588m0639p0322r507O9309
638H242O6083k4664r2710m5954O0245R1015J1211p5476o6516J7352P2661L8949
$$ plain form
650 60438 20479 -45944 -49359 20299 66706 17345 -64819 -64439 22899 85738 47053 -45179 -84018
663 -84018 -26654 59467 74127 2764 -63449 -42450 31469 56290 2953 -50397 -30908 34559
675 34559 61237 10999 -60878 -64944 14633 85831 56760 -41189 -87548 -27869 58492 65786
687 65786 -5300 -58375 -29983 34652 46597 -10547 -58876 -26762 51105 70687 -1855 -78875
699 -78875 -64430 23786 82593 49518 -32994 -73361 -31783 40188 57576 1753 -50957 -25583
711 -25583 41832 48937 -21995 -72444 -27017 60775 80430 4226 -80284 -73032 18118 84240
723 84240 49425 -35120 -63513 -13384 38988 30207 -15393 -33839 -1949 41680 38273 -22468
735 -22468 -71936 -35305 56905 89565 14788 -78149 -77573 10582 77752 49371 -29791 -58790
$$ packed form
650F0438l9959o6423l415O9658M6407m9361q2164L80Q7338O2839l8685r2232l8839
663h4018N7364Q6121J4660p1363o6213K0999P3919K4821n3337n3350J9489O5467
675C4559K6678n0238p1877m066P9577P1198k9071r7949m6359N9679Q6361P294
687F5786p1086n3075K8392O4635J1945n7144m8329L2114P7867J9582p2542p7020
699g8875J4445Q8216N8807l3075q2512m0367M1578P1971J7388n5823n2710K5374
711b5583O7415P105p0932n0449M5427Q7792J9655p6204q4510P252R1150O6122
723H4240l4815q4545k8393N0129N2372q781m5600j8446L1890M3629l407o0741
735b2468m9468L6631R2210L2660p4777r2937N76Q8155O7170k8381p9162k8999
$$ plain form
747 -58790 -8972 44141 26116 -34486 -46439 13723 66158 35904 -44221 -78054 -25672 54937
759 54937 76650 17214 -58632 -69343 -6157 55881 45257 -18662 -48507 -6193 42110 20135
771 20135 -44681 -56760 12841 79904 52164 -47631 -99386 -35693 66846 84232 6039 -62648
783 -62648 -48682 9499 36648 15116 -17095 -20480 9717 36078 13320 -44209 -58794 6999
795 6999 80199 64160 -30472 -93141 -48440 50896 86282 19650 -57275 -47565 20608 43764
807 43764 -4083 -42260 -11019 45561 48444 -9416 -61877 -50605 15851 71405 55400 -20579
819 -20579 -75748 -48215 30305 68084 23581 -41402 -42142 14784 41568 -2853 -52656 -28119
831 -28119 48302 74334 3823 -82179 -73588 21666 86532 49171 -32935 -63174 -24624 25011
$$ packed form
747e8790M9818N3113j8025o0602j1953O0162N2435l0254q0125l3833N2382Q0609
759E4937K1713n9436p5846j0711O3186O2038j0624o3919k9845M2314M8303k1975
771B0135o4816j2079O9601O7063k7740r9795n1755O3693J02539J7386p8193o8687
783f2648J3966N8181K7149k1532l2211l385L0197K6361k2758n7529j4585O5793
795F999P3200j6039r4632o2669M4701R9336L5386o6632p6925R710O8173K3156
807D3764m7847l8177L1241N6580K883n7860n2461J1272O6456N5554j6005p5979
819b0579n5169K7533P8520L7779m4503o4983p40N6926K6784m4421m9803K4537
831b8119P6421K6032p0511q6002Q591R5254O4866l7361q2106l0239L8550M9635
$$ plain form
843 25011 35344 7884 -19899 -13799 18262 26601 -13776 -53162 -26357 47521 78177 18609
855 18609 -70502 -84854 -905 84505 67240 -25893 -71037 -19739 41872 29196 -24205 -32873
867 -32873 12913 46201 20956 -34728 -57547 -18652 45510 67143 18219 -52869 -69674 -12846
879 -12846 55113 57022 -6307 -52621 -23914 32555 31600 -24956 -49092 4412 66144 44192 -43663
892 -43663 -85590 -25036 62873 74253 6663 -55313 -51290 -1026 37743 31042 -5594 -26841
904 -26841 -7529 23035 15326 -26830 -42586 2445 60565 54808 -22326 -85367 -50960 47611
916 47611 88173 20811 -61244 -55048 13275 43587 8442 -28220 -14407 25326 34409 -3053
928 -3053 -46120 -42687 11106 59999 47344 -17653 -66742 -45522 25427 67624 31280 -38391
$$ packed form
843B5011J0333k7460k7783O100L2061Q339m0377l9386K6805P3878L0656n9568
855A8609q9111j4352Q3949Q5410j7265r3133m5144N1298O1611j2676n3401q668
867c2873M5786L3288k5245n5684k2819L8895O4162K1633m8924p1088j6805N6828
879a2846O7959J909o3329m6314K8707N6469r55n6556k4136N3504O1732k1952q7855
892d3663m1927O0554Q7909J1380o7590o1976M023N0264L8769o701l6636k1247
904b6841J9312L0564p709m2156j5756M5031N8120n757p7134o3041L4407R8571
916D7611M0562o7362q2055O196O8323L0312l5145l6662J3813L9733R083l7462
928c053m3067L433N3793M8893j2655o4997m9089K1220P0949M2197l6344o9671
$$ plain form
940 -38391 -52140 3101 44440 13207 -40011 -31456 31990 59573 5655 -63261 -56920 17786
952 17786 70626 44243 -24462 -59448 -31369 22154 43513 15791 -22917 -25070 7792 26949
964 26949 2018 -33941 -26223 25261 57933 20034 -54161 -71950 -848 74512 58620 -23767
976 -23767 -65562 -24890 32937 36583 -4556 -29399 -7824 26965 24790 -16841 -45793 -20159
988 -20159 35245 55854 15043 -44714 -58910 -9399 51953 53918 -7618 -55503 -29190 30138
1000 30138 38574 -10629 -41373 -6521 45204 37961 -24443 -62051 -24925 42670 60626 11026
1012 11026 -47020 -49842 153 43495 34541 -9969 -35023 -13677 22247 23745 -11779 -35079
1024 -35079 -8378 39871 43746 -12990 -63148 -37231 37629 66827 15728 -47746 -48400 4563
$$ packed form
940c8391j3749N5241M1339l1233n3218Q555O3446K7583n3918o8916O341P4706
952A7786N2840k6383o8705l4986K8079N3523K1359k7722l8708k153L2862J9157
964B6949k4931l5959P718N1484L2672l7899p4195j7789P1102P5360j5892q2387
976b3767m1795M0672N7827L646m1139k4843K1575L4789k175m1631k8952K5634
988b0159N5404K0609m0811n9757j4196M9511O1352J965o1536m7885K6313N9328
1000C0138Q436m9203l0744L4852N1725p243o2404l7608L7126O7595J7956m9600
1012A1026n8046k822M9995M3342q954m4510k5054K1346L5924J498l5524k3300
1024c5079K6701M8249L875n6736n0158K5917P4860K9198n1099o3474o54N2963
$$ plain form
1036 4563 41989 23697 -19670 -30704 2334 31671 14643 -27464 -37121 2604 44728 37042
1048 37042 -15187 -54882 -35177 26091 58857 21959 -39251 -47035 4105 42200 18931 -28104
1060 -28104 -32178 11703 42377 15297 -36932 -46064 3119 51776 40414 -17985 -54047 -27228
1072 -27228 27372 45586 11017 -30938 -30928 7147 32652 12132 -27129 -30344 11306 44479 20159
1085 20159 -35681 -50435 -1338 50707 40948 -16363 -51068 -24767 27337 41869 4392 -34295
1097 -34295 -24486 17418 32797 1096 -34429 -25388 18502 42893 15780 -33530 -46670 -4353
1109 -4353 45025 40193 -13517 -47858 -21199 28131 36589 -2177 -34940 -19118 23603 35554
1121 35554 -1864 -40917 -28614 22719 48624 15021 -37147 -43779 1328 41947 31221 -14610
$$ packed form
1036D563L7426j8292m3367j1034L3038K9337j7028m2107r657L9725M2124p686
1048C7042n2229l9695J9705O1268L2766l6898o1210p784N1140L8095k3269m7035
1060b8104m074M3881L0674k7080n2229r132M9183M8657j1362n8399l6062K6819
1072b7228N4600J8214l4569m1955J0L8075K5505k0520l9261l215M1650L3173k4320
1085B0159n5840j4754M9097N2045r759n7311l4705K6301N2104J4532l7477l8687
1097c4295R809M1904J5379l1701l5525R041M3890K4391k7113m9310j3140M2317
1109d353M9378m832n3710l4341K6659M9330Q458l8766l2763J5822M2721J1951
1121C5554l7418l9053J2303N1333K5905l3603n2168o632M5107M0619j0726m5831
$$ plain form
1133 -14610 -39330 -14111 27747 32145 -6573 -36435 -16390 28066 37465 -3021 -42282 -28832
1145 -28832 21729 46801 15592 -33952 -41840 1036 40988 28079 -19048 -38379 -6739 31704
1157 31704 26881 -13371 -36495 -12314 29318 35561 -3718 -41201 -28492 20916 45137 12961
1169 12961 -34160 -37071 4784 37184 21759 -19908 -34773 -3712 33117 26398 -16747 -39702
1181 -39702 -10761 33681 35851 -7410 -41360 -23876 22366 40523 9426 -32241 -32643 8261
1193 8261 37601 17439 -24857 -33427 2344 35463 23029 -19574 -38404 -8802 33033 34676
1205 34676 -7340 -40861 -23012 23913 39391 4250 -34883 -28309 13283 36221 12386 -27552
1217 -27552 -32705 4212 36474 21929 -21950 -39214 -6913 33867 31008 -11113 -38324 -17554
$$ packed form
1133a4610k4720K5219M1858M398l8718k9862K0045M4456R399m0486l9261J3450
1145b8832N0561K5072l1209m9544p888M2876L9952j2909m7127j9331L1640L8443
1157C1704m823m0252k3124K4181M1632O243l9279l7483J2709M9408K4221l2176
1169A2961m7121k911M1855L2400j5425m1667j4865L1061L6829o719m3145k2955
1181c9702K8941M4442K170m3261l3950J7484M6242J8157l1097m1667m02M0904
1193H261K9340k0162m2296q570L5771L3119j2434m2603j8830K9602M1835J643
1205C4676m2016l3521J7849M6925J5478l5141l9133O574M1592K2938k3835l9938
1217b7552n153L6917L2262j4545m3879j7264L2301M0780k859m2121k7211K0770
$$ plain form
1229 -17554 23794 34501 1774 -33333 -26004 15035 36583 10190 -29561 -30569 8103 36660
1241 36660 18553 -22850 -35304 -3445 33185 28773 -11750 -37212 -14359 27193 33156 -3188
1253 -3188 -33947 -20769 18585 34517 7261 -29306 -29032 8670 36256 17742 -24124 -35408
1265 -35408 -842 34656 25239 -16198 -36406 -10555 28143 30748 -6153 -35643 -19556 21544
1277 21544 34734 3299 -32313 -26860 12415 35598 13464 -25561 -32212 1748 33851 23189
1289 23189 -17440 -35869 -7926 30202 29167 -8710 -34404 -16143 22380 32619 1846 -30901
1301 -30901 -24449 13695 35125 11646 -27007 -30407 5829 34137 18682 -19539 -32430 -4876
1313 -4876 28765 26662 -9389 -33817 -14737 23700 31579 -1413 -32372 -21649 16523 33151
$$ packed form
1229a7554M1348J0707l2727l5107P329M1039K1548k6393l9751j008L8672K8557
1241C6660j8107m1403j2454L1859L6630m412m0523k5462K2853M1552N963l6344
1253c188l0759J3178L9354J5932k7256l6567K74L7702K7586j8514m1866j1284
1265c5408L4566L5498r417m1437k0208K5851L8698K605l6901k9490J6087M1100
1277B1544J3190l1435l5612N453L9275K3183k2134l9025o651L3960L2103j0662
1289B3189m0629j8429K7943L8128j035l7877k5694J8261L8523J0239l0773l2747
1301c0901O452L8144K1430k3479l8653l400L6236K8308j5455l8221j2891K7554
1313d876L3641k103l6051k4428J9080L8437P879l2992l0959J0723L8172J6628
$$ plain form
1325 33151 7757 -27424 -28226 7169 34051 17247 -22484 -33040 -834 31558 23017 -14345
1337 -14345 -32692 -9825 25069 28220 -4434 -31873 -19325 18216 33109 5353 -30020 -26569
1349 -26569 11185 33806 12630 -24387 -30154 2022 31132 20421 -16292 -32431 -7623 26745
1361 26745 26857 -7714 -32732 -16014 20681 30470 1942 -28757 -23360 11651 32227 11284 -24571
1374 -24571 -28615 4551 31568 18225 -17617 -30518 -4889 26829 25137 -7863 -30992 -14701
1386 -14701 21225 30398 377 -29636 -20384 15011 30721 7402 -24922 -25726 6522 31034 16443
1399 16443 -19175 -30599 -3300 28060 23634 -10917 -31442 -11955 22181 27462 -2514 -29611
1411 -29611 -18877 16342 30280 4496 -27782 -24710 9814 31612 13345 -21571 -29229 -906
$$ packed form
1325C3151k5394l5181q02L5395K6882j6804l9731j0556L2206L2392q541l7362
1337a4345j8347K2867L4894L151l2654k7439J2548L7541J4893k7756l5373L451
1349b6569L7754K2621k1176l7017n767L2176K9110j0711l6713j6139K4808L4368
1361B6745J12l4571k5018J6718L6695R789k8528l0699N397L5011K0576k0943l5855
1374b4571m044L3166K7017j3343l5842j2901K5629L1718j692l3000k3129J6291
1386a4701L5926R173l0021l0013R252L5395J5710k3319l2324q04L2248K4512j4591
1399A6443l5618j1424K7299L1360m426l4551k0525J9487L4136N281k9976k7097
1411b9611J0734L5219J3938k5784l2278L072L4524K1798j8267l4916p658K8323
$$ plain form
1423 -906 27650 21368 -11454 -29616 -9748 23357 26318 -5497 -30071 -14919 19891 29173 1547
1436 1547 -27667 -21887 11441 31004 12672 -20940 -27780 664 28046 19243 -13383 -27581 -5800
1449 -5800 23219 22569 -7273 -28897 -13280 20613 28580 -393 -29120 -21055 12872 29698 9360
1462 9360 -21967 -25426 2268 25859 15830 -14791 -26381 -3103 24889 20023 -12095 -29583
1474 -29583 -9470 22927 26708 -3023 -28965 -19031 13805 28828 8160 -21949 -23620 5222
1486 5222 26786 12540 -18300 -24573 2016 26821 17563 -14780 -29335 -6873 24867 26104 -4608
1499 -4608 -28655 -16739 14928 26142 4551 -21084 -19040 6978 24214 9968 -18797 -24060
1511 -24060 3539 28479 16690 -17623 -30162 -5366 25464 24224 -6030 -27134 -14298 14934
$$ packed form
1423i06K8556o282l2822j8162J9868L3105K961l1815k4574J5152L4810R282k7626
1436A547k9214N780L3328J9563j8332l3612o840K8444K7382q803l2626j4198K1781
1449e800K9019o50k9842k1624J5617L3893P967k8973k8727Q065L3927J6826k0338
1462I360l1327l459K7694K3591j0029l0621j1590K3278K7992m866l2118j7488
1474b9583K0113L2397L781k9731k5942R934L2836J5023k0668l0109j671K8842
1486E222K1564j4246l0840o273K6589K4805r258l2343j4555K2462L1740J237l0712
1499d608k4047J1916L1667J1214k1591k5635K044K6018J7236j4246k8765n263
1511b4060K7599K4940j1789l4313j2539K4796L0830j240l0254k1104J2836K9232
$$ plain form
1523 14934 23616 2085 -21162 -16031 10445 23203 5158 -20774 -21290 5765 27423 15540 -16617
1536 -16617 -28836 -5491 24337 23585 -5806 -26321 -12610 16090 21814 -1592 -22167 -12865 14446
1549 14446 23882 2234 -24044 -20730 9317 28715 12985 -18425 -26761 -3131 22599 19519 -6261
1562 -6261 -22179 -9600 15011 19759 -2690 -23202 -12508 16942 25776 731 -26679 -21353 10666
1575 10666 29597 12453 -18765 -25373 -976 22041 15769 -9386 -20116 -4086 16376 14825
1587 14825 -6454 -21007 -9409 16335 24429 1678 -25474 -22091 8752 28594 12768 -17801
1599 -17801 -24346 -179 21739 13587 -11632 -19661 -616 19756 13999 -11317 -23662 -6275 19864
1612 19864 22609 -1520 -23866 -18172 8451 23973 10616 -14257 -19945 -164 19106 11930 -12437
$$ packed form
1523A4934Q682k1531k3247N131K6476J2758j8045k5932n16K7055K1658j1883l2157
1536a6617j2219K3345K9828p52k9391k0515J3711K8700N724k3406k0575R302K7311
1549A4446R436k1648k6278L314L0047J9398j5730l1410q336K3630K5730l080k5780
1562f261j5918J2579K4611M748k2449k0512J0694K9450Q834k5045k7410N326L2019
1575A0666J8931j7144l1218o608K4397K3017o272k5155j0730J6030K0462j551
1587A4825k1279j4553J1598K5744Q094k2751k7152L383L0843J9842j5826l0569
1599a7801o545K4167K1918q152k5219q029J9045K0372n757k5316j2345J7387K6139
1612A9864K745k4129k2346N694K6623J5522j3357k4873n688J9781J9270p176k4367
$$ plain form
1625 -12437 -19965 939 22560 15099 -13307 -26520 -6590 22554 24554 -3180 -25844 -16227 11591
1638 11591 22216 5027 -15449 -13892 4935 16013 5944 -12946 -16594 1798 21106 15302
1650 15302 -11850 -26692 -8826 20578 24972 -1317 -24831 -16434 11420 21840 3019 -17783
1662 -17783 -12822 9682 18386 1602 -18199 -15244 7076 21734 11339 -12533 -22750 -6991
1674 -6991 16993 20907 133 -19888 -14250 9127 19310 2765 -17342 -12648 10928 20749 2281
1687 2281 -21119 -18711 8192 26045 12150 -15982 -23631 -3205 18530 16261 -4275 -16734 -7617
1700 -7617 9835 13539 -844 -15209 -9933 10634 19922 3212 -20321 -19843 5658 25458 14440
1713 14440 -14255 -24854 -4487 19619 16573 -7195 -18682 -4018 15138 12502 -7288 -17627
$$ packed form
1625a2437p528K0904K1621p461k8406j3213J9930K9144K000k7734k2664R617K7818
1638A1591J0625j7189k0476J557J8827J1078j0069j8890l648J8392J9308n804
1650A5302k7152j4842J7866K9404M394k6289k3514Q397K7854J0420j8821k0802
1662a7783M961K2504Q704j6784j9801K955K2320J4658j0395k3872j0217J5759
1674f991K3984L914k0774k0021N638K3377J0183j6545k0107M694K3576R821j8468
1687B281k3400K408K6903J7853j3895k8132p649K0426K1735k269k0536j2459R117
1700g617J7452L704j4383j4365N276K0567R288j6710k3533M78K5501J9800j1018
1713A4440k8695j0599K0367K4106l046k3768j1487J4664J9156k636j9790j0339
$$ plain form
1725 -17627 -5401 14014 17595 704 -18114 -16861 4209 21159 13477 -10005 -20759 -5509
1737 -5509 15808 15304 -5704 -17956 -4318 16015 14683 -7566 -21348 -7484 17051 20793 -968
1750 -968 -20797 -15342 6989 19265 8808 -10359 -15389 -1851 12741 10253 -6220 -14987 -2862
1763 -2862 15053 13968 -6711 -21021 -9371 15138 22099 1708 -21022 -17391 7307 20903 7208
1776 7208 -13918 -14664 3660 15442 5720 -11469 -13505 2042 16246 11198 -8247 -19302 -7649
1789 -7649 13729 19324 2171 -17176 -15440 5169 18444 7392 -12800 -14794 3831 17324 6697
1802 6697 -14047 -16504 3312 19629 11334 -10666 -19424 -5296 13919 16175 -89 -14996 -11444
1815 -11444 5399 14540 4590 -11471 -12068 4423 16037 6181 -13212 -17000 1194 19163 13610
$$ packed form
1725a7627J2226J9415L581j6891j8818J253K1070J6950p682k3482j0754J5250
1737e509K1317n04k1008j2252J3638K0333j332k2249j3782J3864K4535L742k1761
1750i68j9829N455K2331J2276j0457j9167n030J3538J4592k488j6473q767J2125
1763b862J7915j085k0679j4310J1650K4509O961k0391k2730L631K4698J3596j3695
1776G208k1126p46J8324J1782r722j7189k036J5547J4204n048j9445j1055J1653
1789g649K1378N595j7153j9347J736K0609J3275j1052k0192j994J8625J3493j0627
1802F697k0744k457J9816J6317q295k2000q758J4128J9215K256j6264j4907L552
1815a1444J6843R141r950j6061n97J6491J1614r856j9393l788J8194J7969n553
$$ plain form
1828 13610 -9545 -21175 -6283 15517 16747 -2382 -16378 -8629 9005 13623 189 -13271
1840 -13271 -9407 7223 15603 4341 -13682 -15342 2159 17751 12284 -7989 -18514 -6485 13231
1853 13231 15727 -1973 -16146 -8382 10442 14898 -1060 -15895 -9533 9928 16981 2612 -15252
1866 -15252 -14757 3228 17022 10318 -8246 -16114 -4240 12080 12767 -2782 -14421 -6949 9860
1879 9860 13755 -1031 -15567 -10387 9083 17995 3943 -15546 -15327 3818 17372 8994 -9573
1892 -9573 -15185 -1846 12867 10526 -5179 -13814 -4195 11441 12752 -2852 -15404 -8619 9423
1905 9423 16329 3230 -14150 -14338 3360 16688 8663 -9871 -14896 -485 14015 9680 -7359
1918 -7359 -14694 -2643 13185 12371 -4363 -16028 -7854 10445 15916 1713 -14268 -12258 4479
$$ packed form
1828A3610k3155j1630J4892K1800J230j9129j3996P749J7634M618j3434j3460
1840a3271L864J6630Q380j1262j8023j660J7501J5592n467k0273j0525J2029J9716
1853A3231K496j7700j4173P764J8824M456j5958j4835O362J9461P053j4369j7864
1866a5252M95J7985J3794o704j8564p868J1874J6320O87j5549j1639P472J6809
1879I860L895j4786j4536N180J9470Q912j4052j9489K19J9145J3554q378j8567
1892i573n612J3339J4713k341j5705q635R619J5636J311j5604j2552O785J8042
1905I423O906j3099j7380j88J7698J3328q025j8534n025J4411J4500m335j7039
1918g359p335J2051J5828q14j6734j1665Q174J8299N471j4203j5981K010J6737
$$ plain form
1931 4479 15121 6575 -10046 -13434 561 13820 8907 -7990 -14997 -2418 13980 12620 -5201
1944 -5201 -16446 -7093 10861 14999 800 -13947 -11093 5512 14602 5046 -10754 -12313 2188
1957 2188 13949 7534 -8745 -13953 -1327 13244 11642 -4641 -15531 -6973 10604 14694 45
1970 45 -14047 -9901 6529 14298 3568 -11485 -11569 3376 14179 6809 -9725 -14330 -447 14160
1984 14160 10803 -6273 -15368 -5268 11083 13301 -1166 -13989 -8773 7615 14003 2298 -12530
1997 -12530 -11188 4759 14706 5666 -10770 -13535 669 14073 9929 -6714 -14948 -4201 11604
2010 11604 12474 -2423 -13857 -7450 8429 13407 1168 -12577 -10198 5303 14344 5367 -10578
2023 -10578 -13254 1116 14096 9067 -7168 -14063 -3260 11578 11676 -3073 -13778 -6725 9017
$$ packed form
1931D479J0642q546j6621l388J3995J3259m913j6897p007J2579J6398j360j7821
1944e201j1245R353J7954M138j4199j4747K854J6605R090r556j5800j559J4501
1957B188J1761o415j6279n208J2626J4571j602j6283j0890Q558J7577M090j4649
1970D5j4092M146J6430P769j0730j5053q4J4945J0803p370j6534m605J3883J4607
1984A4160l357j7076r095J0100J6351K218j4467j2823N216J6388O388j1705j4828
1997a2530J342J5947R947r040j6436k765J4204J3404m144j6643q234J0747J5805
2010A1604Q70j4897j1434O407J5879M978j2239j3745K379J5501R041q977j5945
2023a0578k676J4370J2980n029j6235o895J0803J4838R8j4749j0705P053J5742
$$ plain form
2036 9017 13258 297 -13163 -9790 6341 14223 3953 -11254 -12250 2101 14038 8152 -8304
2049 -8304 -14044 -1833 12536 10562 -4903 -13964 -5185 10210 12449 -1253 -13409 -8641 7213
2062 7213 14085 2943 -12162 -11819 3641 14322 6600 -9264 -13226 -369 12992 9715 -5850
2075 -5850 -13710 -4109 10841 12109 -2220 -13829 -7647 8336 13546 1647 -12068 -10523 4305
2088 4305 13815 5855 -9696 -12843 368 13088 8929 -6705 -13726 -3076 11367 11232 -3220
2101 -3220 -13618 -7005 8613 13366 891 -12837 -10103 5352 13710 4625 -10219 -12100 1407
2114 1407 13104 7964 -7348 -13386 -2480 11728 10907 -3970 -13812 -5843 9464 12744 -117
2127 -117 -12793 -9157 6193 13733 3609 -11011 -11462 2759 13456 7045 -8259 -12906 -921
$$ packed form
2036I017M241j2961j3460L373J6131P882j0270j5207r96J4351J1937n886j6456
2049h304n740J2211J4369j974j5465r061Q779J5395K239j3702j2156M768J5854
2062G213O872j1142j5105L43J5460J0681p722j5864l962J2857J3361l277j5565
2075e850p860R601J4950J268j4329j1609O182J5983N210j1899j3715J545J4828
2088D305R510p960j5551l147J3211J2720m159j5634p021J0650J4443j35j4452
2101c220j0398O613J5618M753j2475j3728K734J5455Q358r085j4844j881J3507
2114A407J1697n140j5312o038J0906J4208q21j4877r842P969J5307L280j2861
2127a17j2676L636J5350P540j0124j4620m51J4221J0697o411j5304m647J1985
$$ plain form
2140 -921 12175 9837 -4824 -13524 -5097 9936 12355 -939 -13031 -8384 6928 13262 2744
2153 2744 -11263 -10806 3310 13100 6205 -8605 -12688 -545 12332 9378 -5689 -13332 -3950 10163
2167 10163 11291 -1877 -12739 -7521 7233 12805 1950 -11423 -10197 4146 13189 5316 -9318
2180 -9318 -11961 611 12399 8538 -6158 -13093 -3202 10851 10992 -2873 -12817 -6358 8232 12313
2194 12313 561 -11801 -8965 5334 12752 4058 -9811 -11363 1651 12746 7460 -7393 -12683
2207 -12683 -1792 11367 9813 -4209 -12894 -5090 9181 11660 -763 -12375 -8314 6361 12861
2220 12861 2842 -10694 -10604 2721 12430 6521 -7802 -12197 -1051 11422 9111 -4765 -12490
2233 -12490 -4157 9506 11041 -1491 -12071 -7341 6678 12297 2396 -10675 -10070 3444 12442
$$ packed form
2140i21J3096k338j4661q700Q427J5033K419j3294j2092M647J5312O334j0518
2153B744j4007M57J4116R790o895j4810m083J2143J2877k954j5067p643R382J4113
2167A0163J128j3168j0862N218J4754N572j0855j3373J226J4343R043p873j4634
2180i318k643J2572J1788l861j4696o935R891J4053J41j3865r944O459J4590M081
2194A2313j1752j2362K836J4299P418q694j3869j552J3014J1095n286j4853n290
2207a2683J0891J3159j554j4022q685P804J4271K479j2423j1612M061J4675O500
2220A2861j0019j3536R0J3325R709n909j4323m395J1146J2473k311j3876p725
2233a2490Q333J3663J535j2532j0580M730J4019N619r901j3071O05J3514Q998
$$ plain form
2246 12442 5417 -8337 -11334 99 11473 8086 -5635 -12195 -3126 9961 10466 -2306 -12391
2259 -12391 -6701 7460 12110 1377 -10999 -9316 4019 12141 4750 -8789 -10947 1031 11685
2272 11685 7240 -6525 -12030 -2087 10621 9687 -3512 -12106 -5484 7956 11336 493 -11131
2285 -11131 -8425 5160 11956 3290 -9444 -9993 2292 11739 6158 -7283 -11603 -1192 10859
2298 10859 9362 -4027 -12240 -4951 8449 10876 -405 -10798 -7362 5424 11175 2485 -9546
2311 -9546 -9183 3116 11564 5261 -7798 -11061 -303 10853 8306 -4703 -11484 -3918 8558 10026
2325 10026 -1359 -10878 -6240 6565 10786 1056 -10190 -8397 4369 11795 4214 -8655 -10672
2338 -10672 570 11200 7694 -5453 -11326 -2735 9148 8958 -2642 -10646 -4892 7309 10127
$$ packed form
2246A2442p025j3754k997J1433J1374l387j3721o560R069J3087N05j2772j0085
2259a2391N690J4161M650j0733j2376J683J3335Q122p391j3539k158J1978J0654
2272A1685m445j3765n505R943J2708r34j3199q594O622J3440L380j0843j1624
2285a1131K706J3585O796q666j2734n49J2285R447n581j3441m320J0411J2051
2298A0859j497j3389q213P289J3400K427j1281j0393L436J2786N751q690j2031
2311i546L63J2299Q448o303j3059l263J0758J1156k547j3009o781P566J2476J468
2325A0026j1385r519M638J2805M221r730j1246J793J2766P426p581j2869k017
2338a0672J1242J0630l506j3147n873Q591J1883j90j1600q004N754J2201K818
$$ plain form
2351 10127 -237 -10503 -7506 5295 11590 3252 -9311 -10142 1569 10990 6428 -5945 -10602
2364 -10602 -1702 9308 8133 -3687 -10782 -3732 8204 9751 -1405 -10960 -6770 5913 11332
2377 11332 2639 -9077 -9468 1760 10543 5889 -6107 -9900 -927 9036 7153 -4102 -10268 -3060
2391 -3060 8546 9369 -1729 -10887 -6327 6198 11043 2015 -9328 -8715 2713 10090 4522 -6484
2405 -6484 -8868 446 9332 6091 -5399 -10306 -2027 9139 8991 -2646 -11114 -5862 6487 10602
2419 10602 1628 -9064 -8054 3114 9904 3483 -7399 -8365 1663 9670 5051 -6314 -9870 -890
2433 -890 9605 8296 -3245 -10696 -4983 6629 9752 658 -8722 -6649 3811 9179 2589 -7531
2447 -7531 -7865 2445 10094 4833 -7042 -10254 -670 9948 8163 -3560 -10460 -4286 6708 8830
$$ packed form
2351A0127j0364j0266K997J2801O295q338j2563q31J1711R421m562j2373m657
2364a0602Q900J1010j175j1820p095P050J1936J547j1156r555M190J2683N419
2377A1332q693j1716l91J1228Q783m654j1996l793Q973R963j883j1255o166P208
2391c060J1606Q23j1098r158M560J2525M845r028j1343O13J1428P377n568j1006
2405f484k384R314Q886l241j1490m907Q279J1166j48j1637q468N252J2349M115
2419A0602q974j0692J010J1168O790o421j0882r66J0028Q007m619j1365l556Q980
2433h90J0495j309j1541p451N713J1612L123r094r380K073J0460N368o590j0120
2447g531l34J0310P649n261j1875l212R584J0618j785j1723o900O174J0994K122
$$ plain form
2461 8830 -19 -8366 -5725 4350 8458 1187 -7979 -6990 3223 9884 4191 -7213 -9794 -216
2475 -216 9610 7631 -3768 -10186 -3739 7046 8213 -1337 -8706 -4311 5851 8387 -133 -8958
2489 -8958 -6478 4500 10187 3376 -7724 -9495 327 9535 6743 -3925 -9135 -2686 6860 7274
2503 7274 -1933 -8561 -3676 6420 8360 -921 -9498 -6274 5110 10370 2889 -8038 -8901 905
2517 905 8985 5619 -4381 -8341 -1533 6979 5967 -2956 -8186 -2672 6793 8011 -1221 -9606 -6326
2532 -6326 4941 10197 2924 -7780 -8678 1134 8753 4804 -4777 -7602 -292 7267 5082 -4071 -8341
2547 -8341 -1658 7618 7683 -1900 -9434 -5493 5194 9441 2296 -7243 -7446 1613 8177 3958 -5259
2562 -5259 -7159 847 8087 4578 -5231 -8727 -1124 8359 7670 -2450 -9571 -4865 5445 8723 1438
$$ packed form
2461H830q849q347K641J0075M108p271r166R89J0213O661n693j1404k581R578
2475b16R826j979j1399o418O447J0785J167r550p369M395J0162K536q520q825
2489h958K480J0978N687o811j1100j771R822R208k792j0668n210O449R546M14
2503G274r207o628M885J0096J940r281q577L224J1384N260p481j0927q63R806
2517I05Q080l366j0000l960O808Q512j012q923n230N514R465J218r232q385L280
2532f326J1267N256p273j0704q98R812P619l949r581k825P310P559k185r153m270
2547h341O683R276O5r583p534L941J0687M247p145r539k03R059O564m219r217
2562e259j900Q006P240l509r809l496P603R483o89j0120p121M706J0310L278p285
$$ plain form
2577 1438 -7151 -6259 2330 7358 2488 -5636 -6371 1476 7953 4191 -5503 -8774 -946 8433 7566 -2580
2593 -2580 -9388 -4668 5411 8105 561 -7009 -5167 3327 7251 1434 -6493 -5969 2599 8355 3640
2608 3640 -5965 -8600 -595 8197 7143 -2331 -8488 -4011 5211 7467 -35 -7172 -4457 4233 7160
2623 7160 422 -7245 -5728 3523 8780 3208 -6521 -8337 -56 8084 6192 -3096 -8014 -2858 5358
2638 5358 6137 -1042 -6864 -3473 4878 7192 -133 -7780 -5793 3692 8813 3021 -6675 -8185 259
2653 259 7952 5621 -3337 -7384 -1846 5800 5433 -2266 -7000 -2506 5534 6887 -618 -7751 -5388
2668 -5388 3811 8615 2929 -6089 -7521 286 7432 4911 -3683 -6971 -949 6089 4992 -2860 -7175
2683 -7175 -2089 6192 6842 -1170 -8099 -5128 4045 8160 2325 -6055 -6640 955 6877 3882 -4000
$$ packed form
2577A438q589Q92Q589N028m870q124p35P847O477l762r694l271P828R379q67j0146
2593b580o808M720J0079K694p544p570J842Q494L924n817p927N24Q568N756m715
2608C640r605k635Q005Q792j054r474o157M477R222K256p502p137K715Q690K927
2623G160o738p667J517R251N257n572r729j816Q281Q140j892r288m918N156Q216
2638E358P79p179n822L391Q351K314p325p647J987R485N121n792r696j510Q444
2653B59P693k331q958m047N538P646l67p699m734M494Q040J353p505p133K363
2668e388R199M804n686r018j432P807P146k521q594l288O022P038j097p852m315
2683g175N086Q281O50q012o929K971R173M115n835q380n85P595N922k995p882
$$ plain form
2698 -4000 -6426 -212 6424 4540 -3698 -7427 -1611 6542 6928 -1352 -8060 -4711 4267 7783 1664
2713 1664 -6147 -5866 1742 6718 2793 -4732 -5868 739 6687 4111 -4067 -7397 -1395 6670 6624 -1470
2729 -1470 -7761 -4459 4114 7291 1274 -5908 -5137 2237 6506 2195 -5181 -5907 1191 7091 3924
2744 3924 -4402 -7341 -1262 6431 6188 -1638 -7241 -3837 4148 6592 685 -5882 -4715 2756 6469
2759 6469 1512 -5607 -5643 1645 7131 3709 -4571 -7285 -943 6531 5753 -2054 -7069 -3039 4570 6044
2775 6044 -398 -6038 -3803 3485 6336 849 -6005 -5416 2203 7247 3269 -4816 -6859 -530 6409
2790 6409 5144 -2477 -6627 -2289 4912 5648 -923 -6283 -3371 4137 6380 429 -6130 -5166 2457
2805 2457 7171 2898 -4808 -6469 -141 6116 4532 -2819 -6374 -1733 5179 5156 -1495 -6300 -3049
$$ packed form
2698d000k426O214O636j884q238l729N816Q153L86q280o708L349Q978L516o119
2713A664p811K81P608M976l925p525j136O607N948k576q178l330O002Q065m6q094
2729a470o291L302Q573L177o017p182P71P374M269m311p376p26P098N900l167
2744C924q326k939O079P693k43p826n603L404P985K444n907o567J167P471L713
2759F469m957p119l6P288N486l422q280k714O342P474p78p807n015M030P609J474
2775F044o442n640K235P288K851n487o854N89P619N044l978q085k043O329O939
2790F409j265p621m150M338P201P36o571n360K912P508K243n951o559R64P623
2805B457M714m273p706j661O328O257j584p351l555M641O912k3o651m805L251
$$ plain form
2820 -3049 4232 6200 189 -6281 -4934 2642 6843 2418 -4935 -6090 331 6058 3833 -3206 -6047
2835 -6047 -1069 5349 4815 -2071 -6460 -2519 4711 6001 -262 -6149 -4429 2964 6591 2013 -5041
2850 -5041 -5432 1021 6159 3353 -3769 -5863 -267 5726 4361 -2558 -6269 -2063 4981 5650 -690
2865 -690 -6238 -3818 3250 6265 1294 -5250 -5029 1522 6018 2619 -4135 -5712 -75 5713 4168
2880 4168 -2935 -6365 -1752 5008 5450 -998 -6126 -3516 3450 5901 842 -5248 -4583 1963 6085
2895 6085 2350 -4411 -5324 509 5753 3749 -3003 -5920 -1299 5126 5128 -1366 -5942 -2950 3835 5703
2911 5703 273 -5471 -4145 2578 5909 1780 -4633 -5144 975 5851 3207 -3527 -5771 -791 5151
2926 5151 4507 -1854 -5917 -2444 3930 5242 -272 -5513 -3765 2711 5836 1352 -4840 -4814 1297 5696
$$ packed form
2820c049P281J968o011o470J347P576M201m425p353j155O421N727k225p039k841
2835f047M978O418n34o886m389L941P230J290o263n887J720P393L627m578p054
2850e041l91O453N138k806p122k094N596N993j365o919l711M206P044O69o340
2865f90n548K420P068L015m971o544K21O551M496l399o754j577N637N788j545
2880D168p103l430M613O760M42o448n128K610O966K451n059o090O65O546M122
2895F085l735o761r13N833N244k004o752k917M621O425Ko494m576K992O785J868
2911E703n430n744J326O723L331m129o413n11O119M876k644o734k244M980N942
2926E151o44o361m063L473O374J312n514n241J748O476L125m484o192K6O111M399
$$ plain form
2942 5696 2844 -3641 -5503 -342 5218 4080 -2115 -5798 -2111 4256 5135 -581 -5439 -3361 2987
2957 2987 5686 1251 -4769 -4693 1448 5651 2638 -3676 -5213 -57 5244 4020 -2332 -5629 -1757
2972 -1757 4295 4775 -803 -5410 -3036 3324 5414 530 -4965 -4148 1837 5475 2109 -4027 -5015 364
2988 364 5204 3383 -2789 -5577 -1283 4621 4553 -1363 -5473 -2575 3539 5126 203 -5047 -3850 2237
3004 2237 5316 1710 -4097 -4649 742 5224 3043 -3046 -5263 -791 4516 4138 -1548 -5293 -2167
3019 -2167 3833 4883 -235 -5064 -3407 2459 5317 1435 -4234 -4452 1074 5255 2709 -3248 -5109
3034 -5109 -426 4801 3894 -1977 -5257 -1857 3914 4750 -568 -5110 -3065 2762 5015 847 -4423
3049 -4423 -4035 1547 5173 2086 -3712 -4787 155 4911 3405 -2482 -5220 -1256 4261 4285 -1185 -5056
$$ packed form
2942E696k852o485j862N161N560j138o195l683L687O367Q79n716m858K078O348
2957B987K699m435o020P6O141M203l013o314j537N156N301j224o352l297L872
2972a757O052M80n578m607K374O360K090m884n495Q17N985L638l366o136r88N379
2988C64M840j821o172k788M294N904o8n916m110K898O114J587m923n250J197O087
3004B237L079l606n807n52N391M482k181o089k217M472N307l78n686l745L126
3019b167O000J050n118m829J657N866K858l882n669k18N526M181k546n957j861
3034e109M683N227r07n871l280L400N771Q36n318m542K045N827K253m168n270
3049d423L88N582L626l087n798j075M942M756j506n887k738L964N517K4n470l871
$$ plain form
3065 -5056 -2572 3134 4837 318 -4488 -3598 1892 5051 1744 -3843 -4532 679 4941 2946 -2792
3080 -2792 -4956 -1014 4307 4077 -1279 -4956 -2164 3300 4513 -118 -4566 -3259 2247 4900 1314
3095 1314 -4030 -4296 854 5001 2853 -2973 -4909 -591 4345 3780 -1590 -4831 -1853 3548 4286 -424
3111 -424 -4665 -2949 2497 4897 1021 -4152 -4078 1240 4941 2417 -3083 -4706 -327 4298 3290 -1884
3127 -1884 -4541 -1296 3719 4037 -846 -4774 -2544 2933 4700 582 -4257 -3741 1497 4921 2022
3142 2022 -3373 -4372 126 4317 2873 -2307 -4457 -866 3930 3621 -1262 -4786 -2291 3184 4753
3157 4753 323 -4522 -3580 1714 4686 1682 -3365 -4001 509 4252 2382 -2569 -4270 -426 4071
3172 4071 3475 -1591 -4853 -1939 3378 4481 80 -4441 -3276 1985 4553 1312 -3432 -3637 912
$$ packed form
3065e056K484N706J703m519m806Q90N490L159l307n587o89N211M262j995n738
3080b792k164L942N321k30n356l677K792N464J213m631m448J307N506K653l586
3095A314n344k66N150M147k148n826j936M318M936n65n370l241K978N401P38m710
3111d24m241J716N446K400l876n173P4N318L701k524n500j623M379M625j008n174
3127a884k657L245N015L18m883l928K230N477J767m118m839N16N238L424k899
3142B022n395r99M498M191j444n180k150L591M796l09m883l524K495N475J569
3157D753m430m845R42N294K972l004n047o36M510L743j870m951j701L844M497
3172D071n96n066l262K914N317J103m401m521J165N261K568l241m744k05M549
$$ plain form
3187 912 4282 2017 -3014 -4122 137 4329 3193 -1957 -4821 -1696 3497 4359 -267 -4273 -2816
3202 -2816 2137 4198 825 -3652 -3226 1434 4193 1595 -3335 -4142 348 4568 3128 -2272 -4767
3217 -4767 -1488 3508 4044 -530 -4226 -2521 2269 3927 360 -3651 -2908 1757 4323 1292 -3544
3232 -3544 -4113 459 4511 3221 -2060 -4673 -1401 3513 3775 -594 -4033 -2026 2634 3793 -53
3247 -53 -3857 -2628 2168 4427 1166 -3685 -4129 571 4560 2941 -2119 -4347 -1200 3256 3426 -938
3263 -938 -3966 -1634 2876 3607 -514 -4190 -2450 2563 4538 810 -4047 -3989 826 4494 2601 -2344
3279 -2344 -4027 -559 3377 2688 -1504 -3692 -979 3225 3382 -903 -4250 -2265 2850 4627 812
3294 812 -4045 -3956 959 4460 2288 -2418 -3770 -111 3548 2270 -2053 -3758 -498 3606 3271 -1309
$$ packed form
3187I12L370k265n031j108M259M192j136n150k864L125N193Q62m626m006J457
3202b816M953K061l373m477M26M660K759k598m930q07M490M220j440n400k495
3217d767L279M996N36m574l696J705M790J658l567m011P43M665K566l031m836
3232c544n69M572M052j290n281k613L272M914K62m369l439K007M660J159l846
3247e3l804J229M796K259l261m851m44M700L989j619n060k228L147M456J70m364
3263i38l028K332M510P31m121l676J740N013J975l728m857N8M815L668j893m945
3279b344j683L468L936o89m192k188K713M204J57m285l347J985N115J777l815
3294H12m857Q9M915L501k172m706j352L659L659j278m323j705L260M104l35m580
$$ plain form
3310 -1309 -4487 -2164 2824 4396 714 -3750 -3627 821 4043 2053 -2507 -3473 280 3581 1999
3325 1999 -2550 -3959 -210 4077 3320 -1688 -4644 -2057 3045 4286 373 -3753 -3172 1326 3673
3340 3673 1366 -2513 -2912 765 3667 1725 -2821 -3945 -16 4206 3374 -1780 -4733 -1859 3098
3355 3098 4131 140 -3679 -2673 1641 3506 592 -3075 -2571 1419 3779 1201 -3179 -3856 285
3370 285 4224 3156 -1594 -4434 -1908 2741 3837 162 -3494 -2316 1864 3406 305 -3431 -2559
3385 -2559 1853 4225 1108 -3532 -4002 409 4323 3071 -1853 -4154 -1401 2723 3200 -285 -3273
3400 -3273 -1771 2150 3182 -214 -3670 -2496 2087 4402 1205 -3645 -4095 463 4336 2772 -1920
3415 -1920 -4032 -1022 2936 2762 -1000 -3227 -1005 2730 2913 -814 -3851 -2235 2363 4268 1095
$$ packed form
3310a309l178K323M988J572l682m464J23M448L222j990m560r66L753L301j582
3325A999m549j409L749M287p57n008k956K587N102J241l913m126N81M498K347
3340C673k307l879l99L677K902j942m546j124L929M222q32n154k953K874M957
3355C098J033l991l819J006M314J865k914l667N04L990K360k578m380o77M141
3370B85L939j068m750k840K526M649J096l675l656J178M180J542l101l736Q72
3385b559M412K372l117m640m70M411L914j252m924k301K753M124M77l485k988
3400c273J502L921J032l396l456J174M583K315l197m850m50M558L873j564m692
3415a920k112L010L958j74l762k227K222L735J83l727l037J616M598J905l173
$$ plain form
3430 1095 -3376 -3802 364 4095 2553 -1920 -3670 -642 3001 2497 -1472 -3444 -690 3299 3085 -1174
3446 -1174 -4230 -2168 2572 4310 836 -3479 -3550 571 3581 2134 -1862 -3310 -222 3048 2194 -1744
3462 -1744 -3524 -621 3457 3254 -1192 -4396 -2249 2658 4224 775 -3444 -3122 944 3446 1426
3477 1426 -2315 -2858 425 3167 1688 -2214 -3431 -198 3620 3164 -1255 -4316 -2194 2567 3997
3492 3997 558 -3317 -2784 1239 3374 971 -2677 -2734 957 3483 1324 -2737 -3577 8 3787 2923
3508 2923 -1482 -4064 -1745 2525 3455 231 -3186 -2243 1416 3077 500 -2902 -2575 1377 3760 1332
3524 1332 -2926 -3654 230 3888 2903 -1572 -3994 -1498 2635 3126 -267 -3058 -1728 1927 3015 120
3540 120 -3119 -2391 1580 3763 1199 -2914 -3557 254 3858 2664 -1624 -3640 -1029 2728 2760 -771
$$ packed form
3430A095m471m26M166L731j542m473j750L028L643n04l969j972K754L989k14m259
3446a174l056K062M740J738l474m315p1M121L010j447l996j448L088L270q54l938
3462a744j780K903M078k03m446l204K147M907J566l449m219L22M066K502k020
3477A426l741n43L283K742j479l902j217L233L818m56m419l061K122M761J430
3492C997l439l875N33M023K135k403l648n7L691K526k159m061q40L585L779q64
3508B923m405k582K319M270R30l224l417R43L659J661k577l402L27L952K383k428
3524A332m258p28L884L658r85m475k422K496M133M91l393k791J330L655J088k895
3540A20l239P28L971K183k564m113o43L811L604j194m288k016K611L757L2l531
$$ plain form
3556 -771 -3190 -1286 2339 2967 -425 -3411 -2124 2033 3785 919 -3085 -3307 457 3558 2227 -1787
3572 -1787 -3372 -642 2705 2372 -1052 -3191 -990 2664 2999 -659 -3604 -2130 2078 3699 819
3587 819 -3081 -3131 706 3462 1885 -1931 -3037 -227 2882 2016 -1505 -3208 -685 2901 2961 -750
3603 -750 -3598 -1997 2171 3640 604 -3016 -2850 851 3424 1506 -2181 -2961 154 3012 1882 -1725
3619 -1725 -3195 -515 2921 2785 -933 -3602 -1775 2196 3371 308 -3128 -2424 1227 3197 1072
3634 1072 -2391 -2646 581 3077 1572 -2139 -3234 -260 3077 2643 -1147 -3520 -1579 2307 3131 22
3650 22 -3062 -2151 1391 3124 701 -2643 -2537 803 3113 1479 -2171 -3082 -56 3086 2421 -1228
3666 -1228 -3291 -1234 2355 2878 -258 -2990 -1805 1648 3030 430 -2758 -2440 1028 3238 1319
$$ packed form
3556g71k419J904L625O28l392k986J287M157J752k866m004k22L764L101j331m014
3572a787j585K730L347l33l424k139K201L654L35l658k945J474M208J621k880
3587H19l900n0L837K756j577l816j106K810L109q66l521j703K523L586O0l711
3603g50k848J601M168J469l036l620J66L701K573j918l687p80L115K858j130l607
3619a725j470K680L436j36l718k669J827L971J175l063l436P04L651J970k125
3634A072l463k55L227K496j505l711j095K974L337m34l790k373J941L886Q24l109
3650B2l084R11L542J733k423l344J06L340K310j634l650r11L026L142o65l649
3666a228k063K057L589N23l136k732J185L453J382k600l188L18L468K210j919
$$ plain form
3681 1319 -2276 -3034 -47 3084 2346 -1342 -3276 -960 2495 2750 -456 -3046 -1645 1840 2968 188
3697 188 -2776 -2212 1103 3147 1197 -2224 -2840 163 2926 1929 -1514 -3113 -662 2593 2368 -894
3713 -894 -3081 -1341 2047 2813 -85 -2936 -2084 1419 2997 907 -2462 -2746 336 2970 1710 -1713
3729 -1713 -2965 -535 2553 2370 -877 -2987 -1190 2068 2680 -126 -2832 -1942 1410 3026 770 -2314
3745 -2314 -2454 594 2888 1454 -1792 -2853 -204 2727 2119 -1092 -2871 -985 2239 2580 -351 -2902
3761 -2902 -1708 1579 2898 598 -2495 -2428 730 2922 1319 -2002 -2725 -57 2708 1998 -1317 -2882
3777 -2882 -740 2203 2269 -646 -2731 -1417 1669 2695 216 -2474 -2076 1013 2842 1101 -2067 -2590
3793 -2590 302 2832 1738 -1474 -2762 -544 2348 2212 -769 -2779 -1247 1829 2637 119 -2581
$$ packed form
3681A319l595p58K987L131p38l688j934K316L455K55l206k590J401L485J128k780
3697A88k964N64L315K044j950l421o16L003K763r97l443j599K451L255k25l262
3713h94k187J740L388P66k898k851Q52L503J578k090l369k84L082K634j260l423
3729a713j252K430L088j83l247k110J797L258O12k806k706Q90L352J616k256l084
3745b314j40L048K294j434l246j061K649K931o08l211j779J886L224L41k931k551
3761b902J194L287J319k300l093O7L158K192j603l321p23K668K765p10l315j565
3777b882K142K943O6k915k085J314L086J026k479k690L98L089J829j741l168n23
3793b590K892K530j094l212j288K218K892j36k981k010J532L076Q08k518k700
$$ plain form
3808 -2581 -1931 1174 2795 818 -2096 -2446 343 2648 1573 -1554 -2605 -329 2331 1952 -953 -2711
3824 -2711 -1024 2079 2511 -238 -2592 -1708 1376 2730 569 -2317 -2211 743 2753 1240 -1718 -2541
3840 -2541 -50 2400 1758 -1146 -2617 -901 2058 2417 -310 -2611 -1508 1462 2635 363 -2270
3855 -2270 -2027 812 2624 949 -1927 -2240 249 2449 1547 -1323 -2504 -505 2140 2084 -540 -2562
3871 -2562 -1315 1599 2515 175 -2375 -1915 966 2525 939 -1964 -2284 308 2502 1503 -1383 -2566
3887 -2566 -466 2207 1996 -656 -2523 -1134 1700 2327 -15 -2363 -1730 1103 2461 661 -1915 -2099
3903 -2099 397 2392 1369 -1427 -2469 -206 2166 1899 -886 -2457 -920 1902 2293 -230 -2398
3918 -2398 -1441 1255 2386 514 -1970 -1931 634 2356 1064 -1526 -2227 -123 2216 1695 -1040 -2421
$$ packed form
3808b581O50L105J621j977k914l50K789K305j075l127j051K276K660l79k905j758
3824b711J687L103M32k749k354Q84L084J354k161k886J06K954K010j513k958q23
3840b541K491K450o42k904j471J716K959L59k727k301J103K970J173k272k633
3855b270K43K839J812j675k876l13K489K200r02k870j181J999K645n6k624k022
3871b562J247K914R16k340k550M60K881J559j586k903l20K592K194r99k886j183
3887b566K100K673k11k652j867J389K834O27k342k348O33K833J358j800k576j84
3903b099K496J995j023k796j042K263K372k67k785j571J537K822L91k523k168
3918b398R57K696J131j872k484L9K565J722j292k590p01K104K339n21k735j381
$$ plain form
3934 -2421 -702 1857 2111 -340 -2405 -1337 1379 2259 256 -2061 -1721 780 2279 871 -1671 -2060
3950 -2060 128 2216 1527 -1182 -2399 -598 1956 2035 -499 -2325 -1274 1375 2242 178 -2040 -1566
3966 -1566 855 2229 738 -1808 -2003 292 2340 1355 -1307 -2197 -424 2065 1862 -583 -2213 -1002
3982 -1002 1456 2023 30 -1989 -1431 1079 2205 478 -1905 -1920 462 2238 1252 -1412 -2254 -336
3998 -336 1996 1681 -726 -2184 -792 1523 1814 -228 -1976 -1129 1202 2137 301 -1956 -1777 656
4014 656 2280 1106 -1379 -2137 -181 1915 1609 -797 -2086 -673 1550 1708 -371 -2032 -1062 1388
4030 1388 2187 220 -2064 -1812 663 2300 1079 -1430 -2002 -95 1869 1335 -776 -1897 -471 1622
4046 1622 1561 -542 -2094 -947 1506 2138 81 -2061 -1663 778 2261 936 -1350 -1950 95 1852
$$ packed form
3934b421J719K559K54k451k065J068K716Q80k003k317L40K501J499j408k542l89
3950b060K188K088o89k709j217J801K554P9k534j826J051K649Q67k064k218M74
3966a566K421J374j491k546j95K295K048r85k662q90J773K489k03k445j630J211
3982a002K458N67j993k019N58K510J126j727k383j5K382J776r86k664q42J918
3998c36K332l15k407j458J392K315K91k042j748Q47K331R35j836k257J79K433
4014F56J624j174k485p58J956K096l06k406j289J413K223J58k079j661R70K450
4030A388P99j967k284K52K475J637j221k509n72J907J964n34k111j121J426K093
4046A622o1k103j552J147K453O32k057k142L98K441J483j325k286o00K045J757
$$ plain form
4062 1852 1120 -1034 -1761 -185 1771 1403 -832 -2141 -774 1631 2046 31 -2032 -1580 784 2075
4078 2075 757 -1410 -1664 218 1771 920 -1141 -1668 38 1882 1366 -943 -2169 -772 1656 2058
4094 2058 -42 -1952 -1438 785 1878 583 -1322 -1478 413 1708 733 -1292 -1685 220 2017 1460
4110 1460 -984 -2211 -787 1628 2047 10 -1869 -1365 775 1797 393 -1425 -1253 663 1703 455
4126 455 -1531 -1717 354 2084 1272 -1009 -2155 -749 1443 1806 -72 -1711 -1098 829 1538 113
4142 113 -1485 -1130 820 1781 365 -1678 -1710 364 2137 1286 -1130 -2097 -641 1395 1605 -154 -1503
4159 -1503 -802 933 1343 -147 -1522 -924 1062 1846 401 -1706 -1803 300 2100 1380 -927 -1979 -627
4176 -627 1465 1453 -324 -1505 -541 1227 1292 -377 -1716 -859 1206 1920 213 -1795 -1768 328 1913
$$ packed form
4062A852p32k154p27J576J956l68k235j309J367K405M15k015k063M52K364J291
4078B075j318k167k54J882J553q51k061n27J706J844n16k309j226J397K428M02
4094B058k100j910N14K223J093j295j905j56J891J295r75k025l93J905J797n57
4110A460k444j227J424K415M19k037j879N04K140J022j404j818J72J916J040j248
4126D55j986j86K071J730q12k281j146J406K192L63j878j639O13J927P09j425
4142A13j598L55J950R61j416k043l2K074J773q51k416r67J456K036K10j759j349
4159a503P01J735M10j490j375N98J986P84j445k107r7K103J800p20k307j052J352
4176f27K092j2j777j181R64J768O5j669j339Q57K065P14j707k008K7K096J585
$$ plain form
4193 1913 1222 -812 -1715 -455 1209 1173 -529 -1428 -278 1401 1227 -586 -1862 -830 1438 2017 265
4210 265 -1771 -1611 427 1825 992 -811 -1467 -188 1168 801 -609 -1273 -1 1404 1244 -663 -1912
4227 -1912 -808 1334 2080 324 -1722 -1581 366 1691 842 -896 -1268 62 1296 618 -1000 -1365
4243 -1365 157 1605 1239 -797 -1982 -885 1253 1916 298 -1421 -1437 230 1485 724 -983 -1179
4259 -1179 301 1414 572 -1176 -1522 162 1764 1318 -658 -1946 -862 1170 1766 269 -1352 -1112
4275 -1112 361 1260 468 -984 -926 484 1452 379 -1270 -1509 125 1771 1391 -715 -1923 -864 1159
4292 1159 1534 159 -1305 -934 574 1118 49 -1200 -856 834 1548 414 -1475 -1649 42 1722
4308 1722 1292 -573 -1749 -856 1001 1367 78 -1217 -733 777 1182 -105 -1401 -867 900 1739 462
$$ packed form
4193A913o91k034r03J260J664l6j702q99J150J679j74j813j276J032K268N79j752
4210B65k036J60K038J398q33j803o56J279J356l67j410o64J272J405j60j907j249
4227a912J104K142P46j756k046J41J947J325q49j738l72J330J234o78j618l65
4243a365J522J448l66k036j185J097K138O63j618j719j6J667J255p61j707j96
4259a179J480J113q42j748l46J684J602m46j976j288J084K032N96j497j621K40
4275a112J473Q99p92j452N8J410R68j073j649k39J634J646l80k106j208J059K023
4292A159L75j375j464L71J508N44j069j249L44J690P14j134j889j74J691J680
4308A722m30j865j176Q93J857L66j289j295M84J510M05j287j296N34J767Q39j277
$$ plain form
4325 462 -1434 -1581 83 1631 1255 -590 -1594 -599 970 1103 -133 -1174 -553 947 1264 -187 -1438
4342 -1438 -1040 876 1750 481 -1416 -1676 28 1527 1166 -494 -1386 -404 979 986 -445 -1157 -339 1079
4360 1079 1157 -359 -1594 -1024 994 1714 525 -1274 -1454 99 1441 919 -634 -1247 -177 984 798
4377 798 -525 -1326 -230 1237 1301 -333 -1705 -1033 854 1732 516 -1196 -1321 119 1349 767 -671
4394 -671 -1138 -37 1142 803 -685 -1407 -289 1265 1380 -391 -1588 -913 878 1653 435 -1146 -1170
4411 -1170 221 1238 520 -922 -1057 217 1297 707 -906 -1474 -198 1348 1288 -379 -1549 -918 797
4428 797 1475 222 -1098 -997 367 1169 432 -964 -995 326 1349 597 -918 -1450 -238 1382 1230
4445 1230 -387 -1499 -761 850 1255 171 -1137 -848 517 1181 197 -1064 -1039 332 1419 752 -909
$$ packed form
4325D62j896j47J664J548l76j845j004R95J569J33j236j041O21J500L17j451j251
4342a438L98J916Q74j269j897k60J704J499l61j660q92R82J383Pj431p12Q18J418
4360A079P8j516j235N70K018P20j189j799j80J553J342n22j553o13J070J161j86
4377G98j323q01J096J467O4j634j372O72J887Q78j216j712j25J440J230n82j438
4394f71m67J101J179l39j488p22J118J554J15j771j197O75J791P75j218j581k4
4411a170J391J017p18j442j35J274J080n90j613n68J276J546o0j667j170O31J715
4428G97O78j253j320J01J364Q02p37j396l1J321J023p52j515n32J212J620j52
4445A230j617j112P38J611M05j084j308K89J365O64r84j261K5J371J087o67j661
$$ plain form
4462 -909 -1419 -191 1314 1238 -379 -1454 -738 832 1267 12 -1091 -734 663 1254 205 -1132 -1035
4479 -1035 425 1417 617 -880 -1396 -72 1296 1021 -385 -1301 -468 915 1020 -246 -1240 -661 800
4496 800 1226 93 -1203 -1028 419 1426 645 -952 -1359 -55 1253 854 -531 -1215 -282 906 1002
4513 1002 -242 -1164 -534 803 1158 46 -1219 -949 474 1350 582 -900 -1199 52 1264 830 -612
4530 -612 -1188 -229 1084 993 -407 -1318 -580 832 1240 24 -1190 -940 522 1284 493 -935 -1220 105
4548 105 1136 828 -705 -1177 -149 1040 927 -363 -1217 -506 839 1178 -141 -1260 -768 659 1268
4565 1268 293 -1044 -972 275 1249 575 -802 -1146 -72 1080 839 -444 -1172 -453 851 1086 -123
4582 -123 -1144 -748 662 1177 228 -1033 -963 398 1164 532 -835 -1118 41 1095 763 -519 -1184 -280
$$ packed form
4462i09n10J228J505p6j617j075P16J570M35j255j103L57J397N91j049j337R7
4479a035J460R92q00j497n16J324J368k75j406r16Q33J383J05j266r94N79J461
4496H00M26j133j296J75J447J007p81j597m07J304J308l99j385o84R33J188R6
4513A002j244r22O30J337L55j112j265K70J423Q76p68j482k99J251J212m34j442
4530f12n76R59J313r1j400r11P38J412M08j216j214K50J462P62p91j428k85J325
4548A05J031l08j533m72J028J189j13j290q54P11J345L39j319j119M92J427O09
4565A268r75j337P2J247R74o74j377l44J074J152k41j283p28P19J304K35j209
4582a23j021L96J410N15r49j261P0J361P66o32j367k83J159J054l32j282o65R04
$$ plain form
4600 -280 964 1000 -207 -1176 -637 759 1270 154 -1123 -937 434 1218 493 -918 -1121 98 1164
4617 1164 698 -587 -1149 -287 1012 973 -298 -1268 -603 796 1226 23 -1127 -836 548 1178 356 -921
4635 -921 -978 197 1083 594 -636 -1063 -103 994 892 -428 -1245 -439 885 1059 -35 -1153 -747 575
4653 575 1048 273 -884 -968 311 1056 525 -687 -1051 -80 1095 862 -464 -1191 -327 923 1065 -34
4671 -34 -1097 -722 680 1128 157 -1028 -821 357 1131 381 -827 -1051 62 1073 768 -497 -1198 -299
4689 -299 957 1016 -180 -1066 -564 653 1068 94 -1022 -809 426 1172 395 -823 -1015 124 1085 704
4707 704 -571 -1060 -258 891 906 -321 -938 -410 754 965 -31 -975 -676 530 1101 217 -962 -932 181
4726 181 1078 649 -659 -1124 -133 999 830 -386 -1021 -427 729 942 -74 -1039 -573 557 1070 286
$$ packed form
4600b80J244L6j207r69N39J396N11j116j277J86J371P84p25j411k03J219J066
4617A164m66j285n62Q62J299l9j271r70O65J399M30j203j150K91J384O30q22j277
4635i21n7J175Q86m89j230m27R60J097j02j320q17Q06J324J74j094j118M06J322
4653E75M73p75j157q4J279P45n31j212l64R71J175k33j326p27Q64J250J42j099
4671c4j063L75J402M48r71j185K07J178P74p50j208k24J113J011l05j265p01Q99
4689b99J256N9j196q86N02J217M15r74j116K13J235P46p77j218j92J139R61l81
4707G04j275m89Q02J149J5j227o17N28J164K11r96r44K99J206N71q84j179L0J113
4726A81Q97m29j308m65R91J132j69j216o35N94J156K13j016r65M66J130N13p84
$$ plain form
4744 286 -916 -852 304 1038 633 -638 -992 -60 977 801 -463 -1061 -404 799 927 -189 -984 -607
4762 -607 569 1017 171 -931 -810 302 1010 460 -729 -938 18 984 678 -391 -966 -206 857 832
4780 832 -169 -922 -427 552 935 105 -860 -641 397 1089 295 -760 -915 155 994 543 -533 -942
4798 -942 -159 843 766 -242 -908 -399 596 822 8 -848 -670 441 1014 298 -753 -926 169 929 589
4817 589 -576 -925 -179 778 696 -295 -908 -346 625 810 -104 -890 -504 494 983 238 -796 -833 223 995
4837 995 503 -563 -859 -42 797 646 -358 -863 -180 719 765 -188 -950 -553 604 1015 148 -832 -706
4856 -706 199 847 380 -590 -746 21 715 470 -482 -797 -147 790 764 -189 -950 -523 567 933 161 -771
4876 -771 -709 146 750 283 -545 -651 67 797 353 -602 -852 -79 841 750 -293 -985 -572 608 924 131
$$ packed form
4744B86j202O4J156P34m05j271l54R32J037j76j264n98O57J203J28j116p95L77
4762f07J176M48q46j102J21J112P08n50j189k09R56R66l06j069n75P60J063k5
4780H32j001p53M95R79L83q30r65K19J038O92p94j055j55J070Q39m51j076m09
4798i42P83J002p7j008o66N09R95K26q14q56J78J111N73p16j051j73J095P60l40
4817E89j165l49P46R57q2r91o13N62R71J85r14p86L86R98M89p45j034l7J056P72
4837I95m92j066k96Q17Q39j51j004n05O83Q99M6r53p62L97J157M11q67r80J26
4856g06R05O48m67r70j56P67O94k45r52l15O50R37k6r53p61M27J090L66p72r32
4876g71O2Q55O04m67q28j06P18P30m44r55k50P73R20r1j043o92M13J180L16p93
$$ plain form
4896 131 -667 -645 225 715 274 -532 -595 254 844 370 -672 -837 0 899 810 -242 -962 -457 547 776
4916 776 46 -696 -426 276 620 114 -634 -518 340 903 268 -671 -833 41 876 731 -268 -894 -361 420
4936 420 654 -6 -682 -338 435 649 -128 -696 -547 373 865 286 -710 -866 -36 789 729 -154 -758 -325
4956 -325 443 538 -79 -581 -211 496 627 -108 -776 -550 444 1045 400 -623 -878 -63 845 592 -254 -679
4976 -679 -175 492 456 -162 -574 -175 604 552 -149 -781 -540 369 910 400 -613 -815 -80 643 522 -161
4996 -161 -634 -29 494 356 -420 -694 -53 729 693 -265 -887 -516 460 880 321 -483 -723 -68 487 351
5016 351 -242 -465 6 549 362 -448 -730 -30 817 739 -173 -874 -657 445 900 314 -410 -578 42 551
5036 551 232 -409 -476 201 687 258 -532 -720 -86 727 773 -48 -853 -620 298 707 328 -432 -436 109 481
$$ packed form
4896A31p98K2Q70M90m41q06o3Q49N90m74j042j65Q37Q99q9j052p20N05J004K29
4916G76p30p42K70P02L44n06p48J16Q58N63o35r39j62Q74Q35j45r99o26N33P81
4936D20K34o60o76L44P73K14p77n68J49R20M92n79r96j56Q30Q25o0q83o04M33
4956c25P68R5o17n02L70P07J31p35o68K26R94O01o45j023k55Q15R08k53q46m25
4976f79N04O67l6o18m12L99P79n2p01o32K41R09N41n10j013k02P35P23j21o83
4996a61m73O05N23j38p76k74O41P82l6r58o22L71R76M20n59q04k40O55N55j36
5016C51n93k23M71N43j87q10k82P00Q47p8r12p01K17J102M55n86p24j68O20N09
5036E51l19o41o7O77M86m29p90j88O34Q13M6q21q05K33R18M09l79p60mN45L72
$$ plain form
5057 481 23 -514 -415 275 758 281 -615 -835 -77 679 781 -102 -710 -474 287 526 196 -362 -286 140 512
5078 512 16 -599 -475 375 815 348 -560 -853 -152 620 678 -71 -567 -348 266 491 42 -369 -218 429
5098 429 512 -117 -584 -408 324 888 392 -466 -784 -202 565 584 -58 -529 -269 271 365 -65 -484 -195 506
5119 506 540 -65 -785 -563 281 768 344 -458 -701 -244 443 496 29 -428 -218 348 291 -143 -439 -149 540
5140 540 595 -19 -706 -606 241 741 379 -315 -615 -148 415 341 -102 -365 -1 385 345 -260 -517 -189 601
5161 601 699 28 -676 -603 90 611 375 -289 -482 -106 399 225 -259 -382 40 453 315 -352 -598 -231 530
5182 530 665 -11 -646 -565 118 537 227 -253 -417 -25 365 261 -411 -422 107 605 416 -312 -680 -224 508
5203 508 641 83 -504 -453 91 495 200 -215 -345 118 392 190 -315 -425 162 612 411 -304 -651 -231
$$ packed form
5057D81m58n37R9O90M83m77q96k20P58P56J02q83o08K36P61K39l30n58P6M26L72
5078E12m96o15J24Q50M40m67r08k93P01P72N8p49m96K19O14K25m49m11J51O47
5098D29Q3o29m67J76P32N64m96q58l18N82P67J9o42m71K60N40R4m30m19K89P01
5119E06L4o05p20K22Q44M87m24q02k43M57O87N3m67m57K10N66n7m34k96K90O89
5140E40N5o14o87J00Q47N00l62o94l00M67N63p4m43k63L64L86m0o05k57L28P90
5161F01R8o71p04P3O93N21k36o64j93L76N05j74m84j23M22M13j38o67k46L67P61
5182E30J35o76o35Q1O83M19l10m80j64L92L90j04o72j1N29M98j89p28l68M56P32
5203E08J33n58n87N1N44M04k95m15j30M63K74k02n05j10N87M50k01p15l47M20
$$ plain form
5223 -231 518 588 27 -491 -362 133 419 68 -307 -327 94 476 103 -441 -483 62 572 430 -274 -638 -271
5244 -271 354 509 23 -419 -275 168 316 3 -418 -205 191 477 145 -460 -475 66 616 371 -235 -535
5264 -535 -162 420 481 -38 -377 -244 254 396 -49 -355 -231 220 541 154 -428 -493 113 565 319 -247 -420
5285 -420 -91 342 333 -92 -292 -189 251 301 -81 -466 -266 265 494 96 -460 -486 70 492 268 -279 -470
5306 -470 -29 349 309 -180 -366 -133 214 381 -50 -482 -338 203 541 195 -349 -425 88 457 319 -267 -413
5327 -413 6 386 229 -190 -318 -120 362 404 -102 -437 -240 238 499 67 -327 -424 76 441 194 -279 -352
5348 -352 -4 321 311 -159 -418 -58 386 347 -114 -436 -264 282 418 10 -366 -279 133 381 109 -273 -315
5369 -315 28 306 249 -144 -330 -17 309 307 -69 -378 -181 299 407 4 -398 -286 214 433 73 -271 -382
$$ packed form
5223b31P49P0n61n18J29M95K86l51l75k0M21L82l73n44m2N45N10j42p04l64L67
5244b71O25J55m86m42J44M43J48l13m21K13L96K86l32o05j5N41N50k45o06l00
5264e35L73N82O1n19l39J33M98J42m45l06J24M51L21l87n82o5O06M52k46n66j73
5285d20L29M33rm25k00J03M40N0l82l85K00N31K29l98n56k6N56M22k24n47j91
5306d70M41L78m0m89j86K33L47J67m31m32J44N41L38l46n44p6N13L69j38n86j46
5327d13M19L80j57m19j28J98M82M2n06l35J97M78K61m32l94r7N00L65k47m73p3
5348c52L48L25j0m70k59L60M44l9m61l22J72N46J36m08l76Q7M12K48k72l82m2
5369c15L43K78n7l93j86L13L26kl76l09J97M80J08m03m02J12N00K19l60l44j11
$$ plain form
5390 -382 108 333 227 -208 -338 -63 358 320 -97 -318 -190 264 402 21 -379 -238 174 383 62 -332
5410 -332 -301 57 369 202 -256 -310 -61 301 266 -120 -395 -96 300 348 -18 -381 -152 275 356 58 -282 -304
5432 -304 73 355 170 -217 -352 -71 254 303 -165 -395 -138 331 356 -125 -296 -179 211 377 51 -266 -334
5453 -334 45 353 160 -198 -241 68 275 228 -151 -429 -69 330 346 -33 -308 -180 199 319 54 -283 -239
5474 -239 124 351 88 -250 -319 53 316 175 -280 -398 -110 365 244 -120 -330 -144 238 253 93 -244 -211
5495 -211 116 345 149 -217 -306 19 424 211 -198 -313 -6 336 291 -70 -343 -119 174 263 -26 -219 -146
5516 -146 141 322 130 -214 -272 31 324 192 -202 -323 -30 288 308 -131 -263 -92 237 301 -37 -307 -149
5537 -149 167 213 29 -270 -237 -9 264 166 -171 -242 -69 205 227 -177 -241 -109 262 200 -25 -246 -188 203 219
$$ packed form
5390c82M90K25j06m35j30K75M21l8m17k21J28M54J38l81m00J41M12K09l21l94
5410c32L1L58L12j67m58n4K49L62l5l86k75K99L96M8l66l63K29M27Q1k98l40k2
5432c04L77K82j85l87j35K81L25M9m68k30K57M69K5m81j71J17L90J66l26l17o8
5453c34L79L08j93l58m3L09K07m7l79k78L60L99J6l79k75J28L79J20k65l37M4
5474b39L63K27k63l38o9L72K63j41m55j18K88M75j21l64k10J86L82J5j60l37L3
5495b11L27K29j96l66q9L25M05k13m09j15L07L42m5l61k73K24K93Q9k89j93P3
5516a46K87J81j92l44n8L03K93j32l94j21K93L18K0m39j32J71L29O4l38k70J58
5537a49L16M6j84k99L3K28K73r8l37p1J73K74K2m04o4J32L71o2k25k21N8L91J6
$$ plain form
5560 219 -25 -321 -246 59 298 126 -188 -215 93 280 177 -68 -211 -75 200 197 -25 -268 -143 153 291
5581 291 88 -276 -240 54 307 66 -233 -245 22 259 148 -196 -256 -43 178 216 -20 -334 -135 221 286 78
5603 78 -201 -199 134 317 87 -238 -202 55 295 121 -194 -287 -56 249 239 -70 -288 -89 146 192 -1 -278
5625 -278 -242 182 284 62 -235 -274 67 303 190 -222 -269 6 243 198 -64 -263 -43 222 227 -39 -274 -157
5647 -157 210 200 -10 -292 -190 69 156 106 -196 -248 -26 252 132 -100 -220 -113 196 250 -71 -231 -151 164
5669 164 260 44 -272 -232 131 256 152 -221 -199 -16 293 153 -100 -301 -55 251 204 -26 -271 -166 200
5690 200 301 32 -317 -260 50 294 106 -150 -198 12 309 189 -179 -217 -31 306 251 -78 -341 -97 216
5711 216 274 22 -241 -175 110 242 105 -145 -229 37 202 143 -147 -320 -68 212 222 -138 -296 -143 210 325
$$ packed form
5560B19k44k96P5L05K39j72l14k7L08J87j03k45j43J36K75lk22k43J25K96J38
5581B91k03l64L6K94K53k41k99j2K67K37j11l44o0K13K21L8k36l14J99L56O5k08
5603G8k79KL33J83k30l25L6K57K40j74l15r3K31L05j0l09k18J99K35M6j93k77
5625b78L6M24J02k22k97l9L41K36j13m12m7K75K37m5k62j99K20K65Nk66k35J17
5647a57L67j0k10k82J02K59Q7n0l02n2K22K78j20k32j20J07L09N4l21j60Q0L15
5669A64R6k16l16M0L63J25j04l73K2J83L09j40k53k01K46L06m7k30k45J05L66
5690B00J01k69l49N7L10K44j88k56m8K10K97j20l68l8J86L37n5l29k63K44L13
5711B16N8k52k63O6K85J32j37k50q4K66J65n9k90j73K52K80J0l60j58J53L53J15
$$ plain form
5733 325 43 -296 -186 -15 245 61 -241 -202 14 247 40 -193 -252 -16 328 262 -96 -276 -153 139 260
5754 260 61 -195 -208 101 201 17 -159 -204 60 283 123 -295 -363 30 308 211 -112 -340 -154 124 229
5775 229 20 -204 -99 97 178 59 -253 -137 35 268 90 -251 -337 -22 333 242 -109 -290 -149 159 237
5796 237 -100 -144 -112 172 236 36 -262 -191 103 262 112 -199 -316 7 255 281 -75 -339 -124 214 226 -74
5818 -74 -135 -69 215 198 -42 -259 -218 191 343 96 -316 -299 -18 313 221 -75 -242 -75 182 178 -104 -190 -71
5841 -71 186 264 -66 -247 -236 125 367 149 -246 -300 -25 284 184 -114 -215 -55 152 135 -142 -217 -58 191
5863 191 279 -46 -274 -237 92 329 223 -210 -253 -20 287 205 -157 -212 83 251 91 -149 -232 -68 295 298 -57
5886 -57 -271 -213 140 322 97 -142 -194 11 217 120 -148 -154 9 250 159 -162 -327 -63 295 305 -12 -314 -187
$$ packed form
5733C25k82l39J10J71K60j84l02L9K16K33k07k33n9K36L44o6l58j80J23K92J21
5754B60j99k56j3L09J00j84j76m5K64K23j60m18o8L93K78r7l23k28J86K78J05
5775B29k09k24J05J96Q1j19l12J16J72K33j78l41q6L15L55r1l51j81J41L08P8
5796B37l37m4L2K84O4k00k98P1K94J59j50l11j17L23K48K6l56k64K15L38J2l00
5818g4o1O6K84j7k40k17M1M09J52k47m12J7K81L31r2k96j67J67K57mk82q6J19
5841g1K57P8l30j81J1L61K42k18l95n4K75L09j00k98j01J60K07j7k77p5J59K49
5863A91Q8l25k28L7L29K37j06m33m3K33L07q2l62n5K95J68j60k40q3J64L63Ll55
5886e7k14N8L53J82k25k39n2K05K06r7k68oJ63K41r1l21j65K64L58J0l17l02J27
$$ plain form
5909 -187 131 286 48 -155 -179 66 206 32 -218 -144 98 302 132 -157 -272 -68 222 298 5 -282 -220
5930 -220 128 262 125 -155 -145 133 232 -34 -216 -142 73 312 116 -146 -289 -90 158 341 -19 -204 -121
5951 -121 126 140 -1 -176 -69 91 177 -5 -248 -168 138 291 94 -201 -314 -114 227 209 -43 -272 -154
5972 -154 135 203 9 -203 -97 133 214 -3 -229 -212 99 260 159 -169 -212 -54 190 225 -13 -206 -54 227
5994 227 145 -82 -215 -33 240 134 8 -178 -174 111 321 169 -143 -240 -84 229 193 -104 -224 -83 198 174
6016 174 -127 -242 -81 272 240 24 -222 -278 126 271 139 -127 -169 -51 205 173 -90 -86 -9 187 153 -106 -218
6039 -218 -89 220 282 -68 -307 -197 133 293 165 -144 -231 -8 245 113 -97 -247 42 278 99 -137 -248
6060 -248 -88 234 284 -47 -218 -179 70 260 126 -162 -191 109 238 56 -161 -173 51 195 122 -167 -295 -27
$$ packed form
5909a87L18J55k38k03k4K45J40j74k50P4K42K04j70k89j15K04K90P6k93k87O2
5930b20L48J34j37k80J0K78R9k66j82P4K15K39j96k62j43J99K48J83l60j85Q3
5951a21K47J4j41j75J07J60Q6j82k43Q0L06J53j97k95j13K00L41j8k52k29J18
5972a54K89O8j94k12J06K30Q1k17k26J7L11J61j01l28m3J58K44L5k38j93J52K81
5994B27q2k27j33J82K73j06j26j86MK85K10j52l12r7J56L13l6k97j20J41K81k4
6016A74l01j15J61L53l2k16k46n6M04J45j32k66m2J18K56l2k63MP7J96l4k59j12
6039b18J29L09O2l50k39J10L30J60j28l09q7K23K53j32k10j50K89K36j79k36j11
6060b48J60L22N0l31j71L9K49J90j34k88k9L00J29j82k17j2K24J44p3k89j28K68
$$ plain form
6082 -27 206 275 11 -227 -170 172 209 103 -125 -247 105 241 105 -171 -144 64 181 136 -96 -213 -10 156
6104 156 209 0 -274 -86 118 203 92 -166 -170 72 205 39 -242 -187 63 281 166 -168 -217 -32 222 203
6126 203 -69 -159 -136 76 195 22 -230 -217 104 301 105 -194 -215 25 228 154 -113 -270 -78 174 156 -36
6148 -36 -187 -93 118 192 -6 -224 -133 200 233 33 -261 -210 55 238 144 -103 -263 -32 210 137 -64 -252 -89
6171 -89 161 238 -44 -247 -126 153 176 37 -277 -193 93 205 50 -180 -207 14 215 177 -104 -247 -29 185
6193 185 206 -25 -246 -133 113 226 8 -216 -196 95 254 84 -221 -196 24 181 128 -97 -279 -78 250
6214 250 178 -96 -251 -91 180 183 -49 -226 -151 119 247 80 -153 -270 -23 191 146 -107 -256 -35 230 284
6236 284 -86 -231 -90 131 198 35 -230 -119 120 189 -17 -249 -179 9 222 164 -147 -269 33 227 171 -32
$$ packed form
6082b7K33O9k64k38N7L42L7j06k28j22L52J36j36k76K7K08J17m5k32j17K03J66
6104A56N3k09k74J88K04Q5j11k58mK42J33j66k81N5K50K18j15l34m9J85K54j9
6126B03k72r0K3K12J19j73k52J3L21J97j96k99k1K40K03p4k67j57J92K52j8j92
6148c6j51R4K11P4j98k18R1L33L3k00k94N1K65J83r4k47j60K31K42p3k01j88J63
6171h9K50P7k82k03J21K79K3j39l14Q4K86J12j55k30k7K21K01l8k81j43K18K14
6193A85K1k31k21J13K46J13k18k24K0K91J59j70l05K5K20J57n3k25j82K01L28
6214B50p2k74j55J60K71Lk32j77P5K70J28j67k33j17K47K14m5k53j49K21K65N4
6236B84l70j45J41K21O7j63k65J11K39O9k06k32P0J88K13n8l11j22L02J94n6k03
$$ plain form
6258 -32 -235 -55 116 186 0 -193 -141 104 287 66 -243 -180 52 164 123 -104 -228 -32 237 172 -54 -218
6280 -218 -38 180 256 -25 -205 -133 150 239 61 -212 -222 122 277 73 -172 -168 -9 195 137 -118 -226 -90
6302 -90 225 178 -106 -171 -145 156 213 -55 -210 -122 -10 232 12 -235 -174 30 238 85 -112 -219 -29 196
6324 196 141 -110 -250 -115 159 260 14 -219 -112 137 205 64 -163 -129 -5 215 83 -90 -194 -28 228
6345 228 141 -117 -279 -64 144 149 -57 -193 -168 110 205 0 -194 -223 16 280 113 -140 -246 -35 238 175
6367 175 -89 -288 -14 140 157 -19 -201 -90 156 162 21 -223 -118 122 256 96 -231 -195 38 296 159
6388 159 -122 -312 -56 259 168 -53 -210 -111 181 223 -34 -224 -136 70 192 99 -186 -179 64 252 95 -117
6410 -117 -247 -68 195 117 -100 -245 -93 116 199 -18 -247 -184 124 205 64 -186 -163 -8 180 130 -181 -254
$$ packed form
6258c2k03J80J71P0j86j93N2K45J83k21l09O3K32J12m1k27j24J96K69o5k26j64
6280b18J80K18P6k81j80P2K83Q9j78k73j0L44J55k04k45MJ59K04n8k55j08J36
6302i0L15m7k84o5K6L01N7k68j55Q8J12K42k20k47O1K04K08j53j97j07J90K25
6324A96n5k51j40J35K74J01k46k33J07K49O8j41k27L4J24K20j32j73j04J66K56
6345B28q7k58j62K15K08Nk06j36K5K78R5k05j94k9K39K64j67k53j06K11K73o3
6367A75k64j99K74J54J7j76j82J11K46Oj41k44J05K40J34j60l27L6K33K58j37
6388A59k81j90K56L15r1k21j57R9K92M2k57j90Q8K06J22r3k85PK43J88j57k12
6410a17j30J79K63p8k17j45J52K09Q3k17k29O3L08Q1j41k50K3J55J88n0l11p3
$$ plain form
6432 -254 -5 226 185 -40 -197 3 193 176 27 -214 -118 153 220 55 -209 -219 65 182 100 -152 -223 -3
6454 -3 186 132 -127 -189 -86 194 142 -26 -260 -159 116 264 89 -216 -166 75 214 47 -206 -228 12 260
6476 260 142 -111 -204 -63 161 173 -4 -216 -111 178 272 19 -201 -174 14 274 75 -154 -225 -7 193 176
6498 176 -32 -174 -42 224 133 -92 -211 -51 124 225 -2 -220 -187 34 213 100 -155 -237 12 257 170
6519 170 -184 -237 -67 215 112 -64 -206 -22 160 199 -19 -232 -132 126 215 143 -254 -247 30 133 140 -187 -187
6542 -187 -18 237 148 -86 -256 -24 249 162 -4 -200 -104 90 199 39 -184 -140 19 166 133 -100 -128 -12
6564 -12 223 130 -118 -191 -26 175 230 -10 -219 -127 139 222 57 -198 -147 24 169 52 -237 -160 89 180 97
6587 97 -170 -220 -18 153 154 -63 -219 -163 84 272 -6 -170 -103 81 235 53 -173 -173 82 202 140 -155 -224
$$ packed form
6432b54K49K31m1k25j57K00J90j7j49k41R6K71O7j65k64j0K84J17q2k52p1K20
6454cJ89n4k59o2J03K80n2j68k34J01K75J48j75l05N0K41J39j67k53k2K40K48
6476B60j18k53r3J41K24J2j77k12J05K89R4k53k20K7J88K60j99k29p1K18K00j7
6498A76k08j42J32K66r1k25j19J60J75J01k27k18L3K21J79j13k55q2K49K45q7
6519A70l54n3J70K82j03j76j42J84J82L9k18k13J00K58Q9p2l97PK77J03Pl27%
6542a87J69K55q9k34j70K32K73q7j66j96R6J94J09j60k23M4J59J47l3k33k8J16
6564a2K35r3k48p3J65K01N5k40k09R2K66Q3j65k55N1J71J45j17k89P7K49R1q3
6587I7k67n0K02J71Jk17j56N6K47J88k78j64O7J84J54j82k26%K55J20o2k95o9
$$ plain form
6610 -224 -70 230 103 -41 -205 -146 82 119 -16 -110 -98 180 192 44 -194 -246 59 273 136 -84 -162 -116 211
6633 211 132 -79 -197 -59 162 180 -57 -186 -83 131 240 -17 -281 -189 75 240 95 -109 -264 -31 132
6654 132 86 -63 -170 -83 101 67 -87 -283 -86 175 221 -40 -265 -180 69 323 72 -126 -207 2 172 127
6676 127 -100 -124 -54 158 122 -73 -213 -79 232 298 44 -218 -216 105 228 136 -110 -195 20 167 97 -95 -133
6699 -133 -10 189 91 -67 -245 -90 124 273 20 -259 -143 65 161 76 -183 -181 57 116 69 -122 -120 -4 239
6722 239 203 -89 -208 -129 178 243 19 -230 -110 60 202 60 -179 -78 106 199 61 -129 -149 27 187 158
6744 158 -94 -233 -121 219 250 43 -173 -97 9 135 34 -128 -148 101 128 -12 -157 -157 -1 270 146 -98
6766 -98 -269 -140 136 192 -4 -267 -139 26 114 -38 -190 -12 87 159 44 -187 -211 30 264 132 -142 -239
$$ packed form
6610b24J54L00j27j44j64N9K28L7j35r4J2K78J2j48k38n2L05K14j37k20p8M6L27
6633B11p9k11j18J38K21J8k37j29J03K14J09k57k64R2K64J65j45k04j55K33J63
6654A32m6j49j07Q7J84l4j54j96J97K61M6k61k25Q5K49K54k51j98q1K09J70m5
6676A27k27k4P0K12l6j95j40J34L11O6k54k62KL21J23r2k46q5K15J47p0j92l8
6699a33J23J99r8j58j78J55K14J49k53k79J16K08R6q5k59KK38N9m7j91KJ16K43
6722B39l6k92j19P9L07O5k24k49J20J70J42j42k39J01J84R3j38j90k0J76J60k9
6744A58k52j39J12L40L1k07k16P6J06J26j01j62k0K49K7j40j45%J56K71j24k44
6766i8j71J29K76N6j96k63J28J65Q8j52j52J78R9P2j15k31k4K41K34j32k74r7
$$ plain form
6788 -239 -68 174 152 -48 -201 -158 96 182 -54 -167 -33 151 239 66 -151 -200 27 211 150 -101 -200 -57
6810 -57 146 136 -84 -137 -29 156 128 -88 -157 -57 133 155 46 -183 -265 14 228 148 -41 -188 -38 100 142
6833 142 -98 -175 4 180 138 -11 -183 -138 125 190 28 -133 -164 39 206 118 -29 -160 -11 139 30 -82
6855 -82 -171 36 164 194 -128 -218 -109 151 294 25 -190 -180 99 192 103 -105 -138 -7 186 83 -88 -50 37
6878 37 158 121 -89 -201 -135 50 106 -1 -214 -177 78 276 12 -184 -131 69 171 29 -216 -232 27 253
6900 253 155 -87 -220 -95 158 271 29 -168 -157 137 146 -27 -173 -146 81 191 97 -164 -177 33 238 155 -90
6923 -90 -215 -106 168 188 -25 -211 -126 56 202 -37 -138 -94 107 242 23 -208 -181 -8 192 110 -75 -175
6945 -175 -83 138 146 -46 -209 -60 112 220 -27 -219 -143 179 242 79 -154 -142 70 168 174 -51 -153 -27 182
$$ packed form
6788b39J71K42k2k00j53M3K54Q6k36j13J34J84Q8j73k17m9K27J84o1k51r9J43
6810e7K03j0k20n3J08J85k8k16o9J00J90K2j09k29q2K79K14q0j89j47J50J38M2
6833A42k40p7J79J76m2j49j72M5K63O5j62j61l1K03J67q8j47j31J49J50j09j12
6855h2q9K07J28L0l22r0J09K60J43k69k15J0K79R3q9k08l3J31J93j03j71L8Q7
6878C7J21l7k10j12O6J85N6j07k13L7K55J98k64j96N3K00J02j42k45j6K59K26
6900B53r8k42j33J25K53J13k42j97J1K94Rj73j46K7K27J10r4k61j3K10K05q3k45
6923i0j25J09K74K0k13j86Q5J82J46k39j01M4K01J35k19k31K7J73K00q2j85j00
6945a75R2K21Qj92j63J49J72J08k47j92P6L22O3j63k33J2K12R8Ok25j02J26K09
$$ plain form
6968 182 220 -76 -178 -46 178 195 -32 -205 -113 102 133 48 -182 -149 75 214 58 -69 -236 -43 92 129
6990 129 -23 -228 -21 163 159 -20 -165 -107 140 199 53 -169 -178 13 226 -11 -117 -179 21 184 41 -172
7012 -172 -216 -20 128 99 -71 -155 -169 136 168 -6 -222 -145 81 162 95 -159 -155 31 187 72 -145 -187 -7 180
7036 180 120 -129 -182 -41 153 162 18 -184 -141 66 211 76 -203 -209 72 218 137 -96 -193 -34 295 92 -107
7059 -107 -208 -67 123 168 -38 -177 -80 69 157 -30 -212 -162 29 155 76 -88 -154 -14 195 136 -81 -160 -101
7082 -101 146 172 -27 -251 -154 105 209 -26 -160 -155 55 239 44 -102 -217 -26 221 104 -110 -132 -24 174
7104 174 158 -54 -212 -122 148 141 -17 -156 -100 46 165 72 -174 -129 38 208 78 -115 -206 -77 204 122 -6
7127 -6 -202 -112 172 138 -7 -196 -65 114 180 -16 -175 -148 116 221 74 -133 -137 34 145 163 -44 -186 -82
$$ packed form
6968A82L8k96j02J32K24J7k27j73R2K15L1q5k30L3K24J39j56j27j67J93J35L7
6990A29j52k05K07J84mj79j45N8K47N9j46k22rJ91K13k37j06o2K00J63j43k13
7012a72m4J96J48k9j70q4j4L05L2j74k16P7K26Q1o7k54MJ86J56j15k17m2J80J87
7036A80o0k49n3J41J94Rj44k02M3K07J45j35k79oK81J46q1k33r7J59L29k03j99
7059a07j01J41J90M5k06j39R7J49Q8j87j82N0J91J26p9j64o6J40K09n9k17p9N9
7082a01K47K6j99k24R7K59J04k35j34NK10J84j95j46j15J91K47j17k14k2J08J98
7104A74j6k12j58R0K70pj58j39N6J46J19r3k46M5J67J70j30j93r1J29K81q2j28
7127fj96R0K84l4j45j89J31J79O6j96j59K7K64J05j47k07mJ71J11J8k07j42J04
$$ plain form
7150 -82 109 196 2 -128 -145 114 198 56 -138 -80 108 147 90 -173 -88 10 220 86 -68 -120 -40 159 78 -63
7174 -63 -143 -94 125 176 -9 -193 -184 67 205 53 -160 -118 19 162 128 -114 -208 -16 171 89 -54 -165 -68 129
7198 129 260 -13 -89 -88 93 217 78 -137 -170 42 178 59 -123 -159 13 162 146 -94 -161 -91 117 175 -43
7221 -43 -139 -75 95 116 49 -194 -125 54 121 -1 -71 -182 66 128 65 -71 -173 -73 177 195 -76 -140 -7 127
7245 127 115 3 -146 -92 47 192 54 -115 -114 -1 173 138 -102 -185 -49 194 132 -72 -185 -20 106 156 -4
7268 -4 -173 -105 78 151 82 -114 -150 71 181 120 -98 -189 45 169 141 -65 -148 -36 154 106 -42 -110 -47 131
7292 131 178 77 -152 -141 140 163 1 -100 -150 77 163 79 -38 -180 -61 142 159 -45 -128 -123 60 95 25 -133
7316 -133 -163 48 198 24 -168 -135 49 144 112 -85 -192 -45 196 173 -46 -139 -88 135 144 4 -170 -88 30
$$ packed form
7150h2J91Q7j94j30j7K59Q4j42j94N8J88L9n7k63Q5R8K10j34j54n2Q0J99q1j41
7174f3q0M9K19N1j85j84RK51J38j52k13M2J37J43l4k42r4J92J87q2j43j11R7J97
7198A29J31k73p6JJ81J24j39k15l3K12J36j19j82l6J72J49j6k40o7P0K08N8k18
7221d3r6O4J70K1o7k43O9J79O7j22p0j11K48O2o3j36j02J00K50J8k71o4J33J34
7245A27j2j12j49N4J39J45j38j69JJ13J74l5k40q3J36K43o2k04j13J65J26N0j60
7268dj69O8J83P3o9j96l6K21J10o1k18r1K34J24k8k06q3J12J90m8j48o8O3J78
7292A31M7j01k29J1K81K3j62j01n0K27Q6q4j17j42J19K03J7k04q3NJ83L5p0j58
7316a33l0K11J50j74j92L3J84R5l2j97j07J47K41k3k19r3N1K23Rj40j74Q2J18
$$ plain form
7339 30 193 41 -88 -48 76 111 92 -166 -118 -71 115 126 -78 -181 -24 134 134 58 -158 -80 48 147 22 -151
7363 -151 -127 53 201 97 -89 -107 -24 154 54 -33 -124 -49 96 113 -15 -85 -61 127 128 -42 -119 -100 85 180 6
7388 6 -147 -151 43 99 52 -20 -155 -10 168 89 -75 -168 -121 132 151 44 -231 -172 55 155 46 -112 -147 29
7412 29 121 97 -28 -117 -36 57 69 -10 -148 -35 120 130 -34 -133 -91 37 202 4 -105 -65 -54 109 83 -82 -102
7437 -102 -45 115 36 -56 -106 -11 147 204 -25 -130 -94 83 155 2 -65 -14 41 75 85 -16 -106 -23 102 128 -115
7462 -115 -123 35 167 109 -22 -116 -1 55 124 43 -71 -149 12 127 39 -67 -164 85 131 7 -37 -182 8 124
7486 124 158 -45 -174 -78 64 151 0 -63 -88 86 91 44 -102 -137 52 109 24 -88 -121 -56 98 160 39 -154 -23
7511 -23 123 79 21 -121 -55 155 160 110 -102 -33 61 190 -3 -69 -125 41 101 90 -11 -56 -32 57 106 -22 -29 0 15
$$ packed form
7339C0J63j52j29M0J24L5j9k58M8M7J86J1k04j03J57J58%p6k16P8J28R9j25j73
7363a51K4J80J48j04j86j8Q3J78j00q7r1P5J45J7j28p0K4J88Jj70p7J9J85R5j74
7388Fj53mJ94N6m7p2j35J45J78p9j64r3M7K53J9j07k75N9K27J00j09j58l5J76
7412B9R2k4j25q9Q1R3J2p9j38J13J55J0j64r9M2J28J65j98j09M0J1J63k6j65k0
7437a02N7J60p9r2n0R5J58N7k29j05L6J77P2j53o7N1N5L4J0j01r0Q3J25K6k43
7462a15qJ58J32n8j31r4J15N6O9q1j14p8J61J15q8j06r7K49M6j24m4j45J90J16
7486A24L4k03j29R6J42Q7j51o3k5J74Nm7j46l5J89N7q5j12l3O5J54O2j21j93J31
7511b3J46m4n8j42O6K10Nn0k12O9R4J29j93o6n6J66O0j1j01m5K4Q9M9j28pK9J5
$$ plain form
7538 15 180 2 -108 -83 70 124 -32 -160 -126 6 120 95 -85 -33 -45 58 81 -66 -171 -52 47 114 27 -109
7562 -109 -51 10 160 83 -37 -142 -10 127 96 -26 -115 5 36 38 -19 -104 22 146 87 57 -118 -87 43 182
7586 182 11 -59 -74 -10 116 82 -71 -127 -5 97 37 -9 -72 11 114 126 -45 -154 -66 142 73 76 -66 -48 1
7611 1 89 -9 -35 -38 6 103 15 -52 -113 -55 76 138 14 -149 -40 59 77 -14 -13 -61 -13 91 20 -89 -34 38 151 58
7639 58 -85 -145 -51 66 155 28 -79 -41 28 114 -34 -45 -88 80 50 2 -113 -45 26 135 95 -64 -104 -7 94
7664 94 103 -39 -104 -58 17 69 -41 -61 -8 112 92 -5 -73 -53 38 132 71 -34 -136 -16 65 120 -36 -74 -1 51 41
7691 41 -24 -60 -51 34 110 61 -71 -63 -24 98 40 -46 -71 -13 9 69 -32 -30 -71 112 23 -8 -60 72 96 58 17 -133 -90
7720 -90 9 107 69 -9 -115 -31 30 56 37 -27 13 47 62 -86 -91 -49 54 6 -61 -84 -102 45 69 5 -66 -16 -5 39 53
$$ packed form
7538A5J65j78j10K5J53N4j56j28L4J32J14k5j80N2j2J03K3j47j05J19R9O7q7j36
7562a09N8O1J50p7j20j05J32J37l1j22q9J20L1Kn7q5J26J24n9l0j75L1J30J39
7586A82j71p0j5O4J26l4j53n6J22J02o0m6o3Q3J03J2j71j09Q8K08o9Lj42J8M9
7611AQ8r8k6lM4R7q8o7o1N8J31O2j24j63J09R9J8r1Jm8M8J04p1j09N5P2J13r3
7639E8j43o0R4J17Q9j27j07L8O9Q6j48j1m3J68l0m8j15O8P1J09m0j59m0R7J01
7664I4Rj42o5M6P5N2j10k0N3J20k0r7o8K0R1R4o1j05j02J20Q1N5j56l8P3N2j0
7691D1o5l6RQ5P6m9j32QL9J22n8q6k5N8K2O0j01Km1J83q9l1n2J32K4l8m1j50M3
7720i0R9R8l8p8j06Q4O1K6j9o4M0L4J5j48nM2J03m8o7k3j8J47K4o4p1N0J1M4J4
$$ plain form
7749 53 -55 -30 -8 63 34 1 -70 -31 85 48 16 -48 -1 9 80 38 -44 -90 9 78 78 -100 12 1 51 30 -10 -30 -24
7778 -24 108 70 -3 -66 -118 -12 19 57 -56 -43 76 -6 145 -44 -85 14 35 33 -60 -65 -6 56 45 -5 -82 -9 29 79
7806 79 56 -51 -22 80 50 62 0 -52 -6 68 86 -35 -27 59 46 87 -21 -55 -57 111 129 26 -60 -12 71 39 -19 -7
7834 -7 -73 16 105 72 -60 -68 -26 53 84 49 -71 -49 -16 60 -6 -87 12 -21 38 13 -54 -31 2 84 -29 -85 -87 -4 -7 26 25
7865 25 -106 -55 35 21 1 -30 -20 46 60 53 -78 -33 49 76 -21 -45 -76 -44 71 33 32 -66 -63 34 6 57 -52 11 36 99
7895 99 108 -32 -55 -12 37 -12 -51 -62 38 36 63 -79 -17 -13 53 15 5 -79 -76 -6 11 32 -68 -37 -16 54 -18 -54 -68 -27
7925 -27 33 63 -13 -52 -54 3 16 -16 -55 4 42 107 75 -49 -49 -38 59 14 -18 -93 -7 39 98 -73 -117 16 68 48 -31 -46
7955 -46 44 20 46 7 -49 -12 -15 37 9 -66 -43 -24 81 50 -44 -79 8 25 67 -42 -53 -68 49 69 -29 -107 37 82 52
$$ packed form
7749E3j08K5K2P1k9l3p1L9J16l7l2o4M7J0P1m2q2m6R9O9%j78J12j1N0k1m0k0O
7778b4J32l8p3o3n2J06L1L8j13J3J19q2J51j89m1R9K1kr3nN9O2j1n0p7P3L8N0
7806G9k3j07K9J02l0J2o2n2M6P4J8j21QQ6j3M1j08l4kJ68J8j03q6M8Q3l2n8J2
7834go6Q9Q9l3j32qM2P9L1l5j20K2L3P6o6q1R9l3N9k5o7K3L3Q2j13n6kQ3lL3j
7865B5j31N1R0j4k0l1J0O6J4pj31M5Q2K7r7k4l1L2J15l8jr8LR7k8N1j09O3K5O3
7895I9Rj40k3M3M9m9l9j1J00kK7j42O2MO6l8j0q4LP0J7K1j00L1K1P0p2l6j4M1
7925b7O0L0p6l9kN7J3l2l9N9L8O5l2j24%J1R7m5l2p5Q6M6N9j71m4J33N2k0p9j5
7955d6R0k4K6l9n6L7lN2k8p5K3J9J05l1r4l5Q7J7M2j09j1j5J17K0r8p8J44M5l0
$$ plain form
7984 52 85 3 -89 -18 -15 20 -3 -64 33 -7 32 -30 -41 26 56 81 1 5 -74 -7 -6 85 -8 -17 38 104 28 0 0 20 72 31 31
8017 31 -4 -49 71 57 32 -17 -4 14 49 17 -21 -85 -30 7 -47 13 -13 4 17 42 -5 -9 -60 81 62 -27 -46 -3 24 16
8047 16 40 -33 -55 -22 70 -40 12 -37 8 26 22 54 0 -18 41 99 13 -41 27 55 -16 0 18 33 -27 118 -16 -14 23 -43
8077 -43 55 16 10 -55 -7 88 -33 37 -64 -21 19 -36 -15 43 -50 -18 4 4 -45 -2 3 1 53 -2 -32 35 88 57 37 -55 -11
8108 -11 36 66 -26 -62 -37 10 71 74 -22 -21 4 -14 5 -13 17 11 37 13 -52 -76 39 56 29 12 -35 24 10 -35 17 26 -72 18
8140 18 -15 36 -8 -73 73 21 8 2 -66 18 62 68 18 -48 0 30 51 16 -49 13 -89 49 -27 -51 11 -59 49 59 -50
8169 -50 -57 13 74 26 -3 -53 4 26 -7 13 -11 -9 -4 56 58 -4 -26 8 30 -10 -1 -11
$$ packed form
7984E2L3q2r2P1LL5k3o1R7m0L9o2j1O7L0K5q0Mp9O7JR1r3rN5O6p6k8%K0N2m1%
8017C1l5m5J20j4k5m9J3J8L5l2l8o4N5L7n4O0k6J7J3K5m7mn1J41j9q9j9M3K7q
8047A6K4p3k2L3R2j10N2m9M5J8mL2n4j8N9N8q6n4O8K8p1J6J8J5o0J45j34KL7o6
8077d3R8l9oo5M8R5j21P0j01M3M0n5K1N8r3L2K2%m9M3NkN2n5l0O7N3l1k0r2M4
8108a1M7L0r2l6K5M7O1Lr6JK5j8J9j8L0oK6k4o5k4J15J7k7j7m7N9j4m5N2Rr8R0
8140A8l3N1m4o5J46n2j3oo8Q4M4On0o6M8L0K1l5o5O2j02J38p6k4O2p0J08J0j09
8169e0pP0O1m8k9n0N7K2l3K0k4KNO0Ko2k2L4K2m0Rj0
8191a1
$$ Imaginary data points
##PAGE= N=2
##DATA TABLE= (X++(I..I)), XYDATA
$$ plain form
0 0 0 0 0 0 0 0 8 0 0 -5 8 -8 8 -8 8 -12 16 -16 19 -24 28 -28 36 -39 44 -52 57 -63 73 -83 91 -100 112 -126
34 -126 136 -153 170 -185 206 -230 253 -278 311 -340 381 -425 474 -533 604 -686 790 -920 1090
53 1090 -1320 1642 -2134 2935 -4420 7749 -18287 116791 690324 397365 -267881 -355361 -41670
66 -41670 98095 72741 72497 37257 -9457 50486 74344 -76658 -176370 -12732 219843 252949
78 252949 73231 -184545 -313221 -104756 288015 366835 -477 -302616 -152089 148372
88 148372 139024 -103957 -161587 77568 270170 112912 -228064 -334354 -79469 246610 313790
99 313790 72617 -243683 -322896 -79798 208958 226583 20844 -123749 -98738 -14369 25669
110 25669 -13031 -82874 -22114 192523 235691 -99365 -404632 -195812 278198 391129 64645
$$ packed form
0@%%%%%%Qq%nJ3j6J6j6J6k0K8l2L5m3N2n6O4p5Q3r6J09j20J36j56J74j91K12k38
34a26K62k89L23l55L91m36M83n31N89o51P21q06Q99j007J137j290J476j710K010
53A090k410K962l776N069p355J2169k6036J35078N73533k92959o65246q7480L13691
66d1670J39765k5354k44l5240m6714N9943K3858j51002r9712J63638K32575L3106
78B52949j79718k57776j28676K08465L92771P8820l67312l02139J50527L00461
88A48372r348k42981n7630K39155J92602j57258l40976j06290K54885L26079O7180
99C13790k41173l16300p9213K43098K88756J7625k05739j44593K5011Q4369M0038
110B5669l8700o9843O0760K14637M3168l35056l05267K08820M74010J12931l26484
$$ plain form
121 64645 -244340 -240214 -19674 167626 138731 -40491 -89924 64143 130397 -46909 -198086
132 -198086 -92697 115188 205182 147751 -39115 -266654 -260461 82378 365068 194816 -191738
143 -191738 -275717 -17455 171318 70494 -106172 -82466 100361 160478 -26029 -233998
153 -233998 -182220 88173 269118 162505 -109697 -259602 -145490 89368 194839 93984
163 93984 -70268 -125464 -39295 67486 46854 -81238 -101288 86702 228918 53518 -253659
174 -253659 -266530 48434 293917 204089 -78012 -249678 -155225 89297 196831 51149
184 51149 -113036 -60555 78799 58008 -77518 -112536 -8509 113439 153981 55604 -147456
195 -147456 -238784 -44909 236024 239329 -36529 -225243 -118830 93478 138286 -44 -105520
$$ packed form
121F4645l08985M126K20540J87300k8895j79222m9433J54067O6254j77306j51177
132a98086J05389K07885Q9994n7431j86866k27539O193L42839K82690j70252l86554
143a91738q3979K58262J88773j00824j76666K3706J82827O0117j86507k07969
153b33998N1778K70393J80945j06613k72202j49905J14112K34858J05471j00855
163I3984j64252n5196Q6169J06781k0632j28092k0050J87990J42216j75400l07177
174b53659j2871L14964K45483q9828k82101j71666R4453K44522J07534j45682
184E1149j64185N2481J39354k0791j35526l5018J04027J21948M0542r8377k03060
195a47456r1328J93875K80933L305k75858j88714J06413K12308M4808j38330j05476
$$ plain form
206 -105520 -23315 129477 110469 -92298 -209937 -64164 176310 222199 29595 -177072
216 -177072 -187927 -16660 153510 160270 7576 -135192 -105939 49179 113384 -4177 -117734
227 -117734 -32417 140056 129333 -79521 -210004 -87313 137467 206979 53665 -153126
237 -153126 -185900 -7559 159714 109033 -62410 -108206 2023 82650 31146 -66878 -88025
248 -88025 3975 127913 129052 -43822 -204020 -126669 115920 221140 68429 -137069 -161526
259 -161526 -11940 122085 93703 -45674 -102903 5260 115867 46953 -116076 -135422 29956
270 29956 167984 108526 -71277 -168543 -88817 75403 151785 59249 -97227 -129376 604
281 604 113775 53799 -87750 -101328 38055 134942 48418 -116616 -150264 -2975 156017
$$ packed form
206a05520Q2205J52792j9008k02767j17639J45773K40474M5889j92604k06667
216a77072j0855J71267J70170O760j52694j42768K9253J55118O4205j17561j13557
227a17734Q5317J72473j0723k08854j30483J22691K24780O9512j53314k06791
237a53126l2774J78341J67273n0681j71443m5796J10229Q0627n1504r8024k1147
248h8025R2000J23938J139j72874j60198P7351K42589J05220j52711k05498k4457
259a61526J49586J34025k8382j39377n7229J08163J10607o8914j63029j9346J65378
270B9956J38028n9458j79803r7266P9726J64220P6382r2536j56476l2149J29980
281F04J13171n9976j41549j3578J39383R6887q6524j65034l3648J47289J58992
$$ plain form
292 156017 136562 -45408 -174037 -92074 90023 140700 18954 -97199 -73782 31892 84394
303 84394 26682 -71867 -81446 33382 130682 58897 -108524 -146310 5165 151918 116022
314 116022 -43764 -137346 -72329 67337 119276 20919 -99747 -74367 63489 112455 -2143
325 -2143 -120313 -80688 63861 132306 44410 -97072 -130943 -14704 121310 113374 -32595
336 -32595 -132774 -61697 77495 99722 -11204 -98743 -51437 65505 101252 2921 -112978
347 -112978 -93528 51214 140325 51930 -103827 -125131 8685 119525 77560 -47314 -102225
358 -102225 -33235 73261 88095 -14071 -104627 -53560 81063 115163 -3793 -119434 -82109
369 -82109 55922 121997 42425 -83395 -107359 -991 107572 80195 -49741 -108747 -20431
$$ packed form
292A56017j9455j81970j28629Q1963J82097N0677j21746j16153K3417J05674N2502
303H4394n7712r8549r579J14828R7300p1785j67421l7786J51475J46753l5896
314A16022j59786r3582O5017J39666N1939r8357j20666K5380J37856M8966j14598
325b143j18170L9625J44549O8445q7896j41482l3871J16239J36014p936j45969
336c2595j00179P1077J39192K2227j10926q7539M7306J16942L5747r8331j15899
347a12978J9450J44742Q9111q8395j55757k1304J33816J10840m1965j24874n4911
358a02225O8990J06496J4834j02166r0556N1067J34623L4100j18956j15641L7325
369h2109J38031O6075p9572j25820k3964J06368J08563k7377j29936n9006Q8316
$$ plain form
380 -20431 89240 73619 -38087 -98296 -34754 73845 96810 366 -104597 -84628 43997
391 43997 117736 37033 -91422 -97141 20192 102404 51766 -58578 -94234 -15400 83637 78004
403 78004 -33719 -108789 -40835 85584 101580 -13855 -108485 -65036 53052 99837 26373
414 26373 -75824 -84118 15348 100743 56533 -64826 -100082 -1365 97730 68721 -44859 -97578
426 -97578 -27788 77582 89820 -8787 -98425 -63227 56064 103421 14319 -91017 -73466
437 -73466 37333 96262 35945 -64582 -86177 -3593 85441 68511 -38955 -98888 -28109
448 -28109 81692 83441 -24385 -98229 -46772 57943 86431 9432 -78847 -70470 29155 94979
460 94979 35960 -73876 -87816 11438 90979 52116 -48613 -84824 -17051 70476 71627 -19514
$$ packed form
380b0431J09671j5621j11706o0209O3542J08599K2965r6444j04963J9969J28625
391D3997P3739q0703j28455n719J17333Q2212n0638j10344l5656P8834R9037n633
403G8004j11723p5070O7954J26419J5996j15435r4630M3449J18088M6785p3464
414B6373j02197q294R9466Q5395m4210j21359l5256R8717R9095k9009j13580n2719
426i7578O9790J05370J2238r8607q9638L5198J19291M7357q9102j05336J7551
437g3466J10799N8929o0317j00527k1595Q2584Q9034j6930j07466n9933P0779
448b8109J09801J749j07826p3844N1457J04715K8488p6999q8279Q377R9625O5824
460I4979n9019j09836j3940R9254P9541l8863j00729l6211O7773Q7527J151r1141
$$ plain form
472 -19514 -92601 -49114 61972 93903 2041 -90407 -63685 40824 88827 25927 -68147 -79197
484 -79197 8626 88449 56370 -50446 -92415 -12218 83142 67137 -35400 -88851 -29993 63079
496 63079 78059 -888 -79755 -60240 38097 89790 23246 -75237 -74576 23345 89056 40664
508 40664 -55478 -79117 -5227 74021 61129 -30972 -87512 -30742 69249 78912 -14347 -85169
520 -85169 -44859 47736 76490 11468 -66940 -64534 19058 83465 43744 -54045 -81955 -1354
532 -1354 79265 53152 -39849 -77074 -15817 65193 68304 -12112 -79857 -46564 50609 84850
544 84850 8429 -77821 -60027 35792 84716 28948 -57186 -69550 2772 71439 51506 -35497
556 -35497 -78117 -15374 72827 66774 -26938 -85811 -36178 56181 77506 4505 -72770 -61014
$$ packed form
472a9514p3087M3487J11086L1931r1862r2448K6722J04509M8003o2900r4074j1050
484g9197Q7823P9823l2079j06816m1969Q0197R5360j6005j02537n3451N8858R3072
496F3079J4980p8947p8867J9515R8337N1693o6544r8483O61R7921O5711m8392
508D0664r6142k3639P3890P9248j2892r2101n6540N6770R9991R663r3259p0822
520h5169M0310R2595K8754o5022p8408K406Q3592O4407l9721r7789k7910Q0601
532a354Q0619k6113r3001l7225O1257Q1010L111q0416o7745L3293R7173L4241
544H4850p6421q6250J7794R5819M8924n5768q6134j2364P2322O8667j9933q7003
556c5497m2620O2743Q8201o053r3712n8873M9633R2359K1325p3001p7275J1756
$$ plain form
568 -61014 26156 80716 31284 -59811 -71786 10959 74827 35628 -49551 -69253 -2303 67590
580 67590 55952 -26687 -82578 -38648 55707 81094 3065 -76772 -56209 33083 73781 20001
592 20001 -54500 -57410 13115 69088 35769 -49612 -74036 1741 80406 57358 -37767 -84622
604 -84622 -29247 56988 71750 2086 -66214 -50860 27758 67491 14378 -60360 -52983 27283
616 27283 70732 19180 -60373 -68013 6515 75545 54793 -35676 -87835 -35071 58672 75254
628 75254 -3725 -72049 -43158 36509 58978 191 -58603 -40747 33866 72844 20530 -65155
640 -65155 -75267 8710 83884 57863 -33019 -76898 -27798 48322 61936 2761 -53640 -35079
652 -35079 35576 60681 -2100 -68322 -39784 50853 82725 13337 -71710 -71742 10734 80334 58109
$$ packed form
568f1014Q7170N4560m9432r1095j1975Q2745O3868l9199q5179j9702O6950O9893
580F7590j1638q2639n5891M3930R4355K5387p8029p9837K0563Q9292M0698n3780
592B0001p4501k910P0525N5973l3319q5381k4424P5777P8665k3048r5125m6855
604h4622N5375Q6235J4762o9664o8300J5354P8618L9733n3113p4738P377Q0266
616B7283M3449n1552p9553p640P4528O9030k0752r0469n2159N2764R3743J6582
628G5254p8979o8324K8891P9667K2469n8787n8794J7856P4613L8978n2314q5685
640f5155j0112Q3977P5174k6021r0882m3879M9100P6120J3614n9175n6401J8561
652c5079P0655K5105o2781o6222K8538R0637L1872o9388q5047l2Q2476O9600k2225
$$ plain form
665 58109 -28022 -73907 -26298 48696 52675 -13232 -54478 -16627 45011 47202 -15393 -66823
677 -66823 -39398 43278 82501 21634 -71029 -80503 5287 78741 52664 -31895 -66618 -15886
689 -15886 46342 38989 -23485 -53771 -6094 59275 49871 -31857 -82502 -33225 58020 82711
701 82711 15507 -64080 -69929 -1915 61480 50831 -17209 -55939 -15247 46278 36393 -34814
713 -34814 -62265 1098 73563 57043 -33186 -89436 -42710 54572 88137 19953 -63928 -63932 7381
726 7381 53202 25315 -25478 -31656 7666 38398 17573 -37661 -58660 -3190 72487 67178 -25484
739 -25484 -93900 -52427 47426 85887 24027 -56652 -60505 6254 51084 18221 -39267 -35461
751 -35461 26838 58026 7503 -63280 -63091 11408 75143 57438 -21817 -77546 -51153 26740
$$ packed form
665E8109q6131m5885M7609P4994L979o5907m1246L7851O1638K191o2595n1430
677f6823K7425Q2676L9223o0867r2663r474Q5790P3454k6077q4559l4723N0732
689a5886O2228p353o2474l0286M7677O5369r404q1728n0645M9277R1245K4691
701H2711o7204p9587n849O8014O3395j0649o8040l8730M0692O1525r885p1207
713c4814k7451O3363P2465j6520r0229n6250M6726R7282L3565o8184q3881mP1313
726G381M5821k7887n0793o178L9322L0732k0825n5234k0999N5470P5677n309r2662
739b5484o8416M1473R9853L8461o1860q0679l853O6759M4830l2863n7488L806
751c5461O2299L1188n0523p0783J89P4499O3735j7705p9255n5729K6393P7893
$$ plain form
763 26740 69087 30914 -37490 -50475 3248 43826 11727 -44452 -36301 34853 73463 17879
775 17879 -72240 -82875 8069 93567 69292 -29895 -80512 -33954 36089 48166 8342 -24110
787 -24110 -16748 13997 27697 -1126 -42907 -34197 33439 77648 29450 -62899 -87095 -9423
799 -9423 80336 76665 -13418 -76972 -39983 36647 47130 -10100 -41123 -1124 46044 28311
811 28311 -33713 -62112 -21559 45737 69463 21245 -53652 -75535 -17257 58173 65667 -604
823 -604 -58072 -37868 25330 41215 -8937 -46222 -8889 55350 52039 -28388 -86804 -41323 58628
836 58628 90284 17960 -64772 -64911 179 47514 36319 -4675 -27408 -12427 17134 17590 -18937
849 -18937 -40058 -1193 57970 55626 -19899 -84462 -57099 39342 94704 40003 -58358 -77114
$$ packed form
763B6740M2347l8173o8404j2985N3723M0578l2099n6179Q151P1154L8610n5584
775A7879r0119j0635R0944Q5498k4275r9187n0617M6558P0043J2077l9824l2452
787b4110P362L0745J3700k8823m1781Q710O7636M4209m8198r2349k4196P7672
799i423Q9759l671r0083o3554L6989P6630J0483n7230l1023L9999M7168j7733
811B8311o2024k8399M0553O7296K3726m8218p4897k1883N8278P5430P494o6271
823f04n7468K0204O3198J5885n0152l7285L7333O4239l311q0427n8416M5481R9951
836E8628L1656p2324q2732j39O5090M7335j1195m0994k2733J4981K9561M56l6527
849a8937k1121L8865N9163k344p5525o4563K7363R6441N5362n4701r8361j8756
$$ plain form
861 -77114 -2154 56700 27375 -30849 -29859 19725 39560 570 -46404 -42611 11303 59325 47699
874 47699 -17474 -69701 -50813 21847 70235 41032 -31234 -59829 -13033 41490 28243 -28028
886 -28028 -38418 18253 60029 17361 -62024 -69990 12216 83523 56932 -29600 -73224 -35979
898 -35979 27468 50617 21640 -20388 -31084 -3480 23257 9972 -25705 -26687 20379 56580
910 56580 24996 -49141 -77614 -14178 74604 77869 -12586 -81201 -44694 35967 52978 1704
922 1704 -33859 -10816 26732 22629 -18458 -44430 -19412 34823 58450 19220 -45203 -64948
934 -64948 -15573 52072 64263 5232 -57093 -47176 18631 49499 6808 -40998 -20443 38555
946 38555 45782 -17105 -66984 -32523 46139 71627 15587 -53109 -60162 -6672 44680 43832 105
$$ packed form
861g7114P4960N8854k9325n8224R90M9584J9835l8990m6974L793N3914M8022j1626
874D7699o5173n2227J8888P2660M8388k9203p2266k8595M6796N4523j3247n6271
886b8028j0390N6671M1776m2668p9385p966Q2206P1307k6591q6532m3624L7245
898c5979O3447K3149k8977m2028j0696K7604K6737j3285l5677r82M7066L6201
910E6580l1584p4137k8473O3436Q8782L265r0455o8615L6507Q0661J7011n1274
922A704l5563K3043L7548m103m1087k5972K5018N4235K3627l9230o4423j9745
934f4948M9375O7645J2191n9031o2325R917O5807L0868m2691m7806K0555N8998
946C8555P227o2887m9879L4461P8662K5488n6040o8696p053N3490N1352q48m3727
$$ plain form
959 105 -34482 -23345 13650 25298 -3694 -30466 -11685 33551 43470 -6772 -63061 -49114 31219
972 31219 81523 33751 -52932 -69479 -4530 51211 35012 -16345 -33242 -2650 27463 14624
984 14624 -24831 -36828 1135 46408 41494 -13179 -57621 -41618 20183 62367 36046 -31743
996 -31743 -60172 -14123 43676 36601 -18749 -39297 3348 44490 20854 -39325 -53652 1534
1008 1534 58687 47744 -17244 -60193 -35084 25067 52318 21239 -27487 -38343 -4317 28682
1020 28682 19405 -17041 -28865 4165 40037 25377 -31060 -58192 -11692 56143 57432 -11424
1032 -11424 -62964 -37146 26234 49130 12677 -31019 -29009 10163 31144 5267 -31224 -25926
1044 -25926 18153 44643 17152 -34807 -51368 -10419 45665 52732 -1392 -53385 -38887 21262
$$ packed form
959A05l4587J1137L6995J1648k8992k6772J8781M5236R919n0242n6289J3947Q0333
972C1219N0304m7772q6683j6547O4949N5741j6199n1357j6897L0592L0113j2839
984A4624l9455j1997L7963M5273m914n4673m4442J6003O1801M2184k6321o7789
996c1743k8429M6049N7799p075n5350k0548M2645M1142k3636o0179j4327N5186
1008A534N7153j0943o4988m2949K5109O0151K7251l1079m8726j0856L4026L2999
1020B8682r277l6446j1824L3030L5872j4660n6437k7132M6500O7835J289o8856
1032a1424n1540K5818O3380K2896l6453m3696K010L9172K0981k5877l6491N298
1044b5926M4079K6490k7491n1959j6561M0949N6084P067n4124n1993J4498O0149
$$ plain form
1056 21262 47239 9442 -35214 -26017 20681 38049 225 -42863 -31734 23352 53826 20064
$$ packed form
1056B1262K5977l7797m4656R197M6698J7368l7824m3088J1129N5086L0474l3762
$$ [...]
8191B4
##END NTUPLES=NMR FID
##END=
