##TITLE=1H_CG-1106
 CDCl3, 8 sc, 
 30.5.2019
##JCAMPDX= 6.0         $$ Bruker NMR JCAMP-DX V2.0
##DATA TYPE= NMR FID
##DATA CLASS= NTUPLES
##ORIGIN= UXNMR, Bruker Analytische Messtechnik GmbH
##OWNER= root
$$ XWIN-NMR		Version 3.5
$$ Thu May 30 13:50:02 2019 Russian Standard Time (UT+4h)  she@DPX200
##.OBSERVE FREQUENCY= 200.13155
##.OBSERVE NUCLEUS= ^1H
##.DELAY= (6, 6)
##.ACQUISITION MODE= SIMULTANEOUS
##.ACQUISITION SCHEME= undefined
##.AVERAGES= 8
##.DIGITISER RES= 18
##SPECTROMETER/DATA SYSTEM= spect
##.PULSE SEQUENCE= zg30
##.SOLVENT NAME= CDCl3
##.SHIFT REFERENCE= (INTERNAL, CDCl3, 0, 15.7039)
##AUDIT TRAIL= $$ (NUMBER, WHEN, WHO, WHERE, WHAT)
$$ ##TITLE= Audit trail, XWIN-NMR		Version 3.5
$$ ##JCAMPDX= 5.01
$$ ##ORIGIN= Bruker BioSpin GmbH
$$ ##OWNER= she
$$ F:/spectra/data/she/nmr/H-F/1/audita.txt
$$ ##AUDIT TRAIL=  $$ (NUMBER, WHEN, WHO, WHERE, WHAT)
(   1,<2019-05-30 13:48:37.32 +0400>,<she>,<DPX200>,
      <created by zg, POWCHK disabled, PULCHK disabled
       configuration hash MD5:
       00 E9 B6 7A A2 85 ED C7 34 08 36 98 17 FE 4E 26
       data hash MD5: 16K
       D2 7C C4 E4 37 5A ED 8F 83 51 B9 A9 FF 3D 65 43>)
$$ ##END=
$$ 
$$ hash MD5
$$ 49 64 8B 97 AD DB 4B E9 22 BC 3D D9 0E 7D 51 39
##$RELAX= 
##$RELAX= 
##$RELAX= 
##$RELAX= 
##$RELAX= 
##$RELAX= 
$$ Bruker specific parameters
$$ --------------------------
##$DU= <F:/spectra>
##$EXPNO= 1
##$NAME= <H-F>
##$PROCNO= 1
##$TYPE= <nmr>
##$USER= <she>
##$AMP= (0..31)
100 100 100 100 100 100 100 100 100 100 100 100 100 100 100 100 100 100 
100 100 100 100 100 100 100 100 100 100 100 100 100 100 
##$AQSEQ= 0
##$AQ_mod= 1
##$AUNM= <au_zg>
##$AUTOPOS= <>
##$BF1= 200.13
##$BF2= 200.13
##$BF3= 200.13
##$BF4= 200.13
##$BF5= 200.13
##$BF6= 200.13
##$BF7= 200.13
##$BF8= 200.13
##$BYTORDA= 1
##$CFDGTYP= 0
##$CFRGTYP= 5
##$CHEMSTR= <none>
##$CNST= (0..31)
1 1 145 1 1 1 1 1 1 1 1 1 1 1 1 1 1 1 1 1 1 1 1 1 1 1 1 1 1 1 1 1 
##$CPDPRG= <>
##$CPDPRG1= <>
##$CPDPRG2= <>
##$CPDPRG3= <>
##$CPDPRG4= <mlev>
##$CPDPRG5= <mlev>
##$CPDPRG6= <mlev>
##$CPDPRG7= <mlev>
##$CPDPRG8= <mlev>
##$CPDPRGB= <>
##$CPDPRGT= <>
##$D= (0..31)
0 1.2 0 0 0 0 0 0 0 0 0 0.03 0 0 0 0 0 0 0 0 0 0 0 0 0 0 0 0 0 0 0 0 
##$DATE= 1559209716
##$DBL= (0..7)
120 120 120 120 120 120 120 120 
##$DBP= (0..7)
150 150 150 150 150 150 150 150 
##$DBP07= 0
##$DBPNAM0= <>
##$DBPNAM1= <>
##$DBPNAM2= <>
##$DBPNAM3= <>
##$DBPNAM4= <>
##$DBPNAM5= <>
##$DBPNAM6= <>
##$DBPNAM7= <>
##$DBPOAL= (0..7)
0.5 0.5 0.5 0.5 0.5 0.5 0.5 0.5 
##$DBPOFFS= (0..7)
0 0 0 0 0 0 0 0 
##$DE= 6
##$DECBNUC= <off>
##$DECIM= 24
##$DECNUC= <off>
##$DECSTAT= 4
##$DIGMOD= 1
##$DIGTYP= 9
##$DL= (0..7)
0 120 120 120 120 120 120 120 
##$DP= (0..7)
150 150 150 150 150 150 150 150 
##$DP07= 0
##$DPNAME0= <>
##$DPNAME1= <>
##$DPNAME2= <>
##$DPNAME3= <>
##$DPNAME4= <>
##$DPNAME5= <>
##$DPNAME6= <>
##$DPNAME7= <>
##$DPOAL= (0..7)
0.5 0.5 0.5 0.5 0.5 0.5 0.5 0.5 
##$DPOFFS= (0..7)
0 0 0 0 0 0 0 0 
##$DQDMODE= 0
##$DR= 18
##$DS= 0
##$DSLIST= <SSSSSSSSSSSSSSS>
##$DSPFIRM= 0
$$ [...]
##$SUBNAM2= <"">
##$SUBNAM3= <"">
##$SUBNAM4= <"">
##$SUBNAM5= <"">
##$SUBNAM6= <"">
##$SUBNAM7= <"">
##$SUBNAM8= <"">
##$SUBNAM9= <"">
##$SW= 24.9336996594482
##$SWIBOX= (0..15)
0 0 2 0 0 0 0 0 0 0 0 0 0 0 0 0 
##$SW_h= 4990.01996007984
##$TD= 16384
##$TD0= 1
##$TE= 0
##$TE2= 300
##$TE3= 300
##$TEG= 300
##$TL= (0..7)
0 120 120 120 120 120 120 120 
##$TP= (0..7)
150 150 150 150 150 150 150 150 
##$TP07= 0
##$TPNAME0= <>
##$TPNAME1= <>
##$TPNAME2= <>
##$TPNAME3= <>
##$TPNAME4= <>
##$TPNAME5= <>
##$TPNAME6= <>
##$TPNAME7= <>
##$TPOAL= (0..7)
0.5 0.5 0.5 0.5 0.5 0.5 0.5 0.5 
##$TPOFFS= (0..7)
0 0 0 0 0 0 0 0 
##$TUNHIN= 0
##$TUNHOUT= 0
##$TUNXOUT= 0
##$USERA1= <user>
##$USERA2= <user>
##$USERA3= <user>
##$USERA4= <user>
##$USERA5= <user>
##$V9= 5
##$VALIST= <valist>
##$VCLIST= <CCCCCCCCCCCCCCC>
##$VD= 0
##$VDLIST= <DDDDDDDDDDDDDDD>
##$VPLIST= <PPPPPPPPPPPPPPP>
##$VTLIST= <TTTTTTTTTTTTTTT>
##$WBST= 1024
##$WBSW= 4
##$XGAIN= (0..3)
0 0 0 0 
##$XL= 0
##$YL= 0
##$YMAX_a= 948342
##$YMIN_a= -1129014
##$ZGOPTNS= <>
##$ZL1= 120
##$ZL2= 120
##$ZL3= 120
##$ZL4= 120
##$ABSF1= 10
##$ABSF2= 0
##$ABSG= 5
##$ABSL= 3
##$ALPHA= 0
##$AQORDER= 0
##$ASSFAC= 0
##$ASSFACI= 0
##$ASSFACX= 0
##$ASSWID= 0
##$AUNMP= <proc_1d>
##$AZFE= 0.1
##$AZFW= 0.1
##$BCFW= 1
##$BC_mod= 2
##$BYTORDP= 1
##$COROFFS= 0
##$CY= 11.3945322036743
##$DATMOD= 1
##$DC= 2
##$DFILT= <>
##$DTYPP= 0
##$F1P= 18.9103706918063
##$F2P= -1.10871071338519
##$FCOR= 0.5
##$FTSIZE= 0
##$FT_mod= 4
##$GAMMA= 1
##$GB= 0.15
##$INTBC= 1
##$INTSCL= 1
##$ISEN= 128
##$LB= 0.24
##$LEV0= 0
##$LPBIN= 0
##$MAXI= 10000
##$MC2= 0
##$MEAN= 0
##$ME_mod= 0
##$MI= 1.114404
##$NCOEF= 0
##$NC_proc= 0
##$NLEV= 6
##$NOISF1= 3.799351
##$NOISF2= 2.8
##$NSP= 1
##$NTH_PI= 0
##$NZP= 0
##$OFFSET= 15.70392
##$PC= 1
##$PHC0= -8502.856
##$PHC1= 22.00023
##$PH_mod= 1
##$PKNL= yes
##$PPARMOD= 0
##$PSCAL= 0
##$PSIGN= 0
##$REVERSE= no
##$SF= 200.130013532006
##$SI= 16384
##$SIGF1= 3
##$SIGF2= 2
##$SINO= 400
##$SIOLD= 16384
##$SREGLST= <1H.CDCl3>
##$SSB= 0
##$STSI= 0
##$STSR= 0
##$SW_p= 3612.71676300578
##$SYMM= 0
##$S_DEV= 0
##$TDeff= 0
##$TDoff= 0
##$TI= <>
##$TILT= no
##$TM1= 0
##$TM2= 0
##$TOPLEV= 0
##$USERP1= <user>
##$USERP2= <user>
##$USERP3= <user>
##$USERP4= <user>
##$USERP5= <user>
##$WDW= 1
##$XDIM= 8192
##$YMAX_p= 0
##$YMIN_p= 0
$$ End of Bruker specific parameters
$$ ---------------------------------
##NTUPLES= NMR FID
##VAR_NAME=  TIME,          FID/REAL,        FID/IMAG
##SYMBOL=    X,             R,               I
##VAR_TYPE=  INDEPENDENT,   DEPENDENT,       DEPENDENT
##VAR_FORM=  AFFN,          ASDF,            ASDF
##VAR_DIM=   8192,          8192,            8192
##UNITS=     SECONDS,       ARBITRARY UNITS, ARBITRARY UNITS
##FACTOR=    0.0002004,     1,               1
##FIRST=     0,             0,               0
##LAST=      1.6414764,     0,               0
##MIN=       0,             -1129014,        0
##MAX=       1.6414764,     948342,          0
$$ Real data points
##PAGE= N=1
##DATA TABLE= (X++(R..R)), XYDATA
$$ [...]
1057 47828 140099 88947 -33836 -105207 -57268 45009 73516 -926 -69993 -28830 83072
1068 83072 106691 -26593 -161719 -104850 97589 197746 70121 -130718 -169675 -14568
1078 -14568 132251 101545 -33802 -89255 -19555 61241 48057 -39349 -87595 -23467 85946
1089 85946 111280 10639 -119897 -136192 406 147332 127090 -40212 -150571 -78315 72680
1100 72680 110587 -3198 -102474 -44716 83388 93727 -33474 -132395 -74764 78146 146977
1111 146977 50306 -99403 -134933 -29578 95006 111702 9392 -92713 -73720 36533
1121 36533 89537 15800 -84462 -69952 58187 132969 36483 -122755 -137164 18467 154224
1132 154224 111445 -53450 -142429 -57741 80190 101857 3251 -78700 -51466 41030 81238
1143 81238 11591 -85662 -83014 27462 119203 77509 -64758 -145900 -57138 101727 133477
1154 133477 3123 -120154 -89499 45521 107981 19669 -93392 -74743 45908 105341 29117
1165 29117 -88723 -107353 256 110681 94264 -27471 -115057 -74482 48382 113701 42242
1176 42242 -78866 -92490 17722 103050 50723 -73458 -104869 9384 124454 83674 -65150
1187 -65150 -131334 -37235 98292 115371 -318 -105129 -75696 38613 94421 36134 -60056
1198 -60056 -80612 1610 88217 64753 -48377 -109499 -37074 89868 113434 -7517 -128521
1209 -128521 -90833 58468 127525 33665 -97115 -101474 20024 107869 49243 -72244 -96395
1220 -96395 -1370 90019 71423 -34178 -103080 -51309 61812 101988 23207 -83446 -94278
1231 -94278 10275 106934 69152 -58225 -108356 -16037 98572 87977 -37091 -115956 -40938
1242 -40938 90207 105222 -9581 -104845 -68172 48896 105303 34341 -72502 -85320 2952
1253 2952 84268 66734 -30546 -95469 -42415 69246 96667 -103 -101318 -78830 46242
1264 46242 117131 35436 -96084 -103996 20809 113237 59617 -67970 -108611 -12757 94039
1275 94039 76627 -33127 -95665 -43589 55287 88006 15483 -77254 -77084 17428 92695 57869
1287 57869 -51255 -103094 -23263 93895 94174 -27290 -113574 -53906 75798 111082 4895
1298 4895 -104417 -73982 50337 104447 28341 -75242 -81402 12345 89255 56741 -41850 -86923
1310 -86923 -30630 62027 86099 6419 -87285 -75043 32552 100678 42096 -72111 -98439
1321 -98439 3029 102543 65310 -60593 -106779 -17123 90343 81344 -30758 -104424 -47732
1332 -47732 62318 88487 9002 -75587 -71488 15095 83394 49889 -46400 -87036 -19843 74743
1344 74743 81844 -17438 -102656 -56153 68081 107788 10378 -98805 -82011 39639 111154
1355 111154 40064 -77197 -87804 12042 89900 55752 -41628 -84756 -22813 66471 74592 -4631
1367 -4631 -78059 -61595 29274 91084 42153 -64653 -93281 -4733 90077 71201 -41540 -105447
1379 -105447 -32772 83255 87379 -23096 -101485 -51654 58859 92439 8541 -83693 -69917
1390 -69917 24997 82773 40936 -46924 -80340 -18405 68266 72171 -13944 -84607 -52809 47974
1402 47974 95032 22030 -84010 -81719 28783 102402 45872 -66762 -92604 2248 94484
1413 94484 64500 -43445 -90006 -24861 67030 77921 -2969 -78864 -57745 32787 81954 35032
1425 35032 -53620 -79940 -6474 80980 66544 -36485 -95473 -33608 73520 89460 -11211
1436 -11211 -101652 -62947 54501 97152 17131 -78874 -75301 17495 82561 41296 -48725 -73762
1448 -73762 -10116 63218 61570 -15670 -79736 -48075 46818 88736 23799 -72668 -83498 10743
1460 10743 95173 59175 -51616 -90540 -10317 80750 65582 -33569 -87732 -24767 72224 77812
1472 77812 -11488 -83021 -56273 35071 86986 38135 -53985 -79014 -12325 65557 63571 -17792
1484 -17792 -79039 -37334 57520 77100 -9236 -89692 -58358 50687 101105 22647 -86907
1495 -86907 -88625 14276 89782 54162 -40017 -79323 -22908 54647 56005 -12916 -63260 -34818
1507 -34818 40574 73073 14160 -73661 -76438 17820 97127 63763 -46536 -101725 -31765 75479
1519 75479 81727 -13055 -78511 -35245 51280 67234 -7790 -73864 -42565 46627 81986 23277
1531 23277 -61665 -80661 -10159 74272 75550 -7593 -77401 -55142 30304 73514 18275 -62661
1543 -62661 -56004 32786 80264 16439 -79385 -81825 20178 102727 59821 -53990 -98962 -32601
1555 -32601 58923 73964 6776 -58491 -46658 18401 51553 14051 -45570 -50650 16389 78942
1567 78942 46579 -55037 -100461 -24826 86321 100388 -2342 -96560 -67420 38838 81893
1578 81893 19346 -52754 -42513 27158 59917 9731 -59558 -56415 17372 77963 58591 -25522
1590 -25522 -89763 -58591 39879 93518 41466 -53647 -78484 -6863 65630 39635 -45790 -63274
1602 -63274 16043 81292 38126 -65417 -98364 -13191 88057 84475 -11088 -83720 -63709 12945
1614 12945 62862 39557 -21500 -46617 -11147 34781 30532 -25480 -61341 -12411 75182 81158
1626 81158 -20661 -109920 -72205 53892 117342 42343 -72064 -83533 4133 64887 31860
1637 31860 -32060 -38471 16469 54535 20330 -45725 -63937 -13317 58884 81188 20085 -71872
1649 -71872 -92205 -10172 81910 78049 -14685 -80109 -36090 49506 51036 -31512 -70773 -2778
1661 -2778 81533 64870 -41584 -106466 -48789 59545 92824 28831 -50514 -69930 -25240 33935
1673 33935 48118 9875 -30292 -25218 17879 38832 -5656 -65740 -43319 55924 105111 25958
1685 25958 -94604 -107666 7830 109562 75716 -36580 -78921 -18726 44731 31159 -21774
1696 -21774 -35086 10091 50851 31698 -26761 -63644 -41631 27366 83120 59915 -34059 -98502
1708 -98502 -55277 49041 90516 21032 -65340 -51806 33585 56562 -18311 -77832 -27353 72263
1720 72263 88515 -7236 -99124 -77060 22878 83226 55017 -15704 -58573 -43364 6691 38766
1732 38766 24009 -15095 -27613 8121 44115 13232 -60681 -69954 22691 107520 69742 -56509
1744 -56509 -118176 -39301 78463 89720 -273 -62042 -30817 27945 31261 -14670 -37791 -3706
1756 -3706 44443 46560 -108 -52581 -63431 -11615 65393 83781 10447 -79466 -82000 7748
1768 7748 80115 44998 -43017 -56500 17051 60135 2781 -73768 -57029 41740 97349 35410
1780 35410 -68109 -90623 -20300 55415 66099 17055 -37308 -48256 -12837 26490 27834 -6610
1792 -6610 -30349 -643 48570 35499 -43634 -85848 -18386 86691 97693 -7412 -102402 -71371
1804 -71371 37528 83311 25886 -40948 -36051 15048 34395 -2142 -39213 -23734 25715 53412
1816 53412 30106 -27223 -69900 -45467 33962 85251 44251 -47300 -84336 -22189 58904 52517
1828 52517 -24396 -55760 2521 58655 26278 -56043 -74945 2860 82518 64534 -25284 -80176
1840 -80176 -49869 21094 60806 37363 -16905 -44463 -21510 19733 30514 -4254 -37466 -12062
1852 -12062 48260 55844 -18071 -84576 -50606 52058 100317 31432 -69854 -78785 3328 64659
1864 64659 39061 -22620 -38114 1891 36103 16231 -29731 -41570 -3522 45165 53576 4394
1876 4394 -60102 -66186 2213 71069 60607 -18432 -72733 -36417 39534 51661 -10816 -52908
1888 -52908 -14042 48823 46109 -25360 -74224 -33635 48339 72537 16321 -51707 -62643 -11534
1900 -11534 44828 47978 527 -39533 -28579 16203 36820 3130 -43545 -30743 35550 66675
1912 66675 12623 -65452 -69014 12363 82551 54643 -33413 -70347 -20909 42413 44344 -4762
1924 -4762 -38611 -15113 30026 35131 -6991 -45300 -33491 21271 61492 34355 -38306 -71442
1936 -71442 -23428 50701 63936 1853 -59081 -41595 26203 50240 1300 -48700 -31006 29980
1948 29980 55030 6835 -55616 -53452 10363 59785 42591 -19079 -58385 -33747 26650 51150
1960 51150 14150 -35975 -37230 10852 46355 17591 -41264 -47870 14338 64931 36847 -38408
1972 -38408 -69124 -15596 55955 58447 -5581 -52930 -32640 22075 44482 11172 -33051 -31819
1984 -31819 13033 42894 20658 -31530 -51310 -8822 51650 52997 -11909 -64573 -40158 30747
1996 30747 61769 14568 -49168 -46026 15749 50045 14974 -39722 -43737 8299 50715 29989
2008 29989 -28573 -54047 -18174 36704 50310 7708 -44769 -44216 9620 50243 27652 -29022
2020 -29022 -47553 -2091 49723 36214 -27547 -56003 -10335 50753 50319 -10956 -57323 -32271
2032 -32271 31102 53097 12861 -36279 -38513 4316 40754 26943 -20895 -41972 -10376 37356
2044 37356 41607 -7448 -52835 -34017 31211 58538 11555 -50452 -49112 12485 55835 25748
2056 25748 -37917 -49652 1264 45577 29694 -23110 -47158 -14650 34841 41207 -1995 -42288
2068 -42288 -34238 13199 46847 25240 -29574 -48801 -6185 45242 40112 -16052 -53663 -20534
2080 -20534 42377 51015 -6331 -53387 -30572 30508 53459 10578 -42404 -38914 11876 45244
2092 45244 23978 -22205 -41275 -10525 34168 38569 -4347 -42725 -29838 20237 48955 15784
2104 15784 -40435 -47180 7611 51625 28384 -31916 -52033 -6308 46590 37205 -21030 -50602
2116 -50602 -17491 33141 40889 -524 -41130 -32238 13948 41041 18951 -25233 -41076 -7074
2128 -7074 38303 37210 -12853 -48481 -22235 34220 50048 2299 -50275 -37369 25487 54449
2140 54449 14853 -39702 -41305 8589 46612 25582 -25058 -40674 -5347 34458 33587 -5550
2152 -5550 -39489 -26098 20383 43875 14913 -33420 -43265 517 45299 33249 -23714 -50770
2164 -50770 -11702 40497 38972 -13866 -49997 -22132 33201 43952 -1649 -43538 -32108 14663
2176 14663 41803 18645 -26701 -39246 -5886 32823 31958 -7592 -40275 -23423 26067 43871
2188 43871 4755 -41821 -35683 17657 51571 20260 -37215 -45381 5073 47668 29815 -21512
2200 -21512 -42627 -9670 34576 34395 -6825 -36480 -21043 19468 38378 12327 -30686 -37603
2212 -37603 2805 41514 30323 -19106 -47393 -16822 36775 42524 -8610 -47916 -25370 27554
2224 27554 43880 2491 -42579 -32903 16783 42265 14150 -29644 -37581 -2726 33835 29461
2236 29461 -10501 -37788 -20648 20825 38570 9413 -34180 -35442 10696 44556 21541 -29388
2248 -29388 -43189 -385 45149 33262 -21102 -45628 -10538 35865 37437 -5522 -38945 -22968
2260 -22968 20762 37559 10190 -26965 -31210 1887 34514 26087 -15647 -39771 -13929 30552
2272 30552 38074 -3002 -44328 -29643 24108 46400 7853 -40243 -37415 11360 43188 18709
2284 18709 -29054 -38391 -653 33749 24832 -13873 -35935 -15798 23511 34516 3261 -32731
2296 -32731 -31163 8038 40330 24097 -24021 -42079 -6212 38099 33543 -12947 -41794 -14970
2308 -14970 33306 37684 -6448 -39518 -21290 23246 40251 9492 -30958 -32731 4472 34540
2320 34540 25178 -12137 -34332 -15075 23506 33218 -235 -34592 -24411 18127 39788 9181
2332 9181 -37145 -37853 10259 44996 22294 -27391 -43275 -7346 33883 29790 -10689 -34431 -15057
2345 -15057 19489 28206 1103 -29737 -24482 12229 36290 16236 -25280 -39684 -6271 37826
2357 37826 36744 -9616 -42417 -20622 25490 37482 2561 -33196 -22677 19696 35760 5271
2369 5271 -30887 -28450 9280 38604 23492 -18349 -38044 -14169 24862 35448 6079 -30227
2381 -30227 -28106 9791 33622 11342 -26579 -30228 7281 38674 19027 -28812 -42875 -4051
2393 -4051 38074 33602 -9704 -40015 -23113 17466 31326 6829 -22763 -22572 4264 25297 12485
2406 12485 -20294 -30596 -838 33873 29989 -12566 -44810 -23757 27462 45538 7771 -34708
2418 -34708 -30726 10096 34179 12991 -22814 -23797 9819 31152 13567 -21065 -32084 -4958
2430 -4958 31275 34103 -1057 -34902 -30186 8354 37744 22242 -19181 -33516 -3157 28724
2442 28724 19006 -18968 -32936 -1228 36522 27342 -19432 -44169 -17550 27069 38622 7065
2454 7065 -29808 -30678 -61 24534 17758 -8086 -22262 -7076 19397 20265 -10320 -33115 -14075
2467 -14075 27963 41568 3641 -42328 -38241 12439 45755 23092 -21740 -32905 -2340 26260
2479 26260 16743 -13583 -21706 2182 25442 19070 -10188 -31237 -18509 17888 38545 18453
2491 18453 -22872 -39694 -11807 29755 33632 -4583 -32982 -13913 22246 24251 -11451 -35722
2503 -35722 -11149 31821 35464 -6154 -41120 -29927 11453 35689 20584 -14109 -29587 -13960
2515 -13960 11498 20082 3927 -17320 -14783 12223 25104 1236 -32140 -28534 15124 47063
2527 47063 22814 -31025 -47031 -6200 37267 32137 -6772 -28921 -10550 17672 16969 -7046
2539 -7046 -18987 -4165 18868 23310 3088 -24981 -28826 -197 33123 33274 -3419 -38367 -29033
2552 -29033 15104 36792 8810 -26647 -21144 14410 28113 -2274 -35090 -22770 21939 40535
2564 40535 9828 -30972 -36629 -5478 26888 27090 1135 -21877 -20133 216 17272 10953 -11519
2577 -11519 -18364 4663 27081 13327 -25076 -37950 -1631 42722 38058 -13365 -45853 -21745
2589 -21745 23630 34606 5009 -21932 -14030 11486 17105 -1787 -17496 -10855 10835 25595
2601 25595 15016 -14569 -32489 -16531 20580 38963 14173 -28715 -35994 330 31658 17580
2613 17580 -18515 -24749 6251 29570 8620 -30016 -32192 6814 37235 23588 -15199 -35533
2625 -35533 -19132 13425 26879 12146 -11183 -20882 -7308 13326 14701 -6901 -20608 -2717
2637 -2717 25430 23560 -12899 -40471 -18643 30411 44178 5344 -35704 -30186 8162 30643
2649 30643 13191 -15029 -16309 5315 17296 5206 -13890 -17911 -182 22603 24250 -1763
2661 -1763 -29362 -27573 5665 35590 25255 -15518 -35248 -10097 23332 20885 -10888 -25786
2673 -25786 -2084 27032 18325 -18974 -35031 -8704 26229 30463 1578 -27123 -26573 -282 21820
2686 21820 18514 -2767 -19258 -12293 10668 17458 -2586 -22283 -10917 20368 30681 451
2698 451 -35173 -29189 14591 41074 18246 -21484 -30943 -3509 23928 17931 -7628 -17072 -1329
2711 -1329 15909 12868 -6727 -21381 -11588 15301 29070 10553 -21694 -32225 -6031 28359
2723 28359 28807 -5723 -30259 -15021 16794 21520 -4662 -24991 -10310 20804 24206 -5232 -30143
2736 -30143 -20482 10933 29408 15064 -15408 -27788 -10627 15007 21296 3526 -17894 -15535
2748 -15535 8172 20871 3065 -21740 -19219 11292 32069 13233 -24444 -32682 -122 31241
2760 31241 24708 -7680 -26275 -11760 14905 19752 294 -16276 -9430 10179 19136 4359 -18592
2773 -18592 -21270 3044 27340 21119 -10089 -31470 -15817 18458 29190 2636 -24676 -18194
2785 -18194 9972 22136 2718 -21980 -17700 10467 25036 7998 -19515 -25830 -3840 21981
2797 21981 22500 -2976 -24046 -17606 7376 22970 9676 -15994 -19746 3947 23261 11123 -17736
2810 -17736 -24873 801 28124 21663 -11972 -29635 -10685 19627 25429 3236 -19591 -16336 6644
2823 6644 19661 8512 -11860 -16416 395 19870 15718 -9973 -25394 -9628 19941 26985 1419
2836 1419 -26777 -21801 9987 27068 8415 -19323 -20928 3390 21854 10208 -15479 -21648 -1027
2849 -1027 20107 16343 -6714 -23945 -14580 11741 23718 7146 -17762 -22043 -130 21902 15442
2862 15442 -12043 -23889 -3228 22078 18429 -8706 -25951 -9196 20347 24689 -771 -23312
2874 -23312 -15785 9491 23195 10327 -13095 -18654 -827 17692 14863 -5128 -20065 -9567
2886 -9567 15028 22532 824 -23265 -18617 9455 26662 10192 -20435 -24485 2098 23615 13741
2899 13741 -12908 -22675 -4544 17884 16208 -6444 -21000 -10291 10848 19350 4838 -17296
2911 -17296 -19715 1519 20874 14624 -10173 -23382 -7527 19041 21071 -4636 -24439 -11561
2923 -11561 16451 23837 1243 -22275 -16344 10898 23947 7713 -15439 -18103 832 19095
2935 19095 15109 -6130 -18807 -8058 12806 19481 3104 -18492 -17604 7101 23787 10093 -16703
2948 -16703 -22783 117 23301 15778 -12755 -24952 -5323 18829 18124 -5595 -22137 -12018 11347
2961 11347 18880 2714 -16029 -15964 1350 17311 12685 -9351 -20944 -7014 16125 19365 -1884
2974 -1884 -22343 -14397 13246 24507 3915 -20937 -18426 7881 24027 10093 -15309 -19606 1797
2987 1797 19955 13271 -7228 -17825 -6214 13357 18411 1760 -16633 -14511 5346 20913 11463
3000 11463 -13325 -21690 -1679 21044 16352 -8944 -23847 -7948 18048 19487 -5143 -23179
3012 -23179 -11921 12170 19958 2655 -17788 -16977 3382 17631 10198 -8871 -18211 -6689 13225
3025 13225 16893 -1667 -19394 -13289 9628 21539 5689 -18658 -19624 5509 23824 11759 -14444
3038 -14444 -21204 -1279 20079 16001 -7321 -18793 -5792 13586 16397 529 -15290 -12457 6859
3051 6859 18690 8524 -11514 -18691 -2841 18181 17550 -6235 -22259 -9115 15385 20051 -868
3064 -868 -21424 -13794 11812 20754 2649 -18149 -16002 4295 18433 9315 -11396 -18273 -4049
3077 -4049 13389 14218 -1572 -17011 -12186 7618 18787 5663 -15559 -17849 2942 21305 12524
3090 12524 -12808 -21894 -1845 20192 16650 -7113 -20427 -7788 14507 18189 -365 -16104
3102 -16104 -11248 6985 17008 7976 -10736 -16243 -1079 15569 14597 -4168 -18570 -9768 12837
3115 12837 19558 821 -19916 -14882 8613 20552 6172 -17205 -18496 3686 18978 9524 -11106
3128 -11106 -17790 -3984 13809 13024 -3982 -16529 -9571 7714 15878 4742 -14063 -16658 1694
3141 1694 19167 12070 -10143 -20379 -5149 17397 17256 -5354 -20059 -8008 14032 18090 -47
3154 -47 -17227 -11425 8958 18236 6021 -11679 -14847 -604 15045 13743 -3766 -16279 -8675
3167 -8675 9853 16972 2827 -16027 -14571 6519 19638 6402 -15538 -18242 1819 19818 12421
3180 12421 -10882 -20041 -4834 13850 14098 -2699 -15990 -10057 7298 14270 2937 -12689 -13237
3193 -13237 1835 16144 11017 -9454 -19719 -5167 15586 17316 -2112 -19113 -11253 10767
3205 10767 18625 2065 -15194 -11236 7404 17357 5761 -12575 -14444 2553 16462 12247 -5433
3218 -5433 -16597 -8533 10060 17341 3820 -12967 -13211 3862 16255 7628 -11853 -15762 2194
3231 2194 18014 10405 -10939 -19840 -4836 16014 16286 -3288 -17733 -11087 6314 14392 4807
3244 4807 -10504 -12430 933 12363 7412 -8362 -15573 -3714 14835 16200 -4228 -20441 -11927
3257 -11927 10577 20125 5352 -14964 -15038 3811 15814 6539 -9591 -11626 2275 14666 9357
3270 9357 -7894 -15425 -4594 12239 16957 2912 -14550 -15327 2930 17544 10746 -8421 -15317
3283 -15317 -2223 14204 10862 -8458 -16554 -1814 16154 13895 -6058 -19646 -10695 10262 17309
3296 17309 4159 -12077 -14457 -1792 10726 9442 -4153 -12361 -4307 9580 10702 -3478 -16442
3309 -16442 -9558 11616 19989 3377 -18003 -17536 3637 19576 11665 -8943 -15044 -1558 11708
3322 11708 8577 -4666 -10804 -1709 11080 11729 -1807 -14048 -10868 5476 18369 11121 -9347
3335 -9347 -18864 -5771 13754 15165 -1780 -14839 -6739 10750 12370 -4852 -16526 -6375 12624
3348 12624 16637 346 -17082 -15149 2551 15222 10338 -4892 -13513 -8140 5460 10701 953
3361 953 -10119 -7713 5816 13052 1861 -15502 -14948 6250 21408 11025 -12425 -20260 -3661
3374 -3661 15493 14624 -2451 -12337 -5130 7511 8622 -1166 -9054 -4721 7451 13056 4412 -10391
3388 -10391 -15010 -2289 15544 17129 -978 -18061 -12068 7724 15988 3636 -12355 -9810 7278
3401 7278 13662 -744 -15443 -11056 7135 16907 7105 -11342 -17235 -4912 10333 13108 2552
3414 2552 -10244 -11344 257 9827 5149 -7125 -10350 2125 14318 7679 -12224 -18957 -870
3427 -870 19357 16858 -5261 -19449 -9608 10173 15359 2261 -8947 -5936 4143 8518 1852
3440 1852 -7353 -7220 3393 12631 9333 -4916 -16000 -9551 10033 19747 5906 -13698 -15727 1146
3454 1146 14779 7696 -9381 -11503 3879 13892 4119 -12229 -14561 610 15125 11845 -4711
3467 -4711 -15561 -10522 3306 12469 7794 -5467 -11871 -3700 7863 7499 -4485 -11736 -2405 13246
3481 13246 12270 -6567 -19479 -8295 13556 19156 2744 -15290 -13246 3769 13284 5963 -5346
3494 -5346 -6773 1189 7634 4948 -4771 -9400 -2069 10089 13331 1580 -14013 -14396 3490 17944
3508 17944 11230 -8216 -16220 -3745 11955 9607 -6040 -12564 -200 11829 8031 -7584 -15470
3521 -15470 -5946 10146 14177 2436 -11277 -13172 -1895 10145 10408 -1557 -10977 -5945 6508
3534 6508 9424 -1430 -12237 -6385 10193 15344 124 -16437 -13126 6272 17965 8876 -9225
3547 -9225 -13395 -1950 10233 8298 -1731 -7557 -2400 6928 8320 -1391 -10159 -6980 5974 14930
3561 14930 6826 -10352 -16555 -2797 14160 13405 -3061 -14320 -6578 8553 10238 -3085 -11444
3574 -11444 -4385 8674 10510 -911 -13152 -10209 3872 13159 7434 -5993 -13306 -6712 7036
3587 7036 11413 1463 -10028 -8217 4436 10705 2112 -11216 -10262 6122 15528 5824 -11043 -14450
3601 -14450 -653 14199 11965 -2920 -11804 -5720 6147 9439 1662 -7215 -5838 4154 10531 3973
3615 3973 -8079 -11104 -216 13305 11550 -5083 -15388 -6897 9272 13625 759 -12112 -9012
3628 -9012 5293 10550 1005 -9811 -8156 3627 10628 4385 -8282 -12153 -2481 9495 10494 -889
3642 -889 -11853 -9399 3950 11900 4103 -8662 -9926 2013 11593 5442 -9033 -12116 1103 13484
3656 13484 8990 -5685 -12999 -4591 9229 11819 1379 -8849 -7822 2590 9968 5527 -5636
3669 -5636 -8772 -99 10501 8372 -4460 -12473 -5211 10127 13158 -71 -13458 -9442 5658
3682 5658 12941 3597 -9450 -10258 1812 9764 4494 -6425 -9942 -1567 8427 8085 -3012 -11133
3696 -11133 -6977 4937 11183 3809 -9374 -11556 604 11367 7211 -6296 -11541 -1583 11217
3709 11217 8978 -4880 -12129 -3186 9629 10709 -591 -10268 -7141 4830 10895 4470 -6172
3722 -6172 -8771 -754 8544 8112 -2496 -10000 -4507 7710 10986 491 -11488 -8637 5426 12999
3736 12999 3874 -10318 -10869 1651 11005 6214 -6592 -10995 -1706 8099 7264 -2407 -9504 -6207
3750 -6207 4397 8985 2053 -8104 -9799 215 10375 7404 -6067 -12322 -3211 10229 9905 -2971
3764 -2971 -11804 -5662 8292 11123 -47 -10009 -6835 4671 10396 3642 -7046 -8320 879 8767
3778 8767 7038 -2455 -9084 -4899 6617 10481 1329 -9254 -8217 4022 11601 4720 -8676 -10625
3792 -10625 1454 11305 6079 -6787 -11179 -1706 9182 7933 -3409 -10248 -4988 4931 8731 1891
3806 1891 -7269 -8483 352 7999 5560 -4767 -10245 -3344 8131 9535 -2460 -11733 -5804 7230
3820 7230 11451 1128 -10560 -8220 4305 10992 4004 -6421 -8053 504 8448 6450 -3216 -8207
3834 -8207 -2799 6557 8777 1240 -7942 -7943 3326 11373 5463 -6982 -10201 -620 10442 7719 -5037
3849 -5037 -10589 -2198 8771 8000 -2916 -10682 -4831 6174 9128 85 -8440 -7784 1094 7889 5198
3864 5198 -4256 -9220 -3040 6356 7640 -998 -9807 -6158 5874 10431 596 -10070 -8574 4003
3878 4003 11514 4339 -7466 -9585 799 9334 6498 -3261 -7833 -2474 6252 7327 1 -6785
3892 -6785 -5195 3279 9602 4414 -5977 -9553 -475 9753 8092 -3450 -10565 -4164 7712 9139
3906 9139 -1889 -9954 -5039 5720 8822 590 -8795 -7242 2702 8576 3453 -5498 -8589 -2660
3920 -2660 6484 7588 -973 -8490 -5862 3782 8472 2005 -8292 -8286 2897 10126 4449 -7533 -9853
3935 -9853 462 9951 7133 -4069 -9243 -2344 6662 7294 62 -6630 -4744 3689 7770 3483 -4894
3950 -4894 -7260 -132 8456 7593 -3284 -9870 -3914 7672 9735 -107 -9885 -6856 5298 9553
3964 9553 1319 -8266 -7214 2581 8296 3602 -5768 -8240 -1375 6236 5874 -1618 -7878 -5361 3688
3979 3688 8347 2227 -7252 -8281 1041 8989 5188 -5937 -9807 -1251 9073 7083 -3460 -9005
3993 -9005 -2907 7537 8058 -962 -7711 -4761 4099 8186 3188 -5305 -7145 270 7083 6636 -2279
4008 -2279 -7995 -3999 6029 8529 -67 -8738 -6159 4199 9276 2220 -8030 -7956 2241 9540
4022 9540 4295 -5321 -8437 -2053 6467 6121 -1575 -7513 -4277 3244 6661 1461 -6120 -6871 1018
4037 1018 8007 4840 -5294 -9754 -2117 8250 8052 -2412 -9496 -4199 5906 8408 171 -7701
4051 -7701 -4743 4243 8011 1830 -5735 -6082 1441 7820 5904 -2695 -7986 -3960 5371 8368 1760
4066 1760 -6761 -6226 2823 8304 2710 -6237 -6958 1835 8819 4216 -6329 -9248 -894 7981 6821
4081 6821 -2091 -8416 -5021 3350 6869 1680 -5238 -5904 231 6063 3806 -4703 -7740 -1015 7378
4096 7378 6735 -3029 -9895 -4797 6027 9618 953 -7391 -6425 2266 7385 2754 -4217 -5421 1683
4111 1683 6363 3811 -3484 -7030 -1820 6351 8419 830 -7812 -7450 1918 9101 5243 -4526 -7700
4126 -7700 -158 7218 4264 -4659 -7584 -194 7831 5763 -4042 -9505 -4176 5255 8080 1807 -6283
4141 -6283 -7447 -981 5390 4222 -2340 -6096 -2063 4798 5006 -3340 -8469 -2992 6613 8703 52
4156 52 -9637 -7909 2914 9448 4203 -4167 -6647 -615 4932 3674 -1862 -4503 -208 5345 4974
4171 4974 -894 -7040 -5272 4520 9977 4817 -5778 -9291 -1702 7860 7401 -1709 -7149 -1919 5350
4186 5350 4835 -2650 -6843 -1462 6238 7085 -1135 -8442 -6834 1398 7268 5413 -2074 -7692 -4105
4201 -4105 2944 5371 277 -5080 -3774 3813 6204 -1175 -8581 -5708 4847 10314 3519 -7887
4215 -7887 -9381 -148 7425 5966 -1371 -5224 -2379 3174 3907 -645 -3472 -1390 3763 6337 1424
4230 1424 -6151 -7622 784 9395 8252 -2393 -9495 -5071 4947 7754 695 -5918 -3162 3444
4244 3444 4759 -1670 -7008 -3415 4446 7569 1919 -5906 -8220 -2573 5388 7423 1025 -6019 -6277
4259 -6277 58 5208 2336 -4181 -4647 2688 6994 1217 -7602 -7869 1928 10160 6600 -4237 -9294
4274 -9294 -3704 4705 6482 1588 -3584 -3126 1357 3165 710 -3008 -2855 2104 6893 4602 -4142
4289 -4142 -8846 -3127 7143 9863 1397 -8186 -7162 2527 7003 2021 -4204 -3361 2712 4981 20
4304 20 -6309 -5213 1992 7270 4406 -2878 -8111 -5579 2272 7152 3853 -3671 -6419 -1841 4135
4319 4135 3504 -3507 -5640 1008 7175 3798 -5819 -9130 -1823 8031 8715 -495 -7537 -5807 1455
4334 1455 5570 3481 -1396 -2890 302 3193 2134 -2329 -4343 -371 6371 6873 -1184 -8809 -5929
4349 -5929 3765 9928 4424 -5258 -6940 -316 5389 2487 -3100 -3770 1691 5137 1635 -4852 -6516
4364 -6516 -1085 5330 6420 731 -6273 -7215 -884 6167 5437 -1535 -5710 -2929 3375 3553 -2610 -5809
4380 -5809 -1064 6470 5977 -2746 -8972 -5059 4912 8220 2894 -4327 -5867 -774 4012 4086 -399 -2792
4396 -2792 -1039 2981 3366 -747 -5161 -2718 4799 8277 1943 -7036 -7975 413 8197 6040 -2882
4411 -2882 -7027 -1548 4308 3276 -2037 -4684 -569 4725 3757 -2533 -6639 -4026 2316 6397 3514
4426 3514 -3665 -7745 -3100 4208 5862 -61 -5275 -3430 3329 4550 -1288 -6533 -2931 4864 7365
4441 7365 686 -7007 -6166 1610 7157 4456 -1793 -5329 -2337 3120 4365 933 -2941 -2321 2197
4456 2197 5259 1166 -5280 -5330 2042 8379 4799 -4306 -8343 -1984 6253 6052 -1013 -5899 -2697 3004
4472 3004 3483 -568 -4430 -2443 2519 4853 998 -4704 -6022 -1052 5538 5587 -1213 -7029 -4571 2423
4488 2423 6151 918 -5190 -4404 2472 5701 761 -5604 -4664 2663 6981 3117 -4079 -6183 -933
4503 -933 4773 5077 402 -4064 -3382 1841 4695 2232 -3000 -4145 1218 6082 3942 -3647 -6585 -837
4519 -837 6570 5770 -1940 -6963 -3253 4292 5958 445 -4792 -3432 1982 4432 1175 -3843 -4338 195
4535 195 4166 3410 -1944 -6081 -3711 3300 5984 874 -5705 -5252 1472 6272 2396 -4809 -5671 1220
4551 1220 5709 2627 -3937 -5439 -253 5257 4287 -1396 -4865 -2428 2327 5009 1829 -3378 -4353
4566 -4353 375 4908 3876 -1861 -5603 -1705 5339 5583 -1224 -6282 -2736 4816 6217 -109 -6012
4581 -6012 -3947 2976 5727 1142 -3810 -4632 87 4468 3113 -1876 -4774 -2600 2346 4589 539
4596 539 -5151 -4900 1510 5774 2456 -4870 -6169 325 6265 3750 -3609 -6373 -931 5049 4308 -1316
4612 -1316 -4862 -2047 3016 4288 322 -3581 -3030 772 4742 3165 -2379 -5298 -1274 4659 5733
4627 5733 -156 -5754 -3614 3651 6310 652 -5261 -4068 2691 5551 1309 -4896 -4606 1115 4881
4642 4881 2553 -2776 -4973 -1759 2795 3915 375 -4161 -4184 486 4759 2531 -3736 -5274 124
4657 124 5418 3591 -3581 -6839 -1358 6267 5090 -2024 -6298 -2864 3467 5158 560 -3963 -3035
4672 -3035 1503 3801 1512 -2032 -3552 -342 4223 4373 -525 -5465 -3324 3375 6525 1834 -4969
4687 -4969 -5193 1797 6063 2364 -3779 -4397 1237 4922 2263 -3801 -5089 -126 4364 4163 -1214 -4820
4703 -4820 -3576 1093 4603 2543 -2667 -5050 -1395 3852 3239 -2706 -5381 -1648 5005 4604 -2431
4718 -2431 -6892 -2505 4678 6248 85 -5130 -3678 1361 4574 2070 -2097 -3103 207 3024 2914
4733 2914 -648 -3593 -2230 3238 5429 1268 -5040 -5495 1489 6643 3735 -3703 -5679 -341 5140
4748 5140 3343 -3105 -4741 -563 4801 3172 -2307 -4822 -2216 2610 4225 1370 -3766 -5031 -521
4763 -521 3658 3633 -1221 -5260 -2829 3367 4611 -942 -5614 -2601 4054 5642 -140 -6369 -4427 2890
4779 2890 5872 2046 -3221 -4429 -66 3797 3066 -943 -3029 -1415 2131 3936 1236 -3481 -3773
4794 -3773 1985 5709 3231 -3983 -5788 -576 5882 4727 -2661 -5645 -1181 4185 4110 -1413 -4842
4809 -4842 -1662 3204 3763 -169 -4196 -3442 652 3661 2599 -1986 -4859 -2456 2763 4767 355
4824 355 -5464 -4337 2314 5654 840 -5302 -4540 1737 6013 1995 -4750 -4846 864 5015 2998 -2189
4840 -2189 -4314 -1135 2820 3741 228 -3184 -3000 1257 4610 2810 -2040 -4960 -208 5399 4533 -1945
4856 -1945 -5862 -1815 5143 5346 -1238 -5592 -2797 3594 4754 299 -4486 -3040 971 3492 1715
4871 1715 -2071 -3768 -1308 3245 3440 -583 -4582 -3152 2295 5259 1595 -5265 -5278 1439 5646 3043
4887 3043 -3809 -5270 -5 4875 2601 -2609 -4211 211 4030 3471 -1076 -4032 -2391 2014 4560
4902 4560 2576 -2169 -4314 -1350 4189 4770 -641 -4592 -2151 3517 4607 -786 -5620 -2495 4569
4917 4569 5917 189 -5811 -4333 1523 5706 2426 -2509 -4024 -1218 1936 2395 -252 -3309 -2236
4932 -2236 1624 3261 218 -4510 -4672 1553 6419 3051 -4481 -6695 -958 5109 4283 -1447 -4406
4947 -4406 -1496 3158 2723 -1355 -3439 -811 3337 3944 592 -3770 -4611 257 4981 5136 -126 -5254
4963 -5254 -3846 2653 5131 1320 -3731 -2578 3061 4837 -612 -5507 -3433 3476 6450 1716 -4607
4978 -4607 -5943 -944 4242 4299 145 -3178 -3184 -231 2128 1056 -2222 -2989 1386 4067 1360 -5048
4994 -5048 -6622 93 7113 5645 -2429 -7268 -3563 3052 4730 654 -2992 -1367 1837 2040 -1183
5009 -1183 -2973 -1216 2383 5011 2460 -2634 -5579 -2726 4013 7208 2434 -4753 -5449 789 4816
5024 4816 2181 -2502 -2547 2426 5014 -30 -5787 -4689 2169 7001 4199 -2712 -6205 -3594 1292
5039 1292 4442 2844 -1094 -3312 -1544 1603 1803 -2049 -3307 992 5422 3449 -4529 -8299 -2806
5054 -2806 6345 7505 254 -6242 -5263 881 4133 1491 -1276 -933 1664 1757 -664 -2947 -2342 1162
5070 1162 5273 5197 -572 -6552 -5623 1628 7790 5135 -2567 -5572 -998 3716 1828 -2860 -2806 2543
5086 2543 5840 666 -5851 -6060 -117 5974 5750 356 -4832 -5310 -1625 2880 4137 948 -2840 -2558
5102 -2558 1042 1753 -1977 -4576 -325 5896 5885 -2331 -9190 -5639 4272 8258 3076 -3956 -5136 -869
5118 -869 2371 860 -772 -398 1701 2220 291 -2767 -3984 -1102 4227 7044 2701 -4927 -7769 -1705
5134 -1705 6474 6751 -481 -4864 -2092 2968 1921 -2920 -3609 1994 6213 3307 -4147 -6933 -3032
5149 -3032 3362 6216 3363 -2305 -5302 -3847 919 3932 2209 -1822 -1979 1358 2427 -1833 -5488
5164 -5488 -2556 5251 7666 450 -8027 -7574 873 7048 4810 -1398 -3945 -1539 1322 614 -514
5179 -514 -635 1161 2493 2284 -1353 -4611 -4016 1856 7229 5527 -2487 -8130 -4511 4574 6776 1032
5195 1032 -4152 -1941 2603 2532 -2425 -5027 -300 5730 5057 -1183 -5968 -5386 273 5127 4565 647
5211 647 -4117 -4534 -661 3115 2365 -1631 -2256 1554 3512 -473 -6420 -5066 3106 8602 3883 -5259
5227 -5259 -8144 -1848 4704 4846 -14 -2556 -1512 593 1072 -455 -1336 -59 2469 3877 1414 -3809
5243 -3809 -5896 -1332 6087 7417 609 -6844 -5878 2556 6138 1803 -3363 -1830 2821 3502 -1397
5258 -1397 -5374 -2336 3666 5838 1751 -3807 -5405 -2484 2282 4861 2786 -2530 -4631 -1444 3135
5273 3135 2179 -2212 -3624 1048 5150 1956 -5289 -6888 -23 7383 5650 -2418 -6306 -3324 2829
5288 2829 4205 1267 -1706 -1356 704 1684 385 -2091 -2415 982 4523 3819 -1615 -6325 -3888 3989
5304 3989 7598 2199 -4925 -5318 1244 4961 1879 -3264 -2731 2289 4440 485 -4198 -4231 619 4564
5320 4564 3837 -475 -4675 -4068 566 4289 3324 -1847 -4570 -1683 3648 3280 -2578 -5196 -261 5493
5336 5493 4185 -3088 -7387 -2265 5147 5706 -70 -4771 -3646 1102 3625 1732 -1540 -2136 -266
5351 -266 2597 2647 -702 -3706 -1771 3656 5488 1103 -5523 -5485 1516 7031 3345 -4106 -5289 484
5367 484 5074 2611 -3062 -4407 382 4374 2272 -2564 -4205 -1749 2343 3827 1636 -3032 -4573
5382 -4573 -1031 3697 3874 -1375 -5308 -2493 4045 4695 -1605 -6196 -2867 4581 5711 -277 -5724
5397 -5724 -3694 2702 4996 1196 -3191 -3695 258 3348 2365 -880 -3503 -1919 2049 4902 1925
5412 1925 -3756 -4403 1344 5584 3087 -3902 -5658 505 6286 3621 -3785 -5616 -139 5291 3687
5427 3687 -1922 -4525 -1563 2870 3155 562 -2401 -3175 -88 3235 2427 -1599 -4441 -2151 3380 5120
5443 5120 -592 -6166 -4212 3484 6285 975 -5779 -4957 2333 5752 1272 -4288 -3757 1491 4249
5458 4249 1485 -2468 -3676 -932 3243 3834 655 -3572 -3573 591 5120 4071 -2290 -5330 -876 5030
5474 5030 4351 -2273 -6234 -815 5581 4560 -2502 -6218 -2129 3934 5144 298 -4300 -3551 467
5489 467 3191 2098 -701 -3280 -1678 2298 3263 -271 -4367 -3343 2798 6513 1284 -6364 -5902 1722
5505 1722 6862 2879 -3909 -5436 251 4826 2300 -3050 -3639 202 3712 2513 -1320 -3866 -2127
5520 -2127 2059 4711 2946 -2514 -5244 -1850 4646 5368 -269 -5472 -2379 4156 4958 -1089 -5825
5535 -5825 -2473 4823 5583 -850 -6004 -4373 2096 5303 2196 -2769 -4100 -1720 1986 2615 128
5550 128 -3575 -2793 1564 3934 989 -4579 -5104 1900 6851 3215 -5004 -7185 -438 5965 4653 -1888
5566 -1888 -5389 -1401 3398 3036 -1219 -3453 -1096 3057 3781 732 -3515 -3894 -25 4856 4941 -606
5582 -606 -6153 -3832 3620 5885 1151 -4754 -3650 3207 5967 192 -5578 -3720 3224 6251 1291
5597 1291 -4488 -5029 25 4359 3474 -565 -3697 -2923 410 3477 1754 -2935 -4148 80 4346 2783
5613 2783 -3781 -6606 -309 6677 5248 -2746 -7133 -2862 4732 5490 -537 -4908 -2073 2539 3490
5628 3490 -62 -2768 -2873 825 4161 2818 -1561 -4844 -2381 3346 6387 1261 -5529 -5184 1720
5643 1720 6742 2256 -4605 -4849 1607 6295 1911 -4546 -4681 879 5352 2973 -2007 -4930 -2102
5658 -2102 2599 3819 1426 -2832 -4111 -741 3964 3400 -2258 -5296 -1574 4725 4992 -1655 -7184
5673 -7184 -2772 5362 5888 -747 -6386 -3740 3227 5805 628 -4039 -3805 1149 4075 2509 -1451
5688 -1451 -3884 -1196 2811 4411 883 -4197 -4402 1725 6533 2947 -4752 -6073 581 6732 4133
5703 4133 -3793 -6359 -470 5612 4101 -2412 -5063 -1546 3669 3756 -333 -3810 -2909 1254 3647 2450
5719 2450 -2158 -5331 -2167 3974 5266 -383 -6131 -4014 3127 6253 755 -6285 -4445 2920 6331
5734 6331 870 -5637 -4651 1833 5712 2597 -2840 -4405 -1243 2767 4429 1037 -3257 -3657 517
5749 517 4334 2977 -2806 -5230 601 6422 4168 -3913 -7361 -1161 6742 6298 -1980 -6708 -2990
5764 -2990 3714 4837 34 -3588 -2576 1340 3478 840 -2793 -3398 -356 3927 4485 -1155 -6718
5779 -6718 -4865 3175 7241 2660 -5312 -6268 1000 6199 2257 -4461 -4335 2040 5749 1825 -4591
5794 -4591 -5518 341 5721 4450 -797 -4761 -3841 955 5045 3808 -1303 -4619 -1624 3750 4057 -1490
5810 -1490 -5411 -838 6070 5717 -2504 -7899 -3596 5095 7947 1269 -5959 -4927 904 3984 2393
5825 2393 -1617 -2772 -376 2559 2052 -1650 -4744 -2537 3949 6720 1342 -6781 -7888 371 7823
5840 7823 5331 -3191 -7129 -1435 4815 3047 -3183 -4132 953 5067 2971 -3426 -6315 -2120 3608
5855 3608 6072 2704 -3230 -6373 -2879 3908 5606 1363 -4322 -3133 2323 4512 -910 -6166 -2531
5870 -2531 5990 7297 -212 -8227 -6573 2775 8112 4292 -3107 -4989 -2160 1821 2804 336 -2136
5885 -2136 -1170 1939 2740 -592 -5168 -4981 2137 8323 4649 -5287 -9778 -3009 6463 7227 -362 -6218
5901 -6218 -2711 3590 3000 -1961 -4062 -264 4781 4644 -915 -6023 -4916 727 6146 6343 -6 -6540
5917 -6540 -5735 1568 6389 3075 -3099 -3959 2231 5440 -94 -6813 -4299 4883 9076 2541 -6808
5932 -6808 -8266 -746 6001 5663 404 -3609 -3219 -437 2307 1625 -1307 -2115 1125 3842 1802 -4946
5948 -4946 -7840 -414 8575 8371 -2093 -9591 -5798 4276 7194 1502 -4498 -2774 2436 2586 -1708
5963 -1708 -4471 -1741 3527 5789 1862 -3638 -6368 -3354 4145 8432 4052 -4924 -7747 -1051 5750
5978 5750 4754 -2232 -4709 1083 6450 1583 -6756 -7237 2031 9352 6057 -3586 -8358 -4141 2983
5993 2983 5577 2834 -1686 -3646 -1982 1253 1950 -1033 -2871 -389 4663 4767 -2989 -9271 -5009
6008 -5009 6211 10050 2016 -8023 -7708 1157 6720 2695 -3074 -2825 1894 3642 -211 -4106 -3998
6023 -3998 1314 5886 4702 -766 -6217 -6118 633 7761 6579 -2388 -7412 -3369 4323 5145 -1659 -5403
6039 -5403 355 6986 4566 -4902 -8517 -1643 7144 8219 456 -6513 -5677 -334 3778 4113 473
6054 473 -3100 -2683 1260 2499 -745 -4273 -2697 4106 7415 534 -8901 -8132 2381 9770 5293
6069 5293 -5086 -8000 -1461 5069 3639 -2521 -3413 488 3815 2024 -2726 -4751 -2051 3605 6538
6084 6538 3038 -4208 -7804 -3186 6027 7598 402 -6714 -4415 3212 5503 -793 -6079 -1922 5868
6099 5868 6118 -1497 -7792 -5095 3453 7483 3562 -3150 -5666 -2823 2140 4328 1573 -3044 -3618
6114 -3618 1226 4470 1142 -4932 -5699 2037 8554 3761 -6591 -9266 -788 7963 6826 -2251 -7275
6129 -7275 -2474 3914 3767 -1035 -3413 -1222 2670 4103 474 -3974 -4315 259 5825 5976 -1041 -7691
6145 -7691 -4914 4093 7804 2035 -5744 -4969 2786 6393 855 -6511 -4580 3662 7151 1943 -5422
6160 -5422 -6593 -279 5592 5051 -364 -4689 -4064 584 4635 2631 -3075 -4680 -34 5229 3756
6175 3756 -3829 -7534 -961 7895 6660 -3196 -8876 -3504 5161 6792 -57 -5943 -3489 2528 4223
6190 4223 942 -3083 -3319 460 4462 3511 -1614 -5749 -3470 3840 7648 2015 -6549 -6471 1899 7679
6206 7679 3505 -4794 -6374 1436 7323 3185 -4956 -6304 631 6078 4057 -2199 -5714 -2821 2744
6221 2744 4716 1659 -3354 -5061 -1197 4778 4440 -2263 -6285 -2650 5210 6308 -1632 -8246 -4095
6236 -4095 5319 7534 -196 -7151 -5342 3252 6850 1535 -4913 -4482 851 4582 3207 -1662 -4995
6251 -4995 -2477 3061 5448 1884 -4809 -5458 775 7520 4095 -4916 -7382 84 7768 5378 -3890
6266 -3890 -7824 -1301 6664 5542 -2360 -6158 -2311 3423 5222 578 -4204 -4371 597 4417 3524
6281 3524 -2255 -6312 -2883 4580 6548 -300 -7342 -5538 3393 8115 1664 -6821 -5869 2658 6894
6296 6894 2048 -5183 -5945 1153 6200 3172 -3230 -5223 -1690 3433 4875 1396 -4116 -4940 298
6311 298 5832 4159 -2691 -6465 -1238 6660 5777 -3315 -7837 -2299 6868 7030 -1655 -8082 -4038 4497
6327 4497 6604 1230 -4759 -4470 747 4476 2333 -2310 -4387 -1733 3641 5079 -156 -6530 -5108
6342 -5108 3279 7715 2917 -6218 -7386 645 7941 4152 -4757 -6651 106 6033 3917 -3296 -5917
6357 -5917 -1040 5131 5183 -383 -5140 -4775 1307 5782 4165 -2414 -6209 -2355 4818 6273 -635 -6983
6373 -6983 -3305 5710 7384 -1076 -8068 -4609 4997 8374 1337 -6749 -5941 1559 5734 3446 -2501
6388 -2501 -4797 -1442 3416 3727 -37 -4180 -3774 2298 6749 2389 -5817 -7398 299 7892 5549
6403 5549 -4063 -8953 -2143 6584 5875 -2090 -6609 -2002 4612 4896 -1288 -6079 -3531 3196 5894
6418 5894 2766 -3730 -5906 -2219 5248 6563 -5 -5969 -4527 3447 7161 1166 -6578 -4987 3787
6433 3787 7657 1546 -6483 -6573 1893 7870 4167 -4000 -6293 -1686 4069 4669 209 -4372 -3540 1961
6449 1961 4894 2038 -3996 -5848 -93 7107 5326 -4050 -8862 -2707 6708 7384 -1296 -8327 -4288
6464 -4288 4579 6313 -112 -5448 -3419 2874 5560 1543 -4487 -4897 60 5422 5008 -959 -6387
6479 -6387 -4487 3345 7287 2434 -5415 -6315 1524 7750 3155 -5653 -6951 1214 7806 4286 -4533
6494 -4533 -7406 -1112 5921 5391 -1382 -5422 -3648 1904 4888 2319 -3461 -4905 -799 5253 4618
6509 4618 -2403 -7734 -3230 5897 7279 -1212 -8556 -5056 4532 7988 1166 -7370 -5189 2697 6369
6524 6369 1827 -4488 -4825 211 5077 3572 -1763 -5354 -2998 3060 6219 2341 -5223 -6160 923
6539 923 7401 4927 -4326 -8130 -554 8091 5667 -3916 -7785 -1565 6449 6002 -1770 -7041 -3096
6554 -3096 3843 5363 761 -4168 -4862 114 5369 4253 -1734 -5942 -3352 3889 7025 403 -7605
6569 -7605 -5733 3489 8146 1537 -6953 -6560 2608 7729 2681 -5588 -6499 644 5948 4185 -2465
6584 -2465 -5702 -2636 3288 5270 1936 -3644 -4814 86 5987 4560 -3167 -6893 -1158 7013 6884
6599 6884 -2533 -8862 -3218 6571 7739 -767 -7662 -4270 3953 6307 807 -5020 -4099 1262 4855
6614 4855 3107 -2535 -5709 -2292 4480 6448 335 -6504 -6550 2313 8089 3533 -5662 -7276 924
6629 924 7530 3556 -4699 -7034 370 7361 4524 -3918 -7027 -2261 4340 5984 1297 -4780 -5379
6644 -5379 72 5070 4366 -1659 -5874 -1854 5352 5565 -2298 -7968 -3278 6476 8734 -155 -8897
6659 -8897 -6231 3977 8497 2488 -5063 -5405 412 4765 2737 -2295 -4277 -684 3645 4493 -684
6674 -684 -6249 -5287 2649 8066 3731 -5548 -8900 -1560 7964 6363 -3453 -7587 -1539 5957 4879
6689 4879 -3425 -7246 -1068 6170 6062 -1372 -6492 -5136 1870 6442 4695 -2356 -6307 -3056 3244
6704 3244 6116 527 -5655 -3842 3985 6648 113 -7901 -5859 4496 9600 2949 -7466 -7873 379
6719 379 6854 5190 -2029 -5074 -1816 2964 2939 -407 -3729 -2760 2476 5697 2106 -6072 -8029 -626
6735 -626 8345 7505 -2511 -9845 -4682 5723 7262 -604 -6510 -2747 4930 5461 -1896 -6844 -3023
6750 -3023 4586 6874 1701 -4679 -6763 -2089 5282 6824 1464 -5113 -5639 1045 6581 2952 -5273
6765 -5273 -5202 2594 8070 2646 -7205 -8266 1519 10248 6410 -4512 -8320 -2660 4333 5430 893
6780 893 -3867 -3061 1429 3193 949 -3214 -4361 519 6631 4935 -3364 -9398 -4375 6862 9575
6795 9575 1204 -8322 -6818 2837 6995 1542 -5147 -3854 3029 5791 345 -5573 -5245 1512 6245
6810 6245 4605 -1160 -6808 -5378 1826 7214 4700 -3130 -6709 -1135 5492 4625 -3940 -6535 987
6825 987 8073 5207 -5560 -9655 -2132 8393 8011 -909 -6976 -5207 1620 4825 2586 -2155 -3201
6840 -3201 -457 2893 2640 -1936 -5790 -2413 5822 7854 -51 -9156 -8013 3085 10181 4439 -6444
6855 -6444 -7697 514 6240 2768 -4298 -4787 1664 5997 2331 -4006 -6140 -1912 4257 6767 2476
6870 2476 -4942 -7676 -1892 6331 6808 -981 -6946 -3240 5143 5532 -2624 -7647 -1962 7194 7972 -2150
6886 -2150 -9389 -4991 4629 8204 2718 -4157 -5690 -1259 3456 3683 -257 -3465 -2369 2585 4550
6901 4550 -102 -6792 -5782 3503 9422 3724 -7303 -9864 -627 9119 6527 -3984 -7634 -1250
6915 -1250 5182 3841 -2475 -5231 -538 4796 5017 -823 -5710 -5069 927 7144 5558 -2198 -7805
6930 -7805 -4793 4275 7783 1161 -6408 -5043 4210 6897 -439 -7619 -4822 4586 8704 1982 -7383
6945 -7383 -7185 591 6711 4833 -1403 -5528 -3098 2246 4414 1103 -3904 -4165 915 6249 2779
6960 2779 -5492 -7972 284 8635 6656 -3770 -9780 -3417 6501 7628 -919 -6626 -3412 3384 5069
6975 5069 -230 -5024 -3227 2262 5469 3075 -3077 -6854 -2900 5188 7602 1119 -6785 -6387 2227
6990 2227 8394 3026 -6091 -6371 2271 7833 2362 -6181 -6872 1393 8436 4829 -3913 -6875 -1991
7005 -1991 3807 5135 962 -4432 -4720 226 4996 3368 -2737 -5830 -1419 6347 5958 -2854 -8859
7020 -8859 -3395 6415 8020 -323 -8483 -5689 4051 7225 1231 -5651 -4709 1483 5584 2426 -3233
7035 -3233 -5213 -961 4616 5242 238 -5839 -5301 2670 7857 3420 -5297 -7655 265 8216 4829
7050 4829 -4729 -7551 -27 7145 5225 -3399 -7545 -2082 5604 5825 -802 -5531 -4571 1594 5561
7065 5561 3220 -3096 -5574 -1904 4328 5558 -1424 -7323 -4251 4771 7664 130 -8011 -5828 3963
7080 3963 8405 1942 -6762 -6109 1510 6778 3447 -3681 -5618 -1075 4815 4662 -841 -5216 -3883
7095 -3883 2044 6340 3361 -4326 -6858 -349 6960 5739 -3500 -8343 -2203 7241 7009 -2667 -7914
7110 -7914 -3308 4957 6784 -81 -6335 -4486 2634 5872 2408 -3337 -5350 -906 4593 4931 -865
7125 -865 -6963 -4634 3587 7642 1874 -7148 -7184 1795 7865 3361 -5729 -7392 375 7584 4346 -4498
7141 -4498 -7161 -910 5384 5033 -1082 -6303 -3845 2472 5700 2795 -3261 -5763 -1421 5510 5623
7156 5623 -2276 -7267 -2784 5811 7162 -864 -8217 -4587 5475 8576 1048 -6864 -5872 2146 6610
7171 6610 2911 -4038 -5395 -178 4623 3729 -1268 -5657 -3218 3807 6466 1660 -5513 -6716 744
7186 744 8033 4797 -4878 -8110 -780 6708 5353 -3126 -7346 -1656 5852 5659 -2097 -6630 -3586
7201 -3586 3609 6352 1987 -4271 -5965 -523 5128 5044 -905 -6425 -4229 4364 6763 309 -6770
7216 -6770 -4920 3699 8208 1549 -7627 -6895 2286 7925 3784 -4438 -6691 -713 5205 4605 -1279
7231 -1279 -4731 -2600 2085 5108 1456 -4885 -5595 946 6991 4477 -4206 -8140 -2669 7002 7108
7246 7108 -1791 -7656 -3666 4646 6397 -357 -6647 -3763 3692 6149 1140 -4796 -5466 135 5758
7261 5758 5244 -1911 -6656 -3538 3382 6949 1852 -5949 -5697 2143 7576 2514 -5679 -6561 1469 8191
7277 8191 4443 -5308 -7651 -694 6181 5726 -1101 -6310 -3421 2704 5211 1320 -3716 -4645 161
7292 161 5284 3984 -3326 -7009 -1939 5943 6866 -1089 -8301 -5220 4844 8147 870 -6575 -5503
7307 -5503 2075 6618 1854 -5268 -5078 924 5471 3298 -2311 -6102 -2772 4062 6289 1417 -5483
7322 -5483 -5699 1008 6926 4477 -4117 -7048 -149 6941 5115 -3918 -7449 -1425 6934 6418 -1840
7337 -1840 -7192 -3537 4103 6399 1684 -4689 -5309 227 5215 3836 -2057 -5808 -2583 4724 6004
7352 6004 -568 -7468 -5119 4055 8074 1656 -6936 -7203 2070 7646 3092 -4874 -6520 1 6036
7367 6036 3832 -2924 -5206 -1495 3634 5183 569 -4713 -5093 1043 6396 4194 -3566 -6995 -1917
7382 -1917 6357 6350 -2406 -7827 -2603 5734 6799 -554 -7196 -4048 4228 6815 930 -5403 -4759 1100
7398 1100 5671 3329 -2644 -5586 -2052 3813 5563 398 -6154 -5373 2479 7288 2721 -6074 -6868
7413 -6868 1016 7810 4481 -4966 -7540 -318 6732 4893 -2138 -6830 -2594 4495 5559 -65 -4816
7428 -4816 -4141 1017 5433 3639 -2821 -6092 -1635 5501 5981 -1393 -7421 -3948 5137 7763 643
7443 643 -7637 -5366 3561 7514 2156 -5730 -5235 1136 5653 2818 -2996 -5140 -1366 4195 5041 -327
7459 -327 -5290 -4592 1479 6937 3691 -4763 -7538 -472 6862 5156 -3306 -7506 -1800 6393 5907 -2848
7475 -2848 -7569 -2201 4889 5914 -251 -5984 -4388 1986 5733 2939 -2642 -5148 -2155 4555 5249
7490 5249 -441 -6100 -3793 3563 7260 1274 -7046 -6130 2905 8488 3212 -5956 -7202 124 6943
7505 6943 4486 -3110 -5734 -1011 4002 4236 -310 -4759 -3234 2336 5897 2119 -4163 -6593 -940
7520 -940 6722 6416 -2253 -8124 -3547 5155 6292 -479 -7160 -3681 4395 6074 -729 -6520 -4157
7535 -4157 2988 6746 2610 -4321 -5784 -1117 4105 5265 585 -5404 -4475 1889 6043 1935 -4826
7550 -4826 -5602 1777 7602 3240 -5585 -8083 264 7878 5633 -2968 -7558 -2696 4802 5520 -218
7565 -218 -4729 -2926 1784 4306 1761 -3448 -5037 43 5547 5020 -2477 -8035 -4182 5119 8149
7580 8149 650 -7052 -5781 2568 6804 1705 -5576 -5144 2510 6053 1627 -4770 -5648 151 5526
7595 5526 4928 -1146 -5895 -3925 1644 6502 3564 -3394 -6087 -233 5794 3730 -3697 -6538 -620
7610 -620 7353 5778 -3916 -8604 -2637 6392 7362 270 -6533 -4680 2172 4932 1939 -2675 -3811
7625 -3811 -434 3990 3293 -1746 -5974 -2428 4734 7077 690 -7567 -6815 2541 8662 3708 -5233
7640 -5233 -6771 190 6483 3263 -3833 -5426 711 5829 3285 -2444 -6106 -3082 3791 6502 2043
7655 2043 -4272 -6154 -1177 5251 5675 -1404 -6466 -2467 4600 5535 -1626 -7265 -2646 5903 7240
7670 7240 -869 -7790 -4972 3112 7443 2664 -4205 -5256 -533 3476 3616 -792 -3971 -2301 2705
7685 2705 5004 196 -5740 -5031 2391 8067 4167 -6107 -8609 -824 7698 5787 -2695 -6908 -1902
7700 -1902 4971 4612 -2294 -5700 -1711 4007 4471 6 -5177 -4705 618 6207 4736 -1813 -6428 -3902
7716 -3902 3700 6513 1037 -5754 -3955 3302 6747 709 -6825 -5188 3645 8232 2383 -5581 -6669
7731 -6669 121 5928 4717 -1448 -5107 -2572 2099 4170 1406 -3619 -4044 940 5564 3052 -4193
7746 -4193 -7427 -747 7587 6419 -2788 -8671 -3320 5061 6754 -438 -6279 -3619 3663 5095 -183
7761 -183 -4802 -3579 2044 5317 2911 -2829 -5939 -2022 4090 6360 1314 -5983 -6031 1721 7025 2758
7777 2758 -5019 -5926 1405 7225 3467 -5536 -7036 732 7233 4921 -2989 -6755 -2766 3776 5190
7792 5190 900 -4064 -4028 -265 4230 2904 -2370 -5355 -1542 5304 5101 -1902 -7651 -3801 5376 7841
7808 7841 170 -7277 -5253 2979 6573 1959 -4873 -5040 1547 4640 2312 -2956 -4697 -1122 4304
7823 4304 5076 -1 -5441 -4608 1614 6576 3920 -3793 -6793 -28 6740 4545 -3262 -6715 -929
7838 -929 6671 5444 -3005 -6985 -2283 4580 5766 284 -5335 -4635 1366 4948 2918 -2199 -4715
7853 -4715 -2045 3862 5072 -576 -5859 -3717 3767 6917 1359 -6515 -6415 2625 7562 2652 -4985
7868 -4985 -6082 330 5978 3745 -3218 -5318 -769 3888 3964 -490 -4473 -3917 2128 5651 2692 -3955
7884 -3955 -6153 -803 5892 5431 -2251 -7220 -2313 5240 5927 -1324 -6724 -3179 4624 6214 -173
7899 -173 -5814 -4176 2165 5824 2732 -3180 -5355 -1085 4149 4454 -277 -4972 -3736 2895 6151
7914 6151 1456 -5281 -5802 1478 6855 3487 -4892 -7220 42 6693 4577 -3003 -6305 -1526 4497
7929 4497 4796 -769 -5073 -3028 2154 4677 1774 -3119 -5294 -664 4941 4603 -1435 -6205 -3282
7944 -3282 4481 6786 -214 -6634 -4189 3431 6815 1466 -6114 -5224 1927 6272 2629 -3366 -5112
7959 -5112 -723 4199 4077 -1047 -5059 -2870 2472 5290 1853 -4251 -5405 589 6305 3751 -3888
7974 -3888 -7152 -1166 5794 5342 -2241 -6772 -2096 4645 5526 -798 -5689 -3599 2911 5701 1545
7989 1545 -3702 -4677 -333 4614 4276 -1243 -5426 -2767 3671 5835 802 -5613 -4673 3042 7205 1904
8005 1904 -5471 -5994 1234 6820 3610 -3583 -5782 -420 4839 3938 -1195 -4675 -2589 2496 4621
8020 4621 1154 -3991 -4570 427 5354 3967 -2944 -6750 -1654 5525 5596 -1243 -6740 -3694 3988 5945
8036 5945 -198 -5651 -3740 2771 5516 1879 -4151 -4887 440 4993 3853 -1696 -5286 -2882 3314
8051 3314 5222 882 -4770 -4716 1707 6115 2728 -4605 -6103 1000 6759 3756 -3440 -6142 -1025
8066 -1025 5604 5157 -1315 -5620 -2994 2795 4516 1628 -3797 -4331 561 4664 3314 -2264 -5548
8081 -5548 -1960 4645 5616 -1081 -6475 -3795 3781 6527 986 -5340 -4981 2335 5845 1982 -4150
8096 -4150 -4728 193 4841 3573 -2341 -5541 -1817 3273 4943 1156 -4370 -5069 943 5889 3221
8111 3221 -3338 -5652 -333 5465 4607 -2983 -6337 -1479 5198 5032 -1183 -5686 -3248 3459 5345
8126 5345 1133 -3975 -4479 507 4315 3382 -2164 -4760 -1379 4082 4726 -498 -5876 -4061 3329 6839
8142 6839 1487 -5825 -5592 1599 6644 3161 -4263 -5564 118 5075 3316 -1953 -4824 -1877 3230
8157 3230 4618 326 -4301 -3881 1193 5110 3546 -2740 -6213 -1119 5171 4790 -1814 -6197 -2563
8172 -2563 4878 5699 -566 -6220 -3277 3697 5499 825 -4462 -4505 946 4940 3161 -1931 -4415 -1806
8188 -1806 2968 4751 214
8191B14
$$ Imaginary data points
##PAGE= N=2
##DATA TABLE= (X++(I..I)), XYDATA
0 0 0 0 0 8 -8 0 -16 16 -11 23 -24 32 -40 48 -57 67 -81 99 -113 137 -158 179 -214 245 -273 322 -363 409
28 409 -467 526 -590 662 -745 829 -920 1029 -1147 1265 -1405 1563 -1724 1909 -2118 2338
44 2338 -2595 2886 -3205 3578 -4007 4507 -5109 5833 -6735 7891 -9434 11606 -14880 20393
58 20393 -31414 62018 -322593 -1129014 -455827 560415 748128 66978 -395126 -228706
68 -228706 118582 36425 -241573 -235148 111594 358629 291452 -43170 -411111 -545024 -207793
79 -207793 420769 755438 304564 -553693 -828315 -152548 584481 473095 -178549 -373958
89 -373958 89059 408935 -4011 -597011 -442896 377623 825968 349620 -459511 -724314
99 -724314 -280510 332676 548910 296369 -107237 -340203 -263694 30539 213858 74366
109 74366 -122271 10845 321275 253753 -315157 -713111 -265401 647571 887077 82509
119 82509 -782009 -692994 102901 579980 299188 -188860 -226735 74013 143125 -130739 -313665
130 -313665 -129428 228243 412423 242417 -187343 -537370 -448148 111540 655755 549428
140 549428 -181889 -689641 -358598 318724 442718 -36743 -334713 -2113 427342 216845
150 216845 -432736 -605952 943 645942 574348 -71907 -562032 -453567 33103 385307
160 385307 356748 71083 -208610 -245931 -20500 161500 34464 -183746 -74824 305689
170 305689 406438 -68988 -627452 -503496 267036 763046 379157 -382125 -623533 -175268
180 -175268 330642 322717 -40163 -198841 703 179962 54803 -214239 -295644 -52865
190 -52865 319042 434542 104963 -394261 -550801 -140002 453708 562845 44464 -460882
200 -460882 -351585 140973 330633 21469 -281859 -97817 334105 355599 -146950 -535157
210 -535157 -297509 289078 561543 250535 -277152 -469532 -192227 206060 342060 144766
220 144766 -151754 -222757 2417 191741 43997 -243011 -215671 184063 463433 177228
230 177228 -414950 -573791 -53299 518219 465304 -88235 -459763 -271880 155253 275670
240 275670 21545 -187656 -81539 147398 182365 -39475 -287950 -256699 92587 406681
250 406681 306800 -151892 -489730 -302647 229856 479868 155244 -298202 -311741 59941
260 59941 283377 72643 -252650 -205919 182453 381438 96707 -329178 -390624 -19920
270 -19920 378338 376095 -14388 -355484 -294551 60175 307776 188300 -138349 -249028 3821
281 3821 257304 130610 -224538 -321746 15985 396942 317139 -172220 -474443 -220226 261836
292 261836 405632 91478 -278040 -282428 30965 239476 107102 -146956 -190010 24063
302 24063 236253 163348 -156068 -340861 -123306 271522 377930 48187 -352688 -344144 71563
313 71563 373349 197624 -188914 -285139 -5464 259755 158445 -171768 -275938 60
323 60 297097 241115 -97415 -331584 -198023 163912 346790 141789 -206992 -302189 -48274
334 -48274 252548 232813 -89044 -285099 -81095 246431 245727 -95877 -341928 -157831 247119
345 247119 357639 23302 -331788 -280126 81159 312448 168394 -154291 -266602 -54039
355 -54039 198443 186243 -56890 -238603 -127912 168431 278664 25240 -291047 -259911
365 -259911 99048 351475 177765 -218714 -338135 -30983 293042 226938 -108669 -276587
375 -276587 -84737 209628 229125 -45568 -255666 -142093 142522 262431 84416 -198665
385 -198665 -259185 -8026 262222 220671 -84852 -286988 -134767 194412 277543 -8432
395 -8432 -285802 -182445 159768 294043 49581 -265622 -249015 83172 302814 138406
405 138406 -183544 -269444 -42498 218992 210470 -51484 -245308 -140787 127407 239527
415 239527 60780 -208173 -233360 45598 283119 161460 -173012 -294589 -44365 269229
425 269229 245828 -94009 -307122 -118865 212204 262153 -8865 -251896 -173806 118571
435 118571 256030 78711 -176779 -208662 2958 213534 180299 -72173 -246256 -114854
445 -114854 167260 250326 22327 -245529 -210465 103773 292990 98875 -223340 -254771
455 -254771 33073 270340 160881 -152774 -266696 -43347 215853 190503 -61042 -229898
465 -229898 -127855 122141 224615 51667 -188379 -206933 20220 231677 166116 -118669
475 -118669 -268403 -73290 221449 232382 -53067 -270469 -141473 175162 269633 15298
485 15298 -249188 -184675 107711 257977 96045 -171527 -219848 2851 215837 167238 -68852
496 -68852 -214729 -106337 140052 228853 33203 -211720 -191236 75423 257486 119640
506 119640 -179711 -258175 47 259662 179530 -127103 -265945 -71589 204083 212858 -49526
517 -49526 -240755 -127937 124482 207237 41887 -171005 -186046 17184 198562 135942 -95405
528 -95405 -220718 -83433 165717 216685 -18079 -244170 -157941 133859 255791 51984
538 51984 -221214 -213502 71067 261063 113798 -163622 -218389 -4480 203783 160476 -72601
549 -72601 -206586 -81633 140613 195598 23474 -182491 -176560 55810 237717 127551 -145971
560 -145971 -239924 -34486 217992 196558 -80235 -252389 -90936 182699 207491 -34489
570 -34489 -229074 -135442 125565 223901 40186 -186939 -186986 19782 192368 142523 -74530
581 -74530 -207526 -93868 129476 187067 8937 -187968 -151630 92528 230015 60804
591 60804 -203167 -210740 54003 258480 144709 -149392 -252627 -39238 206183 181874 -49308
602 -49308 -190218 -89071 113002 167381 10994 -155394 -123771 67302 193031 97427 -130316
613 -130316 -221222 -40451 204878 210169 -35592 -234521 -145679 119129 222909 32539 -188433
624 -188433 -145106 89787 197803 41727 -178602 -181214 46531 223873 133311 -110255 -227638
635 -227638 -95552 137829 211639 39221 -170872 -162632 39987 176777 77422 -130103 -166626
646 -166626 37822 215997 112181 -152468 -238673 -30500 225072 219682 -38922 -232205
656 -232205 -139944 94385 187998 65550 -104931 -124224 18595 135678 68673 -100385 -152198
667 -152198 -3293 185817 174739 -63200 -253542 -147432 138477 259403 77040 -180267
677 -180267 -204390 16242 181847 84395 -114629 -136520 33521 161029 74077 -129577 -199420
688 -199420 -35823 178907 199456 1819 -206443 -200011 22492 210337 142669 -83415 -180173
699 -180173 -44035 131745 107304 -86770 -172410 -3567 203938 160478 -96235 -254457
709 -254457 -122885 148917 250371 77605 -151386 -188419 -31725 125061 125488 -10273 -107948
720 -107948 -41095 96107 102274 -55862 -181119 -81919 164278 253288 33345 -248596 -243483
731 -243483 39560 255566 164729 -91759 -192422 -46842 111724 75214 -65010 -97449
741 -97449 17202 129078 93605 -69858 -186712 -117134 84471 220379 137200 -104932 -251124
752 -251124 -119366 139081 208821 25030 -154416 -98886 92704 129414 -58621 -194239
762 -194239 -53179 196141 221643 -19917 -243091 -196533 53564 223112 152631 -40793
772 -40793 -152831 -106664 25699 106842 53653 -53763 -57792 55500 118434 2461 -179699
783 -179699 -170506 84972 291820 162170 -168348 -300371 -88660 191328 213663 350
793 350 -147109 -70149 63492 53945 -53948 -90073 309 117042 125655 -2459 -154829 -179592
805 -179592 -28680 179748 229901 30703 -215942 -216162 25374 199144 102442 -100979 -116688
816 -116688 64041 147953 -23362 -211211 -125338 145496 261421 82138 -177206 -231736
826 -231736 -53761 138713 168984 61150 -66197 -117324 -57054 47280 69759 -10609 -60670
837 -60670 19770 131218 77571 -140895 -246304 -40060 260467 270252 -36506 -285214 -191957
848 -191957 90332 205336 60301 -95912 -63678 48353 48575 -53469 -108200 -38204 90073
859 90073 147704 69208 -89631 -197030 -134918 80965 244257 148857 -116754 -236643 -76300
870 -76300 138674 132209 -51932 -120061 36411 165968 37735 -191345 -196844 46938 246380
881 246380 173978 -69911 -209935 -130796 38530 133972 112646 14877 -80058 -82724 2529
892 2529 57023 3587 -68797 -16703 130029 150893 -58700 -262559 -161731 156400 301350
903 301350 98080 -193941 -227932 -10065 151157 82259 -52853 -50377 44602 63563 -25580
914 -25580 -110402 -87921 28159 132794 132329 9273 -155101 -203115 -39248 190128 215208
925 215208 -3615 -196712 -134340 72615 132573 -19930 -127636 -4027 171069 116353
935 116353 -122746 -234221 -70992 173208 220894 42875 -141517 -158443 -44286 72658
945 72658 112622 59084 -35350 -70658 -12322 46310 8112 -80070 -63244 95221 193829 45819
957 45819 -205874 -234838 18206 249657 185465 -74024 -203526 -79175 87928 84212 -26363
968 -26363 -56035 22548 81021 30960 -76278 -121639 -50649 78558 154773 96495 -76185
979 -76185 -204612 -124488 100061 208562 73851 -126096 -140399 24271 118159 6130 -126433
990 -126433 -55563 134081 168496 -19646 -201170 -155260 61268 198359 122906 -50146 -138570
1001 -138570 -92605 18092 93714 70543 -17000 -59223 -6219 59252 25798 -86386 -113134
1012 -113134 35176 192828 128366 -112324 -236080 -85987 153839 199542 18740 -143717
1022 -143717 -103159 37926 77647 -2807 -63879 -20959 66121 81715 -6655 -109040 -112761
1033 -112761 -2513 129258 148927 7267 -161096 -157849 21489 162469 102508 -66833
1043 -66833 -121818 -1745 105416 35377 -106831 -100581 61654 169087 75177 -114038 -177777
1054 -177777 -44860 125625 151725 32310 -93941 -112107 -20143 78463 74046 -17106 -68820
1065 -68820 -9603 79518 63630 -67061 -144389 -34445 148553 166684 -17265 -184143 -138087
1076 -138087 57819 165392 71099 -82481 -103737 -979 71521 31773 -53690 -68908 13906
1087 13906 95937 68367 -50330 -133262 -80672 70936 160022 70660 -104155 -156033 -26920
1098 -26920 117203 104513 -33398 -107938 -21669 94723 68272 -65216 -118929 -16010 120174
1109 120174 123866 -15551 -138452 -104590 38841 131154 84871 -41331 -110811 -48366 66384
1120 66384 86478 -8378 -87103 -39491 78296 105009 -17229 -140782 -92352 80097 160922
1131 160922 51886 -114227 -142717 -8485 117878 89276 -37165 -96113 -32854 59051 65996
1142 65996 -19378 -90225 -48514 63822 108874 22124 -105714 -124187 4604 136003 105435
1153 105435 -52326 -138344 -54258 85055 105404 -10856 -103711 -48393 74371 94826 -10826
1164 -10826 -104730 -71749 51905 122244 53140 -75789 -115861 -25951 90942 105753 391
1175 391 -101650 -72199 50716 103447 17871 -92383 -79508 47027 122809 37532 -104190
1186 -104190 -116922 15283 125426 84516 -52915 -121600 -45381 74485 91938 -268 -83016
1197 -83016 -64102 31116 87931 30766 -76317 -94103 7826 107812 78428 -55549 -132614
1208 -132614 -46051 100403 118293 -12191 -120400 -74062 60891 111789 17080 -94869 -77149
1219 -77149 38801 101540 39997 -67005 -93377 -7427 92278 85145 -20053 -100106 -62975
1230 -62975 52256 110297 33744 -87128 -93810 23415 111158 56006 -71669 -107987 -1057
1241 -1057 111103 78398 -53664 -113653 -32549 82704 94447 -7680 -97137 -66760 39559
1252 39559 91277 34099 -63219 -88679 -6956 88257 73272 -39336 -107702 -42133 78972
1263 78972 104311 -6957 -115219 -75565 62527 116458 20999 -97244 -90526 29204 109579
1274 109579 49655 -67478 -93157 -5671 82569 72917 -20518 -89018 -49215 52869 93250
1285 93250 22384 -77443 -85744 17163 107213 63624 -65274 -110920 -13871 102057 89117
1296 89117 -37377 -115769 -42892 82120 95523 -11301 -96860 -60580 45634 91643 23439
1307 23439 -72238 -79468 5003 80571 62315 -32106 -95860 -45127 64077 93792 3639 -93801
1319 -93801 -76153 39674 106619 32377 -87503 -92352 23152 105392 52945 -65329 -100685
1330 -100685 -9563 90189 75446 -27005 -88872 -43797 49923 85588 20433 -69159 -72701 15853
1342 15853 88587 55209 -49856 -97980 -18731 93242 88448 -30948 -110840 -49553 74851
1353 74851 104130 1093 -100630 -69531 46476 95331 24030 -71081 -76788 9336 81226
1364 81226 52222 -40034 -83911 -31647 57955 81888 5413 -85546 -74213 31855 98119 39968
1376 39968 -71526 -94860 4556 100945 63659 -57102 -101376 -15311 86369 78359 -26212
1387 -26212 -94455 -42514 59327 83675 10252 -68915 -65171 16369 81978 49907 -43813 -83788
1399 -83788 -19297 73167 80687 -13569 -95890 -54160 61895 99312 10064 -90081 -74142 36949
1411 36949 100631 34297 -73889 -84043 9473 84883 55887 -38126 -85675 -30629 59537 75312
1423 75312 696 -74304 -63074 25039 85805 37875 -64210 -87090 1356 90379 65081 -46665
1435 -46665 -103285 -27960 83966 86435 -19426 -94431 -50366 51055 85527 14373 -69556
1446 -69556 -61882 21330 74260 39124 -42654 -75856 -15800 70889 75051 -13282 -87697 -57191
1458 -57191 45970 97104 27271 -77967 -80370 21528 90669 40693 -60541 -81474 4613
1469 4613 85331 54309 -46579 -87895 -24666 64254 78242 1254 -78325 -66176 20558 77917
1481 77917 41215 -44929 -76967 -11604 71150 58880 -37115 -88937 -25133 76355 85332 -16542
1493 -16542 -102606 -61290 54566 98060 24407 -69177 -73457 7275 71799 44382 -34332 -62147
1505 -62147 -10220 56874 57357 -16063 -78914 -46499 53078 96041 25127 -78434 -90390 7192
1517 7192 96417 63711 -44738 -84827 -13382 67159 53357 -31398 -74558 -17503 65729 66522
1529 66522 -15441 -81122 -58199 28617 86080 47633 -45636 -85998 -28773 55765 68364 -5237
1541 -5237 -71516 -39625 49207 68851 -11871 -85822 -50492 56449 100645 20959 -86506 -88756
1553 -88756 10316 87433 61306 -24616 -70851 -30801 39484 52605 -906 -48772 -30612 36275
1565 36275 69477 13353 -74967 -78182 20845 105188 69615 -47975 -108316 -37770 71611 82611
1577 82611 -5651 -68972 -34047 39524 51580 -11267 -64325 -33456 44410 73551 19823 -61214
1589 -61214 -84982 -18841 72731 85196 1796 -81543 -68413 20679 74681 25154 -56330 -52134
1601 -52134 32787 73556 7134 -81566 -72620 30914 103979 54969 -54479 -95202 -32552 52505
1613 52505 73242 20151 -42462 -47319 2979 41308 21393 -30613 -43732 12936 75368 47417
1625 47417 -56157 -104268 -25130 92939 106459 -3573 -102512 -72752 36155 79199 19251
1636 19251 -46642 -35318 24233 45571 -1919 -56215 -45176 21388 70902 51186 -26107 -89838
1648 -89838 -64341 34222 97374 50945 -51387 -87696 -16748 63867 44848 -39907 -60006 18473
1660 18473 79893 31293 -70545 -93730 -2510 93813 81596 -14511 -80475 -59568 10643 58882
1672 58882 45758 -7750 -40039 -19691 22741 30809 -13715 -51782 -12412 70376 78970 -21029
1684 -21029 -111735 -72224 57828 121959 41930 -76507 -86652 3118 62188 28618 -30066
1695 -30066 -31681 17628 43462 6767 -47273 -54622 -5664 54736 70490 14892 -70353 -91347
1707 -91347 -12928 81183 81777 -12085 -83262 -42882 46479 53198 -26963 -66714 -141 81374
1719 81374 59664 -47365 -104790 -38924 68963 93481 22782 -53748 -66785 -19851 34646
1730 34646 48679 15028 -24559 -25798 10832 33835 -1198 -55203 -37781 52162 97868 22375
1742 22375 -92676 -104443 8721 108721 75119 -37566 -82116 -22280 41860 31724 -19535
1753 -19535 -33074 8232 44109 24098 -29703 -58949 -35528 26536 75088 52367 -34463 -94599
1765 -94599 -53965 45895 88571 23699 -62608 -55144 26893 55617 -10189 -69024 -26592 65589
1777 65589 83167 -5933 -93169 -71630 25678 84215 53412 -17255 -58999 -40223 10546 41313
1789 41313 25845 -12940 -26755 5070 39677 14151 -51649 -61715 20354 97872 63030 -53569
1801 -53569 -111560 -37340 75056 87024 -542 -64443 -36600 24062 33460 -9689 -37043 -8573
1813 -8573 36809 41286 -1816 -49979 -58173 -8315 61154 73645 4293 -75809 -74124 10503 76420
1826 76420 42589 -40393 -55434 11953 55560 8297 -61500 -50955 35440 87742 33603 -60522
1838 -60522 -82159 -15537 56912 65819 13965 -41317 -46967 -5241 33689 29494 -9042 -31444
1850 -31444 -830 45207 32778 -39335 -75033 -13339 77840 83932 -11305 -94200 -63383 36665
1862 36665 78534 23520 -43012 -42049 8658 35442 5252 -35894 -29758 16618 48341 28909
1874 28909 -27415 -66426 -39476 35616 76927 32691 -50059 -75185 -13478 57845 47748 -23946
1886 -23946 -52742 -1327 51731 28735 -41597 -64022 -1909 69290 60019 -17109 -70025 -45657
1898 -45657 21920 61681 36731 -21020 -46974 -16917 28698 34509 -5462 -39736 -13780 44004
1910 44004 50580 -15520 -72567 -42786 44679 84500 24045 -62771 -70098 3429 59614 37086
1922 37086 -22451 -43471 -7034 34237 23975 -22159 -43806 -12843 37950 51358 4241 -57758
1934 -57758 -59477 7622 67429 48452 -25972 -67520 -26099 42863 48385 -12250 -50207 -15762
1946 -15762 41874 44240 -14379 -60343 -32013 37669 64137 19019 -43471 -56617 -8507 47328
1958 47328 48091 -4025 -45415 -27436 24108 44039 3755 -45248 -31940 32041 60812 10815
1970 10815 -56919 -57271 12923 68856 41919 -32617 -61524 -17258 38757 41469 -4488 -40832
1982 -40832 -23084 23656 38148 1673 -42014 -38531 13239 56222 32363 -36634 -65535 -16523
1994 -16523 51242 55664 -7967 -59508 -33671 32692 50410 -48 -46840 -30293 26312 50853
2006 50853 11369 -43420 -45834 6830 50917 38646 -14865 -52293 -28217 30339 52094 10864
2018 10864 -40855 -38948 14807 51771 20513 -41029 -48289 10519 58112 32856 -33257 -58593
2030 -58593 -12326 47966 46949 -9188 -48698 -29175 20836 41932 11633 -33833 -37835 5412
2042 5412 41961 26432 -25664 -51647 -14148 45245 48962 -11460 -59553 -33455 32772 56562
2054 56562 7327 -50219 -41097 20092 50912 15622 -36314 -40901 5076 45213 30664 -20030
2066 -20030 -45203 -16850 30825 45536 7284 -41066 -39245 13449 51268 25614 -32354 -49414
2078 -49414 -1372 52071 38423 -25949 -55696 -12779 45243 45111 -10181 -51767 -27423 28552
2090 28552 45632 6580 -36850 -36358 5383 40278 25762 -22019 -45028 -14293 34062 41634
2102 41634 -3691 -48741 -34337 25495 52533 10531 -45062 -43470 13231 53017 23366 -36045
2114 -36045 -47520 1524 45563 32219 -17850 -44302 -17016 30324 40492 3728 -35521 -32075
2126 -32075 10589 43882 24482 -27249 -45108 -3994 45437 38983 -17065 -53109 -20671 40839
2138 40839 50046 -5185 -50691 -30367 25620 47628 9521 -38498 -36344 9977 40245 20515
2150 20515 -22730 -40533 -11487 32438 37563 -4242 -42957 -32217 17674 47171 16872 -38038
2162 -38038 -45166 5895 48283 26191 -29224 -47858 -4205 44559 35317 -19103 -46694 -16259
2174 -16259 31274 40971 2688 -36623 -31608 11385 39968 21364 -21008 -38326 -7483 36423
2186 36423 36522 -11020 -45120 -20416 33080 47139 1645 -47481 -35022 23183 50442 13686
2198 13686 -36770 -39072 5696 41047 24122 -22321 -38226 -8129 29921 31498 -5081 -38582
2210 -38582 -27455 18007 42375 14001 -33587 -42635 832 44634 31513 -24559 -49071 -9892
2222 -9892 40063 37182 -13880 -46275 -19367 31695 40667 -1331 -38876 -27672 15124 39677
2234 39677 18337 -24096 -36117 -4761 32530 32682 -5390 -38353 -23105 25082 43648 6142
2246 6142 -39202 -34103 15933 47609 18307 -35208 -42212 5395 44228 26219 -22167 -41878
2258 -41878 -10131 31942 32744 -5949 -35728 -22995 14982 35009 12414 -28429 -36051 949
2270 949 37520 26979 -19192 -45021 -14836 36368 40166 -9138 -46804 -24546 27141 43119
2282 43119 4527 -38563 -30980 14970 38843 14288 -24799 -32670 -612 32815 28044 -10742
2294 -10742 -36047 -17498 23477 39906 9304 -34530 -34998 10377 43551 21747 -26577 -39452
2306 -39452 -659 39980 28504 -21075 -41294 -7965 34071 33505 -7840 -38987 -23841 18607
2318 18607 36713 10922 -26190 -32785 -2585 30209 25297 -13814 -36374 -13305 27505 33285
2330 33285 -5925 -42220 -25441 25654 44779 6031 -39910 -36092 10158 41813 21122 -23503
2342 -23503 -34399 -2864 28986 23663 -9650 -30219 -12624 23713 33590 2112 -32706 -29639
2354 -29639 11725 43527 24522 -25330 -42500 -5914 36482 32032 -11276 -37278 -12879 28183
2366 28183 30756 -8146 -35642 -17747 22066 36412 7063 -31715 -34732 1560 34459 27285
2378 27285 -10597 -36399 -19927 20146 31976 518 -31815 -22088 17484 35784 4831 -37345
2390 -37345 -33329 13463 44221 20328 -26517 -41305 -8276 31346 31004 -4013 -28557 -16300
2402 -16300 13840 25374 4745 -23517 -21454 12519 35565 16730 -25815 -39927 -5010 40352
2414 40352 38805 -9641 -43053 -21521 23434 35417 3504 -28930 -19227 16691 28611 1173
2426 1173 -28543 -24240 9692 35172 20921 -19359 -39798 -17142 23565 37225 7859 -31102
2438 -31102 -31311 7050 31833 10839 -25132 -27010 10057 36403 13603 -31797 -39276 1381 39593
2451 39593 31328 -10185 -37722 -22185 15303 30658 11301 -16318 -20700 487 21526 14018
2463 14018 -15763 -27077 645 34772 29739 -13773 -45741 -22459 30546 47125 7678 -35256
2475 -35256 -31006 8492 30717 11336 -19817 -19413 8759 24193 7699 -20927 -28194 -4448 28030
2488 28030 31424 -1133 -35554 -33753 5174 37976 25152 -18213 -36001 -6875 26798 18657
2500 18657 -18397 -31035 1391 35874 24143 -21896 -43036 -13328 29340 37463 6526 -27129
2512 -27129 -28470 -1226 23013 19790 -2137 -18650 -9388 15525 20092 -6418 -29742 -12996 28102
2525 28102 41398 3776 -42954 -38350 13413 46863 23471 -21938 -33197 -3644 23515 14711
2537 14711 -11748 -17916 2241 20172 13865 -10637 -28357 -17794 15191 35203 18196 -21825
2549 -21825 -41388 -15159 28332 35372 -2478 -33205 -16709 19557 23975 -9946 -33464 -9834
2561 -9834 31621 33853 -7637 -40099 -26243 13762 36230 20250 -13020 -27675 -12936 11276
2573 11276 21221 7419 -13252 -13499 9473 23802 2927 -27845 -25711 15088 45709 21991 -31021
2586 -31021 -46259 -5416 37910 32399 -7459 -29381 -11651 16098 15509 -7016 -17822 -3799
2598 -3799 16007 19154 218 -24317 -27273 -704 30298 30407 -4814 -38391 -28991 13987 35861
2611 35861 10084 -25614 -22694 11633 26419 -644 -32080 -20611 21091 38032 8844 -29425
2623 -29425 -33693 -3125 27451 27123 1142 -20744 -18869 1214 18220 12556 -8929 -16638 3938
2636 3938 24979 13034 -21504 -33643 -926 39675 34927 -13148 -43957 -20542 23169 33616
2648 33616 4471 -23028 -16207 9175 16454 -978 -16691 -11716 8527 22474 12246 -15510
2660 -15510 -31326 -14646 20051 35114 10272 -28685 -33997 1196 30204 16766 -17091 -24303
2672 -24303 4501 26745 9285 -25501 -28546 6480 34018 21965 -13363 -32417 -16550 14892
2684 14892 27943 12254 -11991 -20943 -5456 15502 16119 -5569 -18955 -1941 23781 21752 -11371
2697 -11371 -35368 -14678 28415 39221 2650 -33948 -27657 8586 29256 12655 -15378 -18156
2709 -18156 2625 16256 6332 -12973 -18771 -2042 20712 21473 -4231 -29468 -24056 8488 33229
2722 33229 19083 -18661 -32541 -6682 23687 19021 -10912 -24080 -2841 23866 17317 -14723
2734 -14723 -29494 -7994 23495 28125 2974 -24845 -23975 2101 23846 18992 -4623 -20576 -10206
2747 -10206 13947 19190 -2254 -21710 -9949 18907 27786 158 -31140 -24451 13793 35403
2759 35403 14525 -20287 -28502 -3256 21783 17341 -7159 -18907 -5263 13192 14027 -4140 -21248
2772 -21248 -13985 12279 26218 8740 -21880 -29728 -3634 26997 24664 -8673 -29179 -12210
2784 -12210 17186 20870 -3757 -23132 -10550 17510 22220 -1947 -24697 -18542 9098 27003
2796 27003 14993 -13303 -25846 -8269 17384 22637 2295 -19902 -15067 10902 22897 4010
2808 4010 -20960 -17909 10406 28952 11279 -21733 -27870 1003 26887 20416 -7907 -24606 -11196
2821 -11196 13424 19230 1008 -16874 -13404 6462 19114 7053 -16933 -22623 69 24574
2833 24574 19255 -10910 -29681 -13373 18961 25949 -710 -24975 -16335 10986 22131 3298
2845 3298 -19996 -16566 7728 22428 9106 -14725 -22024 -3937 20096 21606 -1553 -22507 -15664
2858 -15664 9661 24076 8803 -17210 -20345 5139 24541 11703 -16153 -23595 685 25562
2870 25562 18770 -11148 -26007 -8381 17312 21356 987 -19055 -15813 5943 19151 8399
2882 8399 -12884 -18969 -2499 18619 16707 -8782 -25565 -10826 17304 24172 -287 -25878 -19272
2895 -19272 11187 25436 6246 -19542 -19731 4058 21312 10862 -12972 -20150 -2228 17529
2907 17529 16863 -3028 -19654 -12899 10779 22712 7666 -16086 -19746 2342 23480 15919 -12248
2920 -12248 -23893 -2872 22457 19102 -7765 -24097 -8950 18106 22216 -1637 -21011 -14206
2932 -14206 8426 20358 7384 -13858 -18632 -1304 16901 14653 -5697 -21232 -11785 13127
2944 13127 21822 719 -22251 -17913 8528 24148 8212 -19796 -22568 3234 23291 12652
2956 12652 -13287 -21479 -3655 17870 16860 -4492 -19040 -10366 9251 18957 6868 -14082 -17641
2969 -17641 1771 20351 14482 -9337 -21702 -6082 20220 21644 -4547 -24008 -11806 16008
2981 16008 23242 2062 -21071 -15947 9358 20972 6531 -14315 -17135 727 16945 13378 -6891
2994 -6891 -19542 -8912 11770 18732 2558 -19493 -18892 5825 22143 9256 -16469 -22050 -68
3007 -68 22047 13984 -12870 -23258 -3957 18694 17077 -5306 -20473 -10676 11659 19018 4190
3020 4190 -14232 -15283 1423 16795 13638 -7863 -19030 -5469 16255 19220 -1834 -21404 -12892
3033 -12892 13737 23974 3645 -20113 -17101 7271 22690 9576 -14670 -18349 816 17441
3045 17441 12075 -6977 -17383 -7284 11903 16916 584 -16851 -15113 4528 19595 10136 -13529
3058 -13529 -21771 -2483 19586 15304 -9141 -22392 -7347 17412 18109 -5086 -21156 -10413 11867
3071 11867 18842 2680 -16444 -15094 4205 17545 10542 -7876 -16729 -5677 13926 17199 -747
3084 -747 -18112 -11991 10353 21500 5785 -18216 -18068 6261 22842 10303 -14170 -19613 -440
3097 -440 18948 14013 -7929 -18550 -6198 12333 15091 119 -15153 -13349 4933 17013 8009
3110 8009 -11288 -18636 -3093 16500 15221 -7028 -21797 -8889 14583 18891 -1463 -20707 -13489
3123 -13489 10838 20158 3515 -16320 -14751 4292 17341 9593 -9678 -15979 -2743 13412 14344
3136 14344 -1542 -16118 -11490 9204 19677 5891 -15008 -16913 3325 20705 12418 -11610
3148 -11610 -19482 -1092 18524 14175 -7368 -18610 -5808 13988 16616 -1200 -16349 -11727 5793
3161 5793 16269 7766 -10421 -16507 -3158 13735 13197 -4441 -18209 -9634 11861 17562 -494
3174 -494 -19409 -13913 9193 20324 5461 -16715 -17915 2736 18348 10178 -8894 -16049 -4211
3187 -4211 12316 13177 -2371 -14259 -8237 8579 16504 5135 -13759 -16183 3201 19519 12679
3200 12679 -9385 -19298 -4768 16396 16482 -4320 -17499 -6834 12311 15474 -892 -15995 -10612
3213 -10612 8619 17244 5192 -12397 -16210 -1646 14485 13777 -3898 -17183 -9741 8623 15111
3226 15111 1645 -15283 -12712 6974 17662 3697 -16389 -16633 2994 19247 11228 -10721 -18858
3239 -18858 -4982 12881 14251 -379 -12939 -9372 5945 13247 3669 -10720 -11532 3216 16899
3252 16899 11008 -9823 -19425 -3725 16988 18416 -1932 -18570 -10815 10026 16944 2108 -12941
3265 -12941 -9557 6367 13696 3566 -12090 -13118 1990 15439 11687 -5304 -18020 -10617 9184
3278 9184 17604 4175 -14048 -14754 2295 14755 6311 -12303 -14731 3268 16773 7593 -12561
3291 -12561 -18633 -2909 16209 15525 -3146 -16645 -10604 5328 14176 6259 -7687 -11519 368
3304 368 11492 7863 -6819 -13857 -1794 15947 16332 -4505 -20446 -11092 12119 20914 5411
3317 5411 -14481 -14163 3325 14135 6022 -7982 -9590 1887 11454 6882 -7471 -14379 -4852 11065
3331 11065 15725 2585 -15390 -17594 1218 17298 11353 -8291 -16517 -3341 12626 9173 -8588
3344 -8588 -15245 -685 15458 11918 -7492 -18927 -8833 10751 17011 4565 -10764 -13395 -2289
3357 -2289 10417 10805 -1664 -10383 -4118 8968 11045 -2232 -14806 -8073 13069 20392 2873
3370 2873 -18466 -16680 4838 19870 11349 -8602 -14240 -1673 10306 7025 -4255 -9259 -1698
3383 -1698 9362 9281 -2380 -13633 -10550 4872 17188 10421 -9981 -19834 -6563 13127 14928
3396 14928 -1882 -15604 -7615 9531 11467 -4823 -15339 -5458 12240 14726 -448 -16123 -13754
3409 -13754 3336 15150 10392 -3874 -12929 -7984 5315 11380 3093 -8224 -6974 5214 13077
3422 13077 2376 -13984 -12990 7569 21739 10274 -13016 -19594 -2732 16250 14598 -2975 -12238
3435 -12238 -4761 6401 7439 -1354 -8686 -4034 6386 10813 2451 -10491 -14355 -2277 14315
3448 14315 15808 -2681 -18793 -12900 6799 15720 3876 -12410 -10233 6249 12372 -618 -14347
3461 -14347 -9629 7687 15838 5844 -11160 -15641 -3712 10791 13298 2859 -9627 -10747 625
3474 625 10863 6336 -5468 -9504 2205 13644 7730 -10518 -16612 57 18574 15375 -5316
3487 -5316 -18546 -8981 10074 14699 2431 -9145 -6672 3092 7299 1543 -7127 -7198 2192 10967
3501 10967 7627 -5668 -15610 -8628 9569 17582 3916 -14566 -15416 1271 13843 6984 -9290
3514 -9290 -11675 2779 12680 3499 -11235 -12877 1164 14339 10989 -4630 -14714 -8592 4983
3527 4983 13335 7643 -5778 -11617 -2631 9027 8113 -3220 -10419 -1731 12711 11617 -5868 -17033
3541 -17033 -6462 12901 17891 2219 -14451 -12466 3864 12887 6077 -5806 -8339 -588 7236
3554 7236 5256 -4643 -9734 -2770 9057 11489 -162 -14308 -13049 4331 16183 8416 -9241
3567 -9241 -15369 -2701 11025 8846 -6030 -11306 -722 10490 7552 -6128 -13033 -4837 9478
3580 9478 13534 2194 -10648 -11677 -576 11270 10481 -2449 -11340 -5081 7835 10003 -931
3593 -931 -11438 -5656 9978 13895 -78 -14253 -10692 6344 16081 7020 -8669 -12835 -1853
3606 -1853 9767 8299 -1916 -8763 -4248 5727 8211 -833 -9822 -7960 4512 12885 5568 -10699
3620 -10699 -15336 -1524 13006 10824 -4805 -13960 -5751 8391 9605 -2423 -10804 -4780 7251
3633 7251 9859 37 -10728 -9275 3474 12273 7502 -5433 -12315 -5040 8872 12378 648 -10312
3647 -10312 -7147 5815 11648 1996 -10523 -8498 6035 14164 4450 -10017 -11973 816 12523
3660 12523 9612 -3642 -11147 -4893 6172 9184 1126 -8238 -7937 2836 9940 3949 -8249 -11539
3674 -11539 -529 12072 9351 -6007 -14953 -5514 9895 11740 -871 -12117 -7908 5501 10384
3687 10384 1239 -8917 -7857 2598 9872 5024 -6247 -10368 -2233 9301 10258 -576 -11258
3700 -11258 -8111 5666 12608 3891 -9019 -9756 2916 12134 5782 -8137 -11028 1281 11870
3713 11870 7822 -5139 -10941 -3543 8685 10254 -8 -9079 -7511 2914 9319 4842 -6487
3726 -6487 -9942 -947 9284 7942 -4471 -12349 -5260 8780 11375 -1555 -13017 -8025 5750
3739 5750 11540 2133 -9884 -9515 1898 9831 4748 -5533 -9211 -2558 7773 8363 -938 -9491
3753 -9491 -6168 4939 10740 3794 -8501 -10134 1853 11975 7161 -6286 -11507 -1128 11212
3766 11212 9167 -4094 -10956 -3527 8028 9231 -501 -8952 -6168 3860 9569 3704 -5964 -8839
3780 -8839 -1347 8223 8172 -2829 -11118 -5464 6550 10242 299 -11215 -8867 4482 11357 2223
3794 2223 -10191 -9646 2290 10437 5027 -6923 -10092 -1288 8105 7379 -1202 -8771 -5379 4225 9072
3809 9072 3088 -6894 -8263 705 10221 6806 -5667 -10707 -1536 10645 10004 -3065 -11086 -4837
3823 -4837 8010 10825 194 -9180 -6278 4181 8924 3205 -6207 -7881 344 8035 5983 -2787
3837 -2787 -9479 -4979 6303 10389 766 -10123 -8691 2920 10751 4118 -8500 -10161 1103 9766
3851 9766 4810 -6566 -10289 -1251 8772 7302 -3288 -9818 -4304 5144 8763 2382 -6894 -7973
3865 -7973 729 8477 6203 -3656 -8939 -2290 8672 8679 -2163 -10605 -4766 7974 10929 687 -9907
3880 -9907 -7565 4386 10775 3694 -6557 -7868 572 7423 5491 -3366 -7910 -3067 5595 7681
3894 7681 513 -8697 -7934 2822 10628 4497 -7629 -10744 -709 9641 6643 -5407 -10449 -2118
3908 -2118 7959 6653 -2876 -9359 -4236 5781 8447 680 -7692 -7119 1359 8421 5486 -3868 -8594
3923 -8594 -2299 6899 8179 -693 -8591 -4891 6462 10475 610 -9256 -7098 4497 10998 3898
3937 3898 -7421 -8514 1244 8774 5995 -3496 -7789 -2968 5548 6973 -81 -7103 -5938 2684 8325
3952 8325 3941 -6420 -9790 -577 8740 6975 -4525 -10757 -3456 7709 8497 -2142 -9782 -4989
3966 -4989 5386 8351 754 -7676 -6675 2244 8100 4093 -4077 -7579 -2038 6421 7658 -574 -7895
3981 -7895 -5044 4972 9592 2384 -8026 -7720 2934 10257 4635 -6333 -8609 392 9423 6152
3995 6152 -3993 -8644 -1873 6784 7250 -190 -7349 -5455 2893 7601 2972 -5499 -7843 -906 7190
4010 7190 6350 -3398 -9736 -3655 6857 8024 -1460 -9775 -5728 5398 9127 868 -8161 -7235 1978
4025 1978 8130 4229 -4508 -7546 -1486 5622 5941 -918 -7139 -4361 3905 8380 1959 -7188 -7384
4040 -7384 2298 9876 6137 -5948 -9183 -499 8365 7066 -2516 -7853 -2518 6532 7271 -1123 -7222
4055 -7222 -4213 4122 7525 2471 -6126 -7612 -293 7224 6525 -2547 -8437 -4598 4727 7537 -212
4070 -212 -7877 -5384 3995 7722 923 -8581 -7746 2362 9301 3697 -5643 -8438 -1886 6385 6522
4085 6522 -902 -6602 -4114 2875 6293 1596 -5535 -5723 2494 8479 4130 -5799 -8908 -846 9652
4100 9652 8578 -1926 -8674 -3944 5500 7305 806 -5748 -3994 3501 6336 1163 -5468 -5868 992
4115 992 7320 5548 -3290 -9336 -4497 5384 8811 1605 -7660 -6994 1991 7248 1792 -6118 -6244 2150
4131 2150 7834 2680 -6873 -8602 -205 8288 6607 -1939 -8058 -5404 2553 6944 2984 -3888 -5383
4146 -5383 524 5609 3514 -4125 -6612 564 8434 6687 -3390 -9883 -4149 7315 9983 1487
4160 1487 -7265 -5725 2130 6692 2771 -3254 -4042 1263 5239 2785 -3451 -6591 -2018 6209 8320
4175 8320 38 -8878 -7922 1934 8967 4987 -5130 -8045 -462 6009 2821 -4698 -5973 658 6720
4190 6720 4229 -4794 -8719 -3010 5302 7943 2248 -5708 -7840 -1456 5670 5304 -558 -5385 -2199
4205 -2199 4495 4919 -2737 -7513 -1577 7649 8700 -855 -9844 -6610 3965 9969 4197 -4086 -5968
4220 -5968 -884 4606 3525 -1481 -3269 -238 4124 3800 -1769 -7112 -4624 4211 9510 3689 -6598
4235 -6598 -9647 -2303 7655 7123 -1906 -7226 -2222 4457 3365 -3162 -6456 -1134 6115 6031 -2246 -7941
4251 -7941 -5930 1998 7697 5884 -2340 -7385 -4136 3103 6270 1395 -4365 -3389 3610 5711 -931
4266 -931 -7485 -4396 6113 10570 2710 -7894 -8687 270 8136 6002 -1069 -5128 -2803 1988 2999
4281 2999 -331 -3046 -1472 2870 4960 852 -6413 -7360 975 9098 7446 -3391 -10491 -5428 5274
4296 5274 7237 164 -5953 -3067 2902 3953 -2141 -6465 -2386 4857 7186 1089 -6062 -7577 -1740
4311 -1740 6109 7330 910 -5873 -6037 892 5841 3057 -3501 -3781 2843 6488 1047 -6869 -6467 2720
4327 2720 10086 6119 -4525 -8761 -2984 5254 6656 1680 -3292 -3069 757 2717 750 -2810 -2866
4342 -2866 1522 5601 3524 -4832 -9077 -3048 7082 8899 111 -8739 -6927 2085 6685 1641 -4702
4357 -4702 -3648 2240 4188 -544 -5579 -4689 2396 6799 4111 -3068 -7597 -4528 3145 7462 4102
4372 4102 -3470 -6101 -1193 4899 3682 -2960 -4527 1473 7179 3265 -5298 -7827 -742 8185 7964
4387 7964 -817 -6940 -4923 2123 5496 3168 -1623 -3684 -397 2731 2067 -2414 -4668 -604 5685
4402 5685 6066 -1919 -8539 -5487 3917 8888 2852 -6388 -7412 183 5213 2692 -3528 -3967 726
4417 726 4410 1790 -3822 -5646 -932 5167 6221 593 -6205 -6395 181 6421 5051 -1750 -5963
4432 -5963 -1728 4622 4408 -2379 -5488 -345 6570 5744 -2601 -7598 -3110 5132 7470 1933 -4685
4447 -4685 -5554 -538 4291 4165 -826 -3827 -1648 2853 3520 -1062 -5694 -3434 4166 7208 801 -7200
4463 -7200 -7214 978 7615 4462 -3987 -6626 -1337 3993 3188 -2131 -4494 -1030 4005 4076 -1121 -5220
4479 -5220 -3909 2053 6328 3698 -3564 -7019 -1773 5318 5922 -512 -5700 -2747 4390 5564 -583
4494 -583 -5721 -2189 5003 6487 396 -6366 -4904 1709 6306 3621 -2110 -5090 -2378 3039 4234
4509 4234 248 -3949 -2995 1999 5049 1328 -5346 -5723 1762 7064 3327 -4503 -7350 -1001 5692
4524 5692 4859 -2293 -5973 -2453 3103 3715 -419 -4559 -3242 2268 4695 1938 -3595 -5146 -855
4539 -855 5536 5204 -1369 -6139 -3541 4163 6325 526 -5829 -4062 3305 6378 1081 -4773 -3934 1935
4555 1935 6041 2950 -3537 -4708 -712 4241 3968 -265 -4409 -3260 1721 5143 1888 -3928 -5218
4570 -5218 140 5914 3603 -3693 -6939 -1184 5870 4583 -2822 -6658 -2434 4554 4852 -1028 -5282
4585 -5282 -3435 1549 4464 1469 -3649 -4221 -585 3893 3563 -1085 -5069 -2519 3641 5211 495
4600 495 -5541 -4229 2919 6916 2246 -5110 -5326 1849 6529 3370 -2841 -4598 -461 4422 4008 -1013
4616 -1013 -4243 -1885 2515 4544 1133 -4041 -4440 720 5418 3692 -2748 -6417 -1926 4857 5208
4631 5208 -1642 -6144 -2799 3581 5053 -892 -5813 -3038 3031 5012 175 -4478 -4335 244 4524
4646 4524 3412 -1374 -4641 -2640 2307 4758 1234 -4382 -3929 1852 5626 1959 -4539 -5154 1451
4661 1451 7342 3881 -4061 -6143 -526 5614 4407 -1216 -4349 -1617 2724 3694 455 -2965 -2679
4676 -2679 1188 4265 2422 -3289 -5433 -1384 4483 5496 -774 -6698 -4312 3504 5648 238 -5340
4691 -5340 -3814 2427 4710 406 -4772 -3955 1756 4877 1932 -3073 -5149 -1993 3360 4531 815
4706 815 -3863 -4277 778 4563 2648 -3498 -4575 935 5833 3042 -3724 -6080 155 6592 5067
4721 5067 -2244 -5851 -2109 3680 4789 480 -2908 -2461 1754 3271 1719 -2043 -3298 -178 4060
4736 4060 3915 -1347 -5798 -3316 3451 6620 1321 -5890 -5562 1825 5891 1732 -4180 -4347 1129 4636
4752 4636 1541 -3866 -4746 92 4175 3362 -867 -4420 -3420 1721 4768 2145 -2510 -4659 -1029
4767 -1029 4434 3644 -2047 -4864 -567 4864 4486 -2050 -5998 -1920 5109 6114 -15 -5023 -3352
4782 -3352 1867 4797 2103 -2121 -3324 -191 3016 2667 -1025 -3985 -1828 3128 5143 405 -5434
4797 -5434 -5004 1773 6071 2356 -4970 -5819 196 5366 2790 -3377 -4895 -221 4122 2895 -2102
4812 -2102 -4338 -2181 2079 3861 1030 -3383 -4204 -282 3986 4019 -1326 -5256 -2349 4045 5252 -1035
4828 -1035 -5706 -2578 4078 5720 54 -5398 -3411 3115 5622 1497 -3586 -3686 667 4446 2791
4843 2791 -1179 -3619 -1812 2213 4084 970 -3977 -4033 1338 5140 2534 -3873 -5812 82 5501
4858 5501 3464 -3745 -6195 -1207 4433 4004 -1657 -5192 -2216 2413 3573 87 -3332 -2955 596
4873 596 3526 2578 -1743 -4277 -1363 4009 4891 -278 -5781 -3774 3741 6517 1109 -5139 -4026 2180
4889 2180 5835 1589 -3810 -3352 1736 4562 2172 -2392 -3972 -534 3335 4126 213 -3759 -4177 595
4905 595 4975 3084 -2227 -5045 -849 4086 3408 -2659 -5440 -944 4934 4154 -2760 -6615 -2851 3792
4921 3792 4998 -44 -4448 -3770 310 3188 1971 -1438 -3000 -893 2707 2979 -1067 -4394 -2345
4936 -2345 3499 5864 839 -5683 -4987 1882 6721 3352 -3284 -4707 68 4205 2197 -2264 -2855
4951 -2855 630 4071 2791 -1712 -4452 -2535 2557 5314 2473 -3048 -5880 -1988 4438 4632 -763
4966 -763 -4819 -2291 2891 3675 -1962 -5563 -1664 4563 5145 -1436 -6492 -4738 1610 5658 2648 -2386
4982 -2386 -4425 -2088 1149 2567 658 -2060 -1786 2181 3338 -372 -5082 -3888 3106 7798 3201
4997 3201 -5081 -7196 -422 5896 5066 -561 -3869 -1372 2661 1711 -1479 -2462 396 3465 3755 -267
5013 -267 -4617 -4497 177 5689 5303 -855 -6708 -4751 2405 5512 963 -4014 -2614 2569 3290 -1807
5029 -1807 -5768 -2480 4862 6311 1006 -5485 -5898 -1151 4201 4786 822 -3084 -3827 -418 2074 1859
5045 1859 -1787 -2072 1837 4600 733 -5237 -5953 1446 8353 5871 -3172 -7460 -3131 3686 5182
5060 5182 1275 -2167 -1140 1351 1079 -1185 -2552 -667 2759 5006 1987 -3592 -6787 -2760 4587
5075 4587 7845 2220 -5622 -6540 59 4896 1781 -2954 -1978 2625 3959 -1476 -6862 -3756 3278
5090 3278 6512 3326 -3204 -6215 -3545 1520 4628 3491 -866 -4057 -2090 1428 1743 -1533 -2566
5105 -2566 1437 5562 3068 -4988 -8272 -1528 7741 8186 -327 -6787 -4708 1239 4239 1363 -764
5120 -764 -287 1479 1010 -918 -2763 -2113 1488 5288 4779 -1490 -6833 -5779 2074 8239 4895 -3429
5136 -3429 -6314 -1379 3334 1776 -3029 -2468 2453 5053 208 -6621 -6156 306 5872 5352 -205 -5065
5152 -5065 -5208 -1373 3504 4567 1250 -2643 -2298 1215 1973 -1895 -3564 143 6281 5975 -2595 -8823
5168 -8823 -4337 5029 8581 2734 -4332 -4688 -270 2657 1526 -503 -34 1403 1758 57 -2117 -3546
5184 -3546 -1001 4172 6679 2276 -5873 -7831 -1401 6614 6161 -1440 -5533 -2132 2895 2023 -3097
5199 -3097 -3707 1906 5836 2482 -4263 -6747 -2363 3534 5715 2829 -2513 -5425 -3167 1488 3967
5214 3967 1806 -2111 -2232 1722 2813 -1313 -5206 -2069 5857 7836 529 -7290 -6493 1928 6953
5229 6953 4536 -1636 -4056 -1449 1676 1296 -376 -672 738 2440 2158 -770 -4762 -3714 1995 6882
5245 6882 4962 -3199 -8239 -3496 5002 6200 -136 -4831 -2263 2661 2341 -2740 -4818 -611 5023
5260 5023 4473 -1295 -5619 -4548 241 4738 4299 3 -4038 -4528 66 4051 2322 -2193 -2845 1888
5276 1888 4388 173 -5655 -4674 3555 8051 3458 -5391 -6963 -544 5263 4705 120 -2647 -1339
5291 -1339 1376 1719 -177 -1697 -1200 1690 3654 1609 -3956 -5564 -1051 5767 6093 -792 -6844 -4375
5307 -4375 2945 5195 480 -4269 -2634 2542 3415 -1459 -5146 -2310 2882 4774 1970 -3243 -4964
5322 -4964 -1803 2895 4923 1576 -3378 -3982 -256 4351 2628 -3058 -3753 1421 5807 2438 -4711
5337 -4711 -5736 683 6868 4531 -2730 -5516 -2019 3477 4135 556 -2408 -2103 473 2472 1292
5352 1292 -1667 -3029 -315 4126 4024 -1532 -5818 -3649 3740 6753 752 -6103 -4925 2378 5464
5367 5464 732 -4473 -3419 1891 4226 1036 -3739 -3790 331 3355 2928 -492 -3950 -3312 1170 4373
5383 4373 2858 -2581 -4902 -424 5073 3585 -2587 -5506 -520 5672 4597 -2446 -5934 -1434 5020
5398 5020 4805 -557 -4281 -2368 1861 3626 1643 -2059 -3120 -203 3099 3592 -491 -4580 -2784
5413 -2784 3032 5659 831 -5585 -4715 1964 6289 1699 -5521 -4999 1678 5483 2053 -3913 -4643 76
5429 76 3871 2399 -1720 -3630 -1757 1376 3143 1325 -2537 -3603 -178 4231 3875 -1919 -5673 -1615
5445 -1615 5166 5494 -1501 -6593 -3046 4344 6047 -158 -5236 -2528 3048 4452 505 -3303 -3314 1248
5461 1248 4111 2499 -1361 -4108 -2360 2383 5437 1931 -4218 -4650 726 5355 2451 -3950 -5362
5476 -5362 678 5895 2540 -4659 -6050 8 5438 3762 -2078 -5374 -2376 2323 3563 1054 -2222
5491 -2222 -3436 -212 2873 2410 -1826 -4326 -1271 4098 4944 -1062 -6544 -3469 4643 6864 839
5506 839 -5710 -4711 2346 5609 1271 -3743 -2632 1791 3841 1110 -2973 -3535 -46 3492 3863 284
5522 284 -4029 -4444 612 5578 4014 -2804 -5799 -920 4399 3665 -2894 -5878 -633 5663 4027 -3261
5538 -3261 -6903 -1984 4353 5050 -21 -4463 -3909 279 3217 2318 -978 -3417 -1810 2704 3462 -485
5554 -485 -4387 -2787 3742 6397 952 -6048 -5552 2414 7446 3289 -4069 -4911 419 4757 2318 -2393
5570 -2393 -2988 469 3568 2673 -726 -3837 -2282 1852 4879 2779 -2672 -6206 -1889 4847 5492 -804
5586 -804 -6138 -2615 3882 4818 -2073 -6032 -1949 4594 5043 -1345 -5864 -3853 2129 4839 2209 -2901
5602 -2901 -4230 -1824 1945 3367 515 -3527 -3025 1984 4562 1063 -4339 -4828 2173 6878 3196
5617 3196 -5295 -6598 -106 6420 4656 -2274 -5234 -1343 3688 3313 -876 -3227 -1218 2502 3909
5632 3909 1029 -3347 -3831 -356 4624 4662 -1183 -6318 -4016 3728 6169 366 -5738 -3788 2800 5794
5648 5794 -92 -5906 -3533 2857 5481 917 -4267 -4373 168 4034 3091 -1040 -3703 -2719 1084 4362
5664 4362 1940 -3407 -4747 661 5353 3642 -3263 -6272 -183 6849 5196 -3048 -6632 -1368 5222
5679 5222 5429 -702 -5130 -2309 3134 4040 690 -2744 -2943 -60 3836 3099 -1163 -4559 -2959 3222
5695 3222 5813 430 -6069 -4940 2553 6867 1825 -5458 -6027 1570 6105 2334 -4303 -5073 205
5710 205 4407 2591 -2022 -4454 -1570 2583 3774 764 -3394 -4364 -67 5000 4080 -2231 -6242 -1952
5726 -1952 5226 5728 -1320 -6760 -2266 5115 5790 -929 -5837 -2781 4070 5575 695 -4567 -3730 1014
5742 1014 4284 3500 -1049 -4149 -2274 2160 4542 1332 -3874 -4065 1689 6015 2027 -5792 -5921 1661
5758 1661 7417 3842 -4866 -7472 -1085 5584 4263 -1860 -4945 -1689 2707 3248 -393 -3504 -2454
5773 -2454 1448 4291 2286 -3310 -6012 -1862 5230 6453 -321 -6863 -4784 3406 6702 1214 -5457
5788 -5457 -3538 3584 5509 -130 -5037 -3985 3030 6347 2573 -3663 -5409 -1912 3370 4854 1922
5803 1922 -3406 -4714 -175 4578 2852 -2744 -4568 612 6139 2906 -5030 -7426 -646 7444 6309
5818 6309 -2061 -7483 -4000 3079 4871 910 -2929 -2726 212 2652 1020 -2452 -3568 -9 4718
5833 4718 4861 -1845 -7758 -5036 4127 8819 2969 -6013 -6958 512 6212 2854 -3511 -3418 2212 4955
5849 4955 1062 -4652 -5070 645 6025 5149 -745 -5402 -5191 64 5793 4848 -1395 -5346 -2645 3295
5865 3295 3839 -1798 -5339 -255 6890 5095 -3862 -8962 -3624 5935 7935 787 -6093 -5318 175
5880 175 3544 3010 -367 -2682 -1042 1866 1560 -1799 -4327 -1987 4406 7433 1048 -7578 -7882 1310
5896 1310 8890 6047 -3327 -6904 -1551 4884 3152 -2741 -3168 1475 4943 2720 -3546 -5839 -2043
5911 -2043 3898 6649 3258 -3405 -7331 -3401 4585 6884 1186 -4841 -3931 2360 4274 -1468 -6365
5926 -6365 -1858 6374 7037 -1890 -8813 -6762 3193 8114 4138 -3063 -5266 -2540 1317 2970 1356
5941 1356 -1330 -1735 1077 2628 -369 -5034 -4929 2832 9269 5141 -5891 -10092 -2223 7208 7905
5956 7905 -716 -5992 -2342 3147 2887 -2148 -3292 625 4698 4124 -1134 -5779 -4862 657 6129 6601
5972 6601 -309 -7476 -6753 1385 6875 3327 -3719 -4456 1690 5358 -221 -7145 -4440 5272 9020
5987 9020 2183 -7365 -8393 -561 6473 5820 -40 -4075 -3654 -522 2362 1982 -991 -2366 986 3933
6003 3933 2262 -4540 -7539 -476 9201 8295 -2365 -9865 -5479 4829 7997 1626 -4708 -2747 2485
6018 2485 2934 -858 -4052 -1260 3425 5547 1664 -3636 -6020 -3133 3977 8317 3575 -5841 -7940
6033 -7940 -1107 6192 4574 -2940 -5320 987 6009 1741 -6868 -6760 1882 8707 5366 -3821 -8476
6048 -8476 -3948 2860 5608 2469 -1811 -4124 -2148 1682 2414 -741 -3089 -720 4732 5010 -2613
6063 -2613 -9109 -4395 6516 10187 2430 -7896 -7443 1047 7141 3092 -3386 -3236 1629 3600 430
6078 430 -3505 -3754 725 5207 4753 -299 -6080 -6026 904 7715 6098 -2833 -7838 -2783 4805 4971
6094 4971 -2046 -5800 -209 6417 3914 -4113 -7686 -2317 5810 7376 408 -6147 -5741 -135 4365
6109 4365 4133 -55 -4287 -2791 1979 3646 -364 -4823 -2988 4340 7581 662 -8594 -7019 3410
6124 3410 9467 4783 -5143 -7521 -579 5746 3656 -1885 -3559 127 3317 2542 -1652 -4629 -2718
6139 -2718 2952 5760 3103 -4083 -7670 -2199 6263 7001 -855 -7234 -4122 3926 6026 -1163 -6948
6154 -6948 -2637 5486 5955 -1193 -6967 -4936 2633 6749 3063 -3464 -5310 -2292 2585 5111 1177
6169 1177 -4151 -4035 1325 5167 1858 -4923 -5824 2055 8210 3857 -6123 -8204 -143 7477 6132
6184 6132 -2425 -6946 -1844 4489 4086 -582 -4081 -2070 1926 4457 1703 -3263 -5091 -654 5573
6199 5573 5756 -983 -7795 -4658 4646 8081 992 -6887 -5374 3139 7091 908 -6572 -5101 2844
6214 2844 6490 1976 -4620 -6039 -728 4669 4316 -832 -4237 -3909 1261 5192 2763 -3771 -6014
6229 -6014 -155 6126 4495 -3302 -8039 -1441 7302 6408 -2796 -7887 -2765 5585 6453 -681 -6152
6244 -6152 -3557 2912 5181 1788 -3099 -4414 -524 4589 4357 -968 -5652 -3520 3426 7024 1656
6259 1656 -6606 -6327 2443 7910 2685 -6263 -7050 1473 7799 3683 -4832 -6483 -403 5163 4056
6274 4056 -1772 -5131 -2755 2277 4680 1121 -3841 -5280 -491 5715 4914 -2745 -7444 -2885 5828
6289 5828 7250 -692 -7922 -3982 5309 7294 -431 -6594 -4227 3271 6555 1137 -5131 -4671 1213
6304 1213 4777 4011 -1028 -5453 -3509 2902 6031 1968 -4112 -5649 442 7160 3536 -5328 -7131
6319 -7131 543 8113 4780 -4470 -8356 -1364 6348 5702 -1610 -6355 -3745 2677 4990 1103 -3746
6334 -3746 -3858 641 4302 3421 -2572 -6479 -2448 5519 7408 -59 -7614 -5834 3790 8323 2108
6349 2108 -6528 -5790 2517 6690 2196 -4734 -5361 1390 6354 3334 -2914 -5578 -2401 3713 6164
6364 6164 2119 -4750 -6037 32 5923 4575 -2788 -6659 -1261 6288 5270 -3980 -8079 -1844 6874
6379 6874 7044 -1978 -8356 -4246 4251 6259 1230 -4545 -4823 9 4179 2560 -1963 -4452 -1805
6394 -1805 3759 5425 -137 -7184 -4951 3696 8618 3113 -6361 -7929 720 8178 4556 -4732 -6217
6409 -6217 338 5868 3536 -2996 -5796 -952 5333 5195 -89 -5523 -5137 947 6245 4701 -2633
6424 -2633 -6797 -2528 5058 6124 -1102 -7025 -3022 5520 6641 -1567 -7523 -4620 4590 7876 989
6439 989 -6503 -5937 938 5662 3529 -2074 -4818 -2105 2836 4204 341 -4469 -4244 2506 6847 2903
6455 2903 -6323 -7620 582 8391 5678 -4373 -8231 -1983 6764 5777 -2137 -6045 -1767 4835 4932
6470 4932 -652 -5537 -3054 2737 5773 3033 -3169 -6280 -1887 5318 6222 -242 -7188 -4763 3593
6485 3593 7631 850 -7045 -5467 3664 7932 1175 -6703 -6764 1713 7224 3242 -3763 -6068 -1750
6500 -1750 3747 4827 301 -4478 -4441 1397 5367 2661 -4196 -6320 -359 7271 5477 -4062 -8414
6515 -8414 -2072 7020 6996 -2097 -8423 -3224 5241 6165 -286 -5561 -3781 2299 5331 1992 -3667 -4916
6531 -4916 -718 4231 5218 -439 -6348 -4534 3212 7444 1893 -6331 -6841 2498 8414 3185 -6334
6546 -6334 -7496 833 7578 4002 -4353 -7211 -1109 5755 4621 -1452 -5663 -3448 2232 5223 2441
6561 2441 -4065 -5849 -595 5933 5624 -2214 -7877 -3100 5908 7165 -1038 -7983 -4312 4828 7739
6576 7739 227 -6977 -4891 3358 6845 2027 -4237 -5122 -252 4910 4251 -837 -4717 -3733 2206 6029
6592 6029 2462 -5214 -6160 1467 7498 4027 -5401 -8334 -551 8316 5777 -3919 -8246 -2150 5917
6607 5917 5827 -1339 -6302 -3003 3141 4670 639 -4308 -4949 313 5572 4306 -2531 -7311 -3522 5021
6623 5021 7821 961 -7258 -5731 3416 7721 1790 -6558 -5447 2856 7530 2269 -6088 -6267 734
6638 734 6556 4861 -1789 -6366 -3307 2865 5946 2455 -3638 -5800 98 6098 3770 -4276 -6966
6653 -6966 -510 7636 5827 -4135 -9550 -3163 6921 7715 -952 -7161 -4368 2549 5558 1042 -4152
6668 -4152 -3705 1086 4095 2773 -2635 -5853 -2082 5075 6844 248 -7504 -7120 1980 9269 4169
6683 4169 -5435 -7296 833 7013 3027 -5056 -6301 1259 7529 3747 -3984 -6869 -2054 4959 6540
6698 6540 2007 -4883 -6075 -408 5040 5092 -1276 -6095 -2069 5340 5298 -2790 -8089 -2549 6929 8545
6714 8545 -1178 -9566 -6208 3926 8033 2387 -4458 -5487 -480 4068 2444 -2046 -3671 -863 2898
6729 2898 4141 -612 -6338 -5009 3081 9035 4228 -5921 -9352 -1586 8421 6627 -2958 -7117
6743 -7117 -824 5553 3976 -3360 -6360 -323 6489 5874 -1154 -6673 -5180 1632 6708 5516 -1735
6758 -1735 -6761 -4027 3075 6278 1476 -6025 -3842 4437 6756 -404 -8200 -5567 5372 10166 2290
6773 2290 -7843 -8282 450 7054 5080 -1638 -5174 -2399 2402 2871 -361 -3305 -2797 2076 5906
6788 5906 2282 -5967 -7828 -233 8857 8027 -2799 -9809 -4249 5813 7533 -345 -6164 -2689 4225
6803 4225 4897 -1478 -6152 -2968 4586 6564 2228 -4539 -6749 -2437 5128 7259 1686 -5490 -6231
6818 -6231 1019 6225 3079 -5127 -5297 2710 7682 1732 -7838 -7870 1896 9915 5620 -4806 -8507
6833 -8507 -2976 4302 5769 1251 -3458 -3434 624 3123 1212 -2761 -4222 359 6607 5138 -3887
6848 -3887 -9728 -4170 6871 10079 1093 -8912 -6520 3337 7438 1513 -4853 -3568 3077 5709
6862 5709 340 -5586 -4806 1349 6269 5059 -914 -6756 -5848 2011 7692 4734 -3391 -7118 -1471
6877 -1471 6242 4297 -4128 -6833 520 7547 4700 -5196 -9384 -1935 7642 7732 -1019 -6818 -5374
6892 -5374 1125 5033 3091 -2086 -3844 -1120 3076 3332 -1360 -6158 -2583 5600 7988 -263 -9246
6907 -9246 -6916 3644 10520 4181 -6548 -7330 1029 6541 3056 -3886 -4511 937 5697 3064 -3279
6922 -3279 -5442 -2075 4071 6834 2578 -4866 -7508 -1473 6577 6600 -1757 -7194 -3057 5409 5739 -2659
6938 -2659 -7484 -2490 6518 7430 -1747 -8916 -5050 4121 7994 2478 -4454 -5809 -1547 3683 3830
6953 3830 -260 -4152 -2977 2652 5313 632 -6513 -5599 3374 8965 3372 -6368 -9300 31 8984
6968 8984 6104 -3590 -7395 -1566 5150 4716 -1776 -5403 -1287 4215 4720 558 -4731 -5339 523 6898
6984 6898 5591 -2468 -8011 -4037 4718 7666 701 -7339 -5026 4369 7187 -170 -7524 -5115 4047
$$ [...]
##END NTUPLES=NMR FID
##END=
