##TITLE=1H_CG-1106-1
 CDCl3, 8 sc, 
 30.5.2019
##JCAMPDX= 6.0         $$ Bruker NMR JCAMP-DX V2.0
##DATA TYPE= NMR FID
##DATA CLASS= NTUPLES
##ORIGIN= UXNMR, Bruker Analytische Messtechnik GmbH
##OWNER= root
$$ XWIN-NMR		Version 3.5
$$ Thu May 30 13:56:46 2019 Russian Standard Time (UT+4h)  she@DPX200
##.OBSERVE FREQUENCY= 200.13155
##.OBSERVE NUCLEUS= ^1H
##.DELAY= (6, 6)
##.ACQUISITION MODE= SIMULTANEOUS
##.ACQUISITION SCHEME= undefined
##.AVERAGES= 8
##.DIGITISER RES= 18
##SPECTROMETER/DATA SYSTEM= spect
##.PULSE SEQUENCE= zg30
##.SOLVENT NAME= CDCl3
##.SHIFT REFERENCE= (INTERNAL, CDCl3, 0, 15.7039)
##AUDIT TRAIL= $$ (NUMBER, WHEN, WHO, WHERE, WHAT)
$$ ##TITLE= Audit trail, XWIN-NMR		Version 3.5
$$ ##JCAMPDX= 5.01
$$ ##ORIGIN= Bruker BioSpin GmbH
$$ ##OWNER= she
$$ F:/spectra/data/she/nmr/H-F/1/audita.txt
$$ ##AUDIT TRAIL=  $$ (NUMBER, WHEN, WHO, WHERE, WHAT)
(   1,<2019-05-30 13:55:41.28 +0400>,<she>,<DPX200>,
      <created by zg, POWCHK disabled, PULCHK disabled
       configuration hash MD5:
       00 E9 B6 7A A2 85 ED C7 34 08 36 98 17 FE 4E 26
       data hash MD5: 16K
       8B 76 90 CA 5F 5E B9 46 B7 FB 54 EB 94 A8 33 31>)
$$ ##END=
$$ 
$$ hash MD5
$$ 82 DA 5F A0 A0 53 A2 76 9E D9 F5 7A E9 79 34 9F
##$RELAX= 
##$RELAX= 
##$RELAX= 
##$RELAX= 
##$RELAX= 
##$RELAX= 
$$ Bruker specific parameters
$$ --------------------------
##$DU= <F:/spectra>
##$EXPNO= 1
##$NAME= <H-F>
##$PROCNO= 1
##$TYPE= <nmr>
##$USER= <she>
##$AMP= (0..31)
100 100 100 100 100 100 100 100 100 100 100 100 100 100 100 100 100 100 
100 100 100 100 100 100 100 100 100 100 100 100 100 100 
##$AQSEQ= 0
##$AQ_mod= 1
##$AUNM= <au_zg>
##$AUTOPOS= <>
##$BF1= 200.13
##$BF2= 200.13
##$BF3= 200.13
##$BF4= 200.13
##$BF5= 200.13
##$BF6= 200.13
##$BF7= 200.13
##$BF8= 200.13
##$BYTORDA= 1
##$CFDGTYP= 0
##$CFRGTYP= 5
##$CHEMSTR= <none>
##$CNST= (0..31)
1 1 145 1 1 1 1 1 1 1 1 1 1 1 1 1 1 1 1 1 1 1 1 1 1 1 1 1 1 1 1 1 
##$CPDPRG= <>
##$CPDPRG1= <>
##$CPDPRG2= <>
##$CPDPRG3= <>
##$CPDPRG4= <mlev>
##$CPDPRG5= <mlev>
##$CPDPRG6= <mlev>
##$CPDPRG7= <mlev>
##$CPDPRG8= <mlev>
##$CPDPRGB= <>
##$CPDPRGT= <>
##$D= (0..31)
0 1.2 0 0 0 0 0 0 0 0 0 0.03 0 0 0 0 0 0 0 0 0 0 0 0 0 0 0 0 0 0 0 0 
##$DATE= 1559210140
##$DBL= (0..7)
120 120 120 120 120 120 120 120 
##$DBP= (0..7)
150 150 150 150 150 150 150 150 
##$DBP07= 0
##$DBPNAM0= <>
##$DBPNAM1= <>
##$DBPNAM2= <>
##$DBPNAM3= <>
##$DBPNAM4= <>
##$DBPNAM5= <>
##$DBPNAM6= <>
##$DBPNAM7= <>
##$DBPOAL= (0..7)
0.5 0.5 0.5 0.5 0.5 0.5 0.5 0.5 
##$DBPOFFS= (0..7)
0 0 0 0 0 0 0 0 
##$DE= 6
##$DECBNUC= <off>
##$DECIM= 24
##$DECNUC= <off>
##$DECSTAT= 4
##$DIGMOD= 1
##$DIGTYP= 9
##$DL= (0..7)
0 120 120 120 120 120 120 120 
##$DP= (0..7)
150 150 150 150 150 150 150 150 
##$DP07= 0
##$DPNAME0= <>
##$DPNAME1= <>
##$DPNAME2= <>
##$DPNAME3= <>
##$DPNAME4= <>
##$DPNAME5= <>
##$DPNAME6= <>
##$DPNAME7= <>
##$DPOAL= (0..7)
0.5 0.5 0.5 0.5 0.5 0.5 0.5 0.5 
##$DPOFFS= (0..7)
0 0 0 0 0 0 0 0 
##$DQDMODE= 0
##$DR= 18
##$DS= 0
##$DSLIST= <SSSSSSSSSSSSSSS>
##$DSPFIRM= 0
$$ [...]
##$SUBNAM2= <"">
##$SUBNAM3= <"">
##$SUBNAM4= <"">
##$SUBNAM5= <"">
##$SUBNAM6= <"">
##$SUBNAM7= <"">
##$SUBNAM8= <"">
##$SUBNAM9= <"">
##$SW= 24.9336996594482
##$SWIBOX= (0..15)
0 0 2 0 0 0 0 0 0 0 0 0 0 0 0 0 
##$SW_h= 4990.01996007984
##$TD= 16384
##$TD0= 1
##$TE= 0
##$TE2= 300
##$TE3= 300
##$TEG= 300
##$TL= (0..7)
0 120 120 120 120 120 120 120 
##$TP= (0..7)
150 150 150 150 150 150 150 150 
##$TP07= 0
##$TPNAME0= <>
##$TPNAME1= <>
##$TPNAME2= <>
##$TPNAME3= <>
##$TPNAME4= <>
##$TPNAME5= <>
##$TPNAME6= <>
##$TPNAME7= <>
##$TPOAL= (0..7)
0.5 0.5 0.5 0.5 0.5 0.5 0.5 0.5 
##$TPOFFS= (0..7)
0 0 0 0 0 0 0 0 
##$TUNHIN= 0
##$TUNHOUT= 0
##$TUNXOUT= 0
##$USERA1= <user>
##$USERA2= <user>
##$USERA3= <user>
##$USERA4= <user>
##$USERA5= <user>
##$V9= 5
##$VALIST= <valist>
##$VCLIST= <CCCCCCCCCCCCCCC>
##$VD= 0
##$VDLIST= <DDDDDDDDDDDDDDD>
##$VPLIST= <PPPPPPPPPPPPPPP>
##$VTLIST= <TTTTTTTTTTTTTTT>
##$WBST= 1024
##$WBSW= 4
##$XGAIN= (0..3)
0 0 0 0 
##$XL= 0
##$YL= 0
##$YMAX_a= 228130
##$YMIN_a= -334292
##$ZGOPTNS= <>
##$ZL1= 120
##$ZL2= 120
##$ZL3= 120
##$ZL4= 120
##$ABSF1= 10
##$ABSF2= 0
##$ABSG= 5
##$ABSL= 3
##$ALPHA= 0
##$AQORDER= 0
##$ASSFAC= 0
##$ASSFACI= 0
##$ASSFACX= 0
##$ASSWID= 0
##$AUNMP= <proc_1d>
##$AZFE= 0.1
##$AZFW= 0.1
##$BCFW= 1
##$BC_mod= 2
##$BYTORDP= 1
##$COROFFS= 0
##$CY= 11.3945322036743
##$DATMOD= 1
##$DC= 2
##$DFILT= <>
##$DTYPP= 0
##$F1P= 18.9103706918063
##$F2P= -1.10871071338519
##$FCOR= 0.5
##$FTSIZE= 0
##$FT_mod= 4
##$GAMMA= 1
##$GB= 0.15
##$INTBC= 1
##$INTSCL= 1
##$ISEN= 128
##$LB= 0.24
##$LEV0= 0
##$LPBIN= 0
##$MAXI= 10000
##$MC2= 0
##$MEAN= 0
##$ME_mod= 0
##$MI= 1.114404
##$NCOEF= 0
##$NC_proc= 0
##$NLEV= 6
##$NOISF1= 3.799351
##$NOISF2= 2.8
##$NSP= 1
##$NTH_PI= 0
##$NZP= 0
##$OFFSET= 15.70392
##$PC= 1
##$PHC0= -8502.211
##$PHC1= 22.00023
##$PH_mod= 1
##$PKNL= yes
##$PPARMOD= 0
##$PSCAL= 0
##$PSIGN= 0
##$REVERSE= no
##$SF= 200.130013532006
##$SI= 16384
##$SIGF1= 3
##$SIGF2= 2
##$SINO= 400
##$SIOLD= 16384
##$SREGLST= <1H.CDCl3>
##$SSB= 0
##$STSI= 0
##$STSR= 0
##$SW_p= 3612.71676300578
##$SYMM= 0
##$S_DEV= 0
##$TDeff= 0
##$TDoff= 0
##$TI= <>
##$TILT= no
##$TM1= 0
##$TM2= 0
##$TOPLEV= 0
##$USERP1= <user>
##$USERP2= <user>
##$USERP3= <user>
##$USERP4= <user>
##$USERP5= <user>
##$WDW= 1
##$XDIM= 8192
##$YMAX_p= 0
##$YMIN_p= 0
$$ End of Bruker specific parameters
$$ ---------------------------------
##NTUPLES= NMR FID
##VAR_NAME=  TIME,          FID/REAL,        FID/IMAG
##SYMBOL=    X,             R,               I
##VAR_TYPE=  INDEPENDENT,   DEPENDENT,       DEPENDENT
##VAR_FORM=  AFFN,          ASDF,            ASDF
##VAR_DIM=   8192,          8192,            8192
##UNITS=     SECONDS,       ARBITRARY UNITS, ARBITRARY UNITS
##FACTOR=    0.0002004,     1,               1
##FIRST=     0,             0,               0
##LAST=      1.6414764,     0,               0
##MIN=       0,             -334292,         0
##MAX=       1.6414764,     228130,          0
$$ Real data points
##PAGE= N=1
##DATA TABLE= (X++(R..R)), XYDATA
$$ plain form
0 0 0 0 0 0 1 0 2 -8 8 -8 16 -16 24 -32 33 -41 49 -64 72 -85 100 -115 135 -156 177 -204 234 -265 301 -341
30 -341 383 -431 486 -542 605 -673 750 -833 925 -1026 1135 -1255 1393 -1541 1707 -1894
46 -1894 2105 -2343 2616 -2936 3307 -3757 4305 -4996 5891 -7111 8878 -11677 16821 -29392
60 -29392 126348 54637 -263858 -157776 52244 159224 63227 -23761 -32074 38159 34837 -31595
72 -31595 -87360 -47359 42227 123651 98439 -23540 -152074 -161078 -30384 156614 191435 1986
84 1986 -192143 -138619 49849 104569 -13965 -100575 -21249 119775 97828 -96239 -209145
95 -209145 -81026 124715 184099 64924 -100773 -160605 -71143 54692 98034 58787 -7178
106 -7178 -49302 -26686 23647 12644 -50388 -52655 50648 154634 98359 -111339 -225619 -64469
$$ packed form
0@%%%%JjKj0J6j6K4l2M0n6O5p4R0j13J36j57J85k15K50k91L33l81M38m99N66o42
30c41P24q14R17j028J147j278J423j583J758j951K161k390K648k934L248l601
46a894L999m448M959n552O243p064Q062r301J0887j3002J5989k0555K8498m6213
60b9392J55740p1711l18495J06082K10020J06980r5997q6988q313P0233l322o6432
72c1595n5765M0001Q9586Q1424k5212j21979j28534r004J30694J86998L4821j89449
84A986j94129N3524J88468N4720j18534q6610P9326J41024k1947j94067j12906
95b09145J28119K05741N9384j19175j65697n9832Q9462J25835M3342l9247o5965
106g178m2124K2616N0333j1003o3032k267J03303J03986n6275k09698j14280J61150
$$ plain form
118 -64469 179868 203114 15920 -135621 -112078 14000 82213 22037 -50604 -12051 71482
129 71482 64502 -33113 -111201 -90692 17265 115488 112637 7682 -121832 -160438 -38788 129787
141 129787 133853 -23293 -119554 -50362 52409 41940 -62362 -101667 14250 145430 95408
152 95408 -86750 -176327 -81927 81625 148969 65052 -65338 -102784 -43342 23797 52066
163 52066 33424 -13571 -22252 27048 48509 -16809 -94597 -69300 66796 167215 81640 -110400
175 -110400 -169567 -32534 117794 122604 9443 -83617 -55486 36910 48727 -29161 -63237
186 -63237 221 76004 75954 -6130 -98779 -104452 -9665 96267 114722 19077 -107593 -121408
198 -121408 797 97114 52444 -44597 -60443 11067 67057 15697 -92178 -98433 32636
$$ packed form
118f4469K44337K3246j87194j51541K3543J26078O8213o0176p2641L8553Q3533
129G1482o980r7615p8088K0509J07957R8223k851j04955j29514l8606J21650J68575
141A29787M066j57146r6261O9192J02771j0469j04302l9305J15917J31180n0022
152I5408j82158q9577R4400J63552O7344q3917j30390l7446N9442O7139K8269
163E2066j8642m6995q681M9300K1461o5318p7788K5297J36096J00419q5575j92040
175a10400n9167J37033J50328M810j13161r3060K8131R2396J1817p7888l4076
186f3237O3458P5783n0q2084r2649n673R4787J05932J8455r5645j26670j3815
198a21408J22205R6317m4670r7041j5846P1510N5990n1360j07875o255J31069
$$ plain form
209 32636 136284 84205 -56729 -132852 -70921 56936 108987 44383 -37317 -56488 -19970
220 -19970 29094 39965 -7960 -42622 3474 73589 65168 -29092 -108379 -66952 72031 144394
232 144394 54025 -83560 -108946 -16094 79282 73899 -15290 -62561 -5410 56792 28865 -42737
244 -42737 -65939 -16032 61952 86574 15364 -81550 -99170 -19422 79216 94512 896 -89910
256 -89910 -63029 29642 59445 3174 -56225 -39756 41995 81450 4774 -95743 -83535 25459
268 25459 102730 70392 -33710 -96851 -50155 41111 70230 24465 -33260 -44191 5545 55222
280 55222 24852 -50231 -59763 15812 85380 65314 -33533 -103046 -50717 64474 99998 24309
292 24309 -63456 -69693 3848 64724 32639 -42199 -49424 12859 55443 32071 -33722 -75683
$$ packed form
209C2636J03648n2079j40934p6123O1931J27857N2051o4604q1700j9171L6518
220a9970M9064J0871m7925l4662M6096P0115q421r4260p9287M1427J38983P2363
232A44394r0369j37585k5386R2852R5376n383q9189m7271N7151O2202k7927p1602
244d2737k3202M9907P7984K4622p1210r6914j7620P9748R8638J5296r3616r0806
256h9910K6881R2671K9803n6271n9399J6469Q1751L9455p6676j00517J2208J08994
268B5459P7271l2338j04102o3141M6696R1266K9119m5765n7725j0931M9736M9677
280E5222l0370p5083r532P5575O9568k0066r8847o9513N2329J15191L5524p5689
292B4309q7765o237P3541O0876l2085p4838p225O2283M2584k3372o5793m1961
$$ plain form
304 -75683 -34826 53605 81707 14983 -69244 -81012 -7196 71383 57315 -28855 -68825 -19070
316 -19070 44389 44104 -18839 -69218 -31251 57837 75676 -2902 -75499 -61861 15722 76129
328 76129 52661 -28285 -67502 -25271 38899 55122 8612 -48829 -39262 34548 68998 11724
340 11724 -59563 -58677 15107 80812 57295 -36536 -82950 -24869 56807 65697 2198 -57647 -43654
353 -43654 26553 56431 9499 -46083 -44926 5646 54768 42991 -30186 -76167 -31578 47736
365 47736 65732 6525 -63431 -60787 14848 66304 25285 -46024 -56320 -406 54756 41465
377 41465 -31787 -69396 -16644 53627 55693 -2144 -53513 -47141 15558 61703 33649 -30613
389 -30613 -51787 -10468 46998 53347 -8466 -60802 -26905 46071 62329 7259 -54260 -51583
$$ packed form
304g5683M0857Q8431K8102o6724q4227j1768P3816P8579j4068q6170l9970M9755
316a9070O3459k85o2943n0379L7967Q9088J7839p8578p2597J3638P7583O0407
328G6129k3468q0946l9217M2231O4170J6223m6510n7441R567P3810L4450n7274
340A1724p1287Q86P3784O5705k3517r3831m6414N8081Q1676Q890o3499n9845J3993
353d3654P0207K9878m6932n5582J157N0572M9122j1777p3177m5981M4589P9314
365D7736J7996n9207o9956K644P5635N1456m1019p1309j0296N5914N5162j3291
377D1465p3252l7609N2752P0271K066n7837n1369O372O2699M6145k8054o4262
389c0613k1174M1319N7466O349o1813n2336L3897P2976J6258n5070o1519K677
$$ plain form
401 -51583 19442 73005 35296 -42308 -59232 -4592 51330 46299 -14512 -56743 -26153 34616
413 34616 48087 6368 -43586 -48870 4577 57674 35633 -36090 -63797 -17755 44786 51970
425 51970 -8044 -64772 -41000 32985 58388 8307 -51088 -51533 9509 59175 30219 -37441
437 -37441 -53666 -6518 42063 43843 -3069 -49501 -34922 26226 55155 19282 -35769 -48201
449 -48201 951 57031 44431 -24060 -56443 -14949 44546 53759 470 -54561 -37853 32536
461 32536 60143 12480 -42918 -44042 5565 50315 34118 -24781 -51450 -17101 32812 44669
473 44669 4511 -47947 -44791 16268 53434 18836 -39189 -52878 -6840 48993 42652 -24437
485 -24437 -63519 -23331 39942 49627 -1612 -53965 -41564 22104 52366 14765 -35522 -41878
$$ packed form
401e1583P1025N3563l7709p7604j6924N4640N5922n031o0811m2231L0590O0769
413C4616J3471m1719m9954n284N3447N3097k2041p1723k7707M6042O2541P184
425E1970o0014n6728K3772P3985K5403n0081n9395m45O1042M9666k8956o7660
437c7441j6225M7148M8581J780m6912m6432J4579O1148K8929l5873n5051j2432
449d8201M9152N6080j2600o8491l2383M1494N9495R213n3289n5031J6708P0389
461C2536K7607m7663n5398j124M9607M4750j6197n8899k6669L4349M9913J1857
473D4669m0158n2458L156O1059L7166l4598n8025j3689M6038N5833o341o7089
485b4437l9082M0188O3273R685n1239n2353J2401O3668L0262l7601n0287o356
$$ plain form
497 -41878 -3461 41143 39803 -13644 -50703 -22715 32422 49869 11476 -41724 -44823 13741
509 13741 58083 29689 -31543 -49848 -6878 48363 46908 -14933 -55632 -20306 37940 46115
521 46115 3128 -40644 -37362 11939 47095 23458 -26919 -44084 -12452 34647 42891 -6240
533 -6240 -52100 -32678 24215 47246 12252 -40490 -50210 3830 53303 29919 -33081 -52054
545 -52054 -9339 41440 40657 -11946 -51060 -25221 28679 44458 11141 -32971 -41425 883 46982
558 46982 34217 -19223 -44502 -15071 33243 47111 3266 -46565 -33347 26896 54154 17837
570 17837 -37515 -47367 4236 54855 36337 -24264 -46286 -11678 32253 39245 1398 -39542
582 -39542 -29146 18749 41752 14239 -29910 -43252 -4846 44349 38650 -17176 -51948 -26053
$$ packed form
497d1878L8417M4604j340n3447l7059K7988N5137J7447l8393n3200l099N8564
509A3741M4342k8394o1232j8305M2970N5241j455o1841m0699L5326N8246Q175
521D6115m2987m3772L282M9301L5156k3637n0377j7165L1632M7099Q244m9131
533f240m5860J9422N6893K3031l4994n2742r720N4040M9473k3384o3000j8973
545e2054M2715N0779p83n2603l9114K5839N3900J5779l3317m4112q454M2308M6099
558D6982j2765n3440k5279K9431M8314J3868m3845m9831J3218O0243K7258l6317
570A7837n5352r852N1603N0619j8518o0601k2022L4608M3931O992l7847m0940
582c9542J0396M7895K3003k7513m4149j3342L8406M9195n699n5826l4772K5895
$$ plain form
594 -26053 26406 47627 9797 -43739 -41064 15463 45875 13963 -33772 -39589 2120 44014
606 44014 31418 -21820 -47888 -17878 29218 45772 12633 -37037 -40934 6686 42956 25056
618 25056 -18459 -37229 -8060 37896 38428 -14153 -49878 -19535 36190 51740 8519 -46357
630 -46357 -45207 11554 49548 25888 -20552 -37659 -12397 27466 31466 -9332 -39126 -17032
642 -17032 26277 39598 5592 -42726 -46824 6613 52726 34200 -22127 -51673 -24134 29354
654 29354 42352 -2131 -40367 -19971 23713 32380 -973 -37661 -32836 15547 49743 25141
666 25141 -26477 -48620 -20666 30443 49563 10040 -36135 -32007 9146 33585 15287 -23905
678 -23905 -32434 10252 48029 23276 -34335 -51196 -9573 44036 50179 285 -46968 -36290
$$ packed form
594b6053N2459K1221l7830n3536K675N6527L0412l1912m7735n817M1709M1894
606D4014j2596n3238k6068L0010M7096J6554l3139m9670l897M7620L6270j7900
618B5056m3515j8770K9169M5956N32n2581l5725L0343N5725J5550m3221n4876
630d6357J150N6761L7994k3660m6440j7107K5262L9863M000m0798k9794K2094
642a7032M3309J3321l4006m8318m098N3437M6113j8526n6327k9546K7539N3488
654B9354J2998m4483l8236K0396M3684Q667l3353l6688M825M8383L4196k4602
666B5141n1618k2143K7954N1109J9120l9523m6175M128M1153K4439j8298l9192
678b3905q529M2686L7777k4753n7611j6861M1623N3609O143m9894m7253J0678
$$ plain form
690 -36290 9116 34675 19823 -14474 -30020 -4345 27469 17414 -22658 -39436 -9510 36836
702 36836 47267 -1886 -57878 -48994 13834 54186 31139 -23682 -46900 -12938 29448 21743
714 21743 -16904 -27165 468 29906 27008 -11388 -45814 -29983 22708 52883 30674 -21593
726 -21593 -52090 -24855 30731 45909 8137 -28484 -19802 16349 31443 -239 -40113 -24076
738 -24076 34198 56156 13755 -41993 -52028 -7492 44140 45972 2833 -32100 -27903 -250
750 -250 22252 14316 -14011 -19665 9339 30488 10724 -31636 -49363 -10752 50538 57708 -5657
763 -5657 -62034 -47188 13036 47561 23925 -22921 -29433 5205 22815 -95 -26129 -21428 10338
776 10338 40053 30748 -16055 -50473 -34675 15610 53911 40726 -15031 -51056 -23931 25141
$$ packed form
690c6290M5406K5559j4852l4297j5546K5675L1814j0055m0072j6778K9926M6346
702C6836J0431m9153n5992Q884O2828M0352k3047n4821k3218L3962M2386p705
714B1743l8647j0261K7633K9438k898l8396l4426J5831N2691L0175k2209n2267
726b1593l0497K7235N5586J5178l7772l6621Q682L6151J5094l1682l9874J6037
738b4076N8274K1958m2401n5748j0035M4536N1632J832m3139l4933M197K7653
750b50K2502p936k8327n654K9004K1149j9764m2360j7727L8611O1290P170o3365
763e657n6377J4846O0224L4525k3636m6846o512L4638J7610k2910k6034M701L1766
776A0338K9715r305m6803l4418J5798N0285L8301j3185n5757l6025K7125M9072
$$ plain form
788 25141 33695 725 -25885 -6813 34037 31562 -23816 -56790 -17430 45458 58843 13759
800 13759 -41689 -51652 -9916 31969 33798 7652 -16124 -20056 -2338 12232 -111 -20923 -13542
813 -13542 19559 40137 15221 -43128 -65280 -11481 58693 58434 -6089 -54770 -39038 12537
825 12537 34070 5185 -22220 -6080 22506 18017 -12564 -35155 -25043 14791 46503 35289
837 35289 -9309 -45951 -42952 4182 52058 43310 -10328 -39817 -14574 23083 21572 -16345 -30933
850 -30933 11649 55856 30555 -37852 -62481 -18098 43097 58285 16633 -33080 -39466 -10565
862 -10565 13926 19404 9247 -5784 -7882 5417 8347 -11783 -32099 -20447 25330 56843 22214
875 22214 -51394 -71169 -11257 52604 48859 -5396 -42472 -22313 16353 14792 -17084 -22091 8890
$$ packed form
788B5141Q554l2970k6610J9072M0850k475n5378l2974L9360O2888J3385m5084
800A3759n5448r963M1736M1885J829k6146k3776l932J7718J4570j2343k0812P381
813a3542L3101K0578k4916n8349k2152N3799P0174k59o4523m8681J5732N1575
825A2537K1533k8885k7405J6140K8586m489l0581k2591J0112L9834L1712j1214
837C5289m4598l6642K999M7134M7876q748n3638k9489K5243L7657j511l7917j4588
850c0933M2582M4207k5301o8407k4629M4383O1195J5188m1652m9713o386K8901
862a0565K4491N478j0157j5031k098J3299K930k0130k0316J1652M5777L1513l4629
875B2214p3608j9775N9912O3861l745n4255l7076K0159L8666j561l1876n007L0981
$$ plain form
888 8890 32765 22207 -13948 -41911 -31250 9434 42089 40511 4985 -40390 -46570 -820 42977
901 42977 32277 -10243 -25706 2105 29326 7371 -38743 -34943 26683 65176 29354 -36570
913 -36570 -60778 -21154 35816 47798 12750 -19249 -21520 -9522 2593 7455 705 -6032 4124
926 4124 18956 13554 -17355 -46792 -30209 31438 65629 21922 -48163 -61406 -10049 40498
938 40498 34558 -10621 -29687 2 23132 1062 -30435 -26609 9466 39129 31029 -9200 -39878
951 -39878 -34366 -1852 33934 43511 10489 -34355 -36089 2855 29761 14324 -16201 -15168 21384
964 21384 37575 -4459 -51451 -35883 26485 61300 31118 -28515 -52338 -18052 24734 28855
976 28855 8055 -7280 -9592 -3222 3772 -1168 -13935 -11860 9221 31130 23836 -19807 -56069
$$ packed form
888H890K3875j0558l6155k7963J0661M0684L2655j578l5526m5375o180M5750M3797
901D2977j0700m2520j5463K7811K7221k1955m6114L800O1626L8493l5822o5924
913c6570k4208L9624N6970J1982l5048l1999k271J1998J2115M862o750o737J0156
926D124J4832n402l0909k9437J6583O1647L4191m3707p0085j3243N1357N0547
938D0498n940m5179j9066K9689K3130k2070l1497L826L6075K9663q100m0229l0678
951c9878N512L2514L5786R577l3022m4844j734L8944K6906j5437l0525J033L6552
964B1384J6191m2034m6992J5568O2368L4815l0182n9633k3823L4286M2786M121
976B8855k0800j5335k312O370O994m940j2767K075K1081K1909p294m3643l6262
$$ plain form
989 -56069 -31665 32495 57740 17338 -37149 -45539 -3724 31221 15141 -20287 -17097 16850
1001 16850 27593 -323 -32908 -32677 3309 38467 34932 466 -30585 -35664 -8779 29679 37356
1014 37356 4611 -25258 -17734 10552 20453 -2784 -26655 -8256 35985 40451 -8034 -49330
1026 -49330 -34666 18311 51460 28326 -20580 -36293 -11209 13193 14970 3155 -7816 -5290
1038 -5290 9198 11885 -6130 -25493 -21398 8876 39034 28704 -21594 -52387 -25056 25956
1050 25956 41994 10316 -29132 -28102 7959 23352 -2603 -25415 -11437 20054 30899 6200
1062 6200 -29729 -35515 -3157 30869 33867 7889 -25048 -32329 -3252 27139 21644 -6132 -18840
1075 -18840 -2183 21435 16981 -17686 -34322 -2535 38972 36727 -5793 -41001 -30831 13497
$$ packed form
989e6069K4404O4160K5245m0402n4487q390M1815L4945j6080l5428L190L3947
1001A6850J0743k7916l2585K31L5986L5158l535l4466l1051n079K6885L8458P677
1014C7356l2745k9869P524K8286R901k3237k3871J8399M4241M466m8485m1296
1026d9330J4664N2977L3149k3134m8906j5713K5084K4402J777j1815j0971K526
1038e290J4488K687j8015j9363M095L0274L0158j0330n0298l0793K7331N1012
1050B5956J6038l1678l9448J030L6061J5393k5955k2812J3978L1491J0845k4699
1062F200l5929n786L2358L4026K998k5978l2937p281K9077L0391n495k7776j2708
1075a8840J6657K3618m454l4667j6636L1787M1507k245m2520l5208J0170M4328
$$ plain form
1087 13497 38215 17947 -14988 -21996 -6091 11315 12094 -5659 -17589 -3333 19486 19278 -5537
1100 -5537 -31155 -28090 9000 40311 23923 -20663 -39622 -15694 21002 28230 -790 -25799
1112 -25799 -11396 17821 17814 -8221 -25933 -13829 17066 32859 11291 -23475 -31332 -7105 23725
1125 23725 31380 6250 -24074 -21677 7750 23783 8992 -14728 -17963 8156 31006 13906
1137 13906 -24175 -32505 -471 32504 30631 -3843 -32663 -21612 12624 26213 9206 -13258
1149 -13258 -18311 -1395 18315 11742 -14770 -24224 -3693 22029 24354 -3352 -33796 -26169 12282
1162 12282 33171 13067 -20181 -28891 -4939 22355 16968 -12368 -23107 -2008 19457 16910
1174 16910 -5635 -25673 -16625 14762 29886 11395 -17885 -26361 -6003 23218 25621 -3094
$$ packed form
1087A3497K4718k0268l2935p008J5905J7406P79j7753j1930J4256K2819k08k4815
1100e537k5618L065L7090L1311j6388m4586j8959K3928L6696P228k9020k5009
1112b5799J4403K9217pk6035j7712J2104L0895J5793k1568l4766p857K4227L0830
1125B3725P655k5130l0324K397K9427J6033j4791k3720l235K6119K2850j7100
1137A3906l8081q330L2034L2975j873l4474k8820J1051L4236J3589j7007k2464
1149a3258n053J6916J9710o573k6512r454K0531K5722K325k7706l0444P627L8451
1162A2282K0889k0104l3248q710K3952K7294n387k9336j0739K1099K1465k547
1174A6910k2545k0038R048L1387J5124j8491k9280q476K0358K9221K403k8715
$$ plain form
1186 -3094 -24065 -10897 15292 22698 2086 -22848 -18202 15344 31410 8194 -23112 -25483 -80
1199 -80 26129 22736 -7349 -26103 -12272 12566 20099 4509 -18229 -19793 5448 23731 9333
1212 9333 -17770 -25830 -5278 22920 23947 -7475 -32187 -17586 15008 25310 4629 -21827
1224 -21827 -22271 5287 23608 9140 -16050 -20333 -2451 18760 19699 -4555 -24998 -14351 12986
1237 12986 24677 9788 -15971 -23088 159 25569 18490 -10462 -22975 -6250 20362 24636
1249 24636 -2709 -26179 -13701 16521 25040 5643 -18171 -21156 2032 23348 15426 -10375
1261 -10375 -21525 -8566 13263 20281 1284 -22634 -18606 8109 23002 9228 -17057 -26160
1273 -26160 -3601 23853 18526 -12585 -27525 -9693 17093 21800 -1019 -24342 -17121 10175
$$ packed form
1186c094k0971J3168K6189P406k0612k4934M646L3546J6066k3216l1306k371K5403
1199h0K6209l393l0085j8754J3831K4838P533j5590k2738j564K5241J8283j4398
1212I333k7103q060K0552K8198J027l1422k4712J4601L2594J0302k0681k6456
1224b1827m44K7558J8321j4468k5190m283J7882K1211R39k4254k0443J0647K7337
1237A2986J1691j4889k5759p117K3247K5410p079k8952j2513J6725K6612M274
1249B4636k7345k3470J2478L0222Q519j9397k3814k985K3188K1316p922k5801
1261a0375j1150J2959K1829P018j8997k3918M028K6715J4893j3774k6285r103
1273b6160K2559K7454n327l1111j4940J7832K6786M707k2819k3323P221K7296
$$ plain form
1285 10175 21828 7079 -14591 -20251 -2381 19853 17972 -6112 -20812 -9876 13166 23058
1297 23058 6309 -19654 -20274 7876 26945 13823 -13077 -23192 -3143 24277 21458 -7198
1309 -7198 -22665 -8276 15176 20622 3306 -17869 -16450 6908 21448 10164 -10960 -20614 -6935
1322 -6935 16952 20584 -2911 -22880 -15147 9082 21502 7111 -19665 -23341 3443 23616 10962
1335 10962 -15543 -23273 -5178 18820 18950 -6003 -23208 -12265 10408 19588 6605 -14989 -19507
1348 -19507 901 19686 13825 -7437 -19647 -8391 15805 23470 258 -22888 -15428 11361
1360 11361 25045 10143 -16458 -21874 2347 23844 14299 -9522 -19059 -5603 14983 19110 -570
1373 -570 -19218 -13146 8230 19053 9001 -12290 -21608 -3973 18717 17129 -6234 -21952 -12804
$$ packed form
1285A0175J1653j4749k1670n660J7870K2234j881k4084j4700J0936K3042R892
1297B3058j6749k5963o20K8150J9069j3122k6900j0115K0049K7420k819k8656
1309g198j5467J4389K3452N446j7316k1175J419K3358J4540j1284k1124r654J3679
1322f935K3887L632k3495j9969P733K4229J2420j4391k6776l676K6784K0173j2654
1335A0962k6505p730J8095K3998J30k4953j7205J0943K2673R180j2983k1594m518
1348a9507K0408J8785n861k1262j2210J1256K4196P665k3212k3146P460K6789
1360A1361J3684j4902k6601n416K4221K1497r545k3821r537J3456K0586M127j9680
1373e70j8648O072K1376J0823j0052k1291r318J7635K2690j588k3363j5718R148
$$ plain form
1386 -12804 11875 22075 1776 -22832 -17706 8163 20776 7620 -15268 -21382 -1700 19597
1398 19597 14540 -8228 -19877 -9188 10722 19048 4015 -17193 -16605 4525 19490 12390 -8958
1411 -8958 -21069 -5803 19473 20187 -4700 -21453 -10579 13643 23516 4390 -19780 -16892 8115
1424 8115 21859 10010 -11209 -19138 -3958 16940 16585 -3806 -17311 -10472 7555 18463 6591
1437 6591 -15936 -19565 1571 20030 13047 -10146 -24207 -9445 17428 20590 -3713 -21842 -13269
1450 -13269 8463 18610 5236 -16068 -16704 3403 17312 8836 -9442 -18388 -6488 14539 19508
1463 19508 380 -18176 -14991 5213 20423 12730 -11314 -20251 -374 19499 13671 -7532 -19209
1476 -19209 -5850 17455 20969 -2508 -21302 -13173 9140 20556 10052 -12052 -19262 -2759
$$ packed form
1386a2804K4679J0200k0299k4608N126K5869J2613j3156k2888o114J9682K1297
1398A9597n057k2768j1649J0689J9910Q326j5033k1208N88K1130J4965p100k1348
1411h958j2111J5266K5276P14k4887j6753J0874K4222R873j9126k4170K888K5007
1424H115J3744j1849k1219p929J5180K0898l55k0391j3505O839J8027J0908j1872
1437F591k2527l629K1136J8459o983k3193j4061J4762K6873L162k4303j8129Q573
1450a3269K1732J0147j3374k1304o36K0107J3909q476j8278q946J1900K1027M969
1463A9508j9128j8556L185K0204J5210p693k4044q937J9877J9873n828k1203j1677
1476a9209J3359K3305L514k3477j8794Q129K2313J1416j0504k2104p210J6503
$$ plain form
1488 -2759 14987 12802 -3564 -15493 -9116 10322 17642 -197 -20476 -15981 7445 22206 11099
1501 11099 -15295 -25529 -4471 19101 16480 -4245 -18195 -10566 8341 15891 254 -16367
1513 -16367 -10515 8280 17363 7669 -12865 -21055 -3666 19559 20100 -830 -18757 -15433 6772
1526 6772 20991 8019 -13001 -13278 5677 16949 7447 -12282 -18311 747 21822 17739 -5877
1539 -5877 -21278 -13413 7740 21215 9887 -11695 -16455 -1870 11947 9281 -6245 -16249 -4117
1552 -4117 16727 15401 -7903 -24198 -14369 11352 25135 8992 -18470 -22620 -2452 15060 12388
1565 12388 -3453 -14304 -5378 10984 10686 -5508 -15814 -7959 10825 21851 8243 -17222 -24383
1578 -24383 -2948 20992 21583 145 -19308 -13043 9809 16231 -89 -12555 -5371 11037 17254
$$ packed form
1488b759J7746k185j6366j1929O377J9438P320j7839k0279M495K3426J4761j1107
1501A1099k6394j0234K1058K3572k621k0725j3950P629J8907P550j5637j6621
1513a6367N852J8795R083r694k0534q190J7389K3225N41k0930j7927L324K2205
1526F772J4219j2972k1020k77J8955J1272r502j9729o029J9058K1075m083k3616
1539e877j5401P865K1153J3475j1328k1582m760J4585J3817k666j5526j0004J2132
1552d117K0844j326k3304j6295R829K5721J3783j6143k7462m150K0168J7512k672
1565A2388j5841j0851Q926J6362k98j6194j0306P855J8784J1026j3608k5465p161
1578b4383K1435K3940N91k1438j9453O265K2852O422j6320j2466P184J6408O217
$$ plain form
1591 17254 2421 -18452 -18148 4349 22468 17471 -3175 -19923 -16455 5474 19099 9299 -8452
1604 -8452 -12742 -875 12009 6349 -13466 -18041 3503 23248 14691 -11854 -27711 -14979 14089
1617 14089 24578 6276 -15015 -16085 -2752 9239 7393 -4838 -9730 1297 12402 7698 -8235
1630 -8235 -19115 -10762 14395 27862 9806 -19389 -25245 -3582 20329 20225 -2655 -16795 -3953
1643 -3953 12406 8122 -8173 -13787 -1010 18030 19441 -1705 -21624 -17830 2493 19432 19783
1656 19783 435 -18891 -15877 3401 13832 5857 -8643 -9976 6020 15894 -381 -23068 -19293
1669 -19293 8118 27245 16299 -13372 -28821 -12565 12920 17943 4274 -8473 -9264 -868 5397
1682 5397 689 -8515 -6160 5757 15331 11000 -8758 -25517 -14363 16598 29770 10823 -17174
$$ packed form
1591A7254j4833k0873L04K2497J8119m997k0646j6748L468K1929J3625r800j7751
1604h452m290J1867J2884n660j9815m575K1544J9745q557k6545j5857J2732K9068
1617A4089J0489j8302k1291j070J3333J1991j846j2231m892J1027J1105m704j5933
1630h235j0880Q353K5157J3467j8056k9195n856K1663K3911j04k2880j4140J2842
1643c953J6359m284j6295n614J2777J9040J411k1146j9919L794K0323J6939L51
1656A9783j9348j9326L014J9278J0431p975j4500j333J5996R874j6275k2687L775
1669a9293K7411J9127j0946k9671j5449J6256K5485N023j3669j2747p91Q396O265
1682E397m708r204K355J1917R574m331j9758j6759J1154L0961J3172j8947k7997
$$ plain form
1695 -17174 -23975 -2899 18523 12756 -7523 -9744 6402 14719 3575 -14790 -17744 1500 22099
1708 22099 19694 -1153 -18333 -18766 -3172 16613 19549 1943 -14153 -12085 2400 10289 190
1721 190 -13552 -6786 16048 20225 -4681 -28132 -21682 8252 29180 16632 -13371 -24320 -8603
1734 -8603 7824 9622 1782 -4716 -2455 4659 4374 -4598 -11547 -8495 5355 20738 16724 -9299
1748 -9299 -28596 -15295 14853 27812 10821 -15148 -18004 2953 15235 2455 -12229 -5610
1760 -5610 12770 18820 2445 -19650 -20608 1624 20068 18619 3270 -13913 -19101 -5346 12671
1773 12671 14269 995 -10118 -6510 6673 8596 -8841 -19950 -3167 22381 22434 -4871 -29522
1786 -29522 -22592 8161 25849 11831 -10730 -14824 -4278 4803 4000 -3134 -5306 2897 10233 6665
$$ packed form
1695a7174o801K1076K1422n767k0279k221J6146Q317j1144j8365k954J9244K0599
1708B2099k405k0847j7180m33J5594J9785K936j7606j6096K068J4485P889j0099
1721A90j3742O766K2834M177k4906k3451O450K9934K0928j2548l0003j0949J5717
1734h603J6427J798p840o498K261P114k85q972o949L052J3850J5383m014k6023
1748i299j9297J3301L0148J2959j6991k5969k856K0957J2282j2780j4684O619
1760e610J8380O050j6375k2095r58K2232J8444j449j5349j7183n188J3755J8017
1773A2671J598j3274j1113L608J3183J923j7437j1109J6783K5548N3k7305k4651
1786b9522O930L0753J7688j4018k2561m094J0546R081q03p134k172Q203P336l568
$$ plain form
1800 6665 -4695 -15582 -14186 5553 24956 18540 -8992 -25796 -13711 12420 22668 5649
1812 5649 -14341 -8686 10506 11430 -5998 -16354 -5753 16226 22328 3117 -18724 -19072 -2379
1825 -2379 13852 18128 6230 -11187 -15034 -2910 8967 7942 -2963 -8921 431 14104 6825
1838 6825 -16270 -22897 -1996 22749 23005 -3735 -26562 -18521 7901 18227 6125 -7301 -8151
1851 -8151 426 6140 879 -8833 -7826 3308 13373 11906 -2486 -19303 -17066 5933 23743
1864 23743 15966 -7204 -20360 -8805 12389 15180 -3025 -12285 58 14261 10546 -8476 -19504
1877 -19504 -7331 15650 21429 4852 -13814 -17504 -5489 10382 15470 3312 -9599 -9022 856
1890 856 7870 2355 -10122 -10501 7236 18523 5469 -17698 -22736 -3032 20231 19969 -4045 -20545
$$ packed form
1800F665j1360j0887J396J9739J9403o416k7532j6804J2085K6131J0248j7019
1812E649j9990N655J9192R24j7428j0356J0601K1979O102j9211k1841l48J6693
1825b379J6231M276j1898j7417l847J2124J1877j025j0905n958R352J3673p279
1838F825k3095o627K0901K4745K56k6740k2827Q041K6422J0326j2102j3426q50
1851h151Q577N714n261r712J007J1134J0065j467j4392j6817K237K2999J7810
1864B3743p777k3170j3156J1555K1194K791j8205r260J2343J4203l715j9022j1028
1877a9504J2173K2981N779j6577j8666l690J2015J5871N088j2158j2911N77R878
1890H56P014n515j2477l79J7737J1287j3054k3167n038J9704K3263k62k4014j6500
$$ plain form
1904 -20545 -11266 6121 11040 2350 -7408 -6151 5485 9795 -6 -11337 -11112 716 15002 16328
1918 16328 -2036 -19532 -14770 5932 19655 11853 -8130 -15407 -574 13853 6839 -9543 -11766
1931 -11766 3151 16685 11524 -8842 -19566 -7217 12509 17766 5636 -10144 -15436 -3984
1943 -3984 10660 9920 -1606 -9560 -4818 6737 9796 -3053 -16781 -9728 10650 18365 4337
1956 4337 -16207 -19698 -1153 17378 12798 -5634 -13904 -5569 6735 9089 -1204 -10575 -4957
1969 -4957 8259 12003 1856 -11464 -14082 -293 16633 15317 -3414 -16402 -9723 7842 16018
1982 16018 5047 -11425 -9618 6619 13386 2661 -11258 -11551 3253 17008 11001 -8018 -16554
1995 -16554 -6746 8925 14651 4610 -10894 -12486 845 10667 6003 -6438 -11995 -1995 12552
$$ packed form
1904b0545R279J7387M919q690r758J257J1636M310r801j1331K25J1828J4286J326
1918A6328j8364j7496M762K0702J3723p802j9983p277J4833J4427p014j6382k223
1931a1766J4917J3534n161k0366j0724J2349J9726N257j2130j5780n292J1452
1943c984J4644p40j1526p954M742J1555L059j2849j3728P053K0378P715j4028
1956D337k0544l491J8545J8531m580j8432q270Q335J2304K354j0293r371N618
1969d957J3216L744j0147j3320k618J3789J6926j316j8731j2988O679J7565Q176
1982A6018j0971j6472J807J6237O767j0725j3919k93J4804J3755o007j9019q536
1995a6554R808J5671N726j0041j5504j592J3331R822m664j2441n557J0000J4547
$$ plain form
2008 12552 10739 -7170 -17728 -7256 10720 16413 2645 -15215 -14479 2588 13527 6735 -6375
2021 -6375 -11121 -2702 9215 9186 -3832 -12129 -4874 8395 13375 3798 -11807 -14569 2012 16199
2035 16199 11063 -5160 -14073 -4782 11183 13192 -1607 -12735 -4887 9006 12578 2017 -11506
2048 -11506 -10985 3953 14784 8097 -6629 -12864 -5641 8403 12840 398 -12058 -9131 4318
2061 4318 11921 4550 -10319 -13537 1031 14780 8316 -8430 -15167 -5156 10556 13014 -1471
2074 -1471 -14179 -8584 5432 11247 3845 -8017 -11137 87 11579 8339 -4724 -12020 -5787
2087 -5787 8338 14168 2302 -12712 -10861 5065 14677 7467 -7873 -13137 -278 13891 9863
2100 9863 -5559 -11971 -4181 8685 11951 1255 -11169 -8757 4598 11520 6089 -6096 -12123
$$ packed form
2008A2552j813j7909j0558J0472J7976N693j3768j7860P36J7067J0939o792j3110
2021f375m746Q419J1917k9j3018q297P255J3269M980r577j5605k762J6581J4187
2035A6199n136j6223q913R291J5965K009j4799j1128P848J3893L572j0561j3523
2048a1506N21J4938J0831o687j4726o235P223J4044M437j2442j2456K927J3449
2061D318P603p371j4869l218J4568J3749o464j6746o737J0011J5712K458j4485
2074a471j2708N595J4016N815p402j1862l120J1224J1492l240j3063p296O233
2087e787J4125N830j1866j5014J851J5926R612p210j5340n264J2859J4169m028
2100I863j5422o412P790J2866L266j0696j2424K412J3355O922n431j2185o027
$$ plain form
2113 -12123 -3400 10507 10419 -2731 -13027 -8479 6462 13466 2508 -13080 -12004 3538 12751
2126 12751 5376 -8396 -13061 -2053 11274 9376 -5183 -12266 -5733 6305 11121 2667 -9769
2139 -9769 -10482 1820 11227 7433 -4510 -12245 -4558 10566 12525 -1558 -12524 -7184 7454 14161
2153 14161 3854 -11232 -11245 3447 13621 6995 -5954 -11384 -3245 9328 10392 -1840 -10308
2166 -10308 -6096 4724 10852 4140 -8691 -11901 41 11390 8409 -4639 -13413 -6659 8908
2179 8908 12462 -986 -13081 -8709 5169 11091 3138 -10235 -11015 1843 11427 6230 -5642 -11106
2193 -11106 -4600 7697 10930 1096 -10071 -8479 2723 10947 6798 -6349 -11776 -805 12205
2206 12205 9618 -3894 -12320 -5041 9860 13193 356 -12025 -8080 5724 11982 5099 -6689
$$ packed form
2113a2123Q723J3907q8j3150j0296M548J4941P004j0958j5588J076J5542R213
2126A2751p375j3772m665J1008J3327j898j4559p083O533J2038M816q454j2436
2139i769p13J2302R407l794j1943p735P687J5124J959j4083j0966N340J4638O707
2153A4161j0307j5086j3J4692J0174o626j2949n430Q139J2573J064j2232q468
2166a0308M212J0820O128o712j2831l210J1942J1349k981j3048q774O754J5567
2179H908L554j3448j2095M372J3878N922p953j3373p80J2858R584n197j1872n464
2193a1106O506J2297L233r834j1167J592J1202Q224m149j3147n427J0971J3010
2206A2205k587j3512q426P279J4901L333j2837j2381L945J3804O258o883j1788
$$ plain form
2219 -6689 -10560 3 9550 7142 -3042 -9631 -5427 5860 11217 2412 -10492 -10442 2136 11583
2233 11583 7088 -7003 -13630 -3082 10873 9408 -4263 -12132 -6157 6809 10717 620 -10937
2246 -10937 -8301 3306 9914 5428 -5280 -10557 -2928 8718 9900 -935 -9811 -7187 4038
2259 4038 11679 4697 -9086 -10431 2394 12147 7945 -5534 -11871 -2648 11088 10748 -2204 -10741
2273 -10741 -5509 5939 11172 2817 -8314 -9083 1383 9152 6803 -3204 -10588 -4769 7183 10286
2287 10286 -403 -10659 -8738 3638 11479 4770 -9430 -12094 386 11096 7171 -5217 -12001
2300 -12001 -4567 8006 9798 -982 -9441 -6432 3145 9044 4090 -6019 -9643 -538 9037 8396
2314 8396 -2100 -10451 -6255 7356 12917 2693 -9960 -8454 3164 11418 6552 -6910 -9877
$$ packed form
2219f689l871J0563R547k408j0184o589M204J1287N357q805j2904N0J2578R447
2233A1583m495j4091o627J0548J3955j465j3671p869N975J2966L908j0097j1557
2246a0937K636J1607O608m486j0708n277P629J1646J182j0835q876K624J1225
2259D038P641o982j3783j345J2825R753m202j3479o337R223J3736l40j2952q537
2273a0741N232J1448N233q355j1131p69J0466P769k349j0007p384N819J1952L103
2287A0286j0689j0256J921J2376P841o709j4200k664J2480J0710l925j2388o784
2300a2001P434J2573J792j0780q459L009R577N899m954j0109l624R105R575o41
2314H396j0496q351M196J3611N561j0224j2653J506J1618Q254m866j3462k967
$$ plain form
2327 -9877 624 10284 6948 -3999 -9890 -3974 7192 10802 1110 -8935 -8021 1090 9072 6630
2341 6630 -4380 -10859 -3470 7690 7498 -2147 -10374 -6419 6219 11218 868 -12038 -9759 2322
2355 2322 10870 6340 -6259 -11249 -2761 7482 7273 -1717 -7630 -5043 4438 8866 1636 -8461
2369 -8461 -7947 2409 10902 8229 -4561 -12612 -4339 8950 11206 1005 -8839 -6797 3893 10069
2383 10069 2776 -7694 -6878 3278 10162 5296 -5747 -11001 -3491 8503 10413 868 -8774 -8927
2397 -8927 372 9420 5571 -5571 -8358 -329 7446 5253 -4928 -11283 -3387 9667 10444 -1670
2411 -1670 -11818 -9153 2556 11004 5827 -5516 -8964 -1654 5728 5189 -1705 -7620 -3007 7138
2425 7138 9077 -819 -10391 -8186 3858 13157 8005 -6459 -12176 -2819 7998 8630 -40 -7440
$$ packed form
2327i877J0501R660l336j0947n891N916J1166L610r692j0045R14R111P982k442
2341F630j1010o479P389J1160j92r645q227L955J2638M999j0350j2906K279J2081
2355B322Q548m530j2599m990Q488J0243k09q990n913K587R481M428p230j0097
2369h461N14J0356Q493k673j2790q051Q273J3289K256j0201r844K042J0690O176
2383A0069p293j0470Q16J0156O884m866j1043n254P510J1994J910r545r642j53
2397h927R299R048l849j1142k787Q029P775k193j0181o355P896J3054P77j2114
2411a670j0148K665J1709Q448n177j1343l448P310P382n39o894n915M613J0145
2425G138J939r896r572K205J2044R299n152j4464n717R357J0817O32q670p400
$$ plain form
2439 -7440 -3667 5897 7323 -1554 -8207 -4754 4704 10793 5669 -7123 -12123 -3532 8344 11131
2453 11131 1961 -8669 -8922 1963 8295 1868 -6917 -6155 3159 9131 3174 -8847 -11996 -970
2467 -970 10567 9453 -1286 -10779 -9039 1593 9004 4824 -3944 -6005 -938 4896 4039 -4257 -8658
2482 -8658 -358 10357 9919 -1625 -12238 -9431 5183 14432 6896 -6348 -9090 -1507 6491 5343
2496 5343 -2185 -5354 487 7443 5167 -3409 -8924 -5690 5485 12618 6054 -7231 -12156 -4525
2510 -4525 7121 10172 789 -8816 -5590 4387 5904 -2199 -8569 -4280 6795 11225 928 -11485
2524 -11485 -11281 -320 9352 8937 -73 -8871 -7700 973 5938 3045 -2619 -4365 1349 7288 2974
2539 2974 -8079 -10187 628 12343 11323 -2550 -13947 -8897 6226 11905 3921 -4763 -5353 1006
$$ packed form
2439g440L773R564J426q877o653L453R458O089n124j2792n000Q591J1876K787
2453A1131r170j0630k53J0885O332o427q785P62R314N972n957j2021l149J1026
2467i70J1537j114j0739r493J740J0632P411m180q768k061N067N834q57q296m401
2482h658Q300J0715m38j1544j0613K807J4614R249p536j3244k742P583P998j148
2496E343p528l169N841O956k276q576n515L234J1175P133o564j3285m925P631
2510d525J1646L051r383r605L226R977J517q103o370M289J1075M430j0297j2413
2524a1485K04J0961R672m15r010q798J171Q673M965k893n664j746N714N939m314
2539B974j1053k108J0815J1715j020j3873j1397N050J5123N679p984q684n90O359
$$ plain form
2553 1006 5699 1300 -5407 -3779 3667 8132 5136 -3704 -10748 -7005 5466 12483 6230 -5677
2567 -5677 -11508 -4746 7027 7849 -2210 -7465 -739 6680 4970 -5681 -11749 -3198 10223 11248
2581 11248 -306 -10381 -9873 -1428 7548 7900 331 -5587 -4305 798 3476 794 -4370 -3939 5145
2596 5145 9703 1791 -10007 -11756 565 13674 11825 -3527 -12295 -5994 5464 7341 1321 -4301
2610 -4301 -2072 4182 4459 -2037 -6976 -4091 3391 9121 7118 -3726 -11400 -7613 4028 10966 6493
2625 6493 -5321 -9918 -1944 6870 3458 -5246 -6474 2537 9502 4385 -8603 -12737 -2017 9671
2639 9671 9944 546 -8447 -8378 -1246 5774 5074 -272 -3611 -1808 2376 3737 -2123 -7622 -2950 8285
2655 8285 10860 1731 -10143 -11820 1271 13216 9000 -3808 -8431 -2550 5066 4516 -1932 -4968
$$ packed form
2553A006M693m399o707J628P446M465k996q840p044L743J2471P017o253j1907
2567e677n831O762J1773Q22j0059n255O726P419j710j0651o068Q551J3421J025
2581A1248j1554j0075N08Q445Q976L52p569n918J282N103K678k682n164M31R084
2596E145M558p912j1798j749J2321J3109j849j5352q768O301J1458J877o020n622
2610d301K229O254K77o496m939K885P482N730k003j0844p674L787J1641O938m473
2625F493j1814m597P974Q814l412q704j228R011O965n117j2988m134J0720J1688
2639I671K73r398q993O9P132P020p00n346l339J803M184J361n860n499M672J1235
2655H285K575r129j1874j677J3091J1945m216j2808m623N881P616n50o448l036
$$ plain form
2669 -4968 743 6874 4516 -2594 -7613 -5871 2620 10131 7425 -3221 -10016 -6821 3198 9407
2683 9407 3752 -6009 -6748 2137 5981 -144 -7832 -6216 4645 11388 3576 -9163 -11792 -2013 7508
2698 7508 8321 1259 -6689 -6042 310 3834 2065 -1427 -2987 589 5849 4120 -4793 -8960 -2267
2713 -2267 8384 11311 1280 -10695 -9556 3224 10347 4978 -3659 -5455 154 5229 2255 -5009
2727 -5009 -5107 1653 6964 5467 -1695 -8651 -6956 2159 9236 6287 -2611 -8652 -5279 3940 7100
2742 7100 -416 -6643 -2641 4928 5882 -2078 -9952 -6359 5516 10635 3055 -7080 -9299 -2507 5959
2757 5959 6766 -14 -5180 -3366 1495 3704 1026 -3733 -4444 2525 8071 3620 -5528 -9242 -2277
2772 -2277 8407 10469 125 -8761 -5990 3457 7013 2049 -4417 -3634 2790 6153 1399 -5722 -5787
$$ packed form
2669d968N711O131k358p110n019J742Q491P511k706j0646o795L195J0019O209
2683I407n655r761p39Q885L844o125p688J616J0861O743p812j2739k629R779R521
2698G508Q13p062p948O47O352L524j769l492j560L576N260j729q913m167O693
2713b267J0651K927j0031j1975J139J2780P123n369q637j796N609N075k974p264
2727e009r8O760N311j497p162o956J695R115P077k949q898o041L373R219L160
2742G100p516o227M002P569R54p960p874L593J1875N119p580j0135k219O792Q466
2757E959Q07o780n166J814M861K209k678m759p11O969N546m451r148l714O965
2772b277J0684K062j0344q886K771R447L556m964o466P83O424L363m754p121o5
$$ plain form
2787 -5787 344 6769 6731 -959 -8518 -6476 2233 7349 4744 -3543 -7618 -1693 5518 3825 -3806
2802 -3806 -6353 -990 6412 6012 -2944 -9889 -4931 5185 8374 2385 -5638 -7628 -1121 5662 4445
2817 4445 -1637 -4508 -1740 3122 4904 -373 -6225 -4140 4373 8453 3424 -5122 -8304 -958 8458
2832 8458 6943 -1775 -6459 -2702 4114 5757 -53 -5586 -3147 4241 6316 1313 -5001 -6052 -361
2847 -361 6753 6301 -1531 -7360 -4710 2709 6710 2079 -5702 -6102 1633 6114 1807 -5273 -6707 -5
2863 -5 7355 5542 -3592 -7778 -3275 3781 6662 1668 -5290 -5295 923 5526 3100 -2675 -5353 -1174
2879 -1174 5491 5797 -2025 -6822 -3511 4396 7883 2373 -5720 -6830 1634 7202 3853 -3016 -5172
2894 -5172 -1188 5465 5395 -1674 -5831 -2440 3354 5739 1825 -4882 -6041 262 6427 4432 -2659
$$ packed form
2787e787O131O425l8p690p559K042Q709N116k605q287m075N925P211j693p631
2802c806k547N363P402m00q956o945M958J0116L189n989q023j990O507O783j217
2817D445o082k871K768M862J782n277n852K085Q513M080n029q546l182P346R416
2832H458j515q718m684L757O816J643n810n533K439P388K075n003o314j051N691
2847c61P114m52p832n829K650P419M001m631p781m00P735M481m307p080j434O702
2863eP360j813r134m186M503P056K881m994o958nO218M603k426n775k678M179
2879a174O665L06p822m797L311P907L487n510q093j110Q464N568l349o869k156
2894e172L984O653p0p069m157L391N794K385l914o707j159O303O165j995p091
$$ plain form
2909 -2659 -6807 -3115 4341 5965 -747 -6940 -4112 3421 5955 1282 -5780 -6162 1053 6280 3160
2924 3160 -3665 -5936 -1962 4033 5359 -212 -5720 -3828 2278 5586 2858 -3741 -6388 -278 6555
2939 6555 5059 -2066 -6075 -2410 4917 6764 200 -6102 -4031 3172 6145 2086 -3980 -5355 -70
2954 -70 5377 4134 -2081 -4933 -2514 3032 5470 914 -5210 -4782 1350 5558 3036 -4085 -6855 -1328
2970 -1328 5790 4727 -2183 -6643 -3242 3498 5460 176 -5794 -4352 2141 5031 1805 -3297 -5159
2985 -5159 -1252 4953 4446 -1244 -5369 -3433 2687 6736 2405 -4679 -5560 1271 6168 3486 -2886
3000 -2886 -5426 -644 6011 4971 -2350 -6017 -2105 4044 6019 1412 -4710 -4870 770 4989 3251
3015 3251 -1811 -4687 -2597 3460 5032 -634 -5292 -3638 2369 6022 1906 -5726 -6620 554 6042
$$ packed form
2909b659m148L692P456J624o712o193K828P533K534m673p062l82P215N227l120
2924C160o825k271L974N995J326n571n508J892O106L308k728o599k647O110O833
2939F555j496p125m009L665P327J847o564o302K071P203K973m059o066j375N285
2954g0N447j243o215k852K419N546K438m556o124M28O132M208k522p121k770N527
2970a328P118j063o910m460L401O740J962n284n970J442O493K890l226n102j862
2985e159L907O205n07n690m125J936O120M049m331p084q81O831M897k682o372
3000b886k540M782O655j040p321l667L912O149J975m607o122j60N640M219j738
3015C251n062k876K090O057J572n666m658J654O007L653m116p632q94P174N488
$$ plain form
3030 6042 3748 -2955 -6300 -2290 4062 4663 -1104 -5006 -2587 2196 4280 1368 -3819 -4980 195
3045 195 5115 3918 -1580 -5156 -3440 3478 6251 1183 -5060 -3997 2221 5626 2732 -3759 -4902
3060 -4902 1062 6047 3227 -2582 -5041 -1778 3863 5236 374 -4665 -3616 1187 4205 2905 -2218
3075 -2218 -4981 -1037 4555 3962 -1636 -5519 -3119 3309 6269 18 -6262 -4982 1746 5250 2820
3090 2820 -3533 -5281 -283 4579 3308 -1982 -4169 -1891 2701 4798 1060 -4080 -4171 915 4900
3105 4900 3685 -1658 -5627 -2067 4866 5347 -544 -5051 -3017 2868 5713 1315 -5050 -3988 2225
3120 2225 5306 2734 -2995 -4772 -1279 4559 4243 -462 -4008 -3081 1371 4681 2022 -3539 -4846
3135 -4846 215 4648 3488 -1940 -5948 -2404 4298 4965 -1179 -5622 -3337 2488 5047 1379 -4478
$$ packed form
3030F042k294o703l345M010O352O01n767l902K419M783K084k912n187j161N175
3045A95M920j197n498l576J716O918K773n068o243J063O218L405k894o491j143
3060d902N964M985k820n809k459L263N641J373m862n039J049M803L018j300n123
3075b218k763L944N592n93n598l883K400O428K960o251o280J280O728L504k430
3090B820o353j748M998M862j271n290k187K278M592K097l738n140r1N086L985
3105D900j215n343l969L560O933M81n891m507K034N885K845m398o365J062O213
3120B225L081k572n729j777L493N838l16m705l546R27M452L310k659n561j307
3135d846N061M433j160n428m008L544O702O67o144m443K285N825K559l668n857
$$ plain form
3150 -4478 -4104 643 3909 2413 -2103 -4625 -2026 3124 4318 177 -3604 -3275 1174 4772 3219
3165 3219 -3073 -5557 -143 5060 4261 -1304 -5031 -2428 4124 5193 120 -4469 -2833 1943 4691
3180 4691 2142 -2994 -4254 0 4098 3316 -964 -4267 -3167 2029 5056 1238 -4121 -4585 354
3195 354 4399 3039 -3120 -5475 -810 4184 3368 -2180 -5109 -2696 3299 5055 402 -4524 -3771 443
3211 443 3911 2817 -1561 -4554 -1300 3026 3457 -25 -3627 -3108 2221 5385 1656 -4379 -4713 918
3227 918 5544 3864 -2012 -5497 -1364 4069 4266 -260 -3504 -2334 1832 4262 564 -3746 -3616 773
3243 773 4118 3492 -1797 -5179 -2873 2936 4728 612 -3743 -4159 684 4080 1499 -3675 -4081 1070
3259 1070 4796 2517 -2670 -5358 -2090 4069 4575 520 -3967 -3891 440 4085 2367 -1994 -3395 -282
$$ packed form
3150d478L74M747L266j496m516k522K599N150J194m141l781L29M449L598j553
3165C219o292k484N414N203p99n565l727K603O552J069n073m589J636M776K748
3180D691k549n136j260M254M098p82m280l303J100N196L027l818n359m64M939
3195C54M045j360o159k355M665M994q16n548k929K413N995J756m653m926P53M214
3211D43L468j094m378k993L254M326M31l482l602N19N329L164l729o035l34N631
3227I18M626j680n876l485M133N433J97m526l244J170M166K430l698m310J30M389
3243G73L345o26n289l382K306N809J792m116m355m16M843L396k581n174m06N151
3259A070L726k279n187k688L268O159N06m055m487P6M331L645j718m361j401L113
$$ plain form
3275 -282 3076 2654 -1064 -4736 -1630 4272 5267 142 -4765 -4071 1554 5451 3254 -2662 -4369 -873
3291 -873 3044 2531 -798 -3194 -963 3154 3947 -570 -4219 -3258 1176 5380 3280 -2474 -5790 -2186
3307 -2186 3028 3967 251 -3794 -2984 1982 3642 -469 -4195 -2734 1859 4744 1974 -3234 -5412
3322 -5412 -1351 3388 4465 1136 -3638 -3706 413 3769 1164 -2191 -2353 1002 4044 2559 -3219 -5022
3338 -5022 -306 5029 5002 -250 -4612 -3888 1630 4800 2271 -1862 -2455 -230 2615 2045 -1536 -3975
3354 -3975 -330 3998 3784 -710 -5281 -4313 1723 6247 3163 -2951 -4508 -1244 2853 2835 -1420 -3502
3370 -3502 -722 3100 2110 -1842 -4488 -2408 2590 5225 2414 -3133 -4656 -1672 2792 4267 1061
3385 1061 -3219 -2335 1421 2746 -402 -3107 -2583 2395 5397 1889 -4615 -4997 58 4937 4776 -194
$$ packed form
3275b82L358m22l718l672L106N902R95n125m907O94N625L897k197n916j707L496
3291h73L917n13l329k396K231M117P93m517l649R61M434M204k100n754l316L604
3307b186N214R39l716m045Q10M966J660m111l726J461M593K885k770n208k178
3322e412M061M739J077l329m774o8M119L356k605l355j62L355L042j485n778j803
3338e022M716N335k7n252m362P24N518L170k529m133n93K225K845n70l581k439
3354c975L645M328k14m494m571R68O036M524l084o114j557L264M097j8m255k082
3370c502K780L822r90l952k646K080M998K635k811n547j523K984M464J475l206
3385A061m280Q84L756J325l148k705N24M978L002l508o504l82N055M879j61m970
$$ plain form
3401 -194 -4265 -3045 1434 3139 1163 -1242 -1413 649 3102 651 -3368 -3539 -118 4449 4523 -515
3417 -515 -5913 -4394 1734 5182 2085 -2557 -3972 -575 3063 1255 -2833 -2576 858 3696 2193
3432 2193 -2160 -4702 -2943 2717 4651 2307 -2456 -4455 -2137 2533 3706 -148 -3050 -980 2358
3447 2358 2548 -1086 -4555 -2029 4092 5645 964 -4677 -4758 -187 4567 3875 -553 -2661 -1476 1315
3463 1315 1268 130 -1765 -1174 1611 3486 788 -3692 -4087 -672 4787 5079 -1170 -5524 -3688 1708
3479 1708 4108 900 -2736 -2481 1479 2819 -502 -3636 -2299 1160 4059 2469 -2056 -5158 -2305
3494 -2305 2033 4009 2297 -2050 -3742 -941 3052 2080 -1285 -2553 392 3734 2846 -2361 -5138
3509 -5138 -1145 4460 5071 1007 -3805 -3950 318 3425 2184 -863 -1483 -158 1559 1368 -1297 -2988
$$ packed form
3401a94m071J220M479J705j976k405j71K062K453k451m019j71L421M567P4n038
3417e15n398J519O128L448l097m642j415L397L638j808m088K57L434K838j503
3432B193m353k542J759N660J934k344m763j999K318M670J173l854k902K070L338
3447B358J90l634l469K526O121J553m681n641q1M571M754o92m428k108J185K791
3463A315m7j138j895N91K785J875k698m480l95L415N459K92o249m354J836N396
3479A708K400l208l636K55L960J340l321l134J337L459K899j590m525l102K853
3494b305M338J976j712m347j692K801L993r72l365j268K945L342q88n207k777
3509e138L993N605O11m064m812j45M268L107j241l047o20J325J717j91k665j691
$$ plain form
3525 -2988 -1063 2617 4192 722 -3846 -4736 -526 4823 4036 -1729 -4375 -2207 1824 2897 -595
3540 -595 -3167 -940 2701 2425 -988 -3810 -2415 1255 4223 2628 -1468 -3957 -2560 1376 3623
3555 3623 2088 -2359 -2424 757 2715 1019 -2153 -2808 1081 4652 2705 -3097 -4993 -1300 3701 4709
3571 4709 745 -3185 -2759 844 2543 841 -1087 -1647 226 1986 1494 -1781 -3385 -1155 3110 3778
3587 3778 712 -4147 -4257 378 4062 2398 -1931 -3627 -876 2594 1906 -2065 -3274 -154 2970
3602 2970 2853 -838 -3879 -2834 1049 3761 2136 -1363 -3233 -1701 1785 2971 523 -2437 -1184
3617 -1184 1954 2976 430 -3405 -3094 1720 5032 2094 -2606 -4113 -560 2988 3519 -187 -2718
3632 -2718 -1283 1121 1644 465 -1998 -2114 1067 2873 1637 -2190 -3572 -1174 2648 3808 32
$$ packed form
3525b988J925L680J575l470m568q90M210N349p87n765k646K168M031J073l492
3540e95k572K227L641k76l413k822J395L670K968j595m096k489J397L936K247
3555C623j535m447o5L181J958j696l172o55L889L571j947n802j896L693N001J008
3571D709l964l930M26L603J699j702j928n60J873J760m92l275j604K230M265O68
3587C778l066m859j10M635L684j664m329j696K751L470o88l971j209L120L124
3602B970j17l691l041J045L883K712j625l499j870J532L486J186k448k960J253
3617a184L138J022k546l835L11M814L312k938m700j507L553L548N31l706k531
3632b718J435K404N23j179k463j16L181J806j236l827j382K398L822J160l776
$$ plain form
3647 32 -3826 -2745 809 2981 1222 -2544 -2573 397 2848 774 -2173 -2762 -471 2655 2939 -571
3663 -571 -3662 -2441 1209 3119 1723 -1507 -2941 -615 2574 2092 -883 -2853 -854 2531 3262 -222
3679 -222 -3941 -2397 2112 4102 1594 -2018 -3145 -116 2886 2153 -1011 -2157 -1227 1329 2546 76
3695 76 -2503 -1943 1083 2872 1484 -1696 -3688 -746 2746 2893 -964 -3019 -1800 1474 2726 211
3711 211 -3245 -2321 1163 2700 718 -1959 -2414 -493 2566 2508 -651 -3120 -1864 1397 2885 946
3727 946 -2306 -2656 651 3016 1408 -1636 -2740 -550 2710 3105 -887 -3207 -1440 2067 3359 918
3743 918 -2605 -2464 715 2532 1374 -1328 -2378 -837 2208 2322 -247 -2822 -1842 1119 2801 1251
3759 1251 -2454 -3210 308 3147 1763 -1719 -3024 -878 2264 2441 -452 -2800 -1559 1307 2725
$$ packed form
3647C2l858J081L554K172j759l766k9K970K451k074k947n89K291L126K84l510
3663e71l091J221L650J910j396l230j434K326L189m82k975j970J999L385P31l484
3679b22l719J544M509J990k508l612j127L029L002p33l164j146R30K556J217k470
3695G6k579N60L026J789j388l180j992K942L492J47l857k055J219L274J252k515
3711B11l456R24L484J537j982k677m55J921L059n8l159k469J256L261J488j939
3727I46l252l50L307K365j608l044j104K190L260L95l992k320J767L507J292k441
3743I18l523J41L179J817j158k702j050J541L045J14k569k575R80K961J682j550
3759A251l705p56L518K839j384l482j305K146L142J77k893k348J241K866J418
$$ plain form
3774 2725 879 -1925 -2583 93 2588 1632 -971 -2673 -1287 1783 2971 281 -3031 -1800 1257
3789 1257 3229 1308 -1985 -2835 392 3213 1830 -1120 -2335 -404 2179 2564 -84 -2421 -1471 1184
3805 1184 2363 1223 -1527 -2474 -513 2129 2047 -916 -2725 -1466 1310 2515 36 -2911 -2277 1089
3821 1089 2865 1068 -2051 -3137 -132 2391 1929 -1151 -2586 -1385 1112 1991 512 -1964 -1865 790
3837 790 2429 1160 -1305 -2329 -626 3140 2551 -472 -2677 -1743 1950 3003 691 -2148 -1767 961
3853 961 2447 910 -1519 -2056 -245 2305 1989 -845 -2296 -1347 821 2499 1051 -1734 -2602 22
3869 22 2183 1304 -1181 -2595 -1106 2065 2243 -892 -3056 -1674 1764 2834 481 -2469 -2718 52
3885 52 2360 1168 -1074 -2145 -843 1499 2249 -355 -2099 -1073 939 2568 1174 -1925 -2725 298
$$ packed form
3774B725j846k804o58K676K495r56k603j702J386L070J188k690l312J231L057
3789A257J972j921l293q50L227K821j383k950j215J931K583L85k648k337R50K655
3805A184J179j140k750r47J961K642q2k963j809J259K776J205k479k947O34L366
3821A089J776j797l119j086L005K523m62l080j435J201K497Q79j479k476R9K655
3837G90J639j269k465j024J703L766n89l023k205R34L693J053k312k839L81K728
3853I61J486j537k429n37J811K550l16k834j451R49K168J678j448k785q68K624
3869B2K161q79k485j414J489L171J78l135k164J382L438J070k353k950k49K770
3885E2K308j192k242j071J302K342P50k604j744J026K012J629j394l099q00L023
$$ plain form
3901 298 2754 2042 -893 -2485 -1262 1674 2471 -184 -2082 -1178 1530 2249 514 -1564 -2127 595
3917 595 2439 1811 -1022 -2151 -1369 1233 2676 480 -2272 -1880 341 2162 1149 -1779 -2511 -126
3933 -126 2670 1488 -1373 -2684 -907 1899 2564 -117 -2200 -1801 514 1939 854 -651 -1842 -461
3949 -461 1699 1598 -613 -1999 -1336 1279 2737 455 -2071 -2242 406 2736 1894 -1365 -2436 -652
3965 -652 2345 2086 -584 -1833 -772 1520 2202 577 -1862 -1612 652 2013 1472 -645 -2281 -997
3981 -997 1832 2110 -133 -2035 -1874 637 2276 892 -2335 -2282 230 2289 1134 -1507 -2427 -555
3997 -555 2004 1697 -330 -2405 -1132 558 1965 720 -1350 -1964 302 1211 1621 -604 -2217 -1046
4013 -1046 1904 2557 143 -2155 -1581 1029 2539 621 -1708 -1979 736 2035 1214 -595 -2093 -501
$$ packed form
3901B98K456p12k935j592J223K936P97k655j898R04K708P19j735k078n63K722
3917E95J844o28k833j129P82K602J443k196k752L92K221J821j013k928p32K385
3933a26K796j182k861j311J777K806O65k681k083L99K315J425j085j505j191J381
3949d61K160j01k211j386O63K615J458k282k526j71K648K330q42l259j071J784
3965f52K997k59k670j249J061K292O82j625k439K50K264J361n41k117j636J284
3981i97K829K78k243j902J61K511J639j384l227N3K512K059j155k641r20J872
3997e55K559l07k027k075J273J690J407j245k070o14K266R09M10k225j613J171
4013a046K950O53k414k298N74K610J510j918k329k71K715J299q21j809j498J592
$$ plain form
4029 -501 1620 1957 -419 -1598 -1227 606 1809 1293 -1470 -2156 -587 1867 1478 -233 -2659 -1786 1385
4046 1385 2451 19 -2272 -1563 504 2131 1004 -1478 -2149 123 1748 1477 -604 -2030 -962 978
4062 978 2222 477 -1395 -1480 154 2020 1452 -685 -2261 -410 1906 1778 -452 -2389 -1059 1682
4078 1682 2618 398 -1881 -1659 496 1960 1307 -710 -2107 -583 1716 1151 -511 -1644 -1308 816
4094 816 2272 477 -1866 -2012 227 2190 1405 -1002 -2676 -826 1606 1854 -434 -1844 -1234 1219
4110 1219 1996 298 -2112 -1363 600 1814 1043 -871 -2119 -814 1328 1867 53 -1381 -1401 324
4126 324 1784 813 -1172 -1604 342 1966 1312 -1255 -2089 -642 1848 2134 -166 -1825 -1453 451 1826
4143 1826 943 -954 -1528 -245 1132 1045 -691 -1964 -655 1809 1979 -140 -2334 -2055 508 2178
$$ packed form
4029e01K121L37k376j179L71J833J203n16k763o86J569K454l89j711k426Q73L171
4046A385J066k432k291P09K067J627j127k482o71K272J625k71k081j426J068J940
4062I78J244j745j872q5J634J866n68k137j576J851K316j28k230j937J330K741
4078A682R36k220k279K22K155J464o53k017j397J524K299n65j662j133L36K124
4094H16J456j795k343j46K239J963p85k407j674J850K432K48k288j410O10K453
4110A219P77j698k410P49J963J214p71j914j248J305K142N39j814j434k0J725
4126C24J460r71j985m32J946J624o54k567q34J447K490K86k300j659L72J904J375
4143A826q83j897n74J283J377q7j736j273J309K464J70k119k194K79K563J670
$$ plain form
4159 2178 1520 -1166 -2515 -436 1439 1082 -644 -1663 -479 1425 1759 -443 -1903 -1367 410 2225
4175 2225 1277 -1040 -1969 -853 1444 1682 247 -1232 -1178 773 1959 76 -1698 -1059 863 2253
4191 2253 1177 -1468 -2290 -322 1625 1612 165 -1284 -1504 231 1460 196 -892 -928 267 1330
4207 1330 744 -1516 -1975 -416 1661 2138 -56 -2331 -1882 390 2093 986 -1120 -1078 -121 1335 470
4224 470 -1108 -1390 325 1813 1400 -449 -2048 -1523 581 2499 1190 -1276 -1954 -474 1216 1577
4240 1577 -386 -1640 -370 1711 1450 -565 -1798 -1222 1289 2298 842 -1454 -1934 -414 1290 1742
4256 1742 100 -1577 -786 884 1015 -33 -1458 -1192 564 2209 691 -2024 -2046 151 2073 2080 -432
4273 -432 -2246 -1522 501 1247 436 -1032 -327 452 1313 216 -1646 -1462 129 1688 1456 -174 -1824
$$ packed form
4159B178o58k686j349K079J875l57j726j019J184J904L34k202j460N36J777J815
4175B225r48k317r29J116K297K38j435j479N4J951J186j883j774O39J922J390
4191B253j076k645q22J968J947j3j447j449k20J735J229j264j088l6J195J063
4207A330n86k260m59J559K077M77k194k275M49K272J703j107k106M2R57J456q65
4224D70j578k82J715J488m13j849j599N25K104J918j309k466o78J480J690L61
4240A577j963j254J270K081k61k015j233N76K511J009j456k296m80J520J704M52
4256A742j642j677P91J670J31j048j425K66J756J645j518k715k2K197J922Pk512
4273d32j814P24K023P46q11j468P05P79Q61j097j862J84J591J559k32j630j650
$$ plain form
4290 -1824 -1195 1040 2010 628 -1056 -1526 -16 1486 691 -1194 -1340 648 1792 1119 -692 -2390
4306 -2390 -820 1245 1962 662 -1168 -1714 -446 1307 1237 -131 -1248 -9 694 887 -979 -1524 -978
4323 -978 1360 1884 138 -1840 -2091 -177 1831 1554 -625 -1749 -348 815 763 -306 -1075 -513 831
4340 831 1270 -170 -1016 -1624 -129 1652 1485 -438 -2058 -1371 511 1411 926 -1257 -926 667 1493
4357 1493 -92 -1043 -1135 604 1867 1130 -969 -2139 -513 1268 1417 424 -863 -1141 170 1068 886
4374 886 -719 -850 -147 1137 1198 -1091 -2028 -606 1483 1783 134 -1958 -1883 -75 1421 1214 -720
4391 -720 -1087 -248 716 713 -598 -1232 -21 778 1282 -302 -1448 -1560 125 1620 1298 -392 -1402 -597
4409 -597 1095 1524 -83 -1144 -809 1391 1186 -196 -1541 -1095 555 1919 901 -935 -1792 -486
$$ packed form
4290a824O29K235R70j382j684m70J510J502p95j885j46J988J144o73j811j698
4306b390J570K065P17j300j830n46J268J753p0j368j117J239P03J93j866n45N46
4323i78K338N24j746j978k51J914K008k77k179j124J401J163n2j069p69N62J344
4340H31M39j440q46o08J495J781j67j923j620O87J882R00m85k183L31J593Q26
4357A493j585r51r2J739J263p37k099j170J626J781J49r93j287k78J311Q98j82
4374H86j605j31P03J284O1k289r37J422K089L00j649k092P5J808J496k07j934
4391g20l67Q39R64lj311o34J211P99N04j584j146j12J685J495l22j690j010Q05
4409e97J692M29j607j061L35K200k05j382j345M46J650J364j018j836q57J306
$$ plain form
4425 -486 489 1248 94 -975 -987 757 1119 162 -869 -772 400 1448 1083 -1182 -1853 -639 1373 1791
4443 1791 142 -1732 -1191 324 1214 -15 -671 -842 109 1250 366 -822 -1283 -82 851 1383 195
4460 195 -1100 -1480 102 1645 871 -570 -1196 -317 956 996 -658 -1233 64 1247 932 -400 -1428
4477 -1428 -873 812 1609 538 -799 -1077 -602 502 1020 -394 -1234 -534 641 667 -219 -1265 -992 340
4495 340 1560 410 -781 -1547 -487 1295 1204 -105 -1138 -356 784 783 -38 -855 -909 386 1230 329
4513 329 -897 -1051 -650 1130 1727 -64 -1035 -819 593 1172 568 -716 -1273 462 1564 333 -668
4530 -668 -919 -107 1125 874 -191 -1275 -933 791 1266 415 -562 -893 -148 993 473 -484 -751 -151
4548 -151 584 915 -310 -1202 -924 493 1211 270 -882 -1250 42 1270 648 -450 -1278 -291 389 822
$$ packed form
4425d86R75P59j154j069j2J744L62r57j031R7J172J048l65k265o71J214K012M18
4443A791j649j874N41J515Q90j229o56j71R51J141q84j188m61J201R33N32j188
4460A95j295l80J582J543p74j441o26Q79J273M0j654n75J297J183l15j332j028
4477a428N55J685P97j071j337k78M75J104N18j414q40P00J175K6q86j046K73J332
4495C40J220j150j191p66J060J782r1j309j033P82J140jq21q17n4J295Q44r01
4513C29j226j54M01J780N97j791r71K16J412N79o04j284n57J735J102j231j001
4530f68k51Q12J232k51j065j084L42J724M75q51r77l31P45J141n20r57k67O00
4548a51P35L31j225q92K78J417P18r41j152l68J292J228o22j098q28R87O80M33
$$ plain form
4566 822 -61 -1073 -490 281 1094 534 -916 -1284 35 1215 963 -220 -1134 -640 722 869 438 -1098
4584 -1098 -519 662 1150 382 -699 -844 48 1123 465 -310 -988 -160 568 950 -68 -711 -671 133 712
4603 712 345 -377 -795 -180 885 877 -347 -1257 -623 716 912 234 -849 -1280 424 1180 76 -501 -1147
4622 -1147 -286 858 694 -211 -746 -398 254 686 272 -781 -568 745 1389 311 -421 -1009 -110 928
4640 928 1275 -15 -845 -459 585 1053 643 -590 -979 -27 1052 446 -281 -988 -196 780 783 -51 -670
4659 -670 -572 320 944 286 -511 -1165 -183 785 650 -817 -1090 -294 739 856 -302 -1164 -452 628 733
4678 733 392 -687 -916 43 979 855 -137 -624 -480 587 1151 273 -883 -473 687 974 265 -478 -1108
4697 -1108 30 1232 773 -301 -855 -300 474 922 185 -815 -226 316 515 268 -613 -734 15 637
$$ packed form
4566H22q83j012N83P71Q13n60j450l68J319J180k52j183r14M94J362J47m31j536
4584a098N79J181M88p68j081j45Q92J075o58p75o78Q28P28L82j018o43M0Q04N79
4603G12l67p22m18O15J065qj224r10O34J339J96o78j083m31J704P56j104n77o46
4622a147Q61J144j64r05n35L48O52M32m14j053K13J313O44j078p32n88Q99J038
4640I28L47j290q30L86J044M68m10j233l89R52J079o06p27p07P92R76Lq34o19
4659f70R8Q92O24o58p97o54R82R68j35j467k73P96J033J17j158q62P12J080J05
4678G33l41j079k29R59R36j24r92m87J44J067N64q78j156M10J160K87p09p43o30
4697a108J138J202m59j074n54N55P74M48p37j000N89N42J99k47q81j21P49O22
$$ plain form
4715 637 1033 -126 -829 -696 233 1017 301 -744 -554 76 985 467 -542 -876 -219 714 656 -386 -908
4734 -908 -306 327 749 487 -330 -530 192 333 466 -383 -509 -119 514 558 53 -846 -566 536 1041 197
4754 197 -844 -663 145 1096 589 -309 -608 -175 455 889 201 -662 -301 326 719 91 -807 -775 -175 902
4774 902 627 -86 -800 -550 584 831 -100 -870 -291 274 251 327 -804 -1155 -113 814 648 -359 -661
4793 -661 -553 645 919 -35 -711 -339 224 520 378 -257 -933 181 801 720 -114 -1041 -665 801 981
4812 981 -46 -577 -709 281 463 504 -557 -756 156 478 468 -95 -797 -119 374 919 54 -704 -356 50
4832 50 813 585 -338 -999 -358 680 684 -43 -607 -338 160 508 -52 -686 -842 235 695 370 -251 -730
4852 -730 -196 702 815 -134 -787 -606 113 1047 511 -421 -554 -95 952 407 227 -843 -368 584 806
$$ packed form
4715F37L96j159p03J33R29P84p16j045J90O30R09n18j009l34O57R33n8j042n22
4734i08O02O33M22k62q17k00P22J41J33q49j26L90O33M4n05q99K80J102N05q44
4754A97j041J81Q08R51n07q98k99M33O30M34o88q63L61O27L93o28q98L2O00J077
4774I02k75p13p14K50J134K47r31p70N79N65k3P6j131l51J042R27j66j007l02
4793f61J08J198K74r54o76L72N63K96j42o35o76J114O20q1q34r27L76J466J80
4812I81j027n31j32R90J82M1j061j99R12L22j0n63p02O78M93N45q65p58L48M06
4832E0P63k28r23o61O41J038Mp27n64K69M98L48n60o34j56J077M60l25o21m79
4852g30N34Q98J13r49o53J81P19R34n36r32j33M59J047n45j80j070M75R52K22
$$ plain form
4871 806 -141 -817 -255 550 840 -22 -478 -581 181 454 520 -96 -405 -334 196 365 85 -779 -460 394 552
4892 552 96 -650 -940 -79 669 407 -531 -777 -507 260 373 83 -468 -376 253 548 -66 -455 -706 -129
4912 -129 394 908 -375 -650 -391 320 782 155 -718 -451 176 854 472 -458 -638 -136 539 292 -280 -629
4932 -629 -234 542 641 281 -428 -451 21 375 337 -578 -696 -117 277 477 -138 -413 -456 413 668 -101 -602
4953 -602 -701 103 428 432 -290 -757 59 689 330 -452 -621 -77 320 785 192 -543 -455 94 633 704 -69 -541
4975 -541 -348 594 542 134 -433 -609 104 496 172 -521 -627 171 503 442 -182 -491 -274 318 553 225 -510
4996 -510 -310 -65 179 320 -487 -446 422 337 92 -276 -713 -541 495 600 -8 -618 -595 120 508 265 -385
5017 -385 -308 170 50 91 -362 -469 -213 211 485 158 -579 -276 219 608 665 -441 -460 -114 530 396 -76
$$ packed form
4871H06r47o76N62Q05K90q62m56j03P62K73O6o16l09P1N30J69k80q64L19Q54J58
4892E52m56p46k90Q61P48k62r38k46K70P67J13k90n51R2O29K95o14l89k51N77
4912a29N23N14j283k75K59P11M62o27q73K67O27O78l82r30j80N02O75k47n72l49
4932f29L95P76R9l60p09k3M72L54l8r15j18N79L94K00o15k75m3Q69K55p69n01
4953f02r9Q04L25Mp22m67Q16O30l59p82j69N44L97M65n93p35Q8N49N39P1p73m72
4975e41J93R42n2m08n67j76P13L92l24o93j06P98L32o1o24l09K17N92K35l28p35
4996e10K00K45K44J41q07M1Q68q5k45l68m37J72J036J05o08o10K3P15L88k43o50
5017c85P7M78j20M1m53j07K56M24K74l27p37L03M95L89N7j106j9L46O44j34m72
$$ plain form
5038 -76 -629 -141 383 529 -148 -482 -276 418 586 519 -260 -790 -30 334 464 87 -331 -776 235 313 -130
5059 -130 -211 -696 282 471 -33 -394 -907 -323 724 453 -120 -149 -215 -40 282 20 -318 2 163 553 522
5080 522 -289 -395 -45 733 559 338 -693 -604 364 891 432 -150 -589 162 291 379 27 -267 -23 501
5100 501 697 -20 -429 -237 88 957 704 -280 -528 -233 307 156 141 -359 -108 166 600 -354 -419 -440 321
5121 321 918 520 -368 -506 -97 412 369 -82 -175 -398 142 249 -25 -445 -116 86 401 133 -350 -558 -199
5142 -199 434 567 -150 -617 -320 215 256 57 -128 -225 261 281 28 -92 -422 242 361 384 152 -577 -149
5163 -149 -67 225 630 -197 -377 110 504 349 -167 -402 54 259 116 -55 -709 -262 179 605 -489 -518
5183 -518 -559 -260 100 208 -51 -113 -82 3 403 -75 -202 -293 74 562 106 -196 -734 -122 275 500 137 -361
$$ packed form
5038g6n53M88N24J46o77l34K06O94J68o7p79n30P60L64J30l77m18m45J011P8m43
5059a30q1m85R78J89n04l61n13N84J047k71n73k9o6J75L22k62l38L20J61L90l1
5080E22q11j06L50P78j74k21j031Q9R68N27m59n82m39P51J29Q8l52k94K44N24
5100E01J96p17m09J92L25Q69k53r84k48K95N40j51j5n00K51K74M34r54o5k1P61
5121C21N97l98q88j38M09N09m3m51r3k23N40J07k74m20L29K02L15k68m83k08L59
5142a99O33J33p17m67K97N35M1j99j85r7M86K0k53j20l30O64J19K3k32p29M28
5163a49Q2K92M05q27j80M87L94j55n16k35M56K05j43j71o54M47M41M26j094k9
5183e18m1K99L60J08k59o2L1Q5M00m78j27r1L67M88m56l02n38O12L97K25l63m98
$$ plain form
5205 -361 -320 103 215 -58 -195 -60 105 185 -13 -273 -570 -3 357 391 23 -186 -113 -148 601 -52 -186 -230
5227 -230 -74 115 198 -329 -477 291 627 96 -388 -539 -244 321 426 44 -175 -246 -202 459 154 -248 85
5248 85 176 452 400 -180 -85 -159 372 650 91 -378 -645 -205 15 553 25 -244 29 254 420 135 -186 -53
5270 -53 394 443 206 -516 -576 -42 466 255 -30 -324 -210 -2 877 265 -209 -235 -69 134 -94 -173 -344 -169
5292 -169 393 252 26 -281 -287 -75 343 -57 -118 -99 460 272 -30 -302 -410 90 284 354 -331 -377 -396 38
5314 38 431 198 -439 -351 244 385 35 87 -251 -60 8 20 -30 -389 69 303 394 196 -118 -411 167 22
5336 22 664 12 -336 -275 274 299 27 -317 -110 213 146 -52 -289 -693 155 544 -56 -108 -23 -212 -118 275
5358 275 102 -99 -503 -58 337 130 -358 -219 37 261 438 144 -163 -150 66 231 284 -66 -157 160 410
$$ packed form
5205c61M1M23J12k73j37J35J65Q0j98k60k97N67L60L4l68k09P3l5P49o53j34m4
5227b30J56J89Q3n27j48P68L36n31m84j51K95N65J05l82k19p1M4O61l05m02L33
5248H5R1K76n2n80R5p4N31K78n59m69k67M40K20N38n28k69K73K25J66k85l21J33
5270e3M47M9k37p22o0N34N08k11k85k94J14K08Q79o12m74k6J66K03k28p9j71J75
5292a69N62j41k26l07oK12M18m00o1J9N59j88l02k72j08N00J94P0o85m6j9M34
5314C8L93k33o37Q8N95J41l50N2l38J91O8J2n0l59M58K34R1j98l14k93N78j45
5336B2O42o52l48O1N49K5k72l44K07L23o7j98k37m04Q48L89o00n2Q5j89R4L93
5358B75j73k01m04M45L95k07m88J39K56K24J77k94l07J3K16J65N3l50r1L17K50
$$ plain form
5379 410 215 158 -219 -106 198 27 -135 -63 -398 -62 399 120 -446 -237 -66 -77 -42 -80 -112 -299 -26 144
5401 144 -130 117 -243 -137 106 96 -185 -79 72 89 230 -221 -74 30 -115 -93 -57 -98 -200 -57 321 -83
5423 -83 -287 -26 320 240 163 104 -332 -91 388 -17 -54 -277 -134 267 334 273 -305 -13 244 511 -252 94
5445 94 -174 127 194 81 210 -210 -250 112 148 252 -62 -330 -222 288 -40 -69 -503 -212 338 134 -77 -322
5467 -322 -146 69 17 313 154 -144 -121 376 -172 -46 -187 -276 220 83 18 -124 35 35 131 -12 160 -242
5489 -242 57 328 154 25 -345 30 199 -116 -66 -323 -88 -44 105 -120 -471 -219 -150 49 232 121 -78
5510 -78 -44 288 596 55 3 -156 -4 73 21 -311 -269 177 86 165 -150 -326 108 131 272 113 -58 -195 70
5533 70 127 294 36 -29 91 3 5 -227 -162 -81 99 230 50 -215 -560 -38 170 101 -226 112 -91 348 -63
$$ packed form
5379D10j95n7l77J13L04j71j62P2l35L36M61k79n66K09J71j1L5l8l2j87K73J70
5401A44k74K47l60J06K43j0k81J06J51J7J41m51J47J04j45K2L6m1j02J43L78m04
5423h3k04K61L46q0p7n9m36K41M79m05l7k23J43M01O7o1n78K92K57K67p63L46
5445I4k68L01O7j13J29m20m0L62L6J04l14k68J08N10l28k9m34K91N50k04k11k45
5467c22J76K15n2K96j59k98K3M97n48J26j41q9M96j37o5j42J59%R6j43J72m02
5489b42K99K71j74j29l70L75J69l15N0k57K35M4J49k25l51K52O9J99J83j11j99
5510g8L4L32L08n41n2j59J52P7n2l32M2M46r1P9l15j76M34K3J41j59j71j37K65
5533G0N7J67k58o5J20q8Kk32O5Q1J80J31j80k65l45N22K08o9l27L38k03M39m11
$$ plain form
5556 -63 -14 -136 -284 -41 226 383 -181 -226 62 246 -131 108 -474 -335 244 93 225 -225 -245 -104 65
5577 65 286 -87 -59 277 139 -131 70 -357 129 200 74 42 -267 -85 -192 -113 96 -112 57 -216 177 51
5599 51 223 -218 -138 -93 -35 65 -136 331 51 -96 -82 204 -124 -104 33 -104 152 -140 48 -75 -50 140
5621 140 -442 -114 153 -56 316 -12 -59 -158 -36 146 220 -219 -58 -116 268 112 -191 -152 13 510 -258 -298
5643 -298 -258 -148 436 62 81 55 -185 -77 256 62 192 -172 -143 5 190 -99 88 -57 -73 185 -198 -110
5665 -110 -125 -84 158 168 -154 -120 0 -209 251 277 -155 -221 79 75 50 -440 41 -130 360 356 -121 -172 -267 -94
5689 -94 132 337 258 41 62 231 -25 -236 113 -157 166 87 264 -394 -151 -19 -42 162 -56 -224 13 -32
5711 -32 220 -205 88 -198 -119 -53 29 -146 -189 -197 -39 281 -118 -199 -134 52 16 -191 -34 -37 -201 93 -82 -252
$$ packed form
5556f3M9j22j48K43K67J57n64m5K88J84l77K39n82J39N79j51J32m50k0J41J69
5577F5K21l73K8L36j38k70K01m27M86P1j26l2l09J82j07P9K09k08J69k73L93j26
5599E1J72m41Q0M5N8J00k01M67k80j47J4K86l28K0J37j37K56k92J88j23K5J90
5621A40n82L28K67k09L72l28m7r9J22J82P4m39J61n8L84j56l03L9J65M97p68m0
5643b98M0J10N84l74J9k6k40J08L33j94J30l64K9J48J85k89J87j45j6K58l83Q8
5665a10j5M1K42J0l22L4J20k09M60K6m32o6L00mk5m90M81j71M90mm77n1r5J73
5689i4K26K05p9k17K1J69k56k11L49k70L23p9J77o58K43J32k3K04k18j68K37m5
5711c2K52m25K93k86P9O6Q2j75m3qJ58L20l99q1O5J86l6k07J57lj64K94j75j70
$$ plain form
5735 -252 -131 -8 -194 158 528 -148 129 -171 -599 136 -178 -197 3 57 -204 -180 -87 -117 147 -304 -200 -31
5757 -31 -274 144 57 185 -48 -270 190 29 -6 -56 -235 255 221 61 -45 -125 -143 287 612 -142 -127 199 -25
5780 -25 130 -120 -98 -275 -106 33 -107 106 98 -123 -200 206 59 -27 -189 -129 186 130 -208 -161 28 -188 329
5803 329 81 -81 70 209 153 119 362 -166 178 20 113 -364 80 59 -27 -10 -143 -181 236 132 -25 -157
5825 -157 -149 -6 95 157 -301 185 39 -278 82 -139 -76 213 -244 118 282 -172 -455 -155 -117 323 -102 102
5847 102 -90 -331 119 75 160 13 19 -53 -36 -73 -11 228 274 107 283 -372 -102 185 215 -67 -100 11 -35 -16
5871 -16 -1 -345 -57 -35 -202 -158 -30 -282 -5 3 -54 -3 1 -54 -36 -97 224 22 53 115 241 264 199 141 4 140
5897 140 -12 54 43 22 126 -52 198 -37 -2 -320 -3 -29 -15 63 -241 130 -158 209 167 350 174 35 -52
$$ packed form
5735b52J21J23j86L52L70o76K77l00m28P35l14j9K00N4k61K4R3l0K64m51J04J69
5757c1k43M18q7J28k33k22M60j61l5n0j79M90l4j60j06q0j8M30L25p54J5L26k24
5780b5J55k50K2j77J69J39j40K13qk21p7M06j47q6j62O0L15n6l38M7J89k16N17
5803C29k48j62J51J39n6l4K43n28L44j58R3m77M44k1q6J7j33l8M17j04j57j32
5825a57QJ43J01O2m58M86j46l17L60k21O3K89m57L62J64m54k83L00L8M40m25K04
5847A02j92k41M50m4Q5j47Op2J7l7O2K39M6j67J76o55K70K87L0k82l3J11m6J9
5871a6J5l44K88K2j67M4J28k52K77Qn7N1Mn5J8o1L21k02L1O2J26K3o5n8j37J36
5897A40j52O6j1k1J04j78K50k35L5l18L17k6J4P8l04L71k88L67m2J83j76j39q7
$$ plain form
5920 -52 -81 -15 54 -90 12 105 15 28 -132 295 -175 108 -49 -404 -116 -24 112 -195 -36 -205 42 137 -157
5943 -157 -207 98 88 112 -67 171 23 305 263 100 58 184 55 -103 112 -32 -143 -47 -81 -9 -26 13 -177
5966 -177 -72 7 -271 313 -127 -271 -199 -55 180 242 -38 -164 23 273 169 130 38 106 178 -83 -118 -28 -42
5989 -42 -76 136 -117 -168 -124 -124 5 -173 -112 -319 130 26 211 106 128 252 153 248 -434 -85 66 129 82 189
6013 189 -22 -104 33 20 260 -15 -148 -288 -10 -132 -84 -100 95 -93 180 107 -149 -105 105 -70 106 258
6035 258 109 -79 -264 -48 23 160 -146 84 161 -135 -411 -426 -276 -163 -204 -267 -156 178 91 55 236 -62
6057 -62 -62 203 46 -84 -344 80 -2 -83 133 -190 -90 -458 406 -86 271 6 -188 244 280 301 131 -107
6079 -107 -17 52 6 2 70 -76 24 144 174 34 -237 49 105 -173 212 -138 76 -282 -14 71 63 -4 9 299
$$ packed form
5920e2k9O6O9j44J02R3r0J3j60M27m70K83j57l55K88R2J36l07J59j69K47R5k94
5943a57n0L05j0K4j79K38j48K82m2j63m2J26j29j58K15j44j11R6l4P2j7L9j90
5966a77J05P9k78N84m40j44P2J44K35O2k80j26J87K50j04l9r2O8P2k61l5R0j4
5989d2l4K12k53n1M4%J29j78O1k07M49j04J85j05K2J24r9R5o82L49J51O3m7J07
6013A89k11q2J37j3K40k75j33j40K78j22M8j6J95j88K73p3k56M4K10j75J76J52
6035B58j49j88j85K16P1J37l06K30P7k96k76j5J50J13m1o3J11L34q7l6J81k98
6057f2%K65j57j30k60M24q2q1K16l23J00l68Q64m92L57k65j94M32L6K1j70k38
6079a07R0O9m6mO8j46J00J20L0j40k71K86N6k78L85l50K14l58K68Q5qo7J3K90
$$ plain form
6103 299 -79 -83 73 -104 226 203 29 -208 -253 -44 235 -199 125 108 -35 224 170 27 -237 -77 83 119
6125 119 -170 238 -245 219 139 -158 -72 -162 -85 -40 201 -171 -216 -8 -185 82 32 9 -133 95 1 151 -249
6148 -249 -144 81 216 100 352 -365 64 152 319 74 -298 -101 11 180 -30 -240 -401 9 104 425 -60
6169 -60 -82 -331 -201 189 163 48 -308 192 397 84 -14 -376 115 123 185 116 -142 -26 359 174 -162 -360 -329
6192 -329 -73 191 246 -114 -99 34 158 118 91 -320 -32 100 268 -74 -119 -284 -63 326 269 -223 -326 -268
6214 -268 -259 289 198 -167 22 -8 152 213 -104 10 -173 269 210 -154 -283 -64 -306 349 -56 -275 92 -137
6236 -137 -37 -79 24 -131 -127 394 191 351 -145 -283 59 152 -129 -167 -160 153 76 113 -436 114 -35 50 60 -192
6260 -192 10 -135 0 91 38 -170 39 34 44 232 -362 -245 93 -32 454 -60 -111 -342 -24 162 245 -3
$$ packed form
6103B99l78mJ56j77L30k3j74k37m5K09K79m34L24j7j43K59n4j43k64J60J60L6
6125A19k89M08m83M64q0k97Q6r0P7M5K41l72m5K08j77K67n0k3j42K28r4J50m00
6148b49J05K25J35j16K52p17M29Q8J67k45l72J97J12J69k10k10j61M10R5L21m85
6169f0k2k49J30L90k6j15l56N00K05l13r8l62M91QO2o9k58J16L85j85l36j98L1
6192c29K56K64N5l60J5J33J24m0k7m11K88J32J68l42m5j65K21L89n7m92j03N8
6214b68RN48r1l65J89l0J60O1l17J14j83M42n9l64j29K19k42O55m05k19L67k29
6236a37J00m2J03j55MN21k03J60m96j38L42R3k81l8PL13p7L7n49N50j49Q5J0k52
6260a92K02j45J35R1n3k08K09nJ0J88n94J17L38j25M86n14n1k31L18J86Q3k48
$$ plain form
6282 -3 -234 113 113 36 -305 193 41 229 247 -72 -24 -92 56 -21 -156 -182 -195 -27 207 170 -208 -343 -17 209
6306 209 180 -13 -278 -272 -107 -80 180 -319 -159 -230 -5 334 -81 -119 -161 174 327 -20 60 -93 72 -25 46
6329 46 122 -247 138 107 -108 -53 -91 -202 191 0 -112 32 -340 10 -3 132 -430 -148 -126 431 2 -131
6351 -131 -5 -94 301 263 -270 -442 -283 133 281 55 234 -574 103 -24 154 116 -40 121 -89 360 188
6372 188 -34 -359 26 99 353 38 -391 105 71 172 107 -478 -326 180 210 -248 45 -294 122 211 60 -66
6394 -66 -439 -262 -19 18 -132 -92 -225 510 95 135 -34 15 7 208 -290 -182 -273 -51 116 178 -20 -59 -168
6417 -168 168 253 185 0 -319 140 191 59 -372 -89 -7 35 94 152 -420 -340 257 232 -24 -179 -141 -148 343 275
6441 275 -24 -142 -14 250 152 64 -211 -282 -137 75 274 -52 87 -19 126 115 -137 -190 43 212 26 -44
$$ packed form
6282ck31L47%p7l41M98j52J88J8l19M8o8J48p7j35k6j3J68K34l7l78j35L26K26
6306B09k9j93k65OJ65K7K60m99J60p1K25L39m15l8m2L35J53l47Q0j53J65r7P1
6329D6P6l69L85l1k15N5l8j11L93j91j12J44l72L50j3J35n62K82K2N57m29j33
6351a31J26q9L95l8n33j72J59M16J48k26J79q08O77j27J78l8j56J61k10M49j72
6372A88k22l25L85P3K54l15m29M96l4J01o5n85J52N06L0m58K93l39M16Q9j51j26
6394f6l73J77K43L7j50M0j33P35m15M0j69M9qK01m98J08r1K22J67O2j98l9j09
6417a68L36Q5o8j85l19M59N1j32m31K83Q2M2N9N8n72Q0N97k5k56j55L8pM91o8
6441B75k99j18J28K64r8q8k75p1J45K12J99l26J39j06J45j1k52n3K33J69j86p0
$$ plain form
6463 -44 -380 -42 74 47 2 297 -223 -155 443 -68 172 -251 24 110 97 -243 -299 -254 104 253 227 196 -64
6486 -64 -19 180 105 -291 -162 13 -18 42 98 -248 -166 281 155 -226 -248 -354 -154 195 351 -130 -47 -276 345
6509 345 356 -67 -216 -204 274 319 27 -365 -392 -168 -39 170 51 -67 -112 138 428 224 -359 116 -106 472
6531 472 122 41 -107 164 254 132 174 -581 -293 315 317 39 -398 -71 256 109 -68 -513 -810 -285 367 273
6553 273 34 -282 -255 -83 657 128 -71 -80 68 17 336 -244 -352 -218 27 -64 -57 17 -80 163 155 178 -256 -346
6577 -346 188 190 363 -78 -66 -190 196 257 186 -277 -530 -40 366 249 -207 -189 6 391 340 -191 -318 -48
6599 -48 49 150 -151 -411 -187 337 458 159 -152 -316 167 -17 -109 -290 -208 -363 158 438 4 -325 -173
6620 -173 164 282 82 -144 -153 41 388 143 -22 -11 -113 526 245 86 -203 -32 24 433 -28 -411 -204
$$ packed form
6463d4l36L38J16k7m5K95n20O8N98n11K40m23K75Q6j3l40n6M5L58J49k6l1k60
6486f4M5J99p5l96J29J75l1O0N6l46Q2M47j26l81k2j06K00L49J56m81Q3k29O21
6509C45J1m23j49J2M78M5k92l92k7K24J29K09j19j18m5K50K90k04n83M75k22N78
6531D72l50q1j48K71R0j22M2p55K88O08Kk78m37L27L27j47j77m45k97N25O52r4
6553B73k39l16K7J72P40n29j99rJ48n1L19n80j08J34K45r1PP4r7K43qK3m34r0
6577c46N34KJ73m41J2j24L86O1p1m63k53M90M06j17m56J8J95L85n1n31j27K70
6599d8R7J01l01k60K24N24J21k99l11j64M83j84r2j81Q2j55N21K80m34l29J52
6620a73L37J18k00k26rJ94L47k45j65J1j02O39k81j59k89J71N6M09m61l83K07
$$ plain form
6641 -204 -148 373 159 -184 -696 -72 370 387 35 -188 -549 -131 342 89 -10 -87 158 77 333 160 -35 -69
6663 -69 67 95 258 -131 -266 13 454 217 -316 -454 -199 138 405 -303 -281 -236 120 374 22 -238 -205 81
6685 81 212 343 -275 -157 64 538 339 -139 -397 -198 96 345 231 -143 -385 145 353 251 -195 -263 -276
6706 -276 244 350 -234 13 -126 -8 405 -116 -388 -396 -70 147 221 -179 -123 -389 178 238 257 -200 -192 330 317
6729 317 88 -377 -221 133 347 310 -116 -361 -308 101 264 69 -222 -131 354 179 389 -170 -11 30 -80
6750 -80 183 68 -66 -110 7 317 415 -62 -43 -111 654 214 -145 -170 342 286 -27 -316 -328 -7 466 13 6
6773 6 134 -582 -21 281 313 179 -210 -108 264 103 39 -494 -66 278 146 160 -333 -242 35 164 287 -164
6795 -164 -22 -210 357 222 -200 -238 -200 30 125 -60 -119 -373 -204 556 68 -229 -404 -300 118 429 -40
$$ packed form
6641b04N6N21k14l43n12O24M42J7l52k23l61M18M73k53r9p7K45q1K56j73j95l4
6663f9J36K8J63l89j35K79M41k37n33j38K55L37K67p08K2M5L56K54l52k60L3K86
6685H1J31J31o18J18K21M74j99m78k58J99K94K49j14l74k42N30K08j02m46o8j3
6706b76N20J06n84K47j39J18M13n21k72qL26K17P4m00N6k66N67O0J9m57QN22j3
6729C17k29m65J56L54K14l7m26k45N3M09J63j95k91R1M85j75K10n59J59M1j10
6750h0K63j15j34m4J17L10R8m77J9o8P65m40l59k5N12n6l13k89j2L21M73m53p
6773FJ28p16N61L02L2j34l89J02L72j61o4n33M28L44j32J4m93R1K77J29J23m51
6795a64J42j88N67j35m22l8L8K30R5j85n9k54J69P60m88k97j75J04M18L11m69
$$ plain form
6816 -40 -560 -520 102 298 -57 -561 -34 -146 514 271 -393 -476 -16 478 467 393 -282 -297 60 330 268 -86
6838 -86 -445 1 48 269 47 -580 -18 181 373 28 -316 -396 245 440 240 23 -180 -185 248 77 -83 -34
6860 -34 -57 34 115 96 -341 -378 411 400 247 127 -235 16 240 375 181 -429 -25 293 188 -187 -284 -189 119
6883 119 331 376 -363 -271 97 220 490 36 -397 -234 -2 480 5 -181 -490 176 405 390 -322 -289 -39
6904 -39 499 231 -149 -214 -224 244 349 -259 -208 14 -225 370 273 -112 -100 126 394 290 -17 -496 -135 68
6926 68 567 176 -262 -281 -105 322 -257 -128 -79 176 469 171 -258 -227 -418 202 485 212 -229 -267 -98 222
6948 222 5 143 -250 -116 -91 133 181 -213 -238 -84 575 71 -283 -417 44 279 376 193 -282 -192 -97 -14
6970 -14 169 -232 -98 -169 482 261 -18 -312 -65 475 632 78 -239 -136 136 370 154 -404 -355 -82 215
$$ packed form
6816d0n20M0O22J96l55n04N27j12O60k43o64q3M60M94j1p4o75j5L57K70o2l54
6838h6l59M46M7K21k22o27N62J99J92l45l44q0O41J95k00k17k03nM33j71j60M9
6860c4k3R1Q1j9m37l7P89j1j53j20l62K51K24J35j94o10M04L18j05l75r7R5L08
6883A19K12M5p39R2L68J23K70m54m33J63K32M82m75j86l09O66K29j5p12L3K50
6904c9N38k68l80o5j0M68J05o08N1K22k39N95r7l85J2K26K68j04l07m79L61K03
6926F8M99l91m38j9J76M27n79J29M9K55K93k98m29L1j91O20K83k73m41l8J69L20
6948B22k17J38l93J34K5K24M8l94k5J54O59n04l54j34M61K35R7j83m75R0R5Q3
6970a4J83m01J34p1O51k21k79k94K47N40J57n54l17J03K72K34k16n58M9K73K97
$$ plain form
6991 215 295 73 -349 -164 184 456 -2 -564 -109 11 305 -12 -140 -537 23 310 372 -37 -398 78 420
7012 420 420 -41 -309 -501 159 611 -72 25 25 55 -151 231 271 -164 -170 185 62 -287 -154 -326 -254 350 254 -57
7036 -57 -146 180 307 327 -107 -345 -154 180 505 -269 -17 -302 34 196 -34 -139 -105 -131 163 179 34 -496
7058 -496 -170 348 189 345 -290 -287 57 416 216 -368 -597 321 158 126 -299 -379 -400 333 108 239 -153 -144
7080 -144 -76 61 77 -71 -403 132 262 307 -44 -27 -78 -3 312 5 -171 -400 145 326 307 -357 -384 162 229
7103 229 175 150 -256 -114 121 459 -157 -465 -450 176 76 279 -259 -346 -221 203 332 -46 -323 -367 256 389
7125 389 253 -343 -470 141 562 129 -334 -249 -4 148 361 -234 -389 -309 233 470 276 -103 -23 149 320
7146 320 105 -49 -557 -361 196 409 -139 -509 -129 253 271 238 -257 -589 -187 363 341 61 -266 3 -60
$$ packed form
6991B15Q0k22m22J85L48K72m58n62M55J20K94l17j28l97N60K87O2m09l61M76L42
7012D20%m61k68j92O60M52o83R7%L0k06L82M0m35oL55j23l49J33j72P2O04r6l11
7036e7q9L26J27K0m34k38J91L34L25p74K52k85L36J62k30j05L4k6K94J6j45n30
7058d96L26N18j59J56o35LL44L59k00n84k29R18j63l2m25q0k1P33k25J31l92R
7080a44O8J37J6j48l32N35J30M5l51J7n1P5L15l07j76k29N45J81j9o64k7N46O7
7103B29n4k5m06J42K35L38o16l08J5O26j00K03n38q7J25M24J29l78k77m4O23J33
7125C89j36n96j27O11M21m33m63Q5K45J52K13n95j55Q0N42K37j94l79Q0J72J71
7146C20k15j54n08J96N57K13n48l70L80L82J8l3m95l32M02N50k2k80l27K69o3
$$ plain form
7167 -60 255 -149 -424 -223 -156 253 101 -312 -80 -296 66 -140 -322 -313 -499 232 156 54 -293 -347 -50 361
7189 361 326 -342 -154 254 383 371 -82 -459 64 202 220 -12 -172 -613 141 249 102 -20 -20 -464 296 350
7211 350 -136 -398 -300 81 449 116 -482 -203 209 219 -160 -156 -414 -260 280 21 -166 -424 -263 23 96 20
7233 20 -24 -451 -167 359 277 70 -461 -220 306 510 -113 -588 114 242 588 90 -105 -210 434 110 -179
7254 -179 -296 -8 -6 348 328 98 -193 185 91 350 -54 -123 -194 -87 388 145 -427 -219 -361 327 324 -176 -478
7277 -478 -252 360 508 -82 -37 -304 -61 456 342 -267 -211 -309 -198 289 30 -191 -267 179 354 231 -464
7298 -464 -410 -248 405 415 3 -369 147 6 226 148 -574 -341 85 323 156 -241 -178 -23 258 433 -56
7319 -56 -48 -248 257 142 -126 -314 -254 198 410 386 -197 -331 -94 276 345 -256 -625 -32 1 312 144 -64
$$ packed form
7167f0L15m04k75K01O7M09j52m13K32k16L62k06j82Rj86P31p6j02l47n4K97M11
7189C61l5o68J88M08J29j2m53l77N23J38J8k32j60m41P54J08j47j22%m44P60N4
7211C50m86k62R8L81L68l33n98K79M12J0l79Mk58J54N40k59j87k58J61K86P3p6
7233B0m4m27K84N26q2k07n31K41N26K04o23m75P02J28L46m98j95j05O44l24k89
7254a79j17K88KL54k0k30k91L78r4K59m04o9p1J07M75k43n72K08j42O88ln00l02
7277d78K26O12J48n90M5k67K43N17j14o09N6r8J11M87k59k21p6M46J75j23o95
7298d64N4J62O53J0m12l72N16j41K20p8p22K33M26K38j67l97O3J55K81J75m89
7319e6Qk00N05j15k68j88O0M52K12k4n83j34K37L70O9o01l69N93L3L11j68k08
$$ plain form
7341 -64 -153 -239 77 283 -155 -322 -200 444 340 19 -524 -181 197 425 152 -242 -243 -184 125 594 -170 -478
7363 -478 -69 159 349 -141 -451 -28 238 437 187 17 -268 -20 57 311 -261 -327 -215 175 818 -290
7383 -290 -155 -198 366 532 -75 -356 -13 70 403 -10 -201 -468 -157 333 38 -62 -381 -85 43 106 225
7404 225 -248 -533 -489 97 98 -17 -290 -78 213 321 191 -597 -99 270 136 -4 -262 -272 35 225 196 -95
7426 -95 -589 -231 -25 495 -27 35 -373 56 543 197 -158 -422 -299 303 285 75 -186 -43 401 168 -68
7447 -68 -583 -34 50 294 46 -79 -328 -180 126 267 84 -377 -192 99 516 52 -410 -639 53 406 132
7468 132 -347 -136 -291 342 259 -329 -519 -304 93 283 -125 -87 -216 36 472 197 -247 -419 -90 323 624
7489 624 -101 -107 -127 107 380 253 -183 -578 -45 88 431 6 -411 263 339 483 85 -84 -122 75 365 51
$$ packed form
7341f4q9q6L16K06m38j67J22O44j04l21n43L43L78K28k73l94jN9L09M69p64l08
7363d78M09K28J90m90l10M23K66J99k50j70k85K48P7K54n72o6J12L90O43j108
7383b90J35m3N64J66o07k81L43Q3L33m13j91k67L11M90k95j00l19K96J28O3J19
7404B25m73k85M4N86Jj15k73K12K91J08j30p88M98L69j34j40k58j0L07J90k9k91
7426i5m94L58K06N20n22O2m08M29M87l46l55k64J23O02j8k10k61J43M44k33k36
7447f8n15N49Q4K44k48j25k49J48L06J41j83m61J85K91M17m64m62k29O92L53k74
7468A32m79K11j55O33q3n88j90K15L97J90m08L8j29K52M36k75m44j72L29M13L01
7489F24p25ok0K34K73j27m36l95N33J33L43m25m17O74P6J44l98j69l8J97K90l14
$$ plain form
7511 51 -245 -413 159 366 285 15 -620 -16 431 418 -133 -290 -275 -50 388 56 -211 -173 181 578 236 -351
7533 -351 -122 -145 284 218 267 -376 -484 -62 308 123 -191 -110 -54 370 157 176 -253 -209 475 621 184 -352
7555 -352 -230 -21 364 162 -271 -150 67 6 270 34 -762 -302 137 166 198 -262 -443 -200 379 70 -23
7576 -23 -392 -82 372 178 -45 -342 -385 217 350 -171 -311 -177 54 222 233 -264 -523 -188 446 278 -75
7597 -75 -304 -114 142 342 85 -109 24 -219 292 169 34 -524 -404 345 370 -157 -261 -440 62 294 117
7618 117 -309 -248 33 193 222 -139 -676 -97 -14 475 60 -398 -227 -201 239 93 -28 -311 -248 817 165
7639 165 -38 -495 -503 192 468 32 -425 -215 63 296 344 -225 -314 -65 174 233 20 -330 -25 368 331 158
7661 158 -394 -243 146 641 260 30 -634 -297 261 475 71 -103 -207 0 233 -130 -348 -398 136 -164
$$ packed form
7511E1k96j68N72K07q1k70o35O04M47j3n51j57J5K25M38l32k67L8L54L97l42n87
7533c51K29k3M29o6M9o43j08M22L70j85l14Q1N6M24k13J9m29M4O84J46m37n36
7555c52J22K09L85k02m33J21K17o1K64k36p96M60M39K9L2m60j81K43N79l09r3
7576b3l69L10M54j94k23k97m3O02J33n21j40J34K31J68J1m97k59L35O34j68l53
7597g5k29J90K56K00k57j94J33k43N11j23j35n58J20P49K5n27j04j79N02K32j77
7618A17m26O1K81J60K9l61n37N79Q3M89m15m58J71K6M40j46j21k83O3J065o52
7639A65k03m57qO95K76m36m57K10K78K33M8n69q9K49K39N9k13l50L05L93l7j73
7661A58n52J51L89M95l81k30o64L37N58K14m04j74j04K07K33l63k18n0N34l00
$$ plain form
7681 -164 158 -255 -520 -40 -166 356 -256 -277 -185 -68 201 127 -430 45 133 448 154 -326 -568 -259 399
7702 399 474 -192 -359 -183 109 664 -100 -376 -195 23 19 48 -297 -266 222 202 417 268 -277 -360 509 379
7724 379 107 -30 -529 -50 420 318 -43 -23 -15 256 262 -133 -423 -411 162 305 150 -47 -324 -36 123 231
7746 231 357 -386 88 38 448 26 -224 -437 252 46 60 -188 -268 83 322 500 79 -555 -91 75 644
7767 644 135 -84 -291 -170 130 -52 -257 -321 112 554 326 -167 -432 -534 320 -50 -25 -162 -467 114 171
7788 171 141 -124 -464 -281 124 275 -140 -68 -218 301 358 99 -245 -298 -227 261 389 -389 -394 -337 132 484 -138
7811 -138 -435 -416 -59 -100 283 48 -377 232 253 295 84 -339 -209 180 431 -11 -254 -159 1 583 178 -440
7833 -440 -430 -189 413 190 24 -486 -122 153 469 -38 -131 -79 -91 578 65 -711 -144 -45 254 -19 -91 -137
$$ packed form
7681a64L22m13k65M80j26N22o12k1R2J17K69p4n57M75Q8L15k94m80k42L09O58
7702C99P5o66j67J76K92N55p64k76J81K18mK9l45L1M88k0K15j49n45q3Q69j30
7724C79k72j37m99M79M70j02l61K0QK71Ol95k90J2N73J43j55j97k77K88J59J08
7746B31J26p43M74n0M10m22k50k13O89k06J4k48q0L51K39J78m21o34M64J66N69
7767F44n09k19k07J21L00j82k05o4M33M42k28m93k65j02Q54l70K5j37l05N81N7
7788A71l0k65l40J83M05J51m15P2j50N19N7k59l44n3P1M88J28p78nN7M69L52o22
7811a38k97J9L57m1L83k35m25O09K1M2k11m23J30L89K51m42k43R5J60N82m05o18
7833d40J0K41O02k23j66n10L64K75L16n07r3N2j2O69n13p76N67R9K99k73p2m6
$$ plain form
7855 -137 -248 -80 305 37 -282 -518 -100 441 138 80 -193 -102 421 -19 -258 -226 -158 493 205 266 9 -52
7877 -52 91 189 192 -37 -308 98 72 421 155 -210 -121 127 565 238 -446 -172 191 511 179 -412 -316 -71
7899 -71 385 406 99 -498 -488 120 591 199 -14 -454 -1 258 359 -138 -336 -330 123 407 -103 -259 129 -198
7921 -198 498 147 -236 -199 50 196 349 95 47 -27 367 393 161 -255 -85 33 13 -58 176 -570 -264 224
7943 224 532 -98 -401 -9 336 264 178 -219 -400 134 11 235 7 -91 -37 376 213 -83 -377 -127 28
7964 28 494 69 -345 -493 48 251 440 -156 -547 -147 277 337 -381 -376 -604 185 275 430 -303 -126 -129 169
7986 169 118 -219 -303 253 86 234 62 -102 8 -116 118 313 -47 -311 -103 384 429 -233 -373 91 -56
8007 -56 669 -323 -343 -70 88 692 132 -245 -344 -114 251 364 -52 -443 -105 258 263 -20 -46 -332 61 551
$$ packed form
7855a37j11J68L85k68l19k36M18N41l03n8k73R1N23m40k39L2O8O51k88O1k57o1
7877e2J43R8Lk29k71M06k6L49k66l65Q9K48M38l27o84K74L63L20l32n91R6K45
7899g1M56K1l07n97J0O08M71l92k13m40M53K59J01m97j98OM53K84n10j56L88l27
7921a98O96l51l83L7K49J46J53k54m8p4L94K6k32m16J70J18k0p1K34p46L06M88
7943B24L08o30l03L92L45p2q6l97j81N34j23K24k28r8N4M13j63k96k94K50J55
7964B8M66m25m14j48N41K03J89n96l91M00M24O0p18Nk28P89R0J55p33J77lK98
7986A69n1l37q4N56j67J48j72j64J10j24K34J95l60k64K08M87M5o62j40M64j47
8007e6P25r92k0K73J58O04n60l77r9K30L65J13m16l91L38L63Nk83k6k86L93M90
$$ plain form
8029 551 9 -390 -476 -116 485 156 -334 -326 -246 284 298 -48 -256 -367 119 701 -16 -220 -87 133 24 -78
8051 -78 69 -204 -291 83 530 -104 -244 -196 247 177 213 -197 -633 26 364 140 20 -43 25 -83 46 155
8073 155 -227 -376 102 350 223 244 -246 -365 348 455 -65 -214 -268 -143 765 -203 -173 -413 81 647 423
8094 423 -323 -114 -457 18 398 -6 -462 -14 138 -3 -49 -180 -57 -192 525 305 76 -365 -185 291
8114 291 329 190 -412 -232 304 472 111 -587 -258 -146 142 243 -202 -382 -127 283 434 -310 -215 -253 -73
8135 -73 126 391 -2 -343 -191 53 259 -89 -523 -313 299 278 21 -351 -276 480 158 234 -193 107 -125
8156 -125 -16 196 -293 -211 -130 249 271 3 -356 -363 99 456 40 -3 -618 -30 207 288 -142 -42 -161 153
8178 153 493 -75 -294 -303 -13 490 369 -71 -415 -63 183 197 86
$$ packed form
8029E51n42l99q6L60O01l29m90QQ0N30J4l46k08j11M86N82p17k04J33K20j09j02
8051g8J47k73q7L74M47o34j40M8M43p0L6m10m36O59L38k24j20o3O8j08J29J09
8073A55l82j49M78K48j27K1m90j19P13J07n20j49n4J25R08r68L0k40M94N66k24
8094D23p46K09l43M75L80m04m56M48J52j41m6j31J23j35P17k20k29m41J80M76
8114B91L8j39o02J80N36J68l61o98L29J12K88J01m45j80K55M10J51p44R5l8J80
8135g3J99K65l93l41J52K44K06l48m34K10O12k1k57l72P5P56l22P6m27L00k32
8156a25J09K12m89Q2Q1L79K2k68l59pM62L57m16m3o15N88K37Q1m30J00j19L14
8178A53L40n68k19rK90N03j21m40l44L52K46J4j11
8191H6
$$ Imaginary data points
##PAGE= N=2
##DATA TABLE= (X++(I..I)), XYDATA
$$ plain form
0 0 0 0 0 0 0 0 0 4 -2 8 -8 8 -10 16 -16 21 -24 32 -32 40 -48 56 -64 74 -83 99 -109 123 -142 160 -177 201
32 201 -225 251 -279 311 -345 384 -426 472 -520 579 -641 710 -786 872 -970 1083 -1212 1365
50 1365 -1545 1764 -2036 2385 -2853 3505 -4493 6151 -9450 18569 -95166 -334292 -122475
63 -122475 143241 177748 12881 -92411 -70447 8268 7741 -54871 -77333 -8732 70540 89423
75 89423 12815 -107268 -164162 -85762 70101 181114 119131 -94016 -224715 -94357 115752
86 115752 129358 -22415 -95266 -16 108828 48707 -125020 -163954 18645 195306 157263
97 157263 -28030 -161911 -134735 12907 128369 111989 19058 -51920 -63131 -19068 32736
108 32736 21706 -29969 -17671 67826 109404 10763 -157242 -177888 31029 228130 152515
$$ packed form
0@%%%%%%%MoJ0j6J6j8K6l2L7m5N6o4P2q8J04j20J38j57J82k08K32k65L02l37L78
32B01m26M76n30N90o56P29q10Q98r92J099j220J351j496J658j842K053k295K577
50A365k910L309l800M421n238O358p998J0644j5601K8019j13735k39126K11817
63a22475K65716L4507j64867j05292K1964P8715n27o2612k2462O8601P9272J8883
75H9423p6608j20083n6894P8400J55863J11013o1983k13147j30699J30358K10109
86A15752J3606j51773p2851R5250J08844o0121j73727l8934J82599J76661l8043
97A57263j85293j33881K7176J47642J15462j6380r2931p0978j1211M4063N1804
108C2736j1030n1675J2298Q5497M1578r8641j68005k0646K08917J97101p5615
$$ plain form
119 152515 -87774 -194076 -88424 65612 102464 12577 -62380 -18272 55479 25051 -71720
130 -71720 -104609 -31919 77073 120257 50406 -73188 -145267 -100546 47455 164973 101475
141 101475 -78348 -140362 -25722 81215 47465 -51581 -61364 52735 135101 38683 -131669
152 -131669 -148454 7791 152393 141544 2069 -116642 -98380 7571 74569 65108 19369
163 19369 -26029 -26657 18945 30674 -28036 -71436 -14376 99719 130788 2300 -158981 -142615
175 -142615 40876 160379 93307 -52774 -114839 -46588 52636 51041 -32134 -54090 19951
186 19951 73896 34182 -55285 -104965 -56274 54628 118499 70783 -46671 -129140 -82999 56707
198 56707 122303 36711 -67824 -57697 26307 61870 -207 -80598 -50335 78689 133889 28967
$$ packed form
119A52515k40289j06302J05652J54036L6852q9887p4957M4108P3751l0428r6771
130g1720l2889P2690J08992M3184o9851j23594p2079M4721J48001J17518o3498
141A01475j79823o2014J14640J06937l3750r9046r783J14099Q2366r6418j70352
152a31669j6785J56245J44602j0849j39475j18711J8262J05951O6998r461m5739
163A9369m5398o28M5602J1729n8710m3400N7060J14095L1069j28488j61281J6366
175a42615J83491J19503o7072j46081o2065O8251R9224j595q3175k1956P4041
186A9951N3945l9714q9467m9680M8691J10902O3871m7716j17454q2469M6141J39706
198E6707O5596q5592j04535J0127Q4004L5563o2077q0391L0263J29024N5200j04922
$$ plain form
210 28967 -107365 -121249 -6836 111207 110649 4506 -75650 -57722 5658 46494 36783 -12551
222 -12551 -36060 11544 61781 26624 -61862 -93893 -15007 104201 117894 -11674 -130223
233 -130223 -96952 30161 100692 52375 -47273 -74791 -2372 54508 10213 -56982 -50851 16412
245 16412 69933 52341 -33520 -101080 -67740 34672 101069 64757 -42955 -103914 -40887 59596
257 59596 65238 -10562 -56505 -19264 52531 61512 -23701 -95321 -43660 71930 106745 27757
269 27757 -74882 -94476 -11476 77387 71793 -1992 -52396 -37552 18810 51143 9374 -54906
281 -54906 -41016 39689 78559 23104 -68985 -94292 -9214 92997 83627 -21933 -91990 -57384
293 -57384 30115 69498 15986 -56011 -43890 26928 52075 5255 -52392 -60078 488 71958
$$ packed form
210B8967j36332j3884J14413J18043n58j06143q0156J7928O3380M0836r711m9334
222a2551k3509M7604N0237l5157q8486l2031P8886J19208J3693j29568j18549
233a30223L3271J27113P0531m8317r9648k7518P2419N6880m4295o7195O131O7263
245A6412N3521j7592q5861o7560L3340J02412O6397l6312j07712o0959O3027J00483
257E9596N642p5800m5943L7241P1795Q981q5213p1620N1661J15590L4815p8988
269B7757j02639j9594Q3000Q8863n594p3785n0404J4844N6362L2333m1769o4280
281e4906J3890Q0705L8870n5455r2089k5307Q5078J02211r370j05560p0057L4606
293e7384Q7499L9383n3512p1997J2121P0818K5147m6820n7647p686O0566P1470
$$ plain form
305 71958 63160 -24202 -86182 -54882 33037 84573 38052 -51716 -67886 3244 58716 33849
317 33849 -31536 -56820 -2125 71483 58372 -32981 -81489 -30274 52850 79645 24483 -55072
329 -55072 -66118 767 59149 46151 -12894 -53135 -24333 44632 56235 -14507 -70041 -36924
341 -36924 42083 75669 21529 -66376 -78927 3826 74193 49206 -29752 -68555 -28835 41119
353 41119 51287 -10878 -56562 -30076 27168 52113 16432 -49617 -66714 -672 67898 52874
365 52874 -22612 -70594 -37670 41921 69626 7295 -58369 -42843 25095 60784 23640 -44756
377 -44756 -57035 11230 69900 42160 -28088 -57919 -23189 39639 62362 12295 -48321 -45329
389 -45329 12014 54750 35337 -29258 -60270 -8938 57491 47145 -22208 -63984 -32513 39383
$$ packed form
305G1958q798q7362o1980L1300Q7919N1536m6521q9768j6170P1130N5472k4867
317C3849o5385k5284N4695P3608j3111r1353m8508N1215Q3124K6795n5162p9555
329e5072j1046O6885N8382j2998n9045m0241K8802O8965J1603p0742n5534L3117
341c6924P9007L3586n4140q7905j2551Q2753P0367k4987p8958l8803L9720O9954
353D1119J0168o2165m5684K6486N7244K4945l5681o6049j7097O6042O8570j5024
365E2874p5486m7982L2924P9591K7705o2331o5664J5526O7938L5689l7144o8396
377d4756j2279O8265N8670k7740p0248k9831L4730O2828K2723n0067o0616K992
389d5329N7343M2736j9413o4595l1012N1332O6429j0346o9353m1776L1471P1896
$$ plain form
401 39383 66865 7437 -64070 -53317 17818 57130 25649 -37221 -58131 -9193 46881 38300
413 38300 -17877 -52014 -31952 24728 56229 14822 -52651 -54754 9506 58683 37716 -28411
425 -28411 -63067 -17614 53353 54248 -12510 -57644 -30696 34141 61405 13336 -50202 -43318 18904
438 18904 54181 29986 -22486 -48766 -15513 42993 50553 -2696 -47552 -35201 21618 57856
450 57856 23873 -43836 -54270 4799 53764 36384 -24445 -59107 -22155 45692 50952 -12307
462 -12307 -57549 -32993 23796 48743 13783 -43118 -49003 2066 43937 31793 -17252 -52121
474 -52121 -28253 33315 51629 -638 -51138 -39078 17368 55010 27004 -39632 -56982 1169
486 1169 56522 40697 -20967 -54305 -20401 42365 53105 -1028 -45487 -29085 19285 47142
$$ packed form
401C9383K7482n9428p1507J0753P1135L9312l1481o2870k0910M8938N6074q581
413C8300n6177l4137K0062N6680L1501m1407o7473k103O4260M9177k0967o6127
425b8411l4656M5453P0967Q95o6758m5134K6948O4837K7264m8069o3538O884O2222
438A8904L5277k4195n2472k6280L3253N8506P560n3249m4856J2351N6819L6238
450E7856l3983o7709j0434N9069M8965j7380o0829l4662L6952O7847N260o3259
462a2307m5242K4556N6789K4947l4960n6901n885N1069M1871j2144m9045l4869
474e2121K3868O1568J8314n2267n0500J2060N6446L7642k8006o6636j7350N8151
486A169N5353j5825o1664l3338L3904O2766J0740n4133m4459J6402M8370K7857
$$ plain form
498 47142 25370 -27880 -47102 -3233 47265 40776 -10006 -48497 -29123 31004 56504 9170
510 9170 -48278 -42806 12966 52328 28742 -34380 -55941 -3766 49340 35045 -19922 -48492
522 -48492 -23885 26851 44920 5350 -41551 -38437 6640 41770 28785 -23525 -52306 -14717
534 -14717 40816 42844 -6969 -47691 -33240 24715 56336 14813 -45773 -43294 13858 51521
546 51521 28788 -26935 -48241 -5844 45269 39991 -7852 -40396 -27031 20470 50051 19679
558 19679 -34134 -41188 3292 43433 34486 -15371 -49381 -18586 40317 47215 -5324 -50117 -35609
571 -35609 21968 54844 16967 -43639 -46434 4720 41307 26618 -17586 -43790 -18562 29581
583 29581 36903 -4256 -40296 -31564 13061 46477 22033 -35208 -50303 -5337 42405 40023 -8805
$$ packed form
498D7142k1772n3250j9222M3869N0498o489n0782l8491J9374O0127K5500m7334
510I170n7448N472N5772L9362k3586o3122k1561N2175N3106j4295n4967k8570
522d8492K4607N0736J8069l9570m6901L114M5077L5130j2985n2310k8781L7589
534a4717N5533K028m9813m0722J4451N7955L1621m1523o0586K479N7152L7663
546E1521k2733n5723k1306M2397N1113n278m7843l2544J3365M7501K9581l0372
558A9679n3813p054M4480M0141q947m9857l4010L0795N8903O898n2539m4793J4508
571c5609N7577L2876l7877o0606k795N1154L6587j4689m4204k6204K5228M8143
583B9581P322m1159l6040Q732M4625L3416k4444n7241j5095M4966M7742k382m8828
$$ plain form
596 -8805 -49506 -27469 31549 46331 -475 -41722 -27463 20297 45788 15958 -35557 -42555
608 -42555 3774 43957 36375 -8319 -44596 -29284 24010 46275 10978 -32023 -32815 5955 39496
621 39496 23720 -29018 -47025 -2072 46575 37877 -16767 -55060 -30846 30485 51244 7807
633 7807 -38780 -36479 1662 32932 22160 -20378 -38372 -4885 34518 28405 -14003 -46257 -28570
646 -28570 27352 54764 15145 -41430 -48018 -2488 43666 37597 -14779 -43157 -9346 33500
658 33500 27317 -13060 -36783 -14830 31200 45695 5298 -42538 -40976 3985 45260 40061 -9731
671 -9731 -46528 -24503 23218 34855 4057 -29157 -24128 18657 41681 4662 -46031 -40729 14122
684 14122 52685 33076 -25529 -55734 -23126 28825 38840 7348 -26082 -28105 2913 28033
$$ packed form
596h805m0701K2037N9018J4782m6806m1247J4259M7760K5491k9830n1515o998
608d2555M6329M0183p582m4694l6277J5312N3294K2265l5297m3001p92L8770L3541
621C9496j5776n2738j8007M4953M8647q698n4644l8293K4214O1331K0759m3437
633G807m6587K301L8141L1270j0772m2538j7994L3487L9403o113m2408l2254J7687
646b8570N5922K7412l9619n6575o588M5530M6154o069n2376k8378L3811M2846
658C3500o183m0377k3723K1953M6030J4495m0397m7836J562M4961M1275n199m9792
671i731l6797K2025M7721J1637l0798l3214N029M2785K3024l7019n0693N302N4851
684A4122L8563j9609n8605l0205L2608N1951J0015l1492l3430k023L1018K5120
$$ plain form
696 28033 9426 -28079 -29147 9465 42476 29504 -23446 -58891 -25660 40686 58602 11900
708 11900 -40987 -42926 3744 40976 20639 -21008 -22643 11796 31402 13453 -23143 -38278
720 -38278 -6746 41726 48748 5700 -41618 -46273 -1911 47182 42055 -8768 -38288 -15621 21256
733 21256 25647 -8956 -36319 -9544 41866 42322 -13697 -56321 -37950 18175 53772 31028 -22984
746 -22984 -45797 -21139 13986 26461 8773 -17262 -17321 11248 23217 -3639 -36361 -31573 14305
759 14305 55946 36793 -32868 -67530 -24611 40765 54119 10131 -35410 -29441 12264 25940
771 25940 -2302 -23657 -7296 23497 35007 10399 -32946 -45751 -7843 40654 52301 15644
783 15644 -38253 -52041 -6961 40766 33363 -9388 -28988 -3601 28689 16233 -33708 -47094
$$ packed form
696B8033j8607l7505j068L8612L3011j2972n2950l5445L3231O6346J7916m6702
708A1900n2887j939M6670L7232k0337m1647j635L4439J9606j7949l6596j5135
720c8278L1532M8472P022m3048m7318m655M4362M9093n127n0823k9520K2667L6877
733B1256M391l4603k7363K6775N1410M56n6019m2624J8371N6125L5597k2744n4012
746b2984k2813K4658L5125J2475j7688k6035n9K8569J1969k6856l2722M788M5878
759A4305M1641j9153o9661l4662M2919O5376J3354m3988m5541N969M1705J3676
771B5940k8242k1355J6361L0793J1510k4608m3345j2805L7908M8497J1647l6657
783A5644n3897j3788M5080M7727p403m2751j9600K5387L2290j2456m9941j3386
$$ plain form
795 -47094 5895 57429 41902 -19208 -59269 -40341 15091 46934 27279 -11868 -28907 -19439
807 -19439 2990 14884 865 -15782 -3770 23059 26356 -7578 -48290 -42958 20067 70973
819 70973 40209 -34806 -63185 -21031 35104 41901 1693 -25642 -4689 22037 10292 -20154
831 -20154 -27512 -2928 32298 43247 11642 -33511 -47572 -18128 31028 56090 24607 -32751
843 -32751 -46625 -5871 30861 19064 -18103 -23687 17118 44401 5112 -54982 -52584 11124
855 11124 59507 43817 -14858 -54213 -36633 7603 28547 18533 -356 -14315 -11989 1535
867 1535 3693 -12362 -21170 -676 33885 40561 -6406 -62793 -52505 22483 69920 36748 -28621
880 -28621 -50461 -13216 28625 20695 -13542 -14536 16997 30410 6084 -27483 -36080 -7380 33569
$$ packed form
795d7094N2989N1534j5527o1110m0061J8928N5432L1843j9655l9147j7039R468
807a9439K2429J1894j4019j6647J2012K6829L297l3934m0712N332O3025N0906
819G0973l0764p5015k8379M2154N6135O797m0208k7335K0953K6726j1745l0446
831b0154p358K4584L5226J0949l1605m5153j4061K9444M9156K5062l1483n7358
843c2751j3874M0754L6732j1797l7167n584M0805K7283l9289o0094K398O3708
855A1124M8383j5690n8675l9355J7580M4236K0944j0014j8889j3959K326J3524
867A535K158j6055q808K0494L4561O676m6967n6387J0288P4988M7437l3172o5369
880b8621k1840L7245M1841p930l4237r94L1533J3413k4326l3567q597K8700M0949
$$ plain form
893 33569 45466 19599 -21752 -47231 -29253 22778 52375 21997 -25410 -30839 3634 24894
905 24894 866 -34313 -18913 38223 54073 -1362 -59080 -52681 6853 53743 40780 -10912
917 -10912 -39168 -24730 -321 10846 10021 492 -5701 1671 10252 -585 -24281 -33421 -3877
930 -3877 46027 52660 -7475 -65542 -48157 19328 56726 28716 -23104 -33546 2570 24522
942 24522 -553 -26326 -10542 25625 38404 12196 -28008 -41162 -13848 24569 42849 28457
954 28457 -12585 -43882 -27357 19188 36901 10040 -20263 -13469 18432 24047 -17284 -48226
966 -48226 -14636 45145 54375 1916 -51876 -49588 2094 41544 28764 -6401 -20288 -13395 -2290
979 -2290 4251 -968 -8898 -3264 14831 21955 3378 -31882 -44720 -4843 51109 51056 -7780 -52757
$$ packed form
893C3569J1897k5867m1351k5479J7978N2031K9597l0378m7407n429L4473K1260
905B4894k4028l5179J5400N7136J5850n5435n7718O399N9534M6890j2963n1692
917a0912k8256J4438K4409J1167q25r529o193P372Q581j0837k3696r140K9544
930c877M9904O633o0135n8067J7385O7485L7398k8010n1820j0442L6116K1952
942B4522k5075k5773J5784L6167J2779k6208m0204j3154K7314L8417J8280j4392
954B8457m1042l1297J6525M6545J7713k6861l0303O794L1901N615m1331l0942
966d8226L3590N9781R230n2459n3792K288N1682L9450j2780l5165j3887O893J1105
979b290O541n219p930N634J8095P124j8577l5260j2838L9877N5952n3n8836m4977
$$ plain form
993 -52757 -36682 15667 41673 13582 -23171 -14563 19573 22003 -10903 -32418 -15549 22939
1005 22939 42351 19120 -21376 -38389 -21290 13792 39249 28572 -11569 -34285 -13870 17068
1017 17068 19324 -5904 -22172 -150 33708 23030 -27356 -50924 -14797 38149 48609 6141
1029 6141 -40877 -39159 544 25094 15749 -3708 -12328 -6096 6582 6196 -11254 -21028 -6223
1042 -6223 20966 33518 8459 -36100 -45986 -1563 44092 38749 -6167 -38023 -22377 17924
1054 17924 26846 -3812 -22860 -1621 25924 22476 -8308 -33550 -21894 17063 39987 22753
1066 22753 -12031 -33465 -23053 12179 33702 15795 -15940 -21051 1210 19505 8658 -21529
$$ packed form
993e2757J6075N2349K6006k8091l6753Q608L4136K430l2906k1515J6869L8488
1005B2939J9412k3231m0496j7013J7099L5082K5457j0677m0141k2716K0415L0938
1017A7068K256k5228j6268K2022L3858j0678n0386k3568L6127N2946J0460m2468
1029F141m7018J718L9703K4550r345j9457q620O232J2678l86j7450r774J4805
1042f223K7189J2552k5059m4559r886M4423M5655n343m4916l1856J5646M0301
1054A7924Q922l0658j9048K1239K7545l448l0784k5242J1656L8957K2924j7234
1066B2753l4784k1434J0412L5232K1523j7907l1735n111K2261J8295j0847l0187
$$ [...]
8191c06
##END NTUPLES=NMR FID
##END=
