##TITLE=1H_CG-1104-b1
 DMSO, 8 sc, 
 28.5.2019
##JCAMPDX= 6.0         $$ Bruker NMR JCAMP-DX V2.0
##DATA TYPE= NMR FID
##DATA CLASS= NTUPLES
##ORIGIN= UXNMR, Bruker Analytische Messtechnik GmbH
##OWNER= root
$$ XWIN-NMR		Version 3.5
$$ Tue May 28 15:57:07 2019 Russian Standard Time (UT+4h)  she@DPX200
##.OBSERVE FREQUENCY= 200.1315
##.OBSERVE NUCLEUS= ^1H
##.DELAY= (6, 6)
##.ACQUISITION MODE= SIMULTANEOUS
##.ACQUISITION SCHEME= undefined
##.AVERAGES= 8
##.DIGITISER RES= 18
##SPECTROMETER/DATA SYSTEM= spect
##.PULSE SEQUENCE= zg30
##.SOLVENT NAME= DMSO
##.SHIFT REFERENCE= (INTERNAL, DMSO, 0, 15.7039)
##AUDIT TRAIL= $$ (NUMBER, WHEN, WHO, WHERE, WHAT)
$$ ##TITLE= Audit trail, XWIN-NMR		Version 3.5
$$ ##JCAMPDX= 5.01
$$ ##ORIGIN= Bruker BioSpin GmbH
$$ ##OWNER= she
$$ F:/spectra/data/she/nmr/H-F/1/audita.txt
$$ ##AUDIT TRAIL=  $$ (NUMBER, WHEN, WHO, WHERE, WHAT)
(   1,<2019-05-28 15:56:03.96 +0400>,<she>,<DPX200>,
      <created by zg, POWCHK disabled, PULCHK disabled
       configuration hash MD5:
       00 E9 B6 7A A2 85 ED C7 34 08 36 98 17 FE 4E 26
       data hash MD5: 16K
       56 F7 D5 D0 4F E1 71 C0 91 23 76 D0 2A 6E CA 43>)
$$ ##END=
$$ 
$$ hash MD5
$$ E1 69 36 49 C2 7D 8B 76 02 79 4D 1F 96 F6 BF BD
##$RELAX= 
##$RELAX= 
##$RELAX= 
##$RELAX= 
##$RELAX= 
##$RELAX= 
$$ Bruker specific parameters
$$ --------------------------
##$DU= <F:/spectra>
##$EXPNO= 1
##$NAME= <H-F>
##$PROCNO= 1
##$TYPE= <nmr>
##$USER= <she>
##$AMP= (0..31)
100 100 100 100 100 100 100 100 100 100 100 100 100 100 100 100 100 100 
100 100 100 100 100 100 100 100 100 100 100 100 100 100 
##$AQSEQ= 0
##$AQ_mod= 1
##$AUNM= <au_zg>
##$AUTOPOS= <>
##$BF1= 200.13
##$BF2= 200.13
##$BF3= 200.13
##$BF4= 200.13
##$BF5= 200.13
##$BF6= 200.13
##$BF7= 200.13
##$BF8= 200.13
##$BYTORDA= 1
##$CFDGTYP= 0
##$CFRGTYP= 5
##$CHEMSTR= <none>
##$CNST= (0..31)
1 1 145 1 1 1 1 1 1 1 1 1 1 1 1 1 1 1 1 1 1 1 1 1 1 1 1 1 1 1 1 1 
##$CPDPRG= <>
##$CPDPRG1= <>
##$CPDPRG2= <>
##$CPDPRG3= <>
##$CPDPRG4= <mlev>
##$CPDPRG5= <mlev>
##$CPDPRG6= <mlev>
##$CPDPRG7= <mlev>
##$CPDPRG8= <mlev>
##$CPDPRGB= <>
##$CPDPRGT= <>
##$D= (0..31)
0 1.2 0 0 0 0 0 0 0 0 0 0.03 0 0 0 0 0 0 0 0 0 0 0 0 0 0 0 0 0 0 0 0 
##$DATE= 1559044563
##$DBL= (0..7)
120 120 120 120 120 120 120 120 
##$DBP= (0..7)
150 150 150 150 150 150 150 150 
##$DBP07= 0
##$DBPNAM0= <>
##$DBPNAM1= <>
##$DBPNAM2= <>
##$DBPNAM3= <>
##$DBPNAM4= <>
##$DBPNAM5= <>
##$DBPNAM6= <>
##$DBPNAM7= <>
##$DBPOAL= (0..7)
0.5 0.5 0.5 0.5 0.5 0.5 0.5 0.5 
##$DBPOFFS= (0..7)
0 0 0 0 0 0 0 0 
##$DE= 6
##$DECBNUC= <off>
##$DECIM= 24
##$DECNUC= <off>
##$DECSTAT= 4
##$DIGMOD= 1
##$DIGTYP= 9
##$DL= (0..7)
0 120 120 120 120 120 120 120 
##$DP= (0..7)
150 150 150 150 150 150 150 150 
##$DP07= 0
##$DPNAME0= <>
##$DPNAME1= <>
##$DPNAME2= <>
##$DPNAME3= <>
##$DPNAME4= <>
##$DPNAME5= <>
##$DPNAME6= <>
##$DPNAME7= <>
##$DPOAL= (0..7)
0.5 0.5 0.5 0.5 0.5 0.5 0.5 0.5 
##$DPOFFS= (0..7)
0 0 0 0 0 0 0 0 
##$DQDMODE= 0
##$DR= 18
##$DS= 0
##$DSLIST= <SSSSSSSSSSSSSSS>
##$DSPFIRM= 0
$$ [...]
##$SUBNAM2= <"">
##$SUBNAM3= <"">
##$SUBNAM4= <"">
##$SUBNAM5= <"">
##$SUBNAM6= <"">
##$SUBNAM7= <"">
##$SUBNAM8= <"">
##$SUBNAM9= <"">
##$SW= 24.9337058887773
##$SWIBOX= (0..15)
0 0 2 0 0 0 0 0 0 0 0 0 0 0 0 0 
##$SW_h= 4990.01996007984
##$TD= 16384
##$TD0= 1
##$TE= 0
##$TE2= 300
##$TE3= 300
##$TEG= 300
##$TL= (0..7)
0 120 120 120 120 120 120 120 
##$TP= (0..7)
150 150 150 150 150 150 150 150 
##$TP07= 0
##$TPNAME0= <>
##$TPNAME1= <>
##$TPNAME2= <>
##$TPNAME3= <>
##$TPNAME4= <>
##$TPNAME5= <>
##$TPNAME6= <>
##$TPNAME7= <>
##$TPOAL= (0..7)
0.5 0.5 0.5 0.5 0.5 0.5 0.5 0.5 
##$TPOFFS= (0..7)
0 0 0 0 0 0 0 0 
##$TUNHIN= 0
##$TUNHOUT= 0
##$TUNXOUT= 0
##$USERA1= <user>
##$USERA2= <user>
##$USERA3= <user>
##$USERA4= <user>
##$USERA5= <user>
##$V9= 5
##$VALIST= <valist>
##$VCLIST= <CCCCCCCCCCCCCCC>
##$VD= 0
##$VDLIST= <DDDDDDDDDDDDDDD>
##$VPLIST= <PPPPPPPPPPPPPPP>
##$VTLIST= <TTTTTTTTTTTTTTT>
##$WBST= 1024
##$WBSW= 4
##$XGAIN= (0..3)
0 0 0 0 
##$XL= 0
##$YL= 0
##$YMAX_a= 80053
##$YMIN_a= -97496
##$ZGOPTNS= <>
##$ZL1= 120
##$ZL2= 120
##$ZL3= 120
##$ZL4= 120
##$ABSF1= 10
##$ABSF2= 0
##$ABSG= 5
##$ABSL= 3
##$ALPHA= 0
##$AQORDER= 0
##$ASSFAC= 0
##$ASSFACI= 0
##$ASSFACX= 0
##$ASSWID= 0
##$AUNMP= <proc_1d>
##$AZFE= 0.1
##$AZFW= 0.1
##$BCFW= 1
##$BC_mod= 2
##$BYTORDP= 1
##$COROFFS= 0
##$CY= 11.3945322036743
##$DATMOD= 1
##$DC= 2
##$DFILT= <>
##$DTYPP= 0
##$F1P= 18.9103706918063
##$F2P= -1.10871071338519
##$FCOR= 0.5
##$FTSIZE= 0
##$FT_mod= 4
##$GAMMA= 1
##$GB= 0.15
##$INTBC= 1
##$INTSCL= 1
##$ISEN= 128
##$LB= 0.24
##$LEV0= 0
##$LPBIN= 0
##$MAXI= 10000
##$MC2= 0
##$MEAN= 0
##$ME_mod= 0
##$MI= 1.114404
##$NCOEF= 0
##$NC_proc= 0
##$NLEV= 6
##$NOISF1= 3.799351
##$NOISF2= 2.8
##$NSP= 1
##$NTH_PI= 0
##$NZP= 0
##$OFFSET= 15.70392
##$PC= 1
##$PHC0= -8867.152
##$PHC1= 28.40025
##$PH_mod= 1
##$PKNL= yes
##$PPARMOD= 0
##$PSCAL= 0
##$PSIGN= 0
##$REVERSE= no
##$SF= 200.130013532006
##$SI= 16384
##$SIGF1= 3
##$SIGF2= 2
##$SINO= 400
##$SIOLD= 16384
##$SREGLST= <1H.CDCl3>
##$SSB= 0
##$STSI= 0
##$STSR= 0
##$SW_p= 3612.71676300578
##$SYMM= 0
##$S_DEV= 0
##$TDeff= 0
##$TDoff= 0
##$TI= <>
##$TILT= no
##$TM1= 0
##$TM2= 0
##$TOPLEV= 0
##$USERP1= <user>
##$USERP2= <user>
##$USERP3= <user>
##$USERP4= <user>
##$USERP5= <user>
##$WDW= 1
##$XDIM= 8192
##$YMAX_p= 0
##$YMIN_p= 0
$$ End of Bruker specific parameters
$$ ---------------------------------
##NTUPLES= NMR FID
##VAR_NAME=  TIME,          FID/REAL,        FID/IMAG
##SYMBOL=    X,             R,               I
##VAR_TYPE=  INDEPENDENT,   DEPENDENT,       DEPENDENT
##VAR_FORM=  AFFN,          ASDF,            ASDF
##VAR_DIM=   8192,          8192,            8192
##UNITS=     SECONDS,       ARBITRARY UNITS, ARBITRARY UNITS
##FACTOR=    0.0002004,     1,               1
##FIRST=     0,             0,               0
##LAST=      1.6414764,     0,               0
##MIN=       0,             -97496,          0
##MAX=       1.6414764,     80053,           0
$$ Real data points
##PAGE= N=1
##DATA TABLE= (X++(R..R)), XYDATA
$$ [...]
2207i43J179N98n01m27o00k64Q38J433o08j300m54J80J075J076j026k114K70J889
$$ -943 236 834 333 -94 -694 -958 -120 1313 705 -595 -1049 -869 206 1282 256 -1858 -1588 301
2225C01O77P1j318j622L18K055J056j584j396l71J427J679J78k293j661J412K454
$$ 301 978 1049 -269 -1891 -1573 482 1538 -46 -1442 -1813 -386 1293 1471 -822 -2483 -1071 1383
2242A383J50j458j741j53J964J731r82k343J51J355O09J18o01j271j27J587O56
$$ 1383 1533 75 -1666 -1819 145 1876 894 -1449 -1298 57 666 784 183 -1088 -1215 372 1028
2259A028r83r7p21l49J129O41m53j217J24N86N30O93n07j473m3R86J013J61r97
$$ 1028 45 -52 -773 -1122 7 648 195 -1022 -898 -312 218 911 404 -1069 -1112 -126 887 1048 51
2278E1j285l02J845J751j559k059j93J149K657j56k427k092J381K816n9j625j211
$$ 51 -1234 -1536 309 2060 501 -1558 -1751 -602 2055 1899 -528 -2620 -1239 1577 1518 -107 -1318
2295a318K1J818J466j096k270J9J482O26K5r15j139L43J493N40r83m09l21K62
$$ -1318 -1297 521 1987 891 -1379 -1360 122 748 773 -142 -1281 -938 555 1095 112 -297 -618 -356
2313c56O60Q87q65q79K04J07M01R36l72j233o45J344R66O8r32j670m0K126J612
$$ -356 304 1191 326 -553 -349 -242 159 1095 723 -510 -1155 189 1155 1223 291 -1379 -1419 707 2319
2332B319j428k116l52J447J964J52k436j924J861K367j75j784r65Q2J503J635
$$ 2319 891 -1225 -1577 -130 1834 1986 -450 -2374 -513 1854 1679 -105 -1070 -988 515 2150
2348B150j181k373R2J308J191J54j050j534J96J926M20j015j128L86M18N43N22
$$ 2150 969 -1404 -1312 -4 1187 1341 291 -1243 -1047 879 1299 284 -844 -458 -40 503 1025
2365A025q43p54P54k00J39O27m1j111k54Q11O58M91o63j514k10J901R99j217j461
$$ 1025 182 -572 182 -18 121 748 707 -404 -658 153 811 1302 639 -875 -1085 816 1815 598 -863
2384h63l58R98J771L90j980k052J753J758L29j307j687j44J681J888j116k191
$$ -863 -1221 -223 1548 1938 -42 -2094 -341 1417 1746 439 -1248 -1392 289 2177 1061 -1130
2400a130o79J967J655n83j117j691N14K368K12j506r49M25O47M52J36r53n45N69
$$ -1130 -1809 158 1813 1230 113 -1578 -1064 1304 1516 10 -939 -514 133 585 721 -232 -777 -208
2418b08L11m62Q37L3r26o74Q09O03L94o24j298l87J775R92r82j415o91J227J535
$$ -208 103 -359 478 511 -415 -1089 -280 323 717 93 -1205 -1592 183 1175 193 -1222 -1913 -686 849
2437H49P90k211k277J235K318J91r35j977l76K020K053q58k620p08J984J406j24
$$ 849 1639 -572 -2849 -1614 704 895 -40 -2017 -2393 -373 1680 822 -1798 -2506 -522 884 760
2454G60j631j457R19K445R0j656o85L04N23O59l4r78k55P44K54k03L99n8j041
$$ 760 -871 -2328 -1409 1036 1126 -530 -1215 -911 -388 271 237 -741 -996 -252 2 -201 198 140 -901
2473i01L3J031J38n6k38r40n83J937R90o34j430m11R18R25J123j683k017N09K410
$$ -901 -868 163 301 245 7 -933 -1516 421 1411 777 -653 -1064 -146 779 1902 219 -1798 -1289 1121
2492A121R68j303j603q57J963K328r00k930n87K187J470J65j732k194J410K079
$$ 1121 2089 786 -817 -1674 289 2617 1717 -1213 -1800 387 1857 2022 290 -1904 -494 1585
2508A585K80j488j204N49R41M21P6j294p83J136N15l55j14r0k19J63M63P6l70
$$ 1585 1865 377 -827 -278 663 1084 1160 -134 -917 219 734 379 265 175 -44 119 582 658 288
2527B88L47p98o35J033J223o58j241n99M10J332J540k062k012L36K481J079j260
$$ 288 635 -163 -798 235 1458 800 -441 -1040 -630 702 2242 180 -1832 -1496 985 2064 804
2544H04j800q23J777K430o24k951p53J647J997r2j570j810N53K325Q95j825j473
$$ 804 -996 -1819 -42 2388 1764 -1187 -1940 -293 1704 1612 42 -1768 -1215 1110 2005 180 -1293
2561a293J14J355J043l15j855l02J079Q58p20M0k84j68M47L04l01l44O75o87m54
$$ -1293 -1179 176 1219 904 -951 -1253 -174 684 -36 4 -280 -448 -1 303 2 -342 333 -354 -808
2580h08K13J375m6j283l96k20J648J168j419k143M97K290N88j090j552m75J364
$$ -808 -595 780 734 -549 -945 -1165 483 1651 232 -1911 -1414 876 1464 374 -1178 -1653 -289
2597b89K318m81k519j200J638J538Q51j936j392m4K456P71j591j254k94J259J608
$$ -289 2029 1548 -971 -2171 -533 1005 1856 -80 -1472 -1516 940 1711 120 -1134 -1428 -169 1439
2614A439m46j834r45J602J198o26o32m31K85M93M82o41j45K11N2j200N79J174
$$ 1439 993 -841 -1786 -184 1014 388 -244 -675 -390 103 585 -56 -201 10 62 -1138 -559 615
2632F15Rq89q06N02R81J125j056j733J89J648N84j49k051r12J356K460k53k281
$$ 615 624 -265 -1071 -569 412 1537 481 -1252 -1063 585 1169 1020 -1031 -1943 -587 1873 1620 -661
2650f61j208J361J646M53j327k001j34K691J485j884j620j6J072J727n11j786
$$ -661 -1869 -508 1138 1591 264 -1737 -1871 820 2305 421 -1199 -1215 -143 1584 1073 -713
2666g13r20J677J054p43m87l89Q6M10O26n52l95N90K04r05N50P15n28o13l25M6
$$ -713 -1633 44 1098 355 -132 -521 -435 -25 601 49 -346 244 448 -457 93 808 280 -333 -658 -612
2686f12R33J057p41j786j4J594J051m29j523j154J250J970M02k546j288R51J875
$$ -612 321 1378 637 -1149 -1163 431 1482 1053 -470 -1624 -374 1596 1998 -548 -1836 -885 990
2703I90J099j352k755K74K845J265j886j506k97J288J521Nk184o38J447J124l03
$$ 990 2089 737 -2018 -1744 1101 2366 480 -1026 -1323 -35 1486 1491 -693 -1331 116 1240 937
2720I37o07p31j57J057K96m44r42P66J03m35J70M72l53J3j51k54K63R03l48j394
$$ 937 330 -401 -558 499 795 351 -591 175 278 -157 13 485 132 145 -6 -260 3 906 558 -836
2740h36j44J046J162l81j138j440P89K230N31k311j831J339J952O11j238k022
$$ -836 -980 66 1228 847 -291 -1731 -942 1288 1819 -492 -2323 -984 968 1579 341 -1681
2756a681m38K649J290j241k061k59J197J807o6k027r18R21J786m68o52r76K66
$$ -1681 -2119 530 1820 579 -1482 -1741 -544 1263 1197 -830 -1748 -827 959 491 -161 -1137 -871
2773h71Q31P10o57r42L55L07j18K50l83J49Q2j82J12q1P83M92j877m70J289P29
$$ -871 -40 670 13 -929 -574 -267 -385 -135 -518 -369 -287 -469 -357 -438 345 837 -1040 -1510 -221 508
2793E08L61j054j431O43K001M75k047j344Q15J689J098j197k233MK150J529j030
$$ 508 869 -185 -1616 -973 1028 1503 -544 -1888 -1073 616 1714 517 -1716 -1712 438 1967 937
2810I37k179J09P65J616N16k492q71J036J648J43j041q09l47J490J060j089j317
$$ 937 -1242 -1133 -368 1248 1764 -728 -1599 -563 1085 1228 187 -622 -969 521 1581 492 -825
2827h25N26Q45k18K15l03n2J85j6p7l04P67k74p90m61J062P21k91r16r92N79J840
$$ -825 -299 546 328 543 240 188 373 357 280 -24 743 469 -321 -782 280 1001 710 -206 -1198 -619 1221
2848A221L57j577j296J099J006M86n15j753q17K063J671j248j671m40P60J735
$$ 1221 1578 1 -1295 -196 810 1296 781 -972 -1789 274 1945 697 -974 -1414 -654 1081
2864A081P38j803j481O40J845L69j331o48n93J542Q30p84j458N56J051J08m81
$$ 1081 1819 16 -1465 -825 1020 1389 58 -590 -1183 359 1189 405 -1053 -497 554 662 181
2881A81k30q3O5L39k86n1O37K62j292L1Q49K48l10n81o15Q5J884K45j634o96M23
$$ 181 -49 -132 -67 272 -14 -65 572 834 -458 -427 422 670 360 -221 -836 -751 1133 1378 -256 -952 -529
2902e29Q37Q55j57j969o14J807J268j86j875q88M95J852Q94j733k040R98J951
$$ -529 308 1163 1006 -963 -1577 230 1498 1312 -563 -1451 -956 896 1790 57 -1983 -985 966
2919I66K66j310p13q0J011J103q89j295K57M96L65j17j86k81L9J90L49m21M01
$$ 966 1232 -78 -791 -871 140 1243 354 -941 -684 -188 177 60 -126 -407 -368 -178 171 -250 151
2938A51O7r27O8R59K5m74O8o25LR47N67p21j184M38P15Q23l12j548o13J350J563
$$ 151 218 -709 -641 318 343 -131 -63 -688 -685 262 829 108 -1076 -638 77 900 588 -960 -1573 -223 1340
2959A340m80j285j037P21J698O28j918j480J062J725np66j108o57J424J192o27
$$ 1340 860 -425 -1462 -741 957 1585 -333 -1813 -751 974 969 203 -905 -1562 -138 1054 427
2976D27j207j17P77n4N78l76p99J56R92J4m40J23j61m79N43M0r7j85M4O9l29R18
$$ 427 -780 -897 -120 -174 404 28 -771 -615 377 391 -49 74 -87 -566 -23 17 -80 -265 -221 -152 -481 437
2998D37P93j613m08J95P77Q73l18j917m77J640J214m34j128p32N49J328O96j675
$$ 437 1230 -383 -791 -596 181 1054 736 -1181 -1658 -18 1196 762 -366 -1098 -549 779 1475 -200
3016b00j346O92J596K70n49j083n61J280J217k88j693k35R63o1J143o04j234J04
$$ -200 -1546 -854 742 1012 463 -620 -1181 99 1316 1028 -665 -900 63 2 1145 541 -693 -589
3034e89R16P07j352J27R6l2M22L53n17LK9l18n5R04M89j057p40L01P44Q01m08
$$ -589 327 1034 -318 -191 -95 -127 295 648 131 134 163 -155 -210 694 1183 126 -614 -313 431 1232 824
3055H24j242k94J145J160n52j167j68j5J232P83j250j389L76J257P51m25j144
$$ 824 -418 -712 433 1593 1041 -126 -294 -309 923 1706 456 -933 -557 700 1451 1026 -118
3072a18q84Q84J784k27j856l18P05R68N5k39j293mJ035L50m82m21q7N0K9M79K5
$$ -118 -1002 -118 1666 1439 -417 -735 -30 938 993 754 -539 -543 492 842 360 -61 -148 -98 -69 410 435
3093D35p48M67k06l65R86L65j340n68M43O50L50j45p03o77R24J041o50p79j72
$$ 435 -313 154 -52 -417 569 934 -406 -974 -531 119 469 324 -379 -1056 -132 909 259 -520 -692
3112f92r8J261M35r85j209J09J347O14n18o58q82P37J527j83j480m68Q72L31N98
$$ -692 -790 471 906 -79 -1288 -1179 168 782 264 -394 -1276 -539 988 805 -675 -1143 -271 60 658
3131F58o23r25J0J185K98m96o95L23j16M24K84m16k53j8O5L47M10p9q86j93P74
$$ 658 35 -890 -880 305 603 107 -588 -265 -381 43 327 -89 -342 -360 -295 52 462 383 -503 -696 78
3152G8j53K62L09q25o56Q76R57k95q43l24k4O39J200q22j558L35J319O26n13q19
$$ 78 -75 187 496 -329 -985 -109 848 553 -290 -614 -638 1 1201 379 -1179 -844 475 1101 588 -231
3172b31j164J021J562k61j582n07P90Q41K48o35n96m47J179Nol70n34Q3M70P85
$$ -231 -1395 -374 1188 927 -655 -1162 -372 469 717 82 -514 -961 218 223 217 -153 -687 -604 -134 651
3192F51o76l96rR2K68M08j33p95r5N47r8L00j34o43l41R01R44l48p67n47J68O77
$$ 651 -25 -421 -430 -338 -70 338 205 -590 -685 -138 -236 64 -70 -713 -1054 -153 791 443 -324 -871 -703 -26
3214b6J003p52j574N42J116N82l31r30n94M19J240pj370l17O31N16O16m23r23
$$ -26 977 225 -1349 -807 309 891 560 -370 -964 -545 695 688 -682 -999 -368 148 764 341 -582
3233e82l58Q27O32k3k84m05m82Q67P48o86q46K66O36Q9K11n64m23J81O04k05N6
$$ -582 -940 -113 519 496 212 -193 -675 192 940 254 -592 -326 310 399 610 46 -377 -196 408 203 259
3254B59K63n97n6J92R51l51r27k29J95R87Q27r67j257L36J073K17l1p99m52J35
$$ 259 522 -75 -131 61 1012 661 -266 -495 -300 687 1514 547 -710 -374 699 916 885 86 -366 -231
3274b31J128j06j085n32K23Q84N21m44j033j80J002O43m19k98n33N5O70L23m50
$$ -231 897 791 -294 -826 -603 281 802 358 -675 -855 147 790 371 73 -460 -405 265 588 138
3293A38o15PO76k27K90p2k95j98J82O43m34Q0n22k55N83R27o13p94j16K71O31
$$ 138 -477 -470 206 -21 269 197 -98 -296 -114 529 95 175 -347 -602 -19 908 295 -499 -615 -344 287
3314B87L84m73j018L22R42K95m62o20j54J9J193k08q63m26K88K88P62N8j163m49
$$ 287 671 198 -820 -498 444 739 277 -343 -497 -478 715 507 -356 -782 -494 -206 556 614 -549 -998
3334i98J107O66m06l55l16j81P95M70o99n63K87J83JM24J5j021o6P62M42k79j93
$$ -998 109 775 369 14 -302 -483 312 782 83 -480 -193 -10 -9 415 430 -591 -657 105 547 268 75
3355G5l93m41J093M61n14p55Q4K57O61K43n27q67K94M86M61l52l60n69K00R94
$$ 75 -318 -759 334 795 281 -474 -390 -133 528 771 244 -623 -329 157 618 266 -94 -663 -463 531
3375E31M44j193l15J52O11L07j49q86k63O34R62m53n89k18j89R14J90l24o20q8
$$ 531 975 -218 -533 -381 230 537 388 -498 -761 -127 835 382 -207 -425 -614 300 490 166 -454 -542
3395e42K35N08L63m80o58k8N58N33r1l49k56k11O71L49n80n69L94l4K5N05j3p45
$$ -542 -307 201 564 84 -574 -602 -44 489 398 49 -207 -418 253 602 22 -547 -153 -187 -162 343 330 -415
3417d15o7O61J96k08k00q08Q70O85k19o52m43K91O51K57k09q45k31M11R75o00
$$ -415 -482 179 375 167 -33 -841 29 714 495 -157 -600 -309 342 599 390 -455 -686 -275 700 100
3437A00k39j24P9K06J009m27q78j44J6Q09j1k28o75K3P61K39P9o27m16L51M07
$$ 100 -139 -263 -184 22 1031 604 -274 -418 -402 407 396 168 -507 -484 277 516 595 -32 -448 -97 310
3458C10L40n87o36N4N46K43K75k40j010K76Q78J79l41n01k87J16J262P1j280n31
$$ 310 650 63 -573 -519 27 270 545 305 -705 -429 449 628 287 -214 -501 -385 877 948 -332 -863
3478h63O18N51K46l7p53l15R93j80j46l69P1m83M49J047n66n57k3K94L14L28p98
$$ -863 -245 306 552 515 -238 -553 440 260 114 -255 -184 -667 -218 829 263 -294 -317 -23 291 619 -179
3499a79p60M10Q70j55m08q0j68K76M37N66o67k20j49K23K10L29n95o15M79O80
$$ -179 -939 -529 341 186 -222 -302 -470 -194 243 809 142 -78 -227 -4 206 535 -60 -675 -196 484
3519D84r1m39n25J6K30Q46J83q70l31K67L19J72J59n94n66L97Q41j48o15j41k02
$$ 484 393 -46 -571 -555 -325 521 704 -166 -497 -230 89 261 420 -174 -740 -343 498 350 -265 -406 -608
3540f08N76P19n68n70o7M36K61L60k58q16n7P64L31m94j38k22j15Q61J8m35p64
$$ -608 -32 687 119 -451 -518 -82 179 539 281 -535 -592 172 503 9 -129 -351 -466 395 413 -22 -786
3561g86L89L74K67M25r27m29M23N27K96m98k37n22O44O01k24m12l58L66J38J63
$$ -786 -397 -23 244 669 -258 -687 -264 263 559 61 -176 -698 -54 547 323 -89 -447 -81 57 220
3581B20M64q51l95M90N74p9l37l74k7O85K69m76o13J42N21L15K90o52m91R0P08
$$ 220 684 -167 -562 -72 502 423 86 -288 -315 370 639 163 -450 -308 213 528 818 166 -325 -235 473
3602D73m9J20n53j12l92J187L62q20p66K04N47J91K85p90k51J89P19J71m68k00
$$ 473 424 544 -9 -121 -513 674 1036 216 -550 -346 201 392 677 -113 -364 -175 544 715 247 47
3622D7k48K5P37K27p93l47L32J88K91p0r47k80Q95L45M8n17j74l71R16K80k59
$$ 47 -201 -176 561 788 -5 -352 -20 168 459 389 -558 -838 57 402 450 -67 -241 -612 304 584 325
3643C25q54R5N08N4L86j91p30lO10M23l38n13m60L56M68Q40j157m07L24J37N47
$$ 325 -529 -434 74 128 514 323 -407 -410 200 623 285 -228 -688 -332 136 976 -181 -588 -264 -127 420
3664D20k03l72n06M81M27N8k74l34j80L02O17j11n98m32L52O79p4J3r89m1O01
$$ 420 217 -155 -661 -180 247 305 31 -303 -483 -181 436 325 -273 -705 -353 326 252 265 -724 -765 -164
3685a64N27l20m28j16j22P03P14r30m34J75N12M1j7K12q85O9R87k63j16l47l74
$$ -164 363 43 -385 -501 -623 80 794 -136 -570 -395 117 158 141 353 -532 -463 524 261 145 -202 -576
3706e76o0P92K22n18n19L82J21J78L36m07m88M02K51J13j84m15j88o2J150rj203
$$ -576 -636 156 378 -140 -659 -277 -156 22 358 -49 -537 -135 116 229 45 -370 -558 -620 530 521 -682
3727f82J75O72k47M8J63m82l09M83R65r08j57j70J81M17N02j5q35j97K09L69L28
$$ -682 -507 165 -82 -34 129 -353 -662 -179 786 -122 -279 -449 -268 149 651 636 -199 -396 -187 182 510
3748E10k19p51j24P29M27m60k69L8k52P70K00n07n43L41J54J94K18l47n10J87
$$ 510 291 -460 -584 145 572 112 -157 -119 -371 399 599 92 -451 -110 44 238 456 109 -401 -214
3768b14N98k7l75j21k79M35P28j16j073R9M12J89J47J84n93p05R28L01j48n76
$$ -214 384 357 -18 -139 -418 17 745 629 -444 -345 67 256 403 587 -6 -711 217 518 370 -206
3788b06K6j84K91O61j73r34M98P5K29M92o59p29L23R19J2k64m60P4p1N69J79m35
$$ -206 -180 -364 -73 588 415 -519 -21 54 283 775 116 -613 -290 629 641 377 -83 -9 -80 489 668 233
3810B33n89K01N94J24nm12n86O3J040m0l68m68p8M18R36l86p15l3M23k42K27k50
$$ 233 -356 -155 439 563 558 146 -440 -377 663 623 255 -213 -291 127 1063 677 -38 -71 352 110 337 87
3832H7l80j21M31N22m10N9l40J11K74N04k07q26k95P10P7M25n05l24R0Q22m52
$$ 87 -293 -414 17 539 129 188 -152 -41 233 737 530 -296 -591 119 196 621 116 -208 -118 704 252
3853B52k03j96J27N2J72M14n26n81L24L51K40j40m85l94K09J086l05n08n6m9K60
$$ 252 49 -147 -20 32 204 618 92 -489 -165 186 426 286 -199 -593 -384 702 397 -111 -167 -216 44
3874D4mM7n27p7N95m9J13J8o03j10M33M61k79k01j00N1J40L96l38m21mL58L92
$$ 44 40 87 -440 -517 78 29 142 160 -443 -553 -120 341 62 -139 -239 -188 -48 348 10 -411 -415 -57 335
3897C35J02o31o06K7J095P7l14k77k78N1O25K92m85n89L32J72L10j69n19n50Q86
$$ 335 437 -194 -800 -773 322 399 85 -192 -470 -419 206 498 13 -576 -244 -72 238 69 -450 -1000 -114
3918a14P69o0q93K91m8l87Q01p4o92m3L64J04L28P5q31j24L77P48o1q90L9N9P47
$$ -114 655 595 -298 -7 -55 -442 359 285 -407 -450 -86 18 346 421 -410 -534 -157 591 530 -360 -321 -262 485
3941D85j08n17n22M30N04J07l63j39k06r4O29J09k53k24k86O8P93K44r04l02K93
$$ 485 377 -140 -662 -232 272 379 16 -123 -329 -423 206 315 62 -162 -448 -380 413 657 -247 -549 -256
3962b56L10K23j40k57m87L15Q88m06N9k13j77j46R99m93m43p9N9M63o0p0m25j55
$$ -256 54 277 137 -120 -607 -292 596 190 249 36 -141 -287 712 219 -224 -303 -244 219 159 89 -336 -491
3984d91N59N33l99o79K64L34K66J34o21j6k17R7M12P0K71o72l03N64M54n30r2
$$ -491 68 601 202 -477 -213 121 387 521 -100 -116 -333 -236 176 246 517 -155 -458 106 560 30 -62
4005f2j6J6N62m9m13l65K20K92L7K38k98n21J59N96l24q4qn57L06P27j42n27r2
$$ -62 -78 -62 500 451 38 -327 -107 185 222 460 162 -359 -200 396 72 -12 -20 -577 -271 456 314 -213 -305
4028c05L28L59n14M23p08k8N06M44j75o90L9R9K55K40J34o97q5M78R9N7l08k67
$$ -305 23 382 -132 291 -417 -445 61 505 330 -360 -321 -222 33 273 407 -290 -375 103 202 259 -49 -316
4050c16p7P35J85o52j80k4K26L67q1l95j17L03M79n54M98o54k79M07O62j96n30
$$ -316 -393 342 527 -125 -305 -329 -103 264 183 -212 -329 -26 453 -101 397 -257 -536 -129 533 337 -193
4071a93K9k18N31J06K27n53k48L94j25L30p7m79j08R3Q00l33k54k98K7M43L39
$$ -193 -164 -382 149 255 482 -71 -319 75 -50 280 203 -276 -384 -291 509 176 -78 -376 -349 94 433
4092D33%q30L5K11K16O3k65m71J9P45K05m82j90j72M67K11p1l91k38L16J77J61
$$ 433 433 -397 -362 -151 65 128 -137 -608 -589 156 361 -121 -311 -483 -16 195 124 -267 -505 -189 -12 149
4114A49j86l34k20M53O35J2p02N0m8PO45k0j101K24L85N57l89Mn43k39P20L46
$$ 149 -37 -371 -591 -138 497 509 -193 -143 -191 -184 461 441 -660 -436 -51 506 117 121 -422 -661 59 405
4136D05l05k9j6j16n0M76J63q10j33L89N06k75k62l52J96P58j62m48j15P5K44
$$ 405 100 71 55 -61 -111 365 528 -282 -415 -26 480 205 -57 -409 -213 545 383 -65 -180 -105 139
4157A39J37K6k54m60L20Q4J35J90m48l78L62P65l64j97k05J06J27L58M8o97l49
$$ 139 276 302 48 -412 -92 -8 127 317 -131 -509 -147 618 254 57 -148 -42 85 443 491 -206 -555
4178e55O02l7jK84j15o16L08N24j63R3m93RM63K43l49o45l7M63R2q4m2l59J97
$$ -555 47 10 9 293 178 -438 -130 394 231 324 -169 -160 303 546 197 -448 -485 -22 70 -14 -56 -415 -218
4201b18O03p8n03J66j74Q2L84N19q42l35N60R1j79J81l62m57N14P02j31n08n11
$$ -218 385 307 -196 -30 -204 -122 262 781 -61 -396 164 255 76 257 -105 -562 -48 654 523 15 -496
4222d96K65N76J04k41m50J06J71K58j65j59j65m32P68K3J48n10j19N1M15L62m71
$$ -496 -231 345 449 208 -242 -136 35 293 128 -31 -196 -628 140 163 311 -199 -318 -267 148 510 39
4243C9m93K13L59K07L2k97l99Q1P03l38j25k41J16l11M94Q6k06m74M92J73J55
$$ 39 -454 -241 118 325 357 60 -339 -258 445 107 -18 -259 -143 -454 40 126 -80 -554 -62 111 266
4264B66j97p9j52RN57n53p7J85k60N85ql3j29n03K85K31O0m8n45j17N25M55n53
$$ 266 69 -10 -162 -153 404 -149 -226 -41 -301 284 276 243 114 -389 -104 127 187 139 -406 -523 2 457 -96
4287i6k81j15N20q2N36l83l36M1N65l23L3m8l58nO07J28m15k27j42K60J23N10
$$ -96 -377 -492 28 -54 482 99 -237 -196 369 46 79 31 -327 -332 275 403 -12 -239 -381 -121 2 512
4309E12r18JM05R0J5mk23m0K62L27k97l93j0J70MM45k04m48j6N35j62J88k26j36
$$ 512 -406 -405 0 90 105 101 -122 -162 100 427 130 -263 -273 -103 -99 346 142 -306 -322 213 51 239 13 -123
4333a23LK81L44l35m83J6N40j18J55o43l15P75K03Nj33r7k66n7O68mm89m9m0L76
$$ -123 -120 161 505 170 -313 -297 243 125 280 -363 -678 97 300 305 172 75 -191 -248 420 416 -73 -122 -162 214
4357B14R4L22o65R6K36O3lj03j31m41N44J19j81k97R4o1q2N03j57n69K87J13M11
$$ 214 308 630 -35 61 297 360 357 254 123 -318 226 345 164 -133 -39 -100 -182 321 164 -405 -118 -5 406
4380D06k53k46k64j83O97L36m30l35J95o3rL80k35k00K28j20K81n6Jk89q7O05
$$ 406 153 -93 -357 -540 157 493 63 -272 -77 -140 -149 231 -4 -204 24 -96 185 129 130 -159 -246 359
4402C59L6k06l99RL20R1k52j99l01P61m5j01j06L42q58M43K81j36l17j79K31L17
$$ 359 395 189 -210 -201 119 210 -42 -241 -542 219 174 73 -33 309 -549 -106 175 39 -278 -457 -226 91
4424I1K48k19k89j74O68j83km01L5j04K09M67p2m81j02P6R0L10q1m05j96M46L93
$$ 91 339 120 -169 -343 325 142 140 -261 -226 -330 -121 346 274 -207 -309 -233 -143 167 86 -319 -515 -69 324
4447C24o60M75o44J37R78n79k78l4Q6J08J98L09m92m36J90K79J01n9j47k23J19
$$ 324 -336 139 -505 -368 610 31 -247 -281 -195 -87 111 420 -72 -508 -318 -39 62 3 -144 -367 -248
4468b48O81j20p68q6M91l06L58k08k68J13J97R7j00j07r2J63L67K2Mp68L31k54
$$ -248 433 313 -455 -541 -50 -356 2 -206 -474 -361 -164 -67 -167 -274 -366 -203 164 186 190 -578 -247 -501
4490e01O77j23j10k96j03P60k70J35k08k88K70K95K15n60k61M73k46L15n6R6n88
$$ -501 176 53 -57 -353 -456 304 34 169 -39 -327 -57 238 453 -107 -368 105 -141 174 118 214 -374
4511c74J63J44L8j30j77K16M4O55n30j97K38q6P3K91J03m38l60K93K86l9Q5n12
$$ -374 -211 -67 -29 -159 -336 -120 -76 579 49 -148 90 4 77 368 471 33 -327 -34 252 213 298 -214
4533b14p1K30M10q5l47J1J85K17J32k59m22K98L53j81j53R5l10q0N15n6l80P4
$$ -214 -285 -55 355 270 -77 -66 119 336 468 209 -213 85 438 257 104 199 -111 -191 324 268 -112 -38
4555c8p1K57K91q0m60l98K98N07J4k53k52k89M18M00k78n41L99K47O4j09K90p53
$$ -38 -109 148 439 359 -101 -499 -201 306 320 67 -185 -474 -56 344 66 -475 -76 171 235 126 416 -337
4577c37k30L59L48M1k86J88l98L03M50k71n25O9P13m02M85p78k16J28M27R8l11
$$ -337 -567 -208 140 181 -105 83 -315 -12 438 167 -358 -289 424 22 507 -271 -487 -359 68 166 -145
4598a45J11j33K8L16O0m40K1k37N36J09M7k70n76Q39q1J30J4n59m1N47J80m20
$$ -145 -34 -167 -139 177 237 -203 -182 -419 117 226 273 3 -573 266 185 315 329 -230 -271 276 456 36
4620C6k13m8J42L42p6J89o15N2K87K97j79j56k35o7M63rk66l05L09P7j18M30m12
$$ 36 -177 -225 -83 259 183 372 -243 -191 96 393 214 58 -177 -244 219 210 -56 -361 -52 25 -93 337 -75
4643g5k23K80M22q2m91k11J55J69K79K76m30k81n0L8J88j37K27n24M45k0J04k83
$$ -75 -298 -18 404 322 -169 -380 -225 -56 223 499 69 -212 -262 -224 -36 -173 54 -470 -25 -45 59 -224
4665b24O9j74J38M19n14O9k47L36J43q4L93p58J02N03mj43j07l22n9O33J72o35
$$ -224 -155 -329 -191 228 -286 -217 -464 -128 15 -69 324 -434 -332 171 167 24 -83 -405 -464 169 341 -294
4687b94K47m58O30J52j61Ll68K73J63J22l45K38k42j65M56O0k26k33P0M20p2q4
$$ -294 -47 -505 125 277 116 119 -249 24 187 309 -36 202 -40 -205 251 311 85 -148 -78 342 270 186
4709A86j46q5JM98k25k03L5k63M30L61k65l19k17Q7K91K74l02q3n52P43K01l65
$$ 186 40 -45 -44 454 229 26 61 -202 228 589 324 5 -212 -125 166 440 138 55 -497 246 447 82
4731H2K2l55R4M62Rj15l46O5J37L2M72l21p05K83L68Q6P6l58m28K07M68R2n22
$$ 82 104 -251 -157 305 314 199 -147 -82 55 87 559 238 -467 -184 184 270 346 -12 -440 -233 235 327 -195
4754a95q1L40l1o9L33n03o5M88k42K25k11m14L17J12M51m67j70N5k76O06K89m94
$$ -195 -276 64 33 -36 297 -206 -271 217 -25 200 -11 -425 -108 4 455 -12 -182 -127 -403 203 492 -2
4776bl36j20L06L71n8m13R8J25n2L61l03j91K90j17j22K51j31n13N58K06j67k8
$$ -2 -338 -458 -152 219 161 -252 -154 -29 -81 280 -23 -214 76 -41 -163 88 -43 -556 2 208 41 13
4798A3O8j02p9J02Q6l10j12L13J02k45J82j38O4j50N41m56J98k92K1j05N24K22
$$ 13 81 -21 -100 2 88 -222 -334 -21 81 -164 18 -120 -56 -206 335 -121 77 -215 -194 -299 225 447
4820D47p55J41J51j5p7K80m33k78P70m4m24K45k79j88L90M29l15m8p8J12j77L09
$$ 447 -308 -167 -16 -31 -108 172 -261 -539 231 187 -237 8 -271 -459 -69 360 45 -3 -81 31 -146 163
4842A63k80k71M32J28j0m43J42j65Q1L51J50n40l0N31j60J41p4m73l1K47M40l43
$$ 163 -117 -388 44 172 162 -281 -139 -304 -223 128 278 -262 -292 239 79 220 146 -327 -358 -111 329 -14
4864a4M3j44k24K14L03j84n4K23j64l14M79j12l63M6K53K06j6p8o3N8k61O89o24
$$ -14 29 -115 -339 -125 178 -6 -60 163 -1 -315 164 52 -311 -265 -12 194 178 100 37 95 -166 523 -101
4887a01k67Q5M46L2l16K47l44L42M10p97L08J57j46K62j74J9j64m2J72L19m93
$$ -101 -368 -283 163 195 -121 126 -218 124 534 -263 45 202 56 318 144 163 -1 -43 129 448 -45
4908d5K47j97k67M30K49l35k34l3Q1J06L70j13l14j25K85m7L75k57k84q5L36L47
$$ -45 202 5 -262 168 417 82 -152 -185 -104 2 372 259 -55 -180 105 58 433 176 -108 -193 143 490
4930D90p22J82J0J54J82J60m99l15N18m80M30m1j96M1R4N52l69r5l14p4K59J93
$$ 490 -232 -50 -40 114 296 456 -43 -358 160 -320 110 69 -127 -86 8 560 191 96 -218 -292 -33 160
4952A60J19l25j77L34n5r0L80m52mK69K10l27m2O6j91K14j52J05j17m1r7K56j16
$$ 160 279 -46 -223 111 56 -34 346 -106 -110 159 369 42 0 66 -125 89 -63 42 -75 -116 -213 43 -73
4975g3J49m50J90L23K51n50Q8l89L1P00N6n70j07Q6L29m8j51l6k41L38K28k99
$$ -73 76 -374 -184 139 390 -160 -72 -461 -430 270 326 -244 -351 -265 64 16 -135 -171 -412 -74 154 -145
4997a45J09N5j55K82K19k57m22rM04J72p4m3p2j63O1O7r6OJ68k28j5M67j67l60
$$ -145 -36 19 -136 146 365 108 -314 -323 81 253 179 136 64 -99 -38 29 -67 -61 107 -121 -136 331 164 -196
5021a96jk16Q50l47J40k04k82M60K29k82l47q1K62K27r2j22K0l41O15l76L78l16
$$ -196 -197 -413 437 90 230 26 -256 204 433 151 -196 -277 -15 212 120 -2 18 -323 292 -84 294 -22
5043b2m6j11N07q1m52OOK89k9m3j93K66J1K04k48R3J4J23N9k46j66N5Q5j05l77
$$ -22 -68 -179 328 247 -205 -199 -193 96 67 24 -169 97 108 312 64 157 171 294 353 107 -59 -4 81 -24 -401
5068d01M35L17l61q3L21j50J85J46o28j13L80kL89o02n7pN90K2m79J06n3J59o6
$$ -401 34 351 -10 -93 228 78 263 409 -219 -332 48 46 435 -167 -224 -231 359 381 -98 8 -45 114 48
5091D8M35J46m83K0Q6L7j18m32J72L52j38mk91k13M81L87l23j93j38j16M62r3
$$ 48 483 629 146 166 252 289 171 -261 -89 263 125 121 -170 -383 98 485 162 -31 -169 -285 177 84
5113H4m3o5O8l84K43J75k9k92o9M22k93L81j02m59K19j4M25k69J11J34m67M30
$$ 84 41 -24 44 -340 -97 78 49 -243 -312 110 -183 198 96 -363 -144 -158 267 -2 109 243 -224 206
5135B06k30K1m81L37K31k15J94j78j50J28N32J25r13K00lK24K33m39o8k3M6j5
$$ 206 -24 -3 -484 -147 84 -131 63 -115 -265 -137 395 520 -393 -193 -196 28 261 -178 -246 -269 -223 -238
5157b38K65j01J24k24K56j15j5j24m5nK20J36k47K11m01j0L48J37q1J34n51M87
$$ -238 27 -74 50 -174 82 -33 -48 -172 -217 -222 -2 134 -113 98 -303 -313 35 172 91 225 -326 161
5179A61j58N6j40k82K52M77J65k20k59k06J74k4K02k62k69J77L20k71k05L83k80
$$ 161 3 59 -81 -363 -111 366 531 311 52 -154 20 -4 198 -64 -333 -156 164 -107 -312 71 -209
5200b09M94j13J67l20j97L79j49L0k0n2l0RP4k50m4O5j44L19n3J61l10M46j69
$$ -209 285 172 339 19 -178 201 52 82 62 10 -20 -11 63 -187 -231 -166 -310 9 -44 117 -193 253 84
5223H4j60N86o19k1L5J65ro5m94N19j93L25j45j88j79K49o7L41j4q7k61j33O41
$$ 84 -76 510 -109 -130 -95 70 61 -4 -498 21 -172 153 8 -180 -359 -110 -177 164 150 63 -198 -331 310
5246C10J77o12k37K30M23J4j5n86L03L05j46J30j09j00k47M02j93J45j93J66k26
$$ 310 487 -125 -362 -132 291 305 290 -296 7 312 166 296 187 87 -160 242 49 194 1 167 -59
5267e9p8N69j01l70J75J07k26J14L36n63k83L04N73k13r8l6l1K6J47l65k77M27
$$ -59 -137 432 331 -39 136 243 17 131 467 -96 -379 -75 498 285 187 151 120 146 293 -72 -349 78
5289G8j4J26L89k14o24N83r6l4l64K1J37R1J78m76j47K81q0L47j58j49L9L5K13
$$ 78 64 190 579 365 -259 324 228 194 -170 -149 -12 79 257 -219 -366 -85 -165 182 24 -125 -86 -51 162
5312A62R9k50l72N9J29n4N01k72j39J41m5k67N4M68j60k47J33q9J49l9p4o9L45
$$ 162 261 11 -361 -302 -173 -227 274 2 -137 4 -41 -308 -254 214 54 -193 -60 -149 0 -39 -113 -182 163
5335A63K97m55k58k76M14N9M39n99k78L95K50J56n08L8o2J41J06Q6l11L05N7k2
$$ 163 460 5 -253 -529 -115 -56 383 -216 -494 -99 151 307 -201 -163 -225 -84 22 108 -203 102 159 137
5357A37J35l70n5M88q0K19o40K2m5l6L39oQ4k48L12k87P9m2L18k33K0K62k82p3
$$ 137 272 -98 -153 335 255 474 -166 -144 -189 -225 114 108 192 -56 256 -31 48 6 324 91 111 373 91 18
5381A8L39k56m6oK58k89j32L1l4K60j86K5k18K0K68k8n7j46K45k08J99o1l48J44
$$ 18 357 101 55 49 307 18 -114 -83 -117 143 -43 -18 -236 -216 52 24 -33 -179 66 -142 57 -4 -352 -208
5405b08N57j01m01p4L0J2K74j17j10r5L61k10J37j00L4j61N1j46N45k46K7k79
$$ -208 349 248 -153 -227 -197 -185 89 -28 -138 -233 128 -82 55 -45 -11 -172 -121 -267 278 32 59 -220
5427b20o3J54N00j70n02L36p3j42K22l23l1M67k49J27N0K73l43j58N53l3p63L81
$$ -220 -283 -129 371 201 -301 35 -38 -180 42 -281 -312 155 -94 33 83 356 13 -145 408 375 -388 -7
5449gq6L65j42K11o76K25j08J48N4PJ88n44M93J06l45j07J95K65k87L72k45k10
$$ -7 -93 272 130 341 -335 -110 -218 -70 -16 -9 179 -365 128 234 -111 -218 -23 242 -45 327 82 -128
5471a28O7J89j88J22Q9mO8l36K93j50J75l88N9PL49m09J02j20J31K44q2N8j57
$$ -128 -61 128 -60 62 151 147 215 -121 172 22 197 -191 -132 -125 224 -185 -83 -203 -72 172 90 148 -9
5494iK01j32J60l05m1J71j60P17k12m93j97M81J45j81%n38j1M94no8k93J67K78
$$ -9 192 60 220 -85 -126 45 -115 602 390 -103 -300 181 326 145 145 -393 -404 90 85 17 -276 -109 169
5517A69r6j08q8L1p5M16j98l12N38m71q6R1N87r12M84M30l64p4J7Pj57j28K14
$$ 169 73 -35 -123 -92 -167 249 51 -261 277 -194 -280 -189 398 -514 -30 400 36 -38 -21 -14 -171 -299 -85
5540h5M81L8l17l58J80J37j66j48J68J32O5J58k62l68K20J46L70l41nj69k96N13
$$ -85 396 434 117 -241 -61 76 -90 -238 -70 62 127 285 23 -345 -125 21 391 50 45 -124 -420 93
5562I3n4l3k44J23Ok1L72k37m46L13L45j57k70L40j19o6K70nj73K4L2p5L91P0
$$ 93 39 6 -238 -115 -109 -130 242 5 -441 -128 217 60 -210 130 11 -55 215 210 37 61 93 18 409 479
5586D79n38l28N50o7k28M0j01q2M1O85j52l71J87k6l03O22k60l05R6O5J72L0j40
$$ 479 -59 -387 163 96 -132 -92 -193 -275 -234 451 299 -72 115 89 -214 408 148 -157 -61 4 176 206 66
5609F6m51J99L43k22J68l19L32Q6k08j36K7J61L73j94J17n03K24Q7m67J51M18
$$ 66 -385 -186 157 -65 103 -216 116 202 -6 -142 -115 46 419 225 342 -161 63 150 -317 -166 252
5630B52m59j61M39J7k7J2k62K77l54P4L80n81K69j01n1M46O1k03j27p0J91J58
$$ 252 -207 -368 71 88 61 73 -189 88 -266 -192 188 -393 -124 -225 -276 170 231 28 -99 -169 22 180
5652A80l30j5O5K26Q4l43q1j9r3M85J10n4m19L54P8Q4m03j06L1R7j7J83j06j56
$$ 180 -150 -165 -100 126 210 -133 -214 -233 -326 159 269 215 -204 150 228 312 -91 -197 -166 -69 -86 97 -9 -165
5676a65L01k67K02p5Oj61J47o7nP4m3j9L3P4mj9q4K81k82K96P9m93j55P1N64j96
$$ -165 136 -131 71 -4 2 -159 -12 -79 -84 -10 -53 -72 -39 35 31 12 -72 209 -73 223 302 -191 -346 -275 289 93
5702I3k84k22L20K21n5R4L9j55m3J30J65j74J74l10K8l3k2J20l34L53k00N80l91
$$ 93 -191 -413 -93 128 73 167 206 51 8 138 303 129 303 -7 21 -12 -34 86 -248 105 -95 485 94
5725I4j47pJ14j40K13p3j56J74p5J33j52J84l56L51j30R5l5J2q2j75L87k16QO
$$ 94 -53 -60 54 -86 127 54 -102 72 -3 130 -22 162 -194 157 27 122 87 99 17 -158 229 13 21 27
5749B7j02o5J85J47l45m1M31k65J11k63L7j43Q88m27q7l08J17J69j01N44o37K2
$$ 27 -75 -140 45 192 -153 -194 237 -28 83 -180 -143 -286 602 175 88 -220 -103 66 -35 509 -128 -106
5771a06OJ13j85j2J4l0j4K12%k24J09P6n8O1K01l40m3L90j25j83J29J20l61r9
$$ -106 -100 13 -172 -184 -170 -200 -214 -2 -2 -226 -117 -41 -99 -38 163 -177 -220 170 45 -138 -9 111 -250 -349
5795c49M20k66J16k80N36k19M7o6j73L21j01j20J24M2o6p3L76L6j64k61J70Lo1
$$ -349 71 -195 -79 -359 177 -42 5 -61 -234 87 -14 -134 -10 32 -34 -107 269 305 141 -120 50 53 -8
5818hK07O3m92K21K38k06j29j77n3M26JN3k26J06J1p6m9K64k67J41q6L54m83O6
$$ -8 199 262 -230 -9 229 23 -106 -283 -336 90 91 144 -82 24 35 -41 -90 174 -93 48 -38 316 -167 -101
5842a01j60M0Q4J37N6k99J1J31O8J3K19m55K89p6J64j49J01j72j43L15K03k16
$$ -101 -261 -221 -137 0 56 -243 -232 -101 -33 -20 199 -256 33 -43 121 -28 73 -99 -242 73 276 60
5864F0k88jL68J2l0k3l55J54J50j72J2L04l24m7L63n9j88q4J20L37m53K10J0l59
$$ 60 -228 -229 139 151 121 98 -257 -103 47 -125 -113 191 -133 -180 183 124 -64 -148 -28 309 -144 66 76 -283
5888b83M68k97K47l22J20k2K29R9k96K3k4Ml24L43J35j86N2K43j1r6j96K08l16
$$ -283 185 -112 135 -187 -67 -89 140 239 -57 -34 -58 -54 -378 -35 100 -86 -34 209 198 102 -94 114 -202
5911b02M02K7k39j89L74k73J91J89k94L3K03j04K27q8k50k02L51Q3j99M2l59J83
$$ -202 200 227 -12 -201 173 -100 91 280 -14 19 222 118 345 257 7 -195 156 239 40 82 -277 -94
5933i4O7M4J99k83J09J86k1o9j21j00R5J23j69k0M5O9j3L9J85j86p2k21O11k32
$$ -94 -27 17 216 -67 42 228 207 138 17 -83 12 135 -34 -54 -9 60 47 86 271 85 13 -208 403 171
5957A71j50j24J84r3N1Q5o73M06K65k40Q7L10nk22NO1m7L93n82M81l40j33L38
$$ 171 21 -103 81 -12 39 124 -549 -143 122 -118 -31 279 274 52 57 118 71 464 -118 363 23 -110 228
5980B28l99m5L05k17M81n54L8j66N84j61l49J88K7k13L8M09j37q9j95K21O9k17
$$ 228 -171 -216 89 -128 353 -201 -163 -329 255 94 -255 -67 -40 -253 -215 194 57 -32 -227 -6 63 -154
6002a54L54k45k96L67j12K5j53J5J7N8L69J3r9m69K77K09o7l52K79j4L83j03l31
$$ -154 200 -45 -341 26 -86 -61 -214 -199 -182 -124 245 258 159 -310 -33 176 109 -243 36 22 405 302 -29
6025b9l1m1K03k75P0N6j71L96k03Q9J20k69j6L50k8l99K78q1l06L64m5L5j61J72
$$ -29 -60 -101 102 -173 -103 -47 -218 178 -25 64 184 -85 -101 249 221 -178 100 19 -287 77 32 67 -94 78
6049G8k01J5L42l01j83N03p2k09N7J55j66N1n8J96k12r5J65K66n4m5o7m84K73
$$ 78 -123 -108 234 -67 -250 253 181 -28 29 184 18 69 11 207 -5 -100 65 331 277 232 165 -319 -46
6072d6K76j17K30l88M3K17l68J48m8P0j35J61J10l57K24k30K75J14l41m1K57k71
$$ -46 230 113 343 -45 -2 215 -153 -5 -53 17 -118 43 153 -204 20 -210 65 179 -162 -203 54 -217
6094b17K84mL17k76q1j92K45k71L19q9l1P6m4J82J3k68j55L14n5p2l86P4K92J2
$$ -217 67 63 380 104 23 -169 76 -195 124 35 4 80 36 218 231 -37 -192 122 67 -5 -391 -317 -25 -13
6118a3l0J61j64K59P6l01j86J18K0l4K52J88m37O0l41L68m0M5J6j15J34J63k0
$$ -13 -43 118 -46 213 289 -12 -198 -80 -60 -94 158 346 -91 -31 -372 -4 -44 1 17 -98 36 199 179
6141A79Qj13k69J53L12J73o05K86J3o8j13J42k79L5N0K5mM11m43K08l64L69Q2
$$ 179 187 74 -195 -42 270 443 -162 124 137 69 -44 98 -181 -146 -96 -71 -75 336 -107 101 -263 106 188
6164A88j93l5K94k97j64L01l02K98p5J18o7j88r0J47J78J53k75L5J24l51K26k6
$$ 188 -5 -40 254 -43 -207 94 -208 90 15 133 66 -122 -212 -65 113 266 -9 26 150 -201 25 -1
6186aj24J70j03K3j50L59k62L67l23K60p0n76O74l20p3J07K8K51l93L64j14K09
$$ -1 -125 45 -58 -35 -185 174 -88 279 -44 216 146 -430 244 -76 -149 -42 -14 237 -156 208 94 303
6208C03j97k2k28L08j78K6p8L65l31L5J83J69l22j37L62l08J07j78k30K59L19
$$ 303 106 84 -144 164 -14 12 -66 299 -32 3 186 355 33 -104 258 -50 57 -121 -351 -92 227
6229B27n2j3m03M30O0p8j82o6J62j71L18j07j8J06k90K05N1k0j84j55K91Kj40
$$ 227 175 162 -241 189 249 171 -11 -77 85 -86 232 125 107 213 -77 128 179 159 -25 -180 111 113 -27
6252b7J04j1m02O80j5m96K52r6j82L49j5j89l7J56j02O7J07j71o8J11L01k36j58
$$ -27 77 66 -336 344 329 -167 85 -11 -193 156 141 -48 -85 71 -31 36 143 -28 -96 15 316 80 -78
6275g8r3N92n27J94J13l27n0K78J04J73m4l01J66k9j06j45M0m8K09m16L99r1j90
$$ -78 -171 421 -106 88 201 -126 -176 102 206 379 335 34 200 171 65 -80 -40 -88 121 -295 104 13 -177
6298a77N7J61j09K33l40J87kN2O1P7j33n1j49K93o8j01K56k92m2n6J11J53l00
$$ -177 -120 41 -68 165 -175 12 10 62 123 200 67 16 -133 160 92 -9 247 -45 -87 -143 -32 121 -179
6321a79K09J22p2q9J3j53j00K23R9j4j89j52k7L73l80L28o6J37kj84j2j46Q5j60
$$ -179 30 152 80 -9 4 -149 -249 -26 73 59 -130 -282 -309 64 -316 12 -54 83 81 -103 -115 -261 -176 -336
6345c36O28J0m50J95m6K7k24L51l17J14J79j35K23l87kK78J12j46K89o39Q9L81
$$ -336 292 302 -148 47 1 28 -196 155 -162 -48 131 -4 219 -168 -170 108 220 74 363 -276 -187 194
6367A94r8j23J32j63L0p6K47O5l65P5q3K17m3Pq5J19R7j61L0j82J62Q6m9l6p2
$$ 194 96 -27 105 -58 -28 -104 143 208 -157 -82 -165 52 9 16 -69 50 147 -14 16 -166 -4 82 33 -3 -75
6392g5k03J90K20k52J27k70K23J65J12k32L04m32k1K08J67l87N4J07j0N3J62l14
$$ -75 -278 -88 132 -120 7 -263 -40 125 237 5 309 -123 -144 64 231 -156 -102 5 -5 48 210 -104
6414a04n2K36q2k6K23k56l17N72k03J40l31mJ55l9m5K75j05M8j66K34j65l6L6
$$ -104 -156 80 -2 -28 195 -61 -378 194 -9 131 -200 -204 -49 -88 -133 142 37 85 -81 153 -12 -48 -12
6437a2J13n19O83n59M77k51J98k16J21q1l11M29j08R3j72L23l4n9L6j37k24K18
$$ -12 101 -418 265 -294 183 -68 130 -86 35 -46 -357 72 -36 57 -115 208 174 115 151 14 -210 8
6459Hl6J87j60L27o2k50J03J13j03K5n9j52R8r0Q2J30j01j49L33j09m08O5J46
$$ 8 -28 159 -1 326 264 14 117 230 127 152 93 -59 39 -51 31 161 60 -89 244 135 -273 -208 -62
6482f2J64j50L23j50O0k11L27j27l84N7Q6l7JK20k74j8K30j08K8K11k32l42O37
$$ -62 102 -48 275 125 185 -26 301 174 -210 -153 -67 -104 -103 117 -157 -175 55 -53 -25 186 -46 -388 249
6505B49k19l21R7J94m5P1j9n2m1J2j51L72J30n02M59m99J10J66k84N77k87p9N0
$$ 249 30 -291 -194 0 -45 26 7 -45 -86 -74 -225 147 277 -225 234 -265 -155 11 -273 304 17 -62 -12
6528a2L8p6j94P6R2L22m17J12O2J57L5j25m19O72n15O7M65l56J00r8j76M76k18
$$ -12 26 -50 -244 -168 -76 246 -171 -59 3 160 195 70 -349 323 -192 -125 340 -16 84 -14 -190 286 68
6551F8J07j16j26L0l6N86o13j3J81J43o7K0k25k74M01m3kL65o53L05m19K42J76
$$ 68 175 59 -67 -37 -73 513 -100 -113 68 211 144 164 -61 -335 66 23 21 386 -267 38 -381 -139 37
6574C7k02L53l68N8J08j94k3q5L56J56k71N72n62j41L90j26j0j71l7Q7o4J59j
$$ 37 -165 188 -180 -122 -14 -208 -231 -316 40 196 -75 497 -65 -206 184 58 48 -123 -160 -73 -137 22 21
6597B1QR5j26L30m54j59J70j60M02j1k82J20O3OK7L4j02l77K57J89j72MP7j55
$$ 21 29 124 -2 328 -126 -285 -115 -275 127 116 -166 -46 17 23 50 84 -18 -395 -138 51 -121 -117 -40 -195
6621a95R4J19j02r0j66M38j45K07j09pl5m8N2N7m1j28K6J41P2k14J08r8k07K36
$$ -195 -101 18 -84 -174 -340 98 -47 160 51 44 9 -39 13 70 29 -99 -73 68 140 -74 34 -64 -271 -35
6645c5J64l55nK87J67l02JK29l23j32L96Q5j76lk01Q1K64k92K37j55J79n7n7J33
$$ -35 129 -226 -231 56 223 -79 -78 151 -172 -304 92 177 1 -2 -203 -122 142 -150 87 -68 111 54 -3 130
6669A30k93P8o1N13j19k81k85K97k37M27K3l25n6L05n4Oo6RM8Q0j68J80j37K28
$$ 130 -163 -85 -146 367 248 -33 -318 -21 -258 169 192 -133 -189 116 62 68 2 11 59 139 -29 151 14 242
6693B42n46R7L78k58J65k69J94J87j34l87J48m7J90M3p2J41k9r9L4m8J42k26J66
$$ 242 -304 -207 171 -87 78 -191 3 190 56 -331 -183 -230 -40 3 -69 72 43 -56 -22 -70 72 -154 12
6716A2L4K8j84N0k28K64J38J52o25K08K09q6K13l20J0j72K39L30j78j42M46l50
$$ 12 46 74 -110 -60 -288 -24 114 266 -359 -151 58 -28 185 -135 -125 -297 -58 272 94 -48 398 48
6738D8l89J95K53N6l30R3o4O2J23O8k06L7j54J17P1M3k95J97L93j83j81J66K15
$$ 48 -341 -146 107 163 -167 -74 -138 -76 47 115 -91 -54 -208 -91 -20 23 -272 -75 318 135 -46 120 335
6761C35o50L05l19K08J11k62L76n5J0j50L8q6L40m34J73J23l07L52J1M4l30KJ63
$$ 335 -315 -10 -329 -121 -10 -272 104 49 59 -91 -53 -139 201 -233 -60 63 -244 108 119 163 -167 -165 -2
6784bQ7j91J23k69L22m3K69m40K29j21j63K03l02L00k30O73j95k67n7J29J00j28
$$ -2 85 -106 17 -252 70 27 296 -144 85 -36 -199 4 -298 2 -228 445 250 -17 -74 55 155 27
6806B7J13r2m81M37J40k21J88p2K3k18N1J5R4k33M3J87K40j73l0j61J43m2n2k54
$$ 27 140 48 -433 4 144 -77 111 39 62 -156 -105 -90 4 -229 -186 1 241 68 38 -123 20 -22 -74 -328
6830c28N11k11L67k88n5j1j15j25L97p4k3N7j06j05MJ88j11J82k85J55q4L04l05
$$ -328 183 -28 339 51 -4 -15 -130 -255 142 68 45 102 -4 -109 -105 83 -28 154 -131 24 -60 244 -61
6853f1R3k69L66q1p7Q6N3o0k21K66L2j07l6N0J60k73l9m5J82j0J2k16K33K12l66
$$ -61 32 -237 129 48 -29 57 110 50 -171 95 127 20 -16 34 194 -79 -118 -163 19 9 21 -195 38 250 -116
6878a16M46j58m96J15L90k26K17k42j2J99k05P0K2N7pJ6J7M5j92mj83K41r6J33
$$ -116 330 172 -324 -209 181 -45 172 -70 -82 117 -88 -18 4 61 54 70 87 132 -60 -64 -247 -6 -102 31
6902C1j22o4M3J20k42R6NN4J18j32J55J3j90K56k29P7O6j92J86L3Q9j9j83j10
$$ 31 -91 -155 -112 8 -234 -138 -133 -79 39 -93 62 75 -115 141 -88 -11 55 -137 49 82 171 152 -31 -141
6926a41Q2R7j85K87j99j49K1P76o37J97J53m16N6lR6J20q7n61M79J10k63j33L91
$$ -141 -59 38 -147 140 -59 -208 -187 589 -48 149 302 -114 -58 -61 35 155 68 -493 -14 96 -167 -300 91
6949I1L45k90j44m6l57M34j16L67l59j55K61m64O48mj99J9l3j43J78%j22K11J9
$$ 91 436 146 2 -44 -401 33 -83 284 -75 -230 31 -433 215 211 12 31 -2 -145 33 33 -89 122 141
6972A41nl46oL59l54J24LL66k57K00m19L25j09p3n2J63L22k58m22R1J63k74K31
$$ 141 136 -210 -216 143 -211 -87 -84 282 25 225 -194 131 22 -51 -103 60 382 124 -298 -207 -44 -318 -87
6995h7q6M8l7k1J11J49nk6l86L13K04m3k32L24n20M05n5j02j9j8K6j67O0j01L80
$$ -87 -173 -125 -162 -183 -72 77 72 46 -340 -27 177 134 -98 226 -294 111 56 -46 -65 -83 -57 -224 -164 -265 115
7020A15k32Q9n0K08l86J94n9K2j43L69j81J90J63m68K37l72K47j81L65N4j22k05
$$ 115 -117 -28 -78 130 -256 -62 -121 -99 -242 127 -54 136 299 -169 68 -304 -57 -238 127 181 59 -146
7042a46JJ20n0L52n2k66N0K13M9l22K65k50j97L31j20L7q7K57j29n1J3J1l24J49
$$ -146 -145 -25 -75 277 225 -41 9 222 271 -51 214 -36 -233 98 -22 15 -72 185 56 5 18 29 -295 -146
7066a46K25k08JK57j32J0k48M21m8l22O3J40l8J82K41p22J11K89p0K38m05J42
$$ -146 79 -129 -128 129 -3 7 -241 180 132 -190 -127 13 -25 157 398 -324 -213 76 6 244 -161 -19
7088a9l20K46K24l36R7L81N2k06r0n4o6K62j19j43J74L9k9J42j87K58l33N0J65
$$ -19 -339 -93 131 -205 -108 273 325 119 29 -25 -91 171 52 -91 83 122 93 235 48 306 -27 23 188
7111A88l70L79l75l28L34J11J10L5j85n4K4K92j11J12j97Jl7l7K26l14J21K39
$$ 188 -182 197 -178 -506 -172 -61 49 84 -101 -155 -131 161 50 162 -35 -34 -71 -108 118 -196 -75 164
7133A64J23k80j84J10j24L02j12J21k10j3l62O12M0R7n38M23j81L1J32N9o0L9
$$ 164 287 7 -177 -67 -191 111 -1 120 -90 -103 -465 147 187 284 -254 169 -12 19 151 210 150 189
7155A89j63l5j18j38J40O1j28K59j22K7L66k27K4k17R0j67J88n9p5j4O7q2M4M
$$ 189 26 -9 -127 -265 -125 -64 -192 67 -55 -28 338 111 135 -82 8 -159 29 -30 -105 -119 -52 -134 -90 -86
7179h6K4K63m12K14K28j65O1K8J1j11K29l56K39j67LP2j31o9J73J09l57L33k39
$$ -86 -62 201 -211 3 231 66 127 155 166 55 284 -72 167 0 3 75 -56 -125 48 157 -200 133 -106
7202a06K57qo9q1K89l46o3O1k07M4J33J78L7J80l05p6K60k98p3L21J19n2j12p0
$$ -106 151 143 74 -7 282 -64 -127 -66 -273 -229 -96 82 119 299 -6 -82 178 -120 -193 128 247 195 83 13
7226A3L79o15J87K52l36J14kNJ92j48J70Jj2k59Q9N2J26k51L32k40m1J00k62J38
$$ 13 392 -223 -36 216 -120 -6 -8 -3 189 41 211 212 200 -59 30 82 208 -43 289 49 8 108 -154 -16
7250a6p8j03jK75j06K4J57n09J98L94l33J51l2j71Q0O5k7k0o6J15r9J55L11m14
$$ -16 -94 -197 -198 77 -29 -5 152 -357 -159 235 -98 53 21 -150 -70 -5 -32 -52 -118 -3 -102 53 364 -50
7274e0R8l8k6L24k38J27j22p3J22M0k71J01R8l36J19kM8j57K69j80J72J44O4j8
$$ -50 48 10 -16 308 70 197 75 2 124 164 -107 -6 92 -244 -125 -127 -79 -236 33 -147 25 169 233 215
7298B15o8Qp2j81j91K02J32mm5J27k07M5k33K99j46m4J93K10N4m04J61o0j80J34
$$ 215 147 155 83 -98 -289 -87 45 41 -4 123 -84 -39 -272 27 -119 -163 30 240 294 -110 51 -9 -189 -55
7322e5m5L79m63J10K91k65j37N6K64n1j34k48K65j48K60k86L60j44O7nk90J72
$$ -55 -100 279 -184 -74 217 -48 -185 -129 135 84 -50 -298 -33 -181 79 -207 153 9 76 71 -219 -47
7344d7k62K79M6n5j99M95k05Jo0j35k60O67j65l30J73L3L9j4K06j5l68L49l2j99
$$ -47 -309 -30 16 -39 -238 257 52 53 -7 -142 -402 265 100 -230 -57 -24 15 1 207 192 -176 173 141 -58
7368e8M0m0K12j34N1R1l51J61j22mK92jk30K86j21k26o7L36l48K48J5r1p6M2K47
$$ -58 -18 -58 154 20 71 162 -189 -28 -150 -154 138 137 -93 193 72 -154 -221 115 -233 15 30 -61 -137 -95 152
7393A52j56o7J39r5p1J19K20j03n5j74K58P8o7m02K98j81K39J80l98J07k78L36
$$ 152 -4 -71 68 -27 -98 21 241 138 83 -91 167 245 178 -224 74 -107 132 312 -86 21 -257 79
7415G9K02n11K25j81J70j43j20M12j05l47O5M1j66P80k35m6k7k24R2J42j81j65
$$ 79 281 -230 -5 -186 -16 -159 -279 133 28 -319 -254 -213 -379 401 166 120 93 -131 -39 103 -78 -243
7437b43K52k65L98k54mk0J55j78J72J28l68K83j84M4J02k12J98l05M48o8k39K8
$$ -243 9 -256 142 -112 -116 -136 19 -159 13 141 -227 56 -128 -84 18 -194 4 -301 147 79 -160 -132
7459a32Q0L8K25l29M0j04J02J26j7k27K32J35m54K79j36J35r7j62J14J50l69M82
$$ -132 -52 -14 211 -118 -78 -182 -80 46 29 -198 34 169 -285 -6 -142 -7 -104 -266 -152 -2 -371 111
7481A11l02j9M91N2m45K09k41L29l26L1L50l06J4K1j04n9J09pJ49j87K09LL6j16
$$ 111 -191 -210 281 333 -112 97 -144 185 -141 -110 240 -66 -52 -31 -135 -194 -85 -92 57 -130 79 82 118 2
7505Bj33K10j66k0JJ83l17j8K10jlJ35k67p1N37l26L22j18n09L33K51k59K4l3
$$ 2 -131 79 -87 -107 -106 77 -240 -258 -48 -49 -52 83 -184 -255 282 -44 278 160 -349 -16 235 -24 0 -33
7529c3M58k64J09m15J4L16k41J92j61L8K29k25k11J83J23q2l0j56K44lJ50k54
$$ -33 425 161 270 -145 -131 185 -56 136 -25 13 242 17 -194 -11 112 30 0 -156 88 85 235 -19
7551a9K95j90m1O4k56L62J89m55j05M05j99k03j42L75p9J72j25k3QK98q3m2l79
$$ -19 276 86 45 109 -147 215 404 -51 -156 249 50 -153 -295 80 1 173 48 25 33 331 248 206 -173
7574a73J29K49K0k00p6Nl07M34K1p6j56L64m11K38k7N3j16J2k28J82m6M49k79
$$ -173 -44 205 225 25 -51 -46 -353 81 102 26 -130 234 -177 61 34 87 -29 -17 -245 -63 -109 340 61
7597F1j9k64L23k22J21J5J02j43j73O8L9J1L38k32j42j32L69j58M5l3Q2J05l21
$$ 61 42 -222 101 -121 0 15 117 -26 -199 -131 -92 -81 257 25 -117 -249 120 -38 7 -26 56 161 -160
7620a60L72N1l40Q9K30k07L7k80K52j39K1J06M9j31J62l31J8p3J40K89nj51J64
$$ -160 212 263 -77 12 242 35 72 -208 44 -95 -74 32 81 -50 112 -219 -201 -274 -134 155 150 -1 163
7643A63o4j24M9k82K39r2J69K6lk01k51L71k60J20N03m03p3P1K80j34J47j19k
$$ 163 99 -25 24 -258 -19 -111 58 84 81 -120 -371 0 -260 -140 363 -40 -113 -42 238 104 251 132 130
7666A30p2k56J81J44p4qJ93k71k5r3K2P1j30M6Q9j09N7k3l78O94k70oK60l0j11
$$ 130 58 -198 -17 127 53 45 238 -33 -58 -151 -129 -58 -188 -142 -53 -162 -105 -128 -506 188 -82 -88 172 142 31
7691C1P8J78n16L38q9J72Oj51j75LJ93J91m0k92J1J52k37M08m25rJ15K08J40l47
$$ 31 109 287 -229 109 20 192 198 47 -128 -125 68 259 219 -73 -62 90 -147 261 -164 -173 -58 150 290 -57
7715e7M61l54k0QK23j58J37j35l3K0k18N50m16Q3p5p2J72j00R7l7jj73J03j29
$$ -57 404 50 30 38 261 103 240 105 72 92 -126 424 8 91 16 -56 116 16 113 76 75 -98 5 -124
7739a24J17Q3l16k06L52M5p8P7J39n5K92k54m4p2j07J34J12j05kjJ6p9K20N5k95
$$ -124 -7 76 -240 -446 -94 -49 -127 -50 89 34 326 72 28 -44 -151 -17 95 -10 -12 -13 3 -76 144 199 -96
7764i6J15j19K93J19k51J98k02Kj81j37K37L0N6k67R5J84J3l3K35l96N9q3K07
$$ -96 19 -100 193 312 61 259 57 59 -122 -259 -22 8 64 -203 -108 76 89 56 291 -105 -46 -129 78
7787G8k9j82M18j72k24J12m3K85N0l09P9j99J02l0R6k09K15k9Jl3q9L1J84Q3l59
$$ 78 49 -133 285 113 -111 1 -42 243 293 -16 63 -136 -34 -64 32 -177 38 9 10 -23 -112 -81 103 186 -173
7812a73K85N1l8r8N4m0k47K99j48J2K39j94j2j62o9J18K13K5l05l4q4M86k61j47
$$ -173 112 163 125 27 81 41 -206 93 -55 -43 196 2 -10 -172 -241 -123 90 115 -190 -224 -308 178 -83 -230
7836b30J94K8P6j16j28m4K83j36J66j39k7L23p7k52J27j35k00N4N89j86k08R0
$$ -230 -36 -8 68 -48 -176 -220 63 -73 93 -46 -73 250 173 -79 48 -87 -287 -233 356 170 -38 52
7858E2m0k2K31l75M57k37m4j05N0R9P9J41k43n0L6J42m6N9m23J86K52j07j99P9
$$ 52 12 -10 221 -154 303 66 22 -83 -33 66 145 286 43 -7 29 171 125 184 -239 -53 199 92 -107 -28
7882b8K30j59j2k25k0M19M6l34P4k17J03J63qq4j32K11J28k42K02k42J40k60J80
$$ -28 202 43 31 -194 -214 205 251 -83 -9 -226 -123 40 32 -52 -184 27 155 -87 115 -127 13 -247 -67
7905f7J68j43J43j72J23K3p7J57r5L6K8k39M03m53r0K21j12L71j98P6J76j25l01
$$ -67 101 -42 101 -71 52 75 -2 155 60 96 124 -115 288 -165 -255 -34 -146 225 27 103 279 154 -147
7928a47L9n1M3N8K11J52m27J60k81J37M8J99K11m02j21J89o8Pj76K17O5k79J03
$$ -147 -108 -159 -116 -58 153 305 -122 38 -243 -106 -58 141 352 -50 -171 18 -50 -43 -219 -2 63 -216 -113
7951a13k20r8O00l60L27k33J65j16N0j07q9N11l53J58j31K97j79k21J03nJ40l42
$$ -113 -333 -431 169 -191 136 -97 68 -48 2 -105 -194 317 -36 122 -9 288 109 -112 -9 -14 126 -216
7973b16J61k8J00j57L69m74J82K60j42j06k2J46K9m06K26K1L6n3Q5l7p5j38M4
$$ -216 -55 -83 17 -140 229 -245 -63 197 55 -51 -73 73 102 -304 -78 -57 -21 -74 11 -26 -101 -239 -195
7996a95O3q6K05J18L10m46K91k58p2K03j47j63J69k0l9M0Mn5p4p5K57j74p4N9
$$ -195 -132 -218 -13 105 415 -31 260 2 -70 133 -14 -177 -8 -28 -67 -27 -23 -78 -152 -227 30 -144 -218 -159
8020a59j85N45k78q0K34l5L6m3k33k7M29M3l82J48k7J29k32k0K44J28j20j65J0
$$ -159 -344 201 -77 -157 77 42 78 35 -198 -225 204 247 -135 13 -14 115 -117 -137 107 235 115 -50 -40
8043d0nr7k3K22r7p3K35l27L76j90k4k40L17q8l0K85k88o4K93J9Ln2j45j18K6
$$ -40 -45 -142 -165 57 -40 -113 122 -205 171 -19 -43 -283 34 -54 -84 201 -87 -151 142 161 164 112 -33 -151 -125
8068a25R8K28l24j9K17mJ4r9J44j42P7K24l57j47K26m5M3l48M48Q7R6l39j12m5
$$ -125 -27 201 -123 -142 75 71 85 -14 130 -12 65 289 -68 -215 11 -34 9 -339 109 196 292 -47 -159 -204
8092b04L40k22k0m8N7L21m02J72j35K60M9l35N1M33k18j27k82L24N3k26k9J02
$$ -204 136 -86 -106 -154 -97 224 -178 -6 -141 119 168 -167 -116 317 99 -28 -310 14 67 -159 -188 -86
8114h6q1L56P7j88J13J12j95k61K04R8j19L4K37m80J91K55m31L54j83k5j30L47
$$ -86 -167 189 266 78 191 303 108 -153 51 149 30 64 301 -179 12 267 -164 190 7 -18 -148 199
8136A99l58p1N30m85O0O6j13KJ6J31j85J91K5j89J1J83j41J42Q7j07K54l33J39
$$ 199 -159 -230 300 -185 -125 -59 -172 -170 -154 -23 -208 -17 8 -181 -170 13 -128 14 101 -6 248 -85 54
8159E4n14O14j57j99J38r5K98j31p8l40P24L7k99K1k2L41l18O2R2m00L43k00J77
$$ 54 -460 154 -3 -202 -64 -159 139 8 -70 -410 314 351 52 73 51 392 74 136 228 -172 171 -29 148
8182A48k8k19K41k73R0N1k55M43j85
$$ 148 120 -99 142 -131 -41 10 -245 198 13
8191A3
$$ Imaginary data points
##PAGE= N=2
##DATA TABLE= (X++(I..I)), XYDATA
0@%%%%%%%%%%%%qJ6j6J6j6J7k5L2l3L9m6N2o1P0p8Q9j03J17j32J48j65J83k04
$$ 0 0 0 0 0 0 0 0 0 0 0 0 0 -8 8 -8 8 -8 9 -16 16 -17 22 -24 28 -33 37 -41 48 -55 62 -70 78 -87 96 -108
35a08K27k53K83l13L45l85M29m74N24n80O42p13P95q87R94j122J274j459J694
$$ -108 119 -134 149 -164 181 -204 225 -249 275 -305 337 -376 419 -468 526 -596 678 -781 913
54I13j998K409l005L955n705R977l9112o4930N9711P1018J9752n2282n4747n214
$$ 913 -1085 1324 -1681 2274 -3431 6546 -32566 -97496 -37785 33233 52985 703 -54044 -59258
68e9258N1540L6687j4581l8124j0244J3945J6531K539p761n345P080k45j2954
$$ -59258 -7718 28969 14388 -23736 -33980 -20035 -3504 -965 -8726 -14071 -6991 -7236 -20190
81b0190j842J9569J1236j1175j8789n765J4375K2802l62k5891j4171J8230K0635
$$ -20190 -22032 -2463 8773 -2402 -21191 -26956 -12581 10221 9859 -16032 -30203 -11973 8662
94H662l361j8247r684J2429K0723l156k7823q450K8081K2085j4455l0860r477
$$ 8662 5301 -12946 -22630 -10201 10522 7366 -20457 -28907 -826 21259 6804 -24056 -33533
107c3533K6264L4245n331m3102k1693K9011L9758J480l5029l0321J0488M1909
$$ -33533 -7269 26976 21645 -21457 -43150 -14139 25619 27099 -7930 -38251 -27763 14146
119A4146J8706k9818l4790M810L0494J7872j0676k6714r780K1680K0647q389j9454
$$ 14146 32852 3034 -31756 -26946 3548 21420 10744 -15970 -25750 -4070 16577 8188 -11266
132a1266j927J1781P426l497r191o57J2009L529j4881o850J5802J3013p971j7553
$$ -11266 -13193 -1412 6014 2517 -6674 -7331 4678 8207 -6674 -13524 2278 15291 7320 -10233
146a0233n577J5448K1505l550k9589j1766K4395K5436o452k7175j5326J6474L1728
$$ -10233 -15810 -362 21143 17593 -11996 -23762 633 26069 19617 -7558 -22884 -6410 25318
159B5318M064l2182k3672J8270L2323O145k4180k6556L802L3962J8860k2884l1610
$$ 25318 29382 -2800 -26472 -8202 24121 30266 6086 -20470 -16668 17294 36154 13270 -18340
172a8340K244K7341J8508j0049k7278r630K1796K2533q782k2296l913J2882J1143
$$ -18340 -16096 11245 29753 19704 -7574 -17204 4592 27125 18343 -3953 -7866 5016 16159
185A6159k507j2637m650J1359P417j0752q609Q934J0252m405j1789n504R274J5951
$$ 16159 13652 1015 -3635 7724 15141 4389 -4220 4714 14966 10561 -1228 -6732 2542 18493
199A8493j601k2660r930J7565K0073m115k2049j4230J1067K7101O390k7376k3519
$$ 18493 16892 -5768 -15698 1867 21940 17825 -4224 -18454 -7387 19714 26104 -1272 -24791
212b4791J2583K8677R299j9582k7267j278L0351K1125j8512l0605j974K3822J9271
$$ -24791 -12208 16469 25768 6186 -21081 -22359 7992 29117 10605 -20000 -21974 1848 21119
225B1119o935k5281j1578J8783K1402o469k0359n168J0611J1167k4j1116p235
$$ 21119 14184 -11097 -22675 -3892 17510 11041 -9318 -14486 -3875 7292 7268 -3848 -11083
238a1083Q164R215n817p834L543N826n14n084m507L487J0661Q73j4313q431J1855
$$ -11083 -2919 6296 479 -7355 -3812 2014 1500 -3584 -8091 -4604 6057 6930 -7383 -15814 -3959
253c959J4449j404j4879j3000O444K2663Q894k1449k2039P677K5524J0912j5704
$$ -3959 10490 9086 -5793 -18793 -12349 10314 19208 -2241 -24280 -16603 8921 19833 4129
266D129k4587l654K6464K0877j4284k7773m247K1062J8721m377k2714j2799J5861
$$ 4129 -20458 -24112 2352 23229 8945 -18828 -23075 -2013 16708 12331 -10383 -23182 -7321
279g321K1662l321j8750q569Q602J2671L754j0347j0285M549J1016m85p180q02
$$ -7321 14341 11020 -7730 -16299 -7697 4974 8728 -1619 -11904 -7355 3661 3176 -4004 -4806
293d806K400K143l76m038r15Q284L460j0116q717Q258J2566J081j1449j2115L466
$$ -4806 -2406 -263 -639 -4677 -5592 2692 6152 -3964 -12681 -4423 8143 9224 -2225 -14340 -10874
308a0874J9144R638j6774k0043N443K1875J0202j1711k1343m392K1896J9099j1186
$$ -10874 8270 17908 1134 -18909 -13466 8409 18611 6900 -14443 -18835 3061 22160 10974
321A0974k3874m507J7317J6725j174j9619j3181J1870J9885P47j5563j0159M711
$$ 10974 -12900 -17407 -90 16635 15461 -4158 -17339 -5469 14416 15163 -400 -10559 -5848
334e848J2198P208p947j2971J737J1467K730n500l822J205K067K106k862l045
$$ -5848 6350 13558 5611 -7360 -5623 5844 8574 3074 -748 457 2524 4630 1768 -1277
348a277N536M057p009p255N134R777J399q671j0112K112J5460Q336j3632j6666
$$ -1277 4259 8316 1307 -5948 -814 8963 10362 1691 -8421 -6309 9151 17487 3855 -12811
362a2811L858J7419Q664r050j8045m873J7389J7044p560k0829n917J2628J5880
$$ -12811 -8953 8466 17130 8080 -9965 -14838 2551 19595 12035 -8794 -14711 -2083 13797
375A3797J886j6318j4839P655J8928L851j3096j1519M93J2218R425o248j3681
$$ 13797 15683 -635 -15474 -7819 11109 14960 1864 -9655 -9162 3056 12481 6233 -7448
388g448j265J0902M940m287n180j095K603L894j659m427K520M073m247n060L577
$$ -7448 -8713 2189 7129 2842 -2338 -3433 -830 3064 1405 -3022 -502 3571 -676 -5736 -2159
403b159O344J48n347p293J131J1183O915j0359j3409K595J3367P449n803j4518
$$ -2159 4185 4333 -1014 -8307 -7176 4007 10922 563 -12846 -10251 3116 10565 4762 -9756
417i756o424J3132J6147m304j7367p788R095J5084M575j3994j5858M881J8575
$$ -9756 -16180 -3048 13099 8795 -8572 -16360 -7265 7819 12394 -1600 -17458 -12577 5998
430E998N842j1884j2279k75J1781J0158n370j3952k081J0745N993l273n437k564
$$ 5998 11840 -44 -12323 -12598 -817 9341 3971 -9981 -12062 -1317 4676 1403 -4034 -6598
444f598K240M851M25m334Q38K707k683k520L521L836q94l812l435O19P851N247
$$ -6598 -4358 493 918 -3416 -2578 129 -2554 -5074 -1553 2283 1389 -2423 -5858 -5239 2612 7859
460G859p154r772J683R731O631l161j1325o401R335J4444j640j4427p337O710
$$ 7859 705 -9067 -7384 2347 8978 5817 -5508 -11909 -2574 11870 10230 -4197 -11534 -4824
474d824J3257N519j1337j4442L006J6492O105r320j1700r88R811J0516l100j2823
$$ -4824 8433 13952 2615 -11827 -8821 7671 13776 4456 -7244 -8232 1579 12095 8995 -3828
488c828l909Q604O528j044m375m463R1N611K847l552k412O26q60M66L098P79k479
$$ -3828 -7737 867 7395 6351 1976 -2487 -2396 3215 6062 2510 98 724 -136 330 3428 4207 1728
505A728j800j163j45M774L731n185p308J053O624N274j852q763o632P508J2199
$$ 1728 -72 -1235 -1380 3394 7125 1940 -5368 -4315 2309 7583 5731 -3032 -9664 -2156 10043
520A0043n92j2273p097N155J1220N379r220j3089J287J4318N867o748j0614k185
$$ 10043 9451 -2822 -9919 -4764 6456 11835 2615 -10474 -9187 5131 10998 4250 -6364 -8549
534h549P465R897q76j0824n359O181P021J110l488o264j280O306M894l085m075
$$ -8549 -1084 8813 7937 -2887 -8246 -2065 4956 6066 2578 -3686 -4966 1340 6234 3149 -926
549i26m7O59J782K340j051k677m03N23o88L499L014m240n799J182O316L831j829
$$ -926 -973 -314 1468 3808 2757 80 -323 200 -488 3011 6025 1785 -4014 -2832 3484 7315 5486
566E486p481n130O087J0897r83j1445n264M693R617L845p680j1115P70J1718N536
$$ 5486 -1995 -7125 -1038 9859 8876 -2569 -7833 -3140 6477 10322 2642 -8473 -7703 4015 9551
581I551n710q590l450N415R443N76r741o368M385P112K268l669o958j995O159
$$ 9551 3841 -4749 -8199 -2784 6659 7235 -2506 -8874 -4489 2623 4891 1222 -5736 -7731 -1572
596a572N217k808n397j058J215K438K687j521m132p56J366P95K320J617l788n538
$$ -1572 3645 837 -4560 -5618 -4403 -1965 722 -799 -4931 -5687 -4321 -3526 -1206 411 -3377 -8915
612h915K056O116J949k484n680l624N495Q680j645q744l563L760O762L875n060
$$ -8915 -6859 -743 1206 -1278 -6958 -10582 -5087 3593 1948 -6796 -10359 -6599 163 4038 -1022
627a022r006k27R277N884l777p138l589M053R373K156q507p150L813P175L624
$$ -1022 -10028 -10255 -978 4906 1129 -6009 -9598 -5545 3828 5984 -2523 -9673 -5860 1315 4939
642D939l004p055l107O968O845k267n446j480J218K931L664j241m156q60J926
$$ 4939 1935 -5120 -8227 -1259 5586 3319 -2127 -3607 -2389 542 4206 2965 -1191 -2051 -125
657a25J485K560N1m197l348L636M735M15k277m108k444N126O422j808o995k892
$$ -125 1360 3920 3971 -226 -3574 62 4797 5212 2935 -1173 -3617 1509 7931 6123 -872 -3764
673c764L390N360L220l667q505q30Q197N550k991o441m666L608Q608K682q499
$$ -3764 -374 4986 8206 4539 -3966 -4796 3401 8951 5960 -481 -5147 -1539 7069 9751 1252
688A252o721K651P486K668k592o485k988N539N773j453m784k104o9L522L785j025
$$ 1252 -5469 -2818 4668 7336 4744 -1741 -4729 810 6583 5130 346 -1758 -1827 1695 5480 4455
704D455m842k363K626K961K007q65n240k603M133M598l76l238l263q79M191N554
$$ 4455 -387 -2750 -124 2837 4844 3979 -1261 -3864 269 4867 4491 1253 -2010 -2889 1302 6856
720F856k208o156k063K900M609L029l463p479j212Q097M586k733n846l785K946
$$ 6856 4648 -1508 -3571 -671 3938 6967 3504 -3975 -5187 2910 7496 4763 -1083 -4868 -1922
735a922P768J932o952o145K833N579K718j815n231l681M012O091j74m953k833
$$ -1922 5846 7778 826 -5319 -2486 3093 5811 3996 -1235 -4916 -904 5187 5013 60 -2773
750b773n64L583N102j199o045k373K954L588J923k414n127j551M694M397j793
$$ -2773 -3337 246 5348 4149 -1896 -4269 -1315 2273 4196 1782 -3345 -4896 -202 4195 2402
765B402l574k090q75L912M453k125n439j767K559M043K796l350o837p14P006M327
$$ 2402 -1172 -3262 -4137 -225 4228 2103 -3336 -5103 -2544 1499 4295 945 -5892 -6606 400 4727
781D727l127n256k695K665O641J870o317n152J935M938K742n98n330m050L951
$$ 4727 1600 -3656 -6351 -3686 2955 4825 -1492 -6644 -4709 229 2971 2373 -2957 -7007 -3056
796c056O237L72m355l717l85L836N164j288o413k018L816L581J049j896m419j083
$$ -3056 3181 3553 -802 -4519 -4904 -1068 4096 2808 -3605 -5623 -1807 1774 2823 927 -3492 -4575
812d575M153L727j457k598k281n88L651M527k006o001j033L204M008J824l627
$$ -4575 -422 3305 1848 -750 -3031 -3619 32 4559 2553 -3448 -4481 -1277 2731 4555 928
827I28o003N13O710L054l343m476k001K330N655J895n438m787J961L905L070r24
$$ 928 -5075 -4562 2148 5202 1859 -2617 -4618 -2288 3367 5262 -176 -4963 -3002 903 3973 3049
843C049m533m455L525N914Q41m388l682o13L904M856q80o326k288L439L646J049
$$ 3049 -1484 -5939 -2414 3500 4341 -47 -3729 -4342 -438 4418 3538 -2788 -5076 -1637 2009 3058
859C058j982m473j740M639M134r42l612k909N21M228M262l282o505j30M342L461
$$ 3058 1076 -3397 -5137 -498 3636 2694 -918 -3827 -3306 922 5184 1902 -4603 -4733 -391 3070
875C070R41m113m853R95O206K348l193l599j197J395M697K313m373m783J091L707
$$ 3070 4011 -102 -4955 -3960 2246 4594 1401 -2198 -3395 -2000 2697 5010 637 -4146 -3055 652
891F52L158p8m628m140L074O335M40m605l295J06L383M737j360n926j853L608
$$ 652 3810 3732 -896 -5036 -1962 4373 4813 208 -3087 -2981 402 5139 3779 -2147 -4000 -392
907c92L049R60j504m260j758M531M012j299m093k260K85M382L901l520n480k30
$$ -392 2657 3617 2113 -2147 -3905 626 4638 3339 -754 -3014 -2729 1653 5554 2034 -3446 -3676
923c676L823K916P67l425m515Q25N521J821k684l018k073J452M960K378n230m484
$$ -3676 147 3063 3830 405 -4110 -3285 2236 4057 1373 -1645 -3718 -2266 2694 5072 -158 -4642
939d642J634L999K743p76m777l591L790N719l73m699k514L49L132L912j208n246
$$ -4642 -3008 991 3734 2958 -1819 -5410 -1620 4099 3726 -973 -3487 -3138 -6 3906 2698 -2548
955b548j757L067L226J438j857m661j746M746M393j710l622k810Q50M424L456
$$ -2548 -4305 -1238 1988 3426 1569 -3092 -4838 -92 4301 2591 -1031 -3841 -2991 1433 4889
970D889l394n091J04L960K800k89k578m172N10N446K181l042l330j013J541M622
$$ 4889 1495 -3596 -3492 468 3268 2979 401 -3771 -3261 2185 4366 1324 -2006 -3019 -1478 3144
986C144J646m847m202J923M146J837j044m294k662L133M905j90l874k274J55K295
$$ 3144 4790 -57 -4259 -2336 1810 3647 2603 -1691 -4353 -1220 3685 3495 -379 -2653 -2498 -203
1002b03M306m47n203k753K765L530J615j728m888j495M831M315k139m165j778
$$ -203 4103 3656 -1547 -4300 -1535 1995 3610 1882 -3006 -4501 330 4645 2506 -1659 -3437
1017c437J500L870K254l408m200L17L308K249J0k493l621O01N145J962l275l137
$$ -3437 -1937 1933 4187 779 -3421 -3104 204 2453 2463 -30 -3651 -3050 2095 4057 782 -2355
1033b355j230K211M380J258n030l788J964M313J374j110l800k212K644M378j7
$$ -2355 -3585 -1374 3006 4264 -766 -4554 -2590 1723 3097 1987 -1813 -4025 -1381 2997 2980
1048B980l428k237q26K983M390q34m917k697L261L682O24k494l602j038M651L475
$$ 2980 -448 -2685 -3511 -528 3862 3028 -1889 -4586 -1325 2357 2981 487 -3115 -4153 498 3973
1064C973k334l956j288J683K784K753k755m412n7L191K407M24k711m408R50N639
$$ 3973 1639 -2317 -3605 -1922 862 3615 860 -3552 -3609 -418 1989 2413 -298 -4706 -3756 1883
1080A883K382l658l629r85K250M640O04m415l801K328L686J403j204l247k312
$$ 1883 4265 607 -3022 -4007 -1757 2883 3487 -928 -4729 -2401 1285 2688 1484 -1763 -4075
1095d075K342M794k4l648j971l65K882L999j010n425j755L758L328L88k108l963
$$ -4075 -1733 3061 3037 -611 -2582 -2947 -65 3934 2924 -2501 -4256 -498 2830 3218 1110 -2853
1111b853m56M111L550k160l634p53J017K963L196k884m764n6L561K771J51k968
$$ -2853 -3309 802 4352 2192 -1442 -2195 -1178 1785 4981 2097 -2667 -2723 838 3609 3760 792
1127G92m091J099N101J993l497l158k34K143L170Q85l710l393J993L132J210q57
$$ 792 -3299 -2200 2901 4894 1397 -1761 -1995 148 3318 4203 493 -2900 -907 2225 3435 2578
1143B578l282k819K389M932J45m030k464J35L324L384j321n679j358L991K894
$$ 2578 -704 -3523 -1134 3798 3943 -87 -2551 -2416 908 4292 2971 -2708 -4066 -75 2819
1158B819pk394l163q18M338K794j671m058o28N64L245K417k315m744j46L942J878
$$ 2819 2812 418 -2745 -3563 775 3569 1898 -2160 -2788 -2224 1021 3438 1123 -3621 -3767 175 2053
1175B053k77k669l155J397M243J286l074k227l30J494L439R23l602l352J437L237
$$ 2053 1776 -893 -4048 -2651 1592 2878 -196 -2423 -2753 -1259 2180 3103 -499 -3851 -2414 823
1191H23J859o82l572k957K929N037n4m727j673L86L245L265j633m698o07L332
$$ 823 2682 2000 -1572 -4529 -1600 3437 3383 -1344 -3017 -2631 614 3879 2246 -2452 -3059 273
1207B73K275l0j595k651r27L287L328j782l378j158J238K629K743k822m419N61
$$ 273 2548 2518 923 -1728 -2655 632 3960 2178 -1200 -2358 -1120 1509 4252 1430 -2989 -2428
1223b428M067J532r33k347k813J290M217J184l278k159j74J097L130J109l612
$$ -2428 1639 3171 2238 -109 -2922 -1632 2585 3769 491 -1668 -1842 -745 2385 3494 -118
1238a18l439J538L270J758j134l410k211K299M861p42l776j902J071K264K646
$$ -118 -3557 -2019 1251 3009 1875 -1535 -3746 -1447 3414 2672 -1104 -3006 -1935 329 2975
1253B975j274l900j667L439K189j6j546l285p61M061L290k179l733n81J152L323
$$ 2975 1701 -2199 -3866 -427 1762 1746 200 -3085 -3846 215 3505 1326 -2407 -2988 -1836 1487
1269A487J606l033l817O88L981J267r80k018k628J198L991J043k324k265j89Q96
$$ 1487 3093 60 -3757 -3069 912 2179 1199 -819 -3447 -2249 1742 2785 461 -1804 -1993 -1097
1285a097L146J352l294l537J833L512J220j141k875k177K393M458n49l652j302
$$ -1097 2049 3401 107 -3430 -1597 1915 3135 1994 -881 -3058 -665 3793 3244 -408 -1710
1300a710M10K511K650j292m258j420L540K989l04j987l360k93M079K902k590l709
$$ -1710 -1300 1211 3861 2569 -1689 -3109 431 3420 3116 1129 -2231 -2524 1555 4457 1867 -1842
1316a842j59J782K489J180k861l607J568K526J223o05j909k252J86L716J413k343
$$ -1842 -2001 -219 2270 3450 589 -3018 -1450 1076 2299 1694 -215 -2467 -2281 1435 2848 505
1332E05k616j31R26L218P10l574k781J650L245P79j766j925k022K596L736r07
$$ 505 -2111 -2242 -1316 1902 2612 -962 -3743 -2093 1152 1931 165 -1760 -3782 -1186 2550 1643
1348A643l248j310M74J935K747n15m399j471L216L350o78k255k435n64M119K787
$$ 1643 -1605 -2915 -2441 -506 2241 1726 -2673 -4144 -928 2422 1744 -511 -2946 -3510 609 3396
1364C396k819k900n56K266K055J070k325l228Q73L229J183j048j705k085Q60L371
$$ 3396 577 -2323 -2879 -613 1442 2512 187 -3041 -2168 1061 2244 1196 -509 -2594 -1734 1637
1380A637J496k966k326K29K303K218R9l473k135K104K903J67q80k213j458J922
$$ 1637 3133 167 -2159 -1930 373 2591 2690 -783 -2918 -814 2089 2256 1376 -837 -2295 -373
1396c73L226n9l080j378L01J573K686l34m521j680L509K832n18k117k681j0L870
$$ -373 2853 2794 -286 -1664 -1363 210 2896 2562 -1959 -3639 -130 2702 2184 67 -2614 -2624 1246
1413A246K154k440l465L98J408J998J366k548l196P85L190J073r67j868k453J346
$$ 1246 3400 960 -2505 -2107 -699 1299 2665 117 -3079 -2294 896 1969 1002 -866 -3319 -1973
1429a973L583P39k888j981L51J742K114K46l061k129J749K498M32p02j996k004
$$ -1973 1610 2349 -539 -2520 -2169 -427 1687 1933 -1128 -3257 -1508 990 1422 720 -1276 -3280
1445c280J811L759K68l146j810R5K762K513r31m554p74L399K661o75k189j936
$$ -3280 -1469 2290 2558 -588 -2398 -2303 459 2972 2041 -2513 -3287 112 2773 2098 -91 -2027
1461b027K4L578K087k398k797j64J587J576J900k237l414J81M026J247j377j838
$$ -2027 -2003 1575 3662 1264 -1533 -1697 -110 1466 3366 1129 -2285 -2104 1922 3169 1792 -46
1477d6j900J306L590M67l117j631N22J659J257O85k613k324J670K655K74q08k111
$$ -46 -1946 -640 2950 3417 300 -1331 -809 850 2107 2792 179 -2145 -475 2180 2454 1646 -465
1494d65j796J913L594n86l070j866J166K138J834j132l451r57K855K111n35j947
$$ -465 -2261 -348 3246 2660 -410 -2276 -1110 1028 2862 1730 -1721 -2678 177 2288 1753 -194
1510a94j777m19L009K720k311k940q11J549K016J805k626l433Q19L690J213j417
$$ -194 -1971 -2390 619 3339 1028 -1912 -2723 -1174 842 2647 21 -3412 -2593 1097 2310 893
1526H93k075j607J180L435K74l229j008L85J194J665K70k240j967J188K382Q21
$$ 893 -1182 -2789 -1609 1826 2100 -1129 -2137 -1752 -558 1107 1377 -863 -2830 -1642 740 1561
1542A561j327j561j499J762L444m81l261j126J116J662J686r13l302n14K897J513
$$ 1561 234 -1327 -2826 -1064 2380 1899 -1362 -2488 -1372 290 1976 1063 -2239 -2753 144 1657
1558A657l14j178k553l04K841K514j591l026n93J833K297J105k532l357J296K962
$$ 1657 1343 165 -2388 -2692 149 2663 1072 -1954 -2547 -714 1583 2688 156 -3201 -1905 1057
1574A057J015j499j423j094J261K189N25k368j534N45J104J600O92k676k223J920
$$ 1057 2072 573 -850 -1944 -683 1506 2031 -337 -1871 -1326 -222 1378 2070 -606 -2829 -909
1590i09K442L16j430j658j285K121L131j088l096p07J136J535J497q03l052o60
$$ -909 1533 1849 419 -1239 -2524 -403 2728 1640 -1456 -2163 -1027 508 2005 1202 -1850 -2510
1606b510K264J971l90j235k018n45L093K539k125l032K64J237K230P61k434k837
$$ -2510 -246 1725 1335 100 -1918 -2463 630 3169 1044 -1988 -1724 -487 1743 2504 70 -2767
1622b767J271L035N39j322j313j278Q28K892M45k143j879O62J472J800k28k762
$$ -2767 -1496 1539 2078 756 -557 -1835 -1007 1885 2330 187 -1692 -1030 442 2242 2014 -748
1638g48j893K166K972l64j694j512p32K294J880m20k847j41P03J301J274l86k988
$$ -748 -2641 -475 2497 2133 439 -1073 -1805 489 2369 1949 -898 -1039 -336 965 2239 1853 -1135
1655a135j073K658J777l57j209k259n10L401J994j925l287K72J624K013P44k386
$$ -1135 -2208 450 2227 1870 661 -1598 -2108 1293 3287 1362 -1925 -1653 -29 1984 2728 342
1671C42k795J126K853R23j567j529o53K43K897R06k652k185R98J710J249k82k340
$$ 342 -2453 -1327 1526 2449 882 -647 -1300 -1057 1840 2746 94 -2091 -1093 617 1866 1584 -756
1688g56j780K071K144k20j345j410l99J493J927J52k664j148Q11J406K002p80
$$ -756 -2536 -465 1679 1459 114 -1296 -1695 -202 1725 1877 -787 -1935 -1124 282 2284 1504
1704A504l412o06K515K055q18j707j466K7K955J366k393k207N28J366J328N19
$$ 1504 -1908 -2514 1 2056 1238 -469 -1935 -1908 1047 2413 20 -2187 -1659 -293 1035 1554
1720A554j460k677R75K203J021j001j185k006J122K921L46k551j806J240J652
$$ 1554 94 -2583 -1608 595 1616 615 -570 -2576 -1454 1467 1813 -738 -2544 -1304 348
1735C48Q60o8k363j846K112K401m80j495o07j167J620K553k55k980o75Q22J487
$$ 348 1208 1140 -1223 -3069 -957 1444 964 -531 -1138 -2305 -685 1868 1613 -1367 -2042 -1220 267
1752B67J384r31k989l07K519J531q62j392r70j35K196J466j528k326N78Q86J402
$$ 267 1651 720 -2269 -2576 -57 1474 612 -780 -1750 -1885 311 1777 249 -2077 -1499 -613 789
1769G89R44j532k946R33K574J331j184j729j343J056K983N01k749j713J181J574
$$ 789 1733 201 -2745 -1812 762 2093 909 -820 -2163 -1107 1876 2377 -372 -2085 -904 670
1785F70Q86N4k379j256J871J962J19j437j042r29J380K582m62k697o85Q72J844
$$ 670 1556 1610 -769 -2025 -154 1808 1927 490 -552 -1481 -101 2481 2019 -678 -1363 -491 1353
1802A353J070j114k606n07K593J872j261j340j188K6K603J308j806k049r8J612
$$ 1353 2423 1309 -1297 -1804 789 2661 1400 60 -1128 -1102 1501 2809 1003 -1046 -1144 468
1818D68J368M09j746k752J070K703Q09j423j707q34J108K778N9k711j281J117
$$ 468 1836 2245 499 -2253 -1183 1520 2329 906 -801 -1635 -527 2251 2310 -401 -1682 -565
1834e65J434M93M65k198j819J760K192n32r82j172r10J757K520r30k487j168J767
$$ -565 869 1362 1827 -371 -2190 -430 1762 1230 248 -924 -1834 -77 2443 1513 -974 -2142 -375
1851c75J547M91j172k329k84K654J307j022j028j399J40K166J366j592j961k88
$$ -375 1172 1663 491 -1838 -2122 532 1839 817 -211 -1610 -1470 696 2062 470 -1491 -1779
1867a779J496J206O36j707k334Q86K777L27j079j473n97N88K331K51k170j645
$$ -1779 -283 923 1559 -148 -2482 -1596 1181 1508 429 -1044 -1641 -1053 1278 1529 -641 -2286
1883b286J322J052J313k28k380j568J875K515o29j433j700N1J961K177j129k701
$$ -2286 -964 88 1401 1173 -1207 -2775 -900 1615 986 -447 -2147 -2096 -135 2042 913 -1788
1899a788RJ148J279M25n90k098k39K191Q96n53j279n03o91K222J794j698k450
$$ -1788 -1779 -631 648 1073 483 -1615 -1854 337 1233 680 -599 -1102 -1793 429 2223 525 -1925
1916a925M48J369J324L32j874j989R45K555L64j093j522m61O20K158P55k275j576
$$ -1925 -1477 -108 1216 1548 -326 -2315 -1370 1185 1549 456 -1066 -1527 -907 1251 2006 -269 -1845
1933a845R71J429J289n07k113j376K026J918j32j913q23j50J445K097o16k815
$$ -1845 -874 555 1844 1337 -776 -2152 -126 1792 1660 -253 -1076 -1226 219 2316 1700 -1115
1949a115k52J419R16L94j06k379m76K081J451j018j053j074m5K167J927k201k059
$$ -1115 -1367 52 968 1362 1256 -1123 -1599 482 1933 915 -138 -1212 -1257 910 2837 636 -1423
1966a423K59J544J416j85j215k219Q40K548O1r41j399n50O79K010P66k578j308
$$ -1423 -1164 380 1796 1611 396 -1823 -983 1565 1626 685 -714 -1264 -585 1425 2191 -387 -1695
1983a695Q76J553P96j19k324j436J689K510m08j882q93K65J172J851j025k515
$$ -1695 -819 734 1530 1411 -913 -2349 -660 1850 1442 -440 -1333 -1068 104 1955 930 -1585
1999a585qJ433J018P00j198k053J24J786J599q41j829q59N81J986R52j519j831
$$ -1585 -1593 -160 858 1558 360 -1693 -1569 217 1816 975 -854 -1713 -1132 854 1806 287 -1544
2016a544K79J327J053%j160j971P25K095R58j411j071r41R75K276M52k327j949
$$ -1544 -1265 62 1115 1115 -45 -2016 -1291 804 1762 351 -720 -1661 -686 1590 2042 -285 -2234
2033b234J288J665J251j238j937p37K029J945j125j351m69J2J271J382q65k042
$$ -2234 -946 719 1970 732 -1205 -1942 87 2032 907 -444 -913 -901 370 1752 887 -1155
2049a155j29J208O75Q84p13k123j50J817J442r50j213p70lJ912R54j313j562K02
$$ -1155 -1284 -76 599 1483 770 -1353 -1503 314 1756 806 -407 -1177 -1180 732 1686 373 -1189 -987
2067i87J016Q97N28j566j600Q8K565Q87j381j334j067R74K751j64k663j165J287
$$ -987 29 926 1454 -112 -1712 -1624 941 1828 447 -887 -1954 -980 1771 1607 -1056 -2221 -934
2084i34J684M26l54k153p44J546J972j052j007l58n26J453J714j008k171m0J132
$$ -934 750 1176 822 -1331 -2075 -529 1443 391 -616 -974 -1500 -47 1667 659 -1512 -1552 -420
2101d20R05Q16j219j496m1J875J069j190r37k14j51J492J098j167j760J57R53
$$ -420 485 1301 82 -1414 -1455 420 1489 299 -638 -852 -1003 489 1587 420 -1340 -1183 -230
2118b30J060Q17j429j923Q12K045O53r81j510o84J206K286M4k246j250R38K034
$$ -230 830 1647 218 -1705 -893 1152 1805 824 -686 -1370 -164 2122 2166 -80 -1330 -392 1642
2135A642K04o92j805o09J622J821q15j203j159J73J636J574j007k313R6J413J078
$$ 1642 1846 1154 -651 -1260 362 2183 1368 165 -994 -821 815 2389 1382 -931 -835 578 1656
2152A656k86j236j166L44J692N16j292n46Q3m7P18J205j087j348R6L63J084P75
$$ 1656 1370 134 -1032 -688 1004 1520 228 -318 -235 -282 436 1641 554 -794 -698 -335 749 1524
2170A524j647j710M35K345O46j395j276m99J194J721L53k313j457P78J830N98
$$ 1524 -123 -1833 -1398 947 1593 198 -1078 -1577 -383 1338 1691 -622 -2079 -1301 529 1127
2186A127n12k028j085K182J710n23j924q04N74J518J509j677k357Q64J509O83
$$ 1127 615 -1413 -2498 -316 1394 871 -1053 -1857 -1283 235 1744 67 -2290 -1426 83 766
2202G66n48p36j039L99J474L32j131j75l43q3J152J373j230j221qJ097M48N17
$$ 766 218 -518 -1557 -1158 316 648 -483 -658 -1001 -1084 68 1441 211 -1010 -1018 79 527 1044
2220A044r16j739L21K067N98p41j392n03O95J756P43k398j659J297J363R13n60
$$ 1044 128 -1611 -1290 777 1375 634 -758 -1261 -566 1190 1933 -465 -2124 -827 536 1449 889
2237H89k185r65K122K079o04k329r05J266J498J178j827k021L66K079Q41p12j021
$$ 889 -1296 -2261 -139 1940 1336 -993 -1898 -632 866 2044 217 -1804 -1438 641 1482 770 -251
2254b51q11OJ812M55j038n68m02O05Q65M73o27j695M88Q91L37N59o11j400l3J832
$$ -251 -1062 -1056 756 1211 173 -395 -797 -192 673 1146 519 -1176 -688 203 540 1099 488 -912 -945 887
2274H87M31j079m68p00O3K258O25j873k175J097J683J264o93k604r86K423K445
$$ 887 1318 239 -229 -929 -866 1392 2017 144 -2031 -934 749 2013 1320 -1284 -2270 153 2598
2291B598q70k602q27J037J839P95j525j983O62J723P10q57q09q24L60J842Jj237
$$ 2598 1728 -874 -1701 -664 1175 1970 445 -1538 -876 847 1557 700 -109 -933 -573 1269 1270 33
2309C3o74P93j12Q03K62j159p69P68N83j5L79l16j190mJ352M91n03r08j236Q22
$$ 33 -641 152 40 843 1105 -54 -823 -55 528 513 892 576 -614 -618 734 1225 722 -186 -1422 -600
2329f00J849O37j869j766R85J761P69n58k190j206K071K223j043j983r14J172
$$ -600 1249 1886 17 -1749 -764 997 1766 1208 -982 -2188 -117 2106 1063 -920 -1834 -662
2345f62J612P79j429k093L27K178M77l94j090j238O14J896L19j512j042N75P12
$$ -662 950 1729 300 -1793 -1466 712 1189 795 -295 -1533 -919 977 1296 -216 -1258 -683 29
2362B9N92L4j200l04R45M04n08N08j92r87o35J390R18l22j080p27j29K105R42
$$ 29 621 655 -545 -849 96 500 -8 500 308 -679 -1314 76 994 672 -408 -1135 -1264 841 1783
2381A783j940j402N97J515Q84l09k155r81J911K197q34j840j166R47J455J204
$$ 1783 -157 -1559 -962 553 1437 1128 -1027 -2008 -97 2100 1266 -574 -1740 -793 662 1866
2397A866j238k623q2K534J198j210j298j001J164J990j56j958r31J158P47j07
$$ 1866 628 -1995 -2077 457 1655 445 -853 -1854 -690 1300 1144 -814 -1745 -587 160 53
2413E3K26j082k26N79L18k37L03m0q31n68J279O92l19n10r40O3J703P40j547j630
$$ 53 279 -803 -1029 -450 -132 -369 -66 -106 -937 -1505 -226 466 147 -363 -1303 -1240 463 1203 -344 -1974
2433a974M58J289J201m0j862j526J517K231L16k202j461O94K309J164j495k688
$$ -1974 -1516 -227 974 934 -928 -2454 -937 1294 1610 -592 -2053 -1359 950 2114 619 -2069
2449b069K21K449J447r94j889n39J194J983m70j956l70J256O44J54l80q84l42
$$ -2069 -1848 601 2048 1054 -835 -1374 -180 1803 1333 -623 -993 263 907 1061 681 -203 -545
2466e45J038L59m52L13j47o09Q4P49M13l88j29r23J00Q68J303j123j528J34J211
$$ -545 493 852 400 713 566 -43 41 790 1203 815 686 -237 -137 731 2034 911 -617 -483 728
2485G28R09K80j685j689J218K516k26j773j424K71J820J670j146k782r7K517J086
$$ 728 1637 1917 232 -1457 -239 2277 2051 278 -1146 -875 945 2615 1469 -1313 -1410 1107 2193
2502B193j073j826p55R80J893r5j912r13J065J249J83q27p66l97J250K52m54o10
$$ 2193 1120 -706 -1461 -481 1412 1317 -595 -1508 -443 806 989 162 -604 -1001 249 501 47 -563
2520e63J58j05K42N34j43l15N1k93l14N04J277r42j105l54P17J545J23j514j555
$$ -563 -405 -510 -268 266 123 -192 -141 -434 -748 -244 1033 91 -1014 -1368 -651 894 1017 -497 -2052
2539b052P43K525N29k095j596L26K133J597j343l136L83K374J348q65j640j119
$$ -2052 -1309 1216 1745 -350 -1946 -1620 513 2110 767 -2369 -1986 388 1736 871 -769 -1888
2555a888J127K265j66j639j293R81J466K86m89j479m31J721K79m25q43M92l62
$$ -1888 -761 1504 1338 -301 -1594 -613 853 1139 650 -829 -1260 461 740 315 -528 -36 -398
2572c98N43J67l3n46O29m88p33Q48J201m66j434j19N94J394J65j590j522R97K266
$$ -398 145 312 279 -267 362 -126 -859 -11 1190 724 -710 -829 -235 1159 1324 -266 -1788 -791 1475
2591A475K86j915j520K70J757J526p64l069n6K379J218q54j637q25O43K633J42
$$ 1475 1761 -154 -1674 -1404 353 1879 1115 -1954 -2010 369 1587 733 -904 -1729 -1086 1547 1689
2608A689k013j381N49J698P35n69j669o09J902O81q46r63J77M91K09J62n96k49
$$ 1689 -324 -1705 -1156 542 1277 708 -961 -1570 332 1013 167 -796 -619 -128 81 243 -353 -602
2626f02Q05m35n72P30J018n78j059m3N99J019M72j524j547Q30J954M87j361j164
$$ -602 203 -232 -804 -74 944 366 -693 -736 -137 882 1354 -170 -1717 -887 1067 1554 193 -971
2644i71Q9J168J777q62k499n23K077J472j84j734j412N43K783M88k341j334P19
$$ -971 -882 286 2063 1201 -1298 -1821 256 1728 1544 -190 -1602 -1059 1724 2212 -129 -1463 -744
2661g44J987N77r57k082m8K180R52j399j219M04O77K10J72r28l46Q32k32j07k0
$$ -744 1243 1820 863 -1219 -1267 913 1865 466 -753 -349 328 538 710 -218 -564 268 36 -71 -91
2680i1P30k59p18O9K93N82K40n45j473N63J555L45j220q11n14J196K028p58k426
$$ -91 639 380 -338 -269 24 606 846 301 -1172 -609 946 1291 71 -740 -1254 -58 1970 1212 -1214
2699a214o59J668J491J02j389k027N45K867N47k202j413N13J990O68j085j507
$$ -1214 -1873 -205 1286 1388 -1 -2028 -1483 1384 1931 -271 -1684 -1171 819 1487 402 -1105
2715a105o20J772J785j293j183p1M29J64O02m88r03O67L90m49Q2L72k26n73O23
$$ -1105 -1725 47 1832 539 -644 -715 -286 -122 480 -8 -911 -244 146 -303 -221 151 -75 -648 -25
2734b5j75K97L77m02j250J08J200P52r58r05m68J146J684j49k244r71K037J360
$$ -25 -200 97 474 72 -1178 -1070 130 882 -76 -981 -1449 -303 1381 1232 -1012 -1983 54 1414
2752A414j26j754j696O66K683L10j944j219M84J849Q62o48j807r48J911J206o02
$$ 1414 1288 -466 -2162 -1496 1187 1497 -447 -1666 -1182 667 1529 881 -926 -1874 37 1243 641
2769F41j331m78O55P62Q33j163j359J071P39j55k96M6J34l70O11p17M61J91K10
$$ 641 -690 -1168 -513 249 1082 -81 -1440 -369 370 215 -81 -35 99 -271 340 -377 84 275 485
2788D85r61k30J089J011p47j296k56O33J719j48j977r73J612J688l45j025j883
$$ 485 -476 -706 383 1394 647 -649 -905 -272 1447 1299 -678 -1651 -39 1649 1304 279 -1604
2805a604P46K278N75j594j827N81J552O85J95k366p97J798J582n18j625n81L99
$$ -1604 -858 1420 1995 401 -1426 -845 707 1392 1587 -779 -1576 222 1804 1286 -339 -920 -521
2822e21J518N86j380j440R37J098k13m97lj65m2M53o0j32O04l42j076K1J695k36
$$ -521 997 1583 203 -1237 -300 798 585 88 85 -80 -122 331 271 139 743 401 -675 -654 1041 805
2842H05n51p25m66N70J619Pk111l98P66J850l55r10j587K71J940Q23j429j682
$$ 805 254 -471 -937 -367 1252 1259 -852 -1250 -484 1366 1011 101 -1486 -1215 725 1548 119 -1563
2860a563M42J085J313n08j764q51J359J817j99j471j208P64J223O35q64j167N09
$$ -1563 -1121 -36 1277 769 -995 -1846 -487 1330 1131 -340 -1548 -784 439 1074 210 -957 -448
2877d48R92j86j39k00p73P42N5K7j3J7J01m79l60R38J71n85n00k49P33Q66M6j521
$$ -448 544 358 219 19 -754 -12 43 70 57 74 175 -304 -664 274 445 -140 -640 -889 -156 710 756 -765
2899g65o13J211Q72P8o60j472m1J717J549j620j722j34J733J164j10k034j207
$$ -765 -1378 -167 705 783 123 -1349 -1390 327 1876 256 -1466 -1600 133 1297 1187 -847 -2054
2916b054J470J896k96j443p66K6J790K82q63j429O83Q49K30k22l53l76L4R49j14
$$ -2054 -584 1312 1016 -427 -1193 -1167 623 905 42 -1387 -704 145 375 153 -200 -576 -542 407 293
2935B93m23j1J48n85O9R35m84q4k82j72M7J177j6r75j030J054P54M72p64j166
$$ 293 -130 -141 7 -578 -509 426 -58 -142 -424 -596 -549 628 612 -363 -1393 -339 415 887 123 -1043
2955a043j76J755J207j209j940j66J738J027p6j841j150J541J928l75j389q57
$$ -1043 -1219 536 1743 534 -1406 -1572 166 1193 1117 -724 -1874 -333 1595 1220 -169 -1026
2971a026M05R93J048r58q85k68J067N74n04m27o34k7R86L17o92k30J97J37JM92
$$ -1026 -621 372 1420 462 -423 -691 376 950 446 19 -615 -642 344 661 -31 -261 -64 73 74 566
2991E66l66k72M3J11o8N05K51r87n66P13O78N69q85r21l33J417J329j340j446
$$ 566 200 -72 -29 82 14 519 770 -217 -783 -70 608 1177 292 -629 -962 455 1784 444 -1002
3010a002J95J076J165k08j346j678J422J888k99p49j237j08J114J332p53j545
$$ -1002 -807 269 1434 1226 -120 -1798 -376 1512 1213 464 -773 -881 233 1565 812 -733
3026g33K34R51P57l26o87j192M76J561P7j156q0N37k87j14P90q61J48P2k39L21
$$ -733 -499 452 1209 883 196 -996 -520 1041 1118 -38 -118 419 132 18 808 -53 95 167 -72 249
3046B49N85j3o83p91P27O74K74r52j116o0J838Q82j248j101L3O42R58L68j688
$$ 249 834 821 138 -653 74 748 1022 70 -1046 -1106 732 1614 366 -735 -702 -60 898 1266 -422
3065d22p67N33J519r1p66p33n23J275R97k29k160M5J325L67j48k56j327N82J162
$$ -422 -1189 -656 863 772 6 -727 -1250 25 1022 793 -1367 -1322 3 370 222 -34 -1361 -779 383
3084C83J59r90l64K48J77Q4M16n63k17J98qr2M89R8r25k67J188L52m42l48m91
$$ 383 542 -448 -812 -564 -387 -303 113 -450 -667 -469 -477 -569 -80 18 -907 -1174 14 366 -76 -424 -915
3105i15l77J453N10o16r13j40P24O94M84j075j178M41J353L66q63r29l91J218
$$ -915 -1292 161 671 55 -858 -998 -274 420 904 -171 -1349 -908 445 811 -52 -981 -1372 -154
3123a54J119o63j311L49O05Q05j88n25j071L35J265J75q90r3k4j51Q10J96m32
$$ -154 965 302 -1009 -660 -55 750 562 37 -1034 -699 566 741 -149 -242 -266 -417 393 589 157
3142A57n30J37M09m8L72q1j094J75O79K39l51j64p7l50P18P69o51q06k64O16L96
$$ 157 -373 -236 173 125 497 416 -678 -503 176 415 64 -100 -177 -527 191 960 309 -497 -761 -145 251
3163B51N08j120j062N80J618O6p96j012m28J077J228l42j161k70J113J19J95o22
$$ 251 759 -361 -1423 -843 775 841 45 -967 -1395 -318 910 568 -593 -863 250 369 564 -58
3181e8p10mQ27Q70j194p1j35K06M32L40m68p77O97K00J17pj19o72OQ72J75l58
$$ -58 -768 -772 55 925 -269 -340 -475 -269 163 503 35 -742 -45 155 272 265 146 -526 -520 352 527 169
3203A69M0k90k03R07K11m75p80Q0J71Q14J75o09j134O75J504o02m45n82j02P58
$$ 169 209 -81 -284 623 834 359 -421 -341 -170 644 819 210 -924 -249 1255 653 208 -374 -476 282
3223B82P83j1j600k3R46M07j65p8j026k71J162N99l65n44l98K50N54N75r59j031
$$ 282 1065 1054 -546 -569 377 784 619 541 -485 -756 406 1005 640 96 -302 -52 502 1077 118 -913
3243i13R98P28k60j02o5p93NP83K14o92J28j85l72P95K22k86o45k66P72J76K80
$$ -913 85 813 553 451 386 -407 -402 381 595 -97 31 -154 -526 269 491 205 -440 -706 66 242 522
3264E22q10r51R85R50j52m12n20j69J74J018q0j377q3O33O63L97o79r91n3J201
$$ 522 -288 -1239 -254 696 544 132 -388 -557 -383 635 555 -822 -905 -272 391 788 109 -882 -935 266
3284B66M10l12o53l63L38J012r5p05m74K75M72k31j22N02p89l09J136O7n17J1
$$ 266 676 364 -289 -652 -314 698 603 -102 -576 -301 171 -60 -182 320 -469 -778 358 425 -92 -81
3304h1l51J8R11L99q10q09J15P74J95R1l41q44L88J160l50m22l16l35L74J113
$$ -81 -432 -414 497 896 86 -723 -608 166 361 452 111 -733 -345 815 465 43 -273 -608 -234 879
3324H79R5j324p80J065M51R7k57q75l87R78Q59n53q62L3L84O92K60n70q10K50
$$ 879 974 -350 -1130 -65 386 483 226 -649 -1036 -58 801 248 -614 -581 -197 495 755 185 -625 -375
3344c75P13k06n8J35n22l82J061J06n56m51J18JQ29J94p66m79L30N43P6m56J34
$$ -375 338 132 74 209 -313 -695 366 472 -84 -535 -417 -416 413 607 -159 -638 -308 235 311 -145 -11
3365a1r86O61Q90j59o43k7m04L39P59L90j179n01Q49M29K20n73o32k81Q26N27
$$ -11 -997 -336 554 395 -248 -275 -679 -340 419 809 -370 -871 -22 407 627 54 -578 -859 -33 494
3385D94j03r97K31L7Q26J84k41r14J37O96n6K51o66o31K30J047k82m43k42K93
$$ 494 391 -606 -375 -338 488 672 431 -483 -346 350 294 545 -121 -752 -522 525 243 -200 -442 -149
3405a49r3N68N91r11n90P01K88k53Q3l21p83O71N97j76k4l09m67N30R12j44j238
$$ -149 -242 326 917 6 -584 117 405 152 235 -86 -869 -198 399 223 199 -110 -577 -47 865 721 -517
3426e17k48P64L84Q9k42m90m87Q46N40n54m51k3K38P91o0n81o68L11L43M59K25
$$ -517 -765 -1 383 472 230 -260 -747 99 639 85 -366 -389 -151 640 580 -1 -669 -358 -15 444 669
3447F69o26o14K37P59K60j021K2J54j90Q06J65o56o19M01M27r5K70n34o52K96
$$ 669 43 -571 -334 425 685 -336 -314 -160 -350 456 621 -35 -654 -253 174 79 349 -185 -837 -541
3467e41J176k68l93n24R9P35O81l99j353R9O19O33l34m3n06k71P80N71n16l68
$$ -541 635 367 -26 -550 -451 284 965 566 -787 -688 -69 564 230 187 -319 -590 190 761 245 -123
3487a23j5m92O91M03j47j148L78N19K41j9k77n21J00R20J6o49k53n1M18L08K15
$$ -123 -138 -630 61 464 317 -831 -453 66 307 288 11 -510 -410 510 526 -123 -376 -427 -9 299 514
3508E14n90p11L71N73J6O9n29o58P65Q75m05k73n21K10j18Q89R4p69l1M3O56k37
$$ 514 -76 -787 -416 157 173 242 -287 -945 -180 695 290 17 -504 -294 -412 477 571 -198 -229 -186 470 233
3530B33Ro33N1N51N43l08p92J6L92J30M75n66o97J64J004m6r9n48k95p1Q58J97
$$ 233 242 -391 -340 211 754 446 -346 -330 62 192 667 101 -596 -432 572 526 427 -121 -416 -487 371 568
3552E68r25j8J03O9N56M48j045m89N61N29K10l3l58m82J14R29J3j067j11N1L46
$$ 568 -357 -375 -272 -203 353 801 -244 -733 -172 357 567 534 176 -306 -192 737 750 -317 -428 -377 -31
3573c1P33j38q90k56O31R4j9J0n21k76J017K29l69k78o76O32L73L85j79r97j51
$$ -31 702 564 -326 -582 49 143 124 134 -387 -663 354 583 214 -64 -740 -108 265 650 471 -526 -677
3594f77J034Kk10j72n46J26R16q8m06j78J61L2N44N5o86m22J83O75j80on62j35
$$ -677 357 359 149 -23 -569 -443 473 385 -21 -199 -38 -6 538 593 -93 -515 -332 343 163 157 -405 -540
3616e40M71Q77p60j89r1j00K48O46l20p41l29Q92J85j15N3p37k21J048N81j072
$$ -540 -69 808 48 -141 -232 -332 -84 562 242 -499 -828 64 249 134 187 -550 -771 277 858 -214
3636b14o19L84K13N80J57o74n33K38O66j14j49J86p36r8Q19L45o06l74M05M0M23
$$ -214 -833 -449 -236 344 501 -173 -706 -468 198 84 -65 121 -615 -713 106 451 -155 -529 -124 -84 339
3657C39K7o42l65L95O54j09k11l11m64L14J075m14m41k63K0N86J47K0n43k24M47
$$ 339 366 -276 -641 -246 408 299 88 -223 -687 -373 702 288 -153 -416 -396 190 337 357 -186 -410 37
3678C7J69M0j77l26m69J028J42m64k16j94L28J41J29j85o72M43K25K75M2j09o49
$$ 37 206 246 69 -257 -726 302 444 -20 -236 -430 -102 39 168 -17 -689 -246 -21 254 296 187 -462
3699d62P1R50no99K3k48N26N7M66p05p89P96L27J85k36m65k51O96J35j81m50r0
$$ -462 -391 559 554 -145 -122 -370 156 213 679 -26 -815 -19 308 493 257 -208 -459 237 372 191 -259 -349
3721c49J1N68K09K06j162K04P67j21J48k67m87j39Q80O1k02m66j98L2N38R5k1
$$ -349 -338 230 439 645 -517 -313 454 333 481 214 -273 -412 468 529 327 -139 -337 -305 233 328 307
3742C07o85NO07K10J35m56q96M16Q43P7n77k88L74M3L18N7l01m81L90N04m38K42
$$ 307 -378 -373 234 444 579 123 -773 -357 486 563 -14 -302 72 115 433 490 189 -292 98 602 164 406
3764D06m61k83M10M31J5n85j10j65L99N76k62p49J2P51J54P9n79m31L30L08K44
$$ 406 -55 -338 72 503 518 -67 -177 -342 57 633 371 -378 -366 385 539 618 39 -392 -62 246 490
3785D90k46l91O4J54L51k4k83o16K05N81J81l00k63l40J17J343n09p86N9j11M91
$$ 490 244 -147 -83 71 422 398 115 -501 -296 285 466 166 -97 -437 -320 1023 514 -272 -213 -324 167
3806A67l6L40m85l21J11O18l88K36j74m66L09n5N91r12q1J35K98N91m08n15J62
$$ 167 131 471 -14 -335 -224 394 6 242 68 -398 -89 -144 447 -465 -546 -411 -113 478 70 -445 -283
3827b83O44l08J53l98j50K6M54J08l04k90J46o4M57K85m68l73o4N53j53J18l46
$$ -283 361 53 206 -192 -342 -316 138 246 -58 -348 -202 -266 191 476 8 -365 -429 124 -29 89 -257
3848b57m29K49O34l0k54n48K60P1M23l13n1k62L76J31L10j24q78R4M2J039l62
$$ -257 -686 -437 197 167 -87 -635 -375 -304 119 -194 -245 -507 -131 0 310 186 -692 -598 -556 483 121
3869A21m84m5Q9K92J02j77m54P6M56K41o7j37n83K20K37O69n06o61J7N38K27K83
$$ 121 -363 -408 -319 -27 75 -102 -556 -480 -24 217 150 13 -570 -350 -113 556 50 -611 -594 -56 171 454
3891D54m93o24O3J005n8n61j07J70K5M11J11k39k66r7R1M84K42o33o01M70P37
$$ 454 -39 -663 -600 405 347 -214 -321 -151 -126 285 396 157 -109 -206 -115 369 611 -22 -623 -153 584
3912E84k47j34m31k50K66P42l51p91K88J52L75K02k48n63p0Q37M5j20j96k76l79
$$ 584 337 203 -228 -478 -212 530 179 -612 -324 -172 203 405 157 -406 -476 361 406 286 90 -186 -565
3933e65P06N02l33o61N4M36j53P59q48n85M91P10l20m7k3m88k11R92J47r32M5
$$ -565 141 643 310 -351 -297 139 -14 745 -103 -688 -197 513 193 146 123 -365 -576 416 563 -369 -324
3954c24K15J41K41j1n12j14L66J78m8k14j51j70N57N42m91k14k46L19L13l39L45
$$ -324 -109 32 273 262 -250 -364 2 180 132 -82 -233 -403 154 696 205 -9 -255 64 377 38 383
3975C83l77m29L53N29r4k40k46n2N44J66q06r0J50M54k16K78j83n70M06K61K93
$$ 383 6 -423 -70 459 365 125 -121 -173 371 537 -269 -359 -209 245 29 307 124 -446 -40 221 514
3996E14m38K02o83N1O83J62m05l59j04M08N00j36l81o36Q26K40m42p4K4j70j23
$$ 514 76 278 -405 -354 329 491 86 -273 -377 31 531 395 14 -622 204 444 2 -72 -48 -218 -341
4017c41P12Jn75M5M9K41L44k91n08j78N55mK99k09n46r1N37K71k75j96k31K46
$$ -341 371 372 -203 -158 -109 132 476 185 -323 -501 54 50 349 140 -406 -497 40 311 36 -160 -391 -145
4039a45N4L06l02p82N85K97K45l74J06n00J25P53J73r91M6J26M99N2k76n20k20
$$ -145 -91 215 -87 -869 -284 13 258 -116 -10 -510 -385 368 541 -450 -404 -278 221 273 -3 -523 -743
4060g43P58K02l23L0j70k5N58K96j58p43j68L11J84L92j23p28p3O68L41m42j13
$$ -743 15 217 -106 -76 -246 -271 287 583 425 -318 -486 -175 9 401 278 -450 -523 145 486 44 -69
4081f9j37k15Q19J72o51l50L15N5J83M97m12m05p8M39lK5j25k48K09N08L5o25
$$ -69 -206 -421 398 570 -81 -431 -116 -61 122 619 207 -198 -276 163 160 185 60 -188 21 529 564 -61
4103f1k65M05L96j09j18n01m9K13L78j43l39j04j89L91O76m77N0k25r5N99n6m30
$$ -61 -326 79 475 366 248 -253 -302 -89 289 146 -193 -297 -486 -95 581 104 154 -71 -166 433 377 -53
4125e3l25j51O47L95k41m90J03j54M23K93m48l19K67J32L33o1j96q36L88O58m2
$$ -53 -378 -529 118 513 272 -218 -115 -269 154 447 -1 -320 -53 79 412 351 155 -681 -293 365 323
4146C23l72j12k82O7R72k19n01J77q7O8J33K42n33l89O76O6j8m75J18m00N51M97
$$ 323 -49 -161 -443 -376 596 377 -124 53 -34 34 167 409 -124 -513 163 229 211 -264 -146 -546 5 502
4168E02m51j76jP1M21N7j35n51R6L92J75l41k12n6j74N51K89l49n38J81l6L08
$$ 502 51 -125 -126 -55 366 423 288 -263 -167 225 400 59 -153 -209 -383 168 457 108 -430 -249 -285 23
4190B3N48n92n47M3J088k80k85k80q1L52N87m28k13q7RK59L53k66n10rJ43N23
$$ 23 571 -21 -568 -525 563 283 -2 -282 -363 -11 576 148 -65 -152 -143 116 469 203 -307 -316 -173 350
4212C50j56m01M6l48N99N91p08q9j60J93L5L17k89k25j42N27K27j26k33l10m4
$$ 350 194 -207 -161 -509 90 681 -27 -116 -276 -83 -48 269 -20 -245 -387 140 367 241 8 -302 -346
4233c46K51P21n84o39L55L13L11j62k63j05O7M34k80l10L17j38r1N74Ro23j66
$$ -346 -95 626 42 -597 -242 71 382 220 -43 -148 -81 353 73 -237 80 -58 -149 425 434 -189 -355
4254c55L41J72J4J6l47n37N86N70o2k01l58K2K40K10M3k42k97L32q7K36m6r57
$$ -355 -14 158 172 188 -159 -696 -110 460 398 197 -161 -139 101 311 354 112 -185 147 60 296 250 -707
4276g07O25K12l5m7j14n67K87L85N55n82j7J22K8L77k81q9o48M78N63k95l19M3
$$ -707 -82 130 95 48 -66 -633 -346 39 594 12 -5 117 145 522 241 152 -496 -18 545 250 -69 -26
4298b6l47KO33L9m54j12N30q2L06k50m92l51O88L58l74J33m17L74k15N08k79n85
$$ -26 -373 -371 262 301 -153 -265 265 183 489 239 -253 -604 84 442 68 201 -216 158 -57 451 172 -413
4320d13K68KM73o3j60o32J04Q14J88o49J46m01K48J47K80n57j68L43J19p7L18
$$ -413 -145 -143 330 267 107 -525 -421 393 581 -68 78 -323 -75 72 352 -205 -373 -30 89 12 330
4341C30l20m06K34M03q6p1jk50j12O21j91m27j27J74L78K63k85k55l50L81N10
$$ 330 10 -396 -162 241 155 84 83 -167 -279 342 151 -276 -403 -229 149 412 127 -128 -478 -97 413
4362D13m21k60L10l45L13K70j04o21K14n0L54j90M46n17k02N05J24l73J42o3j86
$$ 413 -8 -268 42 -303 10 280 176 -445 -231 -281 73 -117 329 -188 -390 115 239 -134 8 -55 -241
4383b41L69K45n34k16Q3N07l24M07m93l7J7P72j83l77j53k6K37L17J02o56j02
$$ -241 128 373 -161 -377 -294 213 -111 296 -197 -234 -217 555 372 -5 -158 -184 53 370 472 -184 -286
4404b86Q3L36K95o4n58j79M78L2k52J12M4l30K41N05m41k29K01k27K23L12l20
$$ -286 -203 133 428 364 -194 -373 105 137 -115 -3 41 -289 -48 457 16 -213 -12 -239 -16 296 -24
4425b4o54J54M49K04j56p6j97O9L82m7l17m20P27m21L18J2j2l58r0M26L91o90
$$ -24 -678 -524 -75 129 -27 -103 -300 -231 151 104 -213 -633 94 -327 -9 3 -9 -367 -457 -31 360 -330
4447c30R8k46K40P24k95o33q9L63K97j02l5J25m10L33K41m7l15K61l03K93R5j81
$$ -330 -232 -478 -238 486 191 -442 -531 -168 129 27 -8 117 -293 40 281 234 -81 180 -123 170 265 84
4469H4m34k7L26L36K11j85k29p7M79J33n05j04Q5R9k1J60l24ok7L36n6J65m00
$$ 84 -350 -377 -51 285 496 311 82 5 484 617 112 8 93 192 171 331 7 1 -26 310 254 419 19
4492A9k00L48L53p8j96j26j05K98K31j28n47M7O5K28L0qK11q03M35M19l8j72n80
$$ 19 -181 167 520 442 246 120 15 313 544 416 -131 -84 -19 209 239 231 442 -361 74 493 455 283 -297
4515b97J93K39N56n17l91J35N22j61q8k9n92J6N77J65j26j28l59k23P48j58k62
$$ -297 -104 135 691 174 -217 -82 440 279 191 162 -430 -414 163 328 202 74 -285 -508 240 82 -180
4536a80j91J98K78L3M0m07j20J4N53k41k69NM00l06K95L32o48L2pK09p9K78m52
$$ -180 -371 -173 105 138 178 -229 -349 -335 218 -23 -292 -287 113 -193 102 434 -214 -182 -189 20 -59 219 -233
4559b33j31K48N17l21m65L77J73l85P18k87o16Q2L17K01j48J9j52j29M75N6k64
$$ -233 -364 -116 401 80 -385 -8 165 -220 498 211 -405 -323 -6 195 47 66 -86 -215 260 316 52
4580E2k25J83L6l8L34m08k28L75N08k56k21k98j7j31M84Pj19k10L64l16P32l96
$$ 52 -173 10 46 8 342 -66 -294 81 589 333 112 -186 -203 -334 150 157 38 -172 192 -124 608 212
4602B12o15r0M39L67n18K68m29k26L57L61l92J10K6R1J54k9k21l27l5O9L78L70
$$ 212 -403 -493 -54 313 -205 63 -366 -592 -235 126 -266 -156 -130 -39 115 86 -135 -462 -497 -428 -50 320
4624C20l70n1k70m9N80l64J9j34J1N38J20l96l05NK47j17K46o8q0J58M20l34j88
$$ 320 -50 -101 -371 -420 160 -204 -185 -319 -308 230 350 -46 -351 -346 -99 -216 30 -38 -118 40 460 126 -62
4647f2k28l5J03M57l6o10J40K00K56k00K54l70K2L10J52m58j41O50m25L80j13
$$ -62 -290 -325 -222 235 199 -411 -271 -71 185 -15 239 -131 -109 201 353 -105 -246 404 -21 359 246
4668B46P4m70J46j5J79j58K18l08O6N37j78k43k09m8K7K84Q1k45l16P46q0l07
$$ 246 320 -150 -4 -19 160 2 220 -88 -22 515 337 94 -115 -163 -136 148 229 -16 -332 414 334 27
4690B7J50k06L0M3L11j90l0j57j48k1O06P5n37j35K80K37k66K22l90k79O53o5
$$ 27 177 -29 1 44 355 165 135 -22 -170 -191 415 490 -47 -182 98 335 69 291 -99 -378 275 210
4712B10j89OJ41k11K23K72k24l08l96O03Q0j47l17n0j60R33j69l66j85K50j0M09
$$ 210 21 27 168 -43 180 452 228 -80 -476 127 207 60 -257 -307 -467 466 297 -69 -254 -4 -14 395
4734C95k2o38k3n3L94Q8j53j38j24j92N21j34J51l37J38M32k06%m27J55L05j04
$$ 395 373 -265 -288 -341 53 141 -12 -150 -274 -466 55 -79 72 -265 -127 305 99 99 -328 -173 132 28
4756B8m27K17K29l72J29Q31o44j05k64K74J95L56o21Q4k35M81J54l22J4m34K87
$$ 28 -399 -182 47 -325 -196 635 -9 -114 -378 -104 91 447 -174 -90 -325 156 310 -12 2 -432 -145
4777a45L24J40o12K16M6MN04r5p35k09J33N91k51Q6J1o1k84P76l66j63j97J03
$$ -145 179 319 -293 -77 -31 -27 477 382 -353 -562 -429 162 -89 -3 8 -53 -337 439 73 -90 -287 -184
4799a84o3K74J33l18m5N0K78k00K00n6l45K33L33l72lj76K00M04o3k67k39q2P01
$$ -184 -247 27 160 -158 -203 -153 125 -75 125 69 -276 -43 290 -82 -85 -261 -61 343 280 13 -226 -308 393
4822C93l09J13o4m15j13L67L81k11m42N46k69L32j45m44J22J37K05r7L0N0n86
$$ 393 84 197 133 -282 -395 -28 353 142 -300 246 -23 309 164 -280 -158 -21 184 87 117 167 -419
4843d19P17R5n20K17J8J25j53p7K22m41K6M64j79k5K08n85j68M81J90J2j50m7
$$ -419 298 393 -127 90 108 233 80 3 225 -216 -190 274 95 70 278 -307 -475 6 196 208 58 11
4865A1J62l70O97k86n56J64K91J63j33J48l38j92M63Q2k74j52q5J09K72K03m28
$$ 11 173 -197 500 214 -342 -178 113 276 143 291 -47 -239 224 306 32 -120 -205 -96 176 379 -49
4886d9l61M45L02k13O7n83j9N13J41mn51K16J02K34o7J9n9k31K22P0r3L4j3k30
$$ -49 -410 35 337 124 191 -392 -411 102 243 239 -312 -96 6 240 173 192 133 -98 124 194 101 135 122 -108
4910a08K99J97o09qJ08q4M01j4Q6o28J81M44l21J05k81j47M9Q0O91k80p29M58
$$ -108 191 388 -221 -229 -121 -205 196 182 268 -360 -179 265 -56 49 -232 -379 -330 -250 441 161 -568 -110
4932a10j11N84m13m6m08L42K36j75k85J52J08R1J34j22l39L66J17J32j69O9m05
$$ -110 -221 363 -50 -96 -504 -162 74 -101 -386 -234 -126 -35 99 -23 -362 4 121 253 84 153 -252
4953b52k62L49M50Q7m41j30k34M07K44q2k00n2p4K50J44q3m01J00J30l5K24rl76
$$ -252 -514 -165 285 372 -69 -199 -433 -26 218 136 -64 -116 -190 60 204 121 -280 -180 -50 -85 139 130 -246
4976b46K27k29N37m60M8J83k03L63J34q65K55M59J22Lo46J16j52M17K42m52l3
$$ -246 -19 -248 289 -171 -123 60 -143 220 354 -511 -256 203 325 328 -318 -202 -354 63 305 -147 -180
4997a80J30J14l17N80k98q2K3M4L11l22J2k57P6L04K51m55J1J72j48Q7L54j02
$$ -180 -50 64 -253 327 29 -53 -30 14 325 3 15 -242 -166 138 389 -66 -55 117 -31 56 410 308
5019C08k05o29L51J37J97l3j53j42N51j63k97J8k0l7J89L08l70k18L76j26K03
$$ 308 103 -526 -175 -38 159 126 -27 -169 382 219 -78 -60 -80 -117 72 380 10 -208 168 42 245
5040B45m07L26m60O60J43j26p63L55n9K94NJ27n08J24K79n9M02r28L18J94J79
$$ 245 -162 164 -296 364 507 381 -382 -27 -86 208 213 340 -168 -44 235 176 578 -350 -32 162 341
5061C41N0o49P8L84l68J89J31k54p0J2L08j68L23J4o70J85L68j20j47l02N02l68
$$ 341 391 -258 -180 204 -164 25 156 -98 -168 -156 152 -16 307 321 -349 -164 204 84 -63 -365 137 -231
5083b31M75p3k78m43N22K59j69k2l62j18M83j95L9k82r0L82N29n88J23l60o8P09
$$ -231 244 171 -107 -550 -28 231 62 40 -322 -440 43 -152 -113 -395 -485 -103 426 -162 -39 -399 -467 242
5105B42k76k66K37k41p4Q6K8J18K1P1j36k54O30j65o33L13J69j26J39J92l90j32
$$ 242 -34 -300 -63 -304 -378 -292 -264 -146 -125 -54 -190 -444 186 21 -612 -299 -130 -256 -117 75 -315 -447
5127d47L27Pj98J9J93j38K60J5J2n90M24L06K9j57L2o56M36L20K33l86o7K24P1
$$ -447 -120 -113 -311 -292 -99 -237 23 38 50 -540 -116 190 219 62 94 -562 -126 194 427 41 -26 198 269
5150B69l80j13k7J47L74J61l71j14O7Km8K27j39J48j47J48l79M93k73m05K29J86
$$ 269 -111 -224 -251 -104 270 431 60 -54 13 15 -33 194 55 203 56 204 -175 318 45 -360 -131 55
5172E5P2J0J61k52q8K44o1l76K24J11k82K73N3j31n04L09P02k95l4l52P5J31K56
$$ 55 127 137 298 46 -42 202 141 -235 -11 100 -182 91 144 13 -491 -182 520 225 191 -161 -86 45 301
$$ [...]
8191A77
##END NTUPLES=NMR FID
##END=
