##TITLE=1H_CG-1104-b
 DMSO, 8 sc, 
 27.5.2019
##JCAMPDX= 6.0         $$ Bruker NMR JCAMP-DX V2.0
##DATA TYPE= NMR FID
##DATA CLASS= NTUPLES
##ORIGIN= UXNMR, Bruker Analytische Messtechnik GmbH
##OWNER= root
$$ XWIN-NMR		Version 3.5
$$ Mon May 27 15:32:45 2019 Russian Standard Time (UT+4h)  she@DPX200
##.OBSERVE FREQUENCY= 200.1315
##.OBSERVE NUCLEUS= ^1H
##.DELAY= (6, 6)
##.ACQUISITION MODE= SIMULTANEOUS
##.ACQUISITION SCHEME= undefined
##.AVERAGES= 8
##.DIGITISER RES= 18
##SPECTROMETER/DATA SYSTEM= spect
##.PULSE SEQUENCE= zg30
##.SOLVENT NAME= DMSO
##.SHIFT REFERENCE= (INTERNAL, DMSO, 0, 15.7039)
##AUDIT TRAIL= $$ (NUMBER, WHEN, WHO, WHERE, WHAT)
$$ ##TITLE= Audit trail, XWIN-NMR		Version 3.5
$$ ##JCAMPDX= 5.01
$$ ##ORIGIN= Bruker BioSpin GmbH
$$ ##OWNER= she
$$ F:/spectra/data/she/nmr/H-F/1/audita.txt
$$ ##AUDIT TRAIL=  $$ (NUMBER, WHEN, WHO, WHERE, WHAT)
(   1,<2019-05-27 15:30:33.78 +0400>,<she>,<DPX200>,
      <created by zg, POWCHK disabled, PULCHK disabled
       configuration hash MD5:
       00 E9 B6 7A A2 85 ED C7 34 08 36 98 17 FE 4E 26
       data hash MD5: 16K
       E0 E8 D7 4B 5C 7E B0 61 99 56 95 32 09 CD 0F 13>)
$$ ##END=
$$ 
$$ hash MD5
$$ 2D EA 52 59 97 93 83 78 92 5A 16 37 AF B9 07 77
##$RELAX= 
##$RELAX= 
##$RELAX= 
##$RELAX= 
##$RELAX= 
##$RELAX= 
$$ Bruker specific parameters
$$ --------------------------
##$DU= <F:/spectra>
##$EXPNO= 1
##$NAME= <H-F>
##$PROCNO= 1
##$TYPE= <nmr>
##$USER= <she>
##$AMP= (0..31)
100 100 100 100 100 100 100 100 100 100 100 100 100 100 100 100 100 100 
100 100 100 100 100 100 100 100 100 100 100 100 100 100 
##$AQSEQ= 0
##$AQ_mod= 1
##$AUNM= <au_zg>
##$AUTOPOS= <>
##$BF1= 200.13
##$BF2= 200.13
##$BF3= 200.13
##$BF4= 200.13
##$BF5= 200.13
##$BF6= 200.13
##$BF7= 200.13
##$BF8= 200.13
##$BYTORDA= 1
##$CFDGTYP= 0
##$CFRGTYP= 5
##$CHEMSTR= <none>
##$CNST= (0..31)
1 1 145 1 1 1 1 1 1 1 1 1 1 1 1 1 1 1 1 1 1 1 1 1 1 1 1 1 1 1 1 1 
##$CPDPRG= <>
##$CPDPRG1= <>
##$CPDPRG2= <>
##$CPDPRG3= <>
##$CPDPRG4= <mlev>
##$CPDPRG5= <mlev>
##$CPDPRG6= <mlev>
##$CPDPRG7= <mlev>
##$CPDPRG8= <mlev>
##$CPDPRGB= <>
##$CPDPRGT= <>
##$D= (0..31)
0 1.2 0 0 0 0 0 0 0 0 0 0.03 0 0 0 0 0 0 0 0 0 0 0 0 0 0 0 0 0 0 0 0 
##$DATE= 1558956632
##$DBL= (0..7)
120 120 120 120 120 120 120 120 
##$DBP= (0..7)
150 150 150 150 150 150 150 150 
##$DBP07= 0
##$DBPNAM0= <>
##$DBPNAM1= <>
##$DBPNAM2= <>
##$DBPNAM3= <>
##$DBPNAM4= <>
##$DBPNAM5= <>
##$DBPNAM6= <>
##$DBPNAM7= <>
##$DBPOAL= (0..7)
0.5 0.5 0.5 0.5 0.5 0.5 0.5 0.5 
##$DBPOFFS= (0..7)
0 0 0 0 0 0 0 0 
##$DE= 6
##$DECBNUC= <off>
##$DECIM= 24
##$DECNUC= <off>
##$DECSTAT= 4
##$DIGMOD= 1
##$DIGTYP= 9
##$DL= (0..7)
0 120 120 120 120 120 120 120 
##$DP= (0..7)
150 150 150 150 150 150 150 150 
##$DP07= 0
##$DPNAME0= <>
##$DPNAME1= <>
##$DPNAME2= <>
##$DPNAME3= <>
##$DPNAME4= <>
##$DPNAME5= <>
##$DPNAME6= <>
##$DPNAME7= <>
##$DPOAL= (0..7)
0.5 0.5 0.5 0.5 0.5 0.5 0.5 0.5 
##$DPOFFS= (0..7)
0 0 0 0 0 0 0 0 
##$DQDMODE= 0
##$DR= 18
##$DS= 0
##$DSLIST= <SSSSSSSSSSSSSSS>
##$DSPFIRM= 0
$$ [...]
##$SUBNAM2= <"">
##$SUBNAM3= <"">
##$SUBNAM4= <"">
##$SUBNAM5= <"">
##$SUBNAM6= <"">
##$SUBNAM7= <"">
##$SUBNAM8= <"">
##$SUBNAM9= <"">
##$SW= 24.9337058887773
##$SWIBOX= (0..15)
0 0 2 0 0 0 0 0 0 0 0 0 0 0 0 0 
##$SW_h= 4990.01996007984
##$TD= 16384
##$TD0= 1
##$TE= 0
##$TE2= 300
##$TE3= 300
##$TEG= 300
##$TL= (0..7)
0 120 120 120 120 120 120 120 
##$TP= (0..7)
150 150 150 150 150 150 150 150 
##$TP07= 0
##$TPNAME0= <>
##$TPNAME1= <>
##$TPNAME2= <>
##$TPNAME3= <>
##$TPNAME4= <>
##$TPNAME5= <>
##$TPNAME6= <>
##$TPNAME7= <>
##$TPOAL= (0..7)
0.5 0.5 0.5 0.5 0.5 0.5 0.5 0.5 
##$TPOFFS= (0..7)
0 0 0 0 0 0 0 0 
##$TUNHIN= 0
##$TUNHOUT= 0
##$TUNXOUT= 0
##$USERA1= <user>
##$USERA2= <user>
##$USERA3= <user>
##$USERA4= <user>
##$USERA5= <user>
##$V9= 5
##$VALIST= <valist>
##$VCLIST= <CCCCCCCCCCCCCCC>
##$VD= 0
##$VDLIST= <DDDDDDDDDDDDDDD>
##$VPLIST= <PPPPPPPPPPPPPPP>
##$VTLIST= <TTTTTTTTTTTTTTT>
##$WBST= 1024
##$WBSW= 4
##$XGAIN= (0..3)
0 0 0 0 
##$XL= 0
##$YL= 0
##$YMAX_a= 259680
##$YMIN_a= -449802
##$ZGOPTNS= <>
##$ZL1= 120
##$ZL2= 120
##$ZL3= 120
##$ZL4= 120
##$ABSF1= 10
##$ABSF2= 0
##$ABSG= 5
##$ABSL= 3
##$ALPHA= 0
##$AQORDER= 0
##$ASSFAC= 0
##$ASSFACI= 0
##$ASSFACX= 0
##$ASSWID= 0
##$AUNMP= <proc_1d>
##$AZFE= 0.1
##$AZFW= 0.1
##$BCFW= 1
##$BC_mod= 2
##$BYTORDP= 1
##$COROFFS= 0
##$CY= 11.3945322036743
##$DATMOD= 1
##$DC= 2
##$DFILT= <>
##$DTYPP= 0
##$F1P= 18.9103706918063
##$F2P= -1.10871071338519
##$FCOR= 0.5
##$FTSIZE= 0
##$FT_mod= 4
##$GAMMA= 1
##$GB= 0.15
##$INTBC= 1
##$INTSCL= 1
##$ISEN= 128
##$LB= 0.24
##$LEV0= 0
##$LPBIN= 0
##$MAXI= 10000
##$MC2= 0
##$MEAN= 0
##$ME_mod= 0
##$MI= 1.114404
##$NCOEF= 0
##$NC_proc= 0
##$NLEV= 6
##$NOISF1= 3.799351
##$NOISF2= 2.8
##$NSP= 1
##$NTH_PI= 0
##$NZP= 0
##$OFFSET= 15.70392
##$PC= 1
##$PHC0= -8863.295
##$PHC1= 19.00026
##$PH_mod= 1
##$PKNL= yes
##$PPARMOD= 0
##$PSCAL= 0
##$PSIGN= 0
##$REVERSE= no
##$SF= 200.130013532006
##$SI= 16384
##$SIGF1= 3
##$SIGF2= 2
##$SINO= 400
##$SIOLD= 16384
##$SREGLST= <1H.CDCl3>
##$SSB= 0
##$STSI= 0
##$STSR= 0
##$SW_p= 3612.71676300578
##$SYMM= 0
##$S_DEV= 0
##$TDeff= 0
##$TDoff= 0
##$TI= <>
##$TILT= no
##$TM1= 0
##$TM2= 0
##$TOPLEV= 0
##$USERP1= <user>
##$USERP2= <user>
##$USERP3= <user>
##$USERP4= <user>
##$USERP5= <user>
##$WDW= 1
##$XDIM= 8192
##$YMAX_p= 0
##$YMIN_p= 0
$$ End of Bruker specific parameters
$$ ---------------------------------
##NTUPLES= NMR FID
##VAR_NAME=  TIME,          FID/REAL,        FID/IMAG
##SYMBOL=    X,             R,               I
##VAR_TYPE=  INDEPENDENT,   DEPENDENT,       DEPENDENT
##VAR_FORM=  AFFN,          ASDF,            ASDF
##VAR_DIM=   8192,          8192,            8192
##UNITS=     SECONDS,       ARBITRARY UNITS, ARBITRARY UNITS
##FACTOR=    0.0002004,     1,               1
##FIRST=     0,             0,               0
##LAST=      1.6414764,     0,               0
##MIN=       0,             -449802,         0
##MAX=       1.6414764,     259680,          0
$$ Real data points
##PAGE= N=1
##DATA TABLE= (X++(R..R)), XYDATA
$$ [...]
1929b14R0m3R4J77p2k72m2L45QP1l56K33L11n06L26J30k0k59j5K69k55k36J55
1952h1J88j5Q2p6l3j29J13P6K73l64k79K03K47o6Pj59j00L27l22J73p2J22J23
1975B38q4k61N1M0K16j27m8J19J40k72J5L8r8mp8p0O12o14J44J96J7j39j53M68
1999C46m93J85J46m26n7L33K35l11j8J62j17j18O0j95K07J77N4J44l66L23k87
2020a6N8j43j56K10K12l74N22l28j38J02q7j45nL21J0k16K48k62K06K73o18N34
2042B08j48j75J97k25P3J60Rn4O2k48O9J19k67P4O7j02M3M3L04j77j62L64k55
2065b1J02k8M24j95j60k41k14J98J01n9N3o0L7J89j99L04j91J7k47J9L61k06J8
2088Bl2k07J75pj84M44m59M31M3k46K17j79k9n0r0J78j00rJ49j40n9j40MK10k88
$$ plain form
1929 -214 -124 -167 -73 104 32 -240 -282 63 71 142 -214 19 330 -176 150 280 260 1 -14 255 0 -236 -81
1952 -81 107 92 174 98 65 -64 49 125 398 34 -245 -42 205 139 146 -13 -113 214 -108 65 -7 115 238
1975 238 154 -107 -56 -16 200 73 25 144 284 12 27 65 -33 -37 -115 -185 427 -187 -43 153 170 31 -122 346
1999 346 -147 38 184 -242 -299 34 269 -42 -60 102 -15 -133 -73 -268 -61 116 170 314 -52 271 -16
2020 -16 42 -101 -257 -47 165 -209 313 -15 -153 -51 -138 -283 -288 33 43 -173 75 -187 19 292 -326 208
2042 208 60 -115 82 -143 -70 90 99 45 107 -141 -72 47 -220 -146 -79 -181 -138 -95 209 32 -130 234 -21
2065 -21 81 53 477 282 122 -119 -333 -135 -34 -93 -40 -100 -63 126 -73 231 40 57 -190 -171 190 -16 2
2088 2 -30 -237 -62 -69 -253 191 -268 163 206 -40 177 -2 -31 -81 -171 7 -93 -102 47 -93 -152 -292 -288 -78 -366
2113c66M04O0j24l04L99K01m44L31k11r0K39j56K25l7Om52K15K78m25M85j22k12
2135a00J00q9J08M1J42L2p8J88m35K73L1m9J23k01Q2m50M87k75J23J3n2m1Nk4
2159d6k05J82o5m5l5P86m97n0l3J64N9k95L41l25J95k52L9m82K67K37O1M6PK73
2183C27j75j44R4k0k37L04q1k76J19k2L04j54J06j39Rk05n3J48k76N56k17J87
2205A55j68j69J39J78J0m04K8j2L15Q3R8o04L78k35R6L18k92J43j35l05N4L73
2227D4J1O4o8L0J55k52J79J72j53R6o77M2J64L55k88O9J78k85K09J67q6J33j80
2250G9k78M9m7J72j19M94l66l04J58L63j79k35M0K49j17L19l97J11k6J12j43L8
2272b7J56n3k25L74k61J53l30j03L79m29M57N0k07K64j38l7J07J49m69K66J82
$$ plain form
2113 -366 38 98 -26 -330 69 270 -174 157 -54 -144 95 -61 164 127 133 -319 -104 174 -251 234 112 -100
2135 -100 0 -89 19 60 202 234 156 344 -91 182 213 164 287 86 168 -282 205 -70 53 66 14 -27 -22 -46
2159 -46 -251 -69 -134 -179 -214 572 75 25 -8 156 215 -80 261 -64 131 -121 -82 -564 -297 -60 1 47 54 327
2183 327 152 8 102 82 -155 149 68 -208 -89 -111 193 39 145 6 15 -190 -243 -95 -371 185 -32 155
2205 155 -13 -182 -43 135 145 -259 -231 -243 72 155 253 -351 27 -208 -112 206 -86 57 -78 -383 -329 44
2227 44 55 119 51 81 236 -16 163 335 182 278 -399 -357 -193 162 -126 -57 121 -164 45 212 126 259 79
2250 79 -199 -150 -197 -25 -144 350 -16 -320 -162 201 22 -213 -173 76 -41 278 -119 -8 -34 78 -65 -27
2272 -27 129 76 -149 225 -36 117 -213 -316 63 -366 91 141 -66 198 60 23 130 279 -190 76 258
2293B58n85N27k59m9J10q1K94n84K60K47l85N62l62r7L35j89K46m10K39J74j15
2314A36l57J87n4J44j2P9N7k81k8J5K9n0K92j24J7%J43k34l7m0J76J74m81J39
2338a10j16N55j97m02J29J32J92n28K86k23K79O1J2l0j70n8K36q0J60k2L93m99
2360@l57J15k2J7j1Q4J21J34k27K06K5j03O0m7k7K97l58P2j61l7M84L5j08l31
2384a39K69j07k0o7j14j66L16J32k47J74K50j23n5k50P7KR6J38k60J27K22l23
2406f8K95l41J70L76l30k30R1N9J95q3l15L07J8j51j16j20J22l83L47K20j45L2
2428e0Q3l39L24j06L95l10j38K10j4j03r6P0K37j53k11J84NP6j61j30J64mM54
2451C87l58P4k61q5k6p3L91k18K81l49L27l5M1R9l06R9L1Q9m3J8J18l94L05j34
$$ plain form
2293 258 -327 200 -59 -108 2 -79 215 -369 -109 138 -247 315 -47 -144 191 2 248 -162 77 251 136
2314 136 -221 -34 -88 56 44 123 180 -101 -129 -114 -85 -135 157 33 50 50 193 -41 -78 -118 58 232 -249 -110
2338 -110 -226 329 132 -270 -141 -9 183 -345 -59 -282 -3 58 70 40 -130 -188 48 -32 128 106 499 0
2360 0 -357 -242 -264 -247 -258 -174 -53 81 -146 60 85 -18 42 -5 -32 265 -93 -21 -182 -219 265 300 192 -139
2384 -139 130 23 3 -64 -178 -344 -28 104 -143 31 281 158 103 -147 -70 -68 28 166 -94 33 255 -68
2406 -68 227 -114 56 432 102 -128 -37 22 217 134 -181 126 144 -7 -123 -243 -121 -504 -157 63 -82 -50
2428 -50 33 -306 18 -88 307 -3 -141 69 55 -48 -144 -74 163 10 -201 -17 -12 64 -97 -227 -63 -67 387
2451 387 29 103 -158 -243 -269 -342 49 -169 112 -237 90 55 96 195 -111 -12 19 108 65 83 201 -193 112 -22
2475b2j26M59j8j63L4l22K73k5j06j07J86R4q6n6Q7k46N3K08J93l43k7Q9k49L7
2499a83J96k2j30K96l8n2j09m8j68K64J29l99L76m22J30J19J14N8j66J64j06N3
2521E6J22j93r0J5K2K8l5Lk05L99k79O6p7L08k09j39J41o2r5M51M8J7l54k6J98
2546A10j55RO7J12o0r1J60j87L02j81l05K01K96k21j90R0R8j60J65J05j62J4p3
2569e6j03j7M31m38L90j11m46Q3K70L64k06m94K21J2L35j17k57m3J55l78L60J17
2591G2Jj42J71k0k82r8J45M20k65J36r1j58K90l57K32l6J39k57J5KJ25k1O3J48
2615B32n54L73J17o8j71K72j57K41j07j03j49J60p2k15L3O8k0L06J20k88k97L41
2637F2j69N0k39M49l30o3L77l89J68p7J07o3M2J76j88L86m19L79m41L15PJ0lj72
$$ plain form
2475 -22 -148 311 293 130 164 -158 115 90 -16 -123 63 157 71 15 102 -144 -91 117 310 -33 -60 29 -220 -183
2499 -183 13 -9 -139 157 119 67 -42 -90 -258 6 135 -264 112 -310 -180 -61 53 111 -55 109 3 56
2521 56 178 -15 -105 -90 -68 -40 -75 -72 -277 122 -157 -91 -168 140 -69 -208 -67 -129 -224 227 275 292 -62 -88 110
2546 110 -45 -36 31 143 83 -8 152 -35 267 86 -219 -18 278 57 -133 -43 55 -105 60 165 3 17 -56
2569 -56 -159 -176 255 -183 207 96 -350 -267 3 367 161 -333 -112 -100 235 118 -139 -182 -27 -405 -45 72
2591 72 73 -69 102 82 -200 -298 -153 267 2 138 47 -111 179 -178 54 18 157 -100 -85 -83 42 21 84 232
2615 232 -322 51 168 100 -71 201 44 285 178 75 -74 86 14 -201 -168 -100 -120 186 306 18 -279 62
2637 62 -107 -57 -296 153 -177 -240 137 -252 -84 -161 -54 -117 -75 101 -87 299 -120 259 -182 133 140 150 147 -25
2661b5J2mM0O8k70K53J17j11k98N9J52j12k02L61j02J09k32J86j02o0K00n8K17
2684A98k03J05l6L5pr9L04k40j07J39o6Lj07N6K59K8k75K07j20j22k6J92j99J74
2708I3k67L38p9r4NJ94j41L9l31P9M6J7K34j23k09L39K1l13J12Q3k87J94m7K93
2732A96K8k36K26l59O2k52K62QQ3J65j19K26l48j66J47j67K52P9j38J13K0k50
2754a68k1M52k95k49J96r3J13k87J89J83O1j94j2j8k51M03j62K10j6J36K4j83
2776A8k59M03j35P8J59l44j44K58r0K58j73n4K13k12j47M16l44J96k25J07l69
2797c90O51l16q1L91L1m40M12m00K75j02q3m5q7L19k29L28L0l24M6R0j46l8j02
2820b10J3N70n31K70j51L19l32K34R1k20j32R2J78m42L91l03K92k16M21k03o2
$$ plain form
2661 -25 -13 -17 23 91 -179 74 191 80 -218 -159 -7 -119 -321 40 -62 47 -185 1 -101 -161 39 -19 198
2684 198 -5 100 64 99 92 -7 297 57 -50 89 23 26 -81 -25 234 262 -13 194 74 -48 -74 118 -81 93
2708 93 -174 164 85 -9 -4 190 49 88 -243 -164 -118 -101 133 10 -199 140 161 -152 -40 43 -244 -50 -97 196
2732 196 224 -12 214 -145 -83 -335 -73 -65 18 183 64 290 -58 -224 -77 -244 8 87 -51 62 82 -168
2754 -168 -189 263 -32 -281 -85 -178 -65 -352 -163 20 81 -113 -125 -143 -394 9 -153 57 41 177 201 18
2776 18 -241 162 27 105 264 -80 -224 34 -56 202 29 -25 188 -24 -171 245 -99 97 -128 -21 -390
2797 -390 261 -55 -136 255 286 -154 258 -142 133 31 -52 -97 -184 135 -94 234 264 -60 -14 76 -70 -108 -210
2820 -210 -197 373 -158 112 -39 280 -52 182 273 53 -79 13 191 -251 140 -163 129 -87 334 131 69
2841F9k46k4M8K06o2j28J52L04l99M16o4k17j75o2J09j21J56J05j13o4J38j74
2863a46L18l74M36M3k74j03l1K29j54L34l25j54q3L90j64K41k43K22k6J53m52
2884a63m3K95k13L3k34K19K86l90L11K05k52j58k91N28j04r9o5J71o7l4j16J45
2906c6L07n79J97K1NK86j34L0k53k3j17K40J83j44L8j2k3j45N9M71m66j0J55j37
2930h7r9K47k16L00n6j36J13K13k17l8J63k62k1j16J77p6P6J26l53Q9Q7j67J93
2953f0R6L1k49jn7%M97k39j35l2J96RQ3j99j29O2n6M25m61L16j61P3KK70l84j48
2979b51K38l40M14l62K16k7L62r3j44J97o08J98L16p7j43k1L71l52N3J47P0k84
3001a20L6k5M4J48l19J69j45M0O3K43Jq2j08j56J42J26J73k79q9J35o1K92j98
$$ plain form
2841 69 -177 -201 -153 53 -9 -137 15 319 -80 336 272 55 -120 -182 -73 -194 -38 67 -46 -110 28 -146
2863 -146 172 -202 234 277 3 -100 -131 98 -56 278 -47 -201 -284 106 -58 183 -60 162 136 289 -163
2884 -163 -206 89 -124 -91 -325 -106 180 -210 101 306 54 -104 -395 133 29 -70 -135 36 -31 -65 -181 -36
2906 -36 271 -308 -111 -90 -85 201 67 97 -156 -179 -296 -56 127 -17 21 9 -14 -159 -100 371 -95 -105 50 -87
2930 -87 -186 61 -155 145 89 -47 66 279 62 24 187 -75 -96 -212 -35 -111 -35 91 -262 -173 -86 -253 -60
2953 -60 36 67 -182 -183 -240 -240 257 18 -117 -149 47 56 139 -60 -189 -127 -183 242 -219 97 -64 9 11 281 -103 -251
2979 -251 -13 -353 61 -301 -85 -112 250 157 13 210 -398 -200 116 39 -104 -125 246 -106 -53 94 164 -120
3001 -120 -84 -109 -65 83 -236 -67 -212 -172 -109 134 135 53 -55 -211 -69 57 230 -49 -138 -3 -64 228 30
3024C0j76M25o36L31J40K18j52j95L49l00k55L21j94o0J07L28l67J44o3K1p1N9
3046Dj87K63j07k3j10O29p19M14n5j13J67q4m9o2q6K19K43l51J59j02k99J46K21
3069A18k70K39N8j9j60J75o6j88j42M00l81M52r5j93j93J5L02J06k96N1J80l29
3091b36Q3O1L85j91j43J53j64K33k72j18L21L54n29j33L22j3K32l02J9k62P7o5
3113a88Q3M64n21J96Q7l11j6K73k3k8l1j9J55m92J11M98j13l18L78k19O5L18l96
3136d7j15K91m7k66LJ28j10M08m37J18kLk1L09kj05l50M28L90p41j67L33j41R7
3160d3M9k17PL32j34k13J46R8j0q2J05L5k90J65Q4j4M3k33K07k96R6N8p2K83L4
3185A38m25m6L73l05M09m58K15J68m79K52K00J88j59j61L30l73P9r6K13j59L3
$$ plain form
3024 30 -146 279 -357 -26 114 332 180 -15 334 34 -221 100 -94 -154 -47 281 -86 58 -5 16 -55 4
3046 4 -183 80 -27 -50 -160 469 -250 164 109 -4 163 79 30 -32 -118 101 344 -7 152 50 -249 -103 118
3069 118 -152 87 145 126 -34 141 75 -113 -255 145 -236 216 121 -72 -265 -250 52 158 -138 -87 93 -236
3091 -236 -153 -92 293 102 -41 112 -52 181 -91 -209 112 466 -63 -196 126 113 345 43 62 -200 -123 -188
3113 -188 -105 359 -162 34 121 -190 -206 67 44 16 -15 -34 121 -371 -260 238 125 -193 185 -34 31 349 -47
3136 -47 -162 129 82 -184 -181 -53 -163 245 -192 -74 -76 -73 -94 215 213 108 -242 186 576 -165 -332 1 -140 -43
3160 -43 6 -211 -204 128 -6 -219 -73 25 15 -67 38 73 -217 -52 32 18 61 -172 35 -261 -165 -107 -179 104 138
3185 138 -287 -333 40 -265 144 -314 -99 69 -410 -158 42 230 71 -90 240 -133 -54 -150 63 -96 -63
3206f3N5P4j34J84K8j69K39J1j95k10J12J57P4j70k73O8K87l04J36J51r6J47K31
3229C40k26k68N09M4o01L36m02L98j81o0K83k55l9K7j45K05j38R1J66k39n0j59
3251c64K15j42M80p3k8j02k0J52l41L13j06L9k8j94K1K32M4o5j12L44j43M7q7
3274H2j82J54j16L23k50k89R7r6J44L6L43l95j11J04K68l53M66m00L76l99J54
3295d4K73j84L28m69J97J84j47j85L6K03j25j45L11n83O62k49J5j01K30k36o6
3316i5o4n9K95l68K28J48p4k07K41N8j15J62k91N0Q4K96j84n6Q3o3j02P2k50J42
3340f9J64qj32j22K1j07P87o14j88K01K32o1j45J76J1j9l29P8J76r6j27J06l9
3363a04j96L33j1L7j63K95k33J66m96L48o8j37J64K3P2j02K18l38R6J62q1pj4
$$ plain form
3206 -63 -8 66 -68 116 144 -25 214 225 30 -180 -68 89 163 -7 -280 -212 75 -229 -93 58 -38 109 340
3229 340 114 -154 355 399 -202 134 -268 130 -51 -111 172 -83 -122 -95 -240 -35 -173 -82 84 -155 -205 -364
3251 -364 -149 -291 189 116 88 -14 -34 118 -223 90 -16 23 -5 -199 -178 54 98 33 -79 265 122 169 82
3274 82 -100 54 -62 261 11 -278 -181 -277 -133 -97 246 -149 -260 -156 112 -241 225 -175 201 -198 -44
3295 -44 229 45 373 -96 101 285 138 -47 -11 192 67 -78 233 -350 312 63 78 -23 207 -29 -95
3316 -95 -159 -218 77 -291 -63 85 11 -196 45 103 -12 150 -141 -91 -7 289 105 49 132 69 -33 39 -211 -69
3340 -69 95 87 -45 -167 -146 -253 534 -80 -268 -67 165 104 -41 135 146 127 -202 -124 52 -44 -171 -65 -104
3363 -104 -300 33 22 59 -104 191 -42 124 -372 -24 -92 -229 -65 -42 30 -72 146 -192 -96 66 -15 -22 -36
3386c6J29l52M25l0j57J18m73O43j25J13l86K04M8N1n8k58J74j90P2kk00L50k4
3409C6j93J23m9k03K02Q3m7M4kj05L40l14J23P3j39j54J30k78L43k9q8j22K60
3432C4j41L36k40O1k97L76j06j32J11qn0j82M03N5k03j17J71k16L79j75J71j89
3454D1j99m7K7L12J3O3Kk75l7n0M13k16R8k56K2P3j60J18k7R9k38L92j31J23m08
3479b48N01l35JK10l36J74J03n0J26m33J82k49K18m9J22j16kL52j82j55K03N0
3501H7K1J16l0m61P1J87R7J9M6m85J99K78m01L24J8m12J80M1L28l62K37j44K03
3524A57k14l02P12q7q6k51N7l29l5K67M04j54l18K22k00K46j1l3j77N84k72R4
3546B74k17j76J39J21j14k3j88o3j05L20K40J05l61K8J53l51L35j46J0P0j16J36
$$ plain form
3386 -36 93 -259 166 136 -21 97 -376 267 142 255 -131 73 121 172 114 -144 30 -160 -88 -90 -290 60 36
3409 36 -157 -34 -83 -286 -84 -1 -48 -4 -6 -111 229 -85 38 111 -28 -182 -52 -330 13 -16 -104 -226 34
3432 34 -107 229 -11 50 -247 129 23 -109 2 -6 -56 -238 165 220 17 -100 71 -145 234 59 230 41
3454 41 -158 -205 -178 134 147 210 212 -63 -100 -150 263 47 145 -111 -89 -16 -176 -58 -85 14 -224 168 37 160 -248
3479 -248 253 -82 -81 129 -207 -33 70 20 146 -287 -105 -354 -136 -185 -63 -179 -181 171 -11 -166 37 87
3501 87 108 224 194 -267 -196 -9 88 107 153 -332 -133 145 -256 68 86 -326 -146 -105 223 -139 98 -46 157
3524 157 -57 -359 353 266 180 -71 -14 -343 -378 -111 293 139 -179 43 -157 89 78 45 -132 452 180 274
3546 274 57 -119 20 141 27 4 -184 -247 -352 -32 208 313 -48 -20 133 -218 117 -29 -19 51 -65 71
3568G1Nj66J10Q6j61J25l73K16P7l13L83m9o4J00J2l1q9n1M28j59K56m71k68J74
3592a52J66j14R2J5k63K20o4K27K5j77L03k33J01J32j49n7O5o2k31R4k8J5J91
3615A16k19j69J72K51k23K92j66j06l6K2M85l97n7j57J52j07J34l7J88j85J86
3636A39L9l23j08L54K86n50J2K23n2J6r4J92o2j8k67J15L67l53j25o5K53j35M21
3659B65l28K16j03n0J27k12J31L3P8k82r3J70lL1J54k43N2j55J52q9J56j64o8
3682b25K37j14k35K74J65N2q1L7k85K65p6O9j50J52j54K54l10J45j1j32K70k55
3704a08j0L07j75k72L49l16L22J76l08j13m0O6J06J06k79R5J79k56J41k51K76
3725eJ7J1L9J2k2M3Nk67J3R5L17j32l37K46k51K66OK19k23n3o8l8L65j76q0K88
$$ plain form
3568 71 76 -90 20 106 -55 70 -303 -87 -10 -323 60 11 -53 47 59 28 -61 -112 316 157 413 -58 -326 -152
3592 -152 14 -100 -8 7 -256 -36 -100 127 152 -25 278 45 146 278 129 72 137 75 -156 -62 -90 -75 116
3615 116 -103 -272 -100 151 -72 220 54 -52 -88 -66 419 22 -35 -192 -40 -147 -13 -50 138 -47 139
3636 139 178 -145 -253 101 387 -163 -151 72 20 36 -58 134 72 54 -213 -98 269 -84 -209 -274 -21 -156 265
3659 265 -63 153 50 0 127 -85 46 79 157 -125 -218 -48 -51 -20 134 -109 -57 -212 -60 -149 7 -157 -225
3682 -225 12 -102 -337 -63 102 154 73 110 -175 90 14 83 -67 85 -69 185 -125 20 9 -123 147 -108
3704 -108 -118 189 14 -258 91 -225 97 273 -35 -148 -188 -122 -16 90 -189 -94 85 -171 -30 -281 -5
3725 -5 12 23 62 74 52 95 100 -167 -154 -59 258 126 -211 35 -216 50 56 275 52 -1 -69 -107 258 82 2 290
3751B90k43m2P4K6J79l33L82l93J19j28K04q1q2j46J97N4P9J7p8j30m7l34M44
3774B8J72l94K10j70k16M83O8k72J02r2O7J7j2K84j68l20K82nL46n11j56J78L7
3797d2K57l66p1K00R7k90K8L87n5j69K32k90J87q6j18P2J12Q8j85K13k51K36k47
3820f1K56k02k2n8M2J04j92J19j08K46M5m6j69J08q8M19m59l1J18k04K45j20l56
3843d14N11n1p3n6J86p0j85M71m92j19J84q2L8L12o7k99Q9P5j04p1K88k9j63M40
3867C19l45j62K82j13j84L97j24j01l51N70Rj63j41q7M18o53K14K14J64k1o3j67
3889h8J15k57K14J05k55K16J81m12L02qk89J82jJ91k22j8oL32nl18K14n26L97
3912D4R2P4j25k58j05L82k47K6J80k16N3K80j95p1K69k95j20l1K15n2J96m5j19
$$ plain form
3751 290 47 5 79 105 284 -49 333 -60 59 -69 135 54 -28 -174 23 77 156 173 95 -35 -82 -416 28
3774 28 200 -194 16 -154 -370 113 181 -91 11 -81 -14 3 -9 275 107 -213 69 64 410 -101 -257 -79 -42
3797 -42 215 -151 -222 -22 75 -215 -187 200 145 -24 208 -82 105 19 -99 -27 85 173 -12 201 -50 186 -61
3820 -61 195 -7 -29 -87 -45 59 -133 -14 -122 124 169 123 -46 62 -26 393 -66 -97 21 -183 62 -58 -414
3843 -414 97 46 -27 -83 103 33 -152 319 -173 -292 -108 -190 -152 160 93 -206 -117 -42 -146 -217 71 42 -121 319
3867 319 -26 -188 94 -19 -203 194 70 -31 -382 188 197 34 -107 -194 224 -429 -215 -1 163 142 79 -88
3889 -88 27 -230 -16 89 -166 50 231 -181 121 113 -176 6 5 196 -26 -44 -50 282 277 -41 173 -353 44
3912 44 136 210 85 -173 -278 104 -143 -117 63 -153 -100 180 -15 -86 183 -112 -232 -263 -48 -100 96 51 -68
3935f8J43j36j0K32m55K17K12j91l58M72l21L05P6k11m7q6J32J67q0J83m6J67
3957B97oj15j44J91J81p18L21j42J80j61K59K2o04N68J9j57j03p8J98P8k06K25
3979A05k58j21J71KN2K16j45K4j8l88L63J95n46K80J9K5N8l2L74l25J65l64J89
4002D1J89l54K36j67P7l03N33k87J20k97l3L77l0j38J88k46J42l5J23M1O8k29
4024A6k04K88k72K13L47j44k98K7k65M72k30N0K55l89j12P4J13j17J28N9J29j34
4046Fo7J12k64K84j28j2J21j9p7Q4J59j36p6M16l83P4j2M4p6K53j73j19M8q7q0
4071a08l6R5j47M27l73k9j70L10M56n81L18j88r7L08k55L08k03k55L73l73K48
4092B8Rj36K15O2k57r7J48J03j0j39J10k9K28m26L40j34k62K04j13N6J64J10j52
$$ plain form
3935 -68 75 -61 -71 161 -294 -77 135 -56 -414 58 -263 42 118 -93 -140 -226 -94 73 -7 176 130 297
3957 297 291 176 32 223 404 -314 7 -135 45 -116 143 165 -439 129 148 -9 -112 -190 8 86 -120 105
3979 105 -153 -274 -103 -101 -49 167 22 46 28 -360 3 198 -348 -68 -49 -24 34 2 376 51 216 -148 41
4002 41 230 -124 112 -55 22 -281 252 -35 85 -212 -245 132 102 -36 152 -94 48 13 136 177 245 16
4024 16 -188 100 -172 41 388 244 -54 -27 -292 180 -50 0 255 -134 -246 -172 -59 -176 -48 11 140 6
4046 6 -61 51 -213 71 -57 -69 52 33 -44 40 199 63 -13 403 20 94 82 126 50 303 130 11 59 -28 -108
4071 -108 -144 -49 -196 231 -142 -171 -341 -31 425 -156 162 -26 -123 185 -70 238 35 -220 153 -220 28
4092 28 37 -99 116 178 -79 -176 -28 75 65 -74 36 7 235 -191 149 15 -247 -43 -156 -100 64 174 22
4115B2n3J9O6K0k26K34J79k00J06p9K46j66j23R3n45M81p6K35K5n63K32J38L25
4138C90l84k40O6j60L31m0q9J93J07j3j55j30p6L57j57K91j40k76O4K60L8j07
4160A30j96L00k40Q4j60p8N7R8j27J50oQ1j12Q8l4j44l85M92j33K97L9o8j62J18
4184H9k65J92r7l57L92j21L40j86K86l70J31j92L40j41k03J13R6j66mK1K3n9J41
4207CN7j71o5J22Q3k17J90J34K2j5L1j74L5k10K81k10J88M4r2k56N5L40j39j10
4231g4K79r2J55km11pK63l72J81K65k03K8n5J91k81L95nm14L1L54n05J85o7k12
4255c73M77l1k3l26J43M82m94l4M58j33j68L24l51J35o3k18jK65K41k64K15l54
4277i3L26l02nK4J47%k5j30j19L24j68j36L63n56J39L4K92k38k00M28j62K57k32
$$ plain form
4115 22 -31 -12 54 74 -152 82 261 61 167 88 334 168 45 138 -407 74 -2 233 258 -305 -73 65 390
4138 390 6 -234 -168 -328 3 -37 -126 67 174 161 6 -124 -200 157 0 291 151 -125 -61 199 237 130
4160 130 -66 234 -6 78 -82 -160 -103 -5 -132 18 12 93 -19 69 35 -109 -494 -2 -135 162 201 133 -29 89
4184 89 -176 16 -81 -438 -46 -167 173 -13 273 -97 34 -158 182 41 -162 -49 47 -119 -123 -102 -79 -138 3
4207 3 60 -111 -176 -54 29 -188 2 136 158 143 174 0 35 -175 106 -104 84 128 36 -220 -165 175 36 -74
4231 -74 205 113 268 266 -145 -152 111 -261 -80 185 -18 10 -45 146 -135 260 255 -159 -128 226 -279 -94 -161 -373
4255 -373 104 73 50 -276 -133 349 -145 -179 279 146 -22 302 -49 86 23 -195 -196 69 310 46 261 -93
4277 -93 233 -69 -74 -50 97 97 72 -58 -177 147 -21 -157 206 -350 -211 -177 115 -123 -323 105 -57 200 -32
4300c2j17K93k52J93k64K22K24l18j03K66l1q7k57J68J84j60r3L00o6k01j78L95
4322H6J00j73J40k77N1q1K29j89M9q1p2K85M7N5k00J15J5n1j3K30l11j40J45j08
4346a49K97j50L16k32p5J13k5J16k53n9J07j13K11j09O4l04L85k57O8J1K79k40
4368AK2J87j23j03k1m15L49N78j07k30K7k48j00J58K27k60J53l79J77J04j41K1
4390a23K41l49K74l07J92l9L8N9PN4p2j8J12O7k04O0l52L37j89N82l50O5j72j5
4414a02K61m22M18l98O6M54l09m4J21Q0q4N4l23K27j27L75k42j28j4L57k66PJ19
4437H0l0J18k45K62k19q4j2j15J3J54K17l83J00M2J71m5k29L17j15j96J29R7J15
4460A42k8j79L33j53k64O1M52m25K31oj89N4l00L66k41j57K95K1m7j79J88J62
$$ plain form
4300 -32 -149 144 -108 85 -179 43 267 -51 -154 112 81 -6 -263 -95 89 -71 -164 136 70 -131 -309 86
4322 86 186 13 153 -124 -73 -154 75 -114 -65 -146 -218 67 114 169 -31 84 99 48 35 265 -46 -186 -41 -149
4346 -149 148 -2 314 82 7 120 95 211 -42 -101 6 -107 104 -5 59 -245 140 -117 -49 -38 241 1
4368 1 23 210 87 -16 -37 -452 -103 475 368 138 165 -83 -183 -25 202 -58 95 -284 -107 -3 -144 -123
4390 -123 118 -231 43 -264 -72 -111 -73 -14 -7 47 -25 -43 69 136 -68 -8 -360 -23 -212 370 20 85 -87 -102
4414 -102 159 -263 155 -243 -177 277 -32 -76 45 125 41 95 -228 -1 -128 247 5 -123 -137 220 -46 -39 80
4437 80 50 168 -77 185 -34 -118 -130 -245 -232 -78 139 -244 -144 -102 69 24 -205 112 -3 -199 -70 27 142
4460 142 114 -65 268 115 -149 -88 364 -61 170 164 -25 29 -271 95 -146 -303 -8 13 -34 -213 -25 137
4482A37k72M28r6j06r7n7K48j24j57R8J03Lr3j31J61l03J88O9q4J43k47j64O79
4505C26j18l09K97j1r7l04J99L58j79n4k07n5J05k23J61J2P8j52P1N6j25J69j31
4528a33K39k31o6J72N8k0r4o0q9K41K68k60n0J60k5m0j97J06j43L59m32N5L85
4551B03k14k15K24J02j12j81L58k81K10Q6l35J32l08O04j03j25l73K29j62L54
4571I3p4k9J38k45J79j84j55K30n7l1R9O0O9J14p6N5p9j27J41j33K8m2K26j86
4595A4J20j07Rk25K29p1K75n30J97J75r8M0n21M07O4K33k83J58j87J86k79J10
4617h4L59l42J30n4r3K26k47K03J33j75P0J13l15K77l00K50m6L7j02j07K67m28
4639b28M44L3r5m87M68l14K04j67RO1N8jj78O0J30J35j64K38j36k21K46j00j08
$$ plain form
4482 137 -135 293 197 91 -6 -63 185 61 -96 2 105 108 15 -116 45 -258 -70 -1 -85 58 -189 -353 326
4505 326 208 -101 196 185 88 -216 -17 341 162 108 -99 -154 -49 -272 -111 -99 -21 -173 -102 -46 -171 -2 -133
4528 -133 106 -125 -191 -19 39 19 -75 -135 -224 17 285 25 -25 135 110 70 -127 -21 -164 195 -237 -182 203
4551 203 -11 -226 -2 100 -12 -193 165 -116 94 180 -155 -23 -331 273 170 45 -328 -99 -261 93
4571 93 19 -10 128 -117 62 -122 -277 -47 -104 -135 -36 24 93 207 131 186 107 -20 121 -12 16 -26 200 14
4595 14 134 27 36 -189 40 -31 244 -286 -89 86 -12 28 -493 -86 -22 211 -72 86 -101 85 -194 -84
4617 -84 275 -67 63 9 -84 142 -105 98 231 56 126 239 -76 201 -99 151 105 142 40 -67 200 -228
4639 -228 216 249 154 -333 135 -179 25 -142 -133 -72 -14 -15 -193 -133 -3 132 -32 206 70 -151 95 -5 -113
4662a13n4J48k19K94M3q4J47k08q8m3J46N2jj59j30L53J41n49M70k65K14k45K1
4685a29L17J07n64K11mq8M71n6j41j75l37L6J60J19M91n83K88r7k5r5J31k2J93
4708B08j82M1O9Rj53k32j8J24M33o5n5m44M87o1j78R4K17j1m91M32k75J54j33
4731c0Qk86N69j52j86l40M33q5QK82l44p1M42k36L0K3o4J86k32j26n5J39L31l41
4755i7J61m50L52Q2J53j16J59p9o5J26j94n0J6O8r2k36J50l7m3J26j15M7J49j20
4779a05K29q1l9Q4L9k81j36L59l00M35l67j36p5M3N99k31k4k86K88j69N8N24j69
4802B59l00J61j07j18Q6Q1j69J67l42M14J65m62J59j78J89J83k55J11k09L1l2
4823a66J7l0N22m13O3J8k61L85Q0j40k41K61J51o9j03K10l42O2j54K09j68J62
$$ plain form
4662 -113 -167 -19 -238 56 99 15 162 -46 -134 -177 -31 21 20 -139 -269 84 225 -324 146 -119 95 -150 -129
4685 -129 188 295 -269 -58 -62 -150 321 265 124 -51 -388 -352 -192 -73 418 -165 123 26 1 -94 37 15 208
4708 208 26 67 136 145 -8 -240 -258 -134 299 234 179 -265 222 161 -17 77 294 283 -208 224 -51 103 -30
4731 -30 -22 -308 261 109 -77 -417 16 -69 -61 221 -123 -194 248 12 42 65 1 187 -45 -171 -226 -87 244 -97
4755 -97 64 -386 -34 48 201 85 244 165 100 226 32 -18 -2 66 -26 -262 -112 -149 -192 -66 -181 -134 15 -105
4779 -105 124 43 4 88 127 -154 -290 69 -231 204 -163 -299 -374 -331 268 37 13 -273 15 -154 -96 428 259
4802 259 -41 120 13 -105 -19 62 -107 60 -282 132 297 -165 -6 -184 5 188 -67 44 -165 -134 -166
4823 -166 -149 -179 343 -70 -7 11 -250 135 215 75 -166 95 246 177 74 284 -58 4 -150 59 -109 53
4845E3LL7o9k57J55M34o84M08qj86L74o0m77M83L4m16J54J80j94L42k56K1q2O7
4869E6L50o00J69R2R2l04P7j93J07J29k18M87j26k18J28n0L2k20j07L11n2M00
4891C42l92q9L49k51J20OP6J24q7n10J92M02o9l36Q2p4J66k13J24r7L37l81L85
4914B06q5j45M30m76K2j71J28J12J25m05K98Jq5j8J6J42M2j48l4m8L24l0l50J0
4938a39K83j27J15j73L8n9R4j00K86k03J10K22q8j83j24l3OK29j72J59k06j18
4960a83K96m0K17k97k69L79l1k73N04m15P2J1k8qK57k61P7j18q0L2J57m0J67r5
4984C1P3k48M9K72k45K7j48L04j69k25J86J82R9l5l3j67L0m4j14J73K78j13l15
5007a52L30j32j02k85M32j05l7K42r6N5J19k10k08k9J05n7K26j08L89k94k57K83
$$ plain form
4845 53 56 93 24 -233 -78 356 -328 80 72 -114 260 200 -277 206 240 -176 -22 158 -36 306 50 71 -11 56
4869 56 406 -194 -25 67 159 -145 -68 -261 -154 -25 -243 244 118 -100 28 -22 10 -210 -317 -6 -58 342
4891 342 -50 -139 210 -41 79 85 161 285 198 -312 -120 282 213 -123 -41 -115 51 -162 -38 -135 202 -179 206
4914 206 121 -24 406 -70 -48 -219 -91 21 146 -259 39 40 -45 -63 -47 95 137 -11 -45 -93 231 201 -149 -139
4938 -139 144 17 132 -41 -3 -62 32 -68 218 15 125 347 259 76 -48 -81 -75 154 -18 141 -65 -183
4960 -183 113 73 290 -7 -276 103 72 -201 303 -112 -40 -29 -57 -65 192 -69 8 -110 -190 -158 -1 -41 126 31
4984 31 104 -144 -95 177 -68 -41 -189 115 -54 -279 -93 89 188 153 120 -47 -17 -61 -175 -2 276 163 -152
5007 -152 178 46 -56 -341 91 -14 -51 191 95 150 269 59 -149 -178 -73 -130 96 -12 377 83 -174 109
5029A09K6L1o7l7P8k10L4K41k80l6N7M9J12l49L15k28M37l50L2K9J2k30L33k58
5053a50j60M38qJ1N8k38L0J08J87k53j13J15q7J89J1k53K09j57J21k31N08j08
5075B27n78K97J48j11R7j78K06k70L74l12M5n3M4K18K8j70j00K17p4K28l70m1
5097a28q2K72o8L2K02j79j63N2K1pK21k80rQ6K64j95l6q4j45K0P8Q7K32k96K26
5122A21p9K6J22l61Q5k06L39J00K24l32k41M2K41j7j89m62O99M0J19j99j36J20
5144E6k78j49K26O7L8K52j06J75r5K03l30n7j52J51O6L9p3%m38m5K98K30J32j65
5168D5k88J18J76K4j28j42k4J67j26j24K87J54K21n82m8O6N43m54K12k43L92k48
5190bR2j41K93J5p0j29J26k18O1j46J74K40l17Q7l1k97K47J05j94K71l48m7N45
$$ plain form
5029 109 135 166 99 62 140 -70 -36 205 -75 -111 -54 -5 107 -242 73 -155 282 -68 -36 -7 5 -225 108 -150
5053 -150 -310 128 120 131 189 -49 -19 89 276 23 -90 25 -62 127 138 -115 94 -63 58 -173 335 227
5075 227 -351 -54 94 -17 80 -98 108 -162 212 -100 -55 -108 -64 154 182 12 -88 129 55 283 -87 -128
5097 -128 -210 62 -6 26 228 49 -114 -62 -41 -48 173 -107 -116 -30 234 39 3 -81 -226 -206 -128 -41 191 -105 121
5122 121 42 68 190 -171 -86 -292 47 147 371 39 -202 -160 81 64 -125 -587 112 152 271 72 -64 56
5144 56 -222 -371 -145 -78 -40 212 106 281 186 389 59 2 -150 1 67 106 33 33 -405 -450 -152 78 210 45
5168 45 -243 -125 51 75 -53 -195 -219 -52 -178 -302 -15 139 360 -222 -270 -204 339 -115 97 -146 246 -2
5190 -2 90 -51 242 257 187 58 184 -34 27 -119 55 295 -22 65 34 -263 -16 89 -105 166 -182 -229 316
5213C16n40P5Q8K79k68q0P4K59n09J90j21L98r5r0L24l91K02K29l17N6m20M01
5235F0O5k65L62m30K41P1j10k02P1R3n4J44M4j54r7L78l44k31K49j5J18P2j2j10
5259e6l8J25n9O0j26K36q4J6j16j51Q3K57k75N9J59j47J6R8k21M49j58m23M66
5282A70n37K53K46P0L5m17L16j72m7J40Mp7j90M0K48K6K9j35P3n9L86o35J86q8
5306a35l1J54J01n4j41M15l82J24M8j7l5m68M37J69k74k09K12J99l87M05j46o9
5328h4o3J50J24k02J83R6k85L96j12p8mj90l6J64J45l04j69L32k13K02q5j02K37
5351A02p7r1R8j54J34J33k67O0Q5r7J66O3j31L18l59n3k45J56J70J22k97k5P9
5374a10K4J60K95m67r6O1K03j91O0M9p1J00k36K22J60k00j05r8N60j79k17j04
$$ plain form
5213 316 -224 -149 -61 218 -50 -130 -56 203 -306 -116 -237 161 66 -24 300 -91 111 340 23 79 -341 60
5235 60 125 -140 222 -208 33 104 -6 -208 -137 -44 -98 46 90 -64 -161 217 -127 -358 -109 -124 -6 66 54 -56
5259 -56 -94 31 -28 32 -94 142 58 74 -42 -193 -110 147 -128 -69 90 -57 -41 57 -164 285 127 -296 170
5282 170 -367 -114 132 202 237 -180 136 -36 -83 57 61 -16 -206 -166 82 108 137 2 75 16 402 -233 -47 -135
5306 -135 -166 -12 89 35 -106 309 -73 51 99 82 47 -421 16 185 -89 -298 -86 113 -274 131 -15 -84
5328 -84 -147 3 127 -75 108 204 -81 315 203 125 121 -69 -105 59 204 -100 -269 63 -150 52 -33 -135 102
5351 102 25 -66 32 -122 12 145 -122 -62 23 -74 92 155 24 342 -17 -70 -315 -159 11 133 -164 -189 -110
5374 -110 -86 74 369 -98 -194 -133 70 -121 -61 -12 -83 17 -219 3 163 -37 -142 -240 320 141 -76 -180
5396a80M1K01m17M07j84J40j09K39k21Q7O3j33J00K31l98l3L93o4k29R1L11k08
5418A28l05K93k29n7L67k30J16l11L20j30k4K02k20j17J37K12l29L0K14k26J4
5439a45K91k29j9O5Q9j88J01j98L27J79l86R0lM6K66k79p9J89j49l06N50l82K81
5462A11l03j5J79j61M6mJ38J77j9k91J32j14J65j82O7K41Rk45L8R6j94j35J94
5485g0J40k12J14J05J49J6nm73j55O78m67K10j95L0K68j55NR2O5j99J17M6O4j99
5509c1J46j01l8J47k02K5J14l10L74J05K1p6k28j42J82j51O1m7L13k96J49p0n7
5532a12J95q0L28k76m8R0j80M0j52M35l05l42N61k66N1N3K26j48j9K53n42L72
5554A34k5q5n2L10k52j32J75Q8Mk72K98j33m2O4R7j48Q2J26k36K68K4l05M8j02
$$ plain form
5396 -180 -139 62 -355 52 -132 8 -101 138 -83 4 67 -66 34 265 -133 -166 227 163 -66 25 336 128
5418 128 -177 116 -113 -170 197 -33 83 -228 92 -38 -62 140 -80 -197 -60 152 -177 -147 67 -159 -145
5439 -145 146 -83 -102 -37 52 -136 -35 -233 94 273 -113 -23 -26 20 286 7 -72 117 -32 -338 212 -170 111
5462 111 -192 -207 -28 -189 -143 -147 -9 168 149 -142 -10 -124 41 -141 -74 167 176 -69 -31 65 -129 -264 -70
5485 -70 70 -142 -28 77 226 242 237 -236 -391 287 -180 30 -165 -135 133 -22 -17 75 140 -59 58 104 168 -31
5509 -31 115 14 -24 123 -79 -54 60 -250 124 229 250 174 -54 -196 -14 -165 -104 -151 162 -134 15 -55 -112
5532 -112 83 3 331 55 7 97 -83 -43 -195 240 -65 -407 154 -112 -61 -8 218 70 51 304 -238 134
5554 134 109 24 -28 282 30 -102 73 161 165 -107 191 58 16 80 177 29 111 237 1 269 293 -12 36 -66
5578f6J20m4j2NJ03j82L7k29M62k93J21r0K89j7l11J06M0MO1l0k43K35j48j38
5602b20K35K10k96J33l5k41K4K38R3k05j25J13J49k9j76m9nr9J16K48l28K91O7
5625A09j54L08k51j28K28j83O1j61Q8l5K1L76m46K86k7J93m35p4K07j5m26M32
5647b6K44l21L58k04p2j07q9K91J60R4n44R1J07j10K02j24l9N5j4J27j93j80L45
5670E1K6m3j05R1j05k31L12Q1j18K33L8n26J84M02l69P5L2J95j07M5m8r9P7J52
5694B43K3k37NR0L8o3q9J73K56k85q8j07J93j82M8j28M12k10j39rj59L86j66k27
5718b22K21L0j10L27l95P7M78n92K03RR5j56k41L47j06k41L00j36L45m5l33L43
5740A98j64L6o4J93l70L43m5j0K04j71k14K79m46K6R4Q2kK90l16J72j18Q8j19
$$ plain form
5578 -66 54 10 -2 3 106 -76 -39 -268 194 -99 22 -68 221 204 -107 -1 39 43 104 74 -169 66 -82 -220
5602 -220 15 225 -71 62 27 -214 -190 48 141 -64 -189 -76 73 44 -132 -181 -186 -285 -169 79 -249 42 109
5625 109 -45 263 12 -116 112 -71 -10 -171 -83 -118 -97 279 -167 119 92 285 -150 -224 -17 -32 -458 -26
5647 -26 218 -103 255 51 -21 -128 -217 74 234 328 -216 -125 -18 -128 74 -50 -89 -34 -48 79 -114 -294 51
5670 51 77 34 -71 20 -85 -316 -4 77 -41 192 230 -296 -112 290 -79 -4 28 223 116 161 113 14 91 243
5694 243 266 29 34 124 162 99 10 183 439 154 66 -41 152 -30 18 -110 302 92 -47 -56 -215 171 5 -222
5718 -222 -1 29 -81 246 -149 -72 406 -186 17 26 121 -35 -276 71 -35 -276 24 -112 233 188 -145 198
5740 198 34 70 6 199 -171 172 127 117 321 150 -64 215 -231 -205 -111 -29 -31 259 -57 115 -3 85 -34
5763c4j49J17J56J40l57n3L52r5k4k62L73k1l84K31J83l98M25Qm19K63k27K30
5785E5M79k66l69r6L0kJ02J44L8j44r6j01QK13J03qJ53k8k98Q9m24M55O3o4p4
5810c8jk79K34J43k48K62P7K88l27j52M0k9p6K76K3l37L6N7O1M6r5j62L17k1Q7
5835A82o9J38p0p1k11N0J45J43k59O8p7K00n35N69k68j22M01o3J01n28J95m5r6
5858b22L53j37J62k70j00Q6J89Q8O2m8q4j89K21r1j61N20m41P7N8K88m57M09j11
5881B02j06lp9J3K98l57Rq0l17N55l94L11Q9l44J14K45j34j6J08K43j72j81l7
5904c3j31R3n3K92M72o72J21m53M55J13j21Q7k40Nj33L71P1l80K54k55J05P8L7
5927H3j10J80m89N15k24OO7o4r7k65M85K06m83N7L16m5M1p4K82l12j29J03K59
$$ plain form
5763 -34 -183 -66 90 230 -127 -180 172 77 53 -209 164 143 -241 -10 173 -225 200 208 -211 52 -175 55
5785 55 534 268 -101 -197 -167 -169 -67 77 115 -29 -125 -226 -218 -5 98 90 243 215 -83 6 -418 37 100 36 -38
5810 -38 -39 -318 -84 59 -189 73 150 438 111 -41 -1 -30 -106 170 193 -144 -108 -51 10 56 -39 -201 116 95 182
5835 182 113 251 181 110 -101 -51 94 237 -22 46 -31 169 -366 203 -65 -187 214 151 252 -276 -81 -126 -222
5858 -222 131 -6 156 -114 -214 -128 61 149 211 163 79 -110 111 20 -141 379 -62 15 73 361 -96 313 202
5881 202 96 93 14 27 325 -32 -23 -103 -420 135 -259 52 141 -203 -89 156 22 6 114 357 185 4 -33
5904 -33 -164 -71 -124 168 640 -32 89 -364 91 204 83 170 -70 -65 -198 173 244 -136 118 -137 -32 46 83
5927 83 -27 153 -336 179 -45 -39 28 -36 -133 -398 87 293 -190 -133 183 138 179 105 387 75 -54 49 308
5950C08l33j7j78J48J76j69n7P0qL80m52j29J11J93k50J05o2q1J03N76m19O7Q6
5973A68l86J96Nj14J58m7K0j70L74k65j06P1L98k97k35L31q9J21k59j7M4N13l40
5996G4q0J1N9n50N25j09P4j29j8K71J73k0j95o3k18K63j59n7L12l94J49k0K23
6019A22K54n32O4L65P2o55K96n3j16j9J27oj18Q8Q5J75k8k21M51j21L9m2n2j43
6043C2O0j03r4J79l4j80R2L45m50K55j87J73j25R9O1k84J95k28L81l30Q0J65p9
6066B3K23j85k00Q1k50L82J98q4O6j76j65J55j62M50l18j96j0J83k26J78MJ54
6088A25l23K93R2J03m01K22r8pk26P5J61j78M08l40J03J81j31k47L10k23j30K57
6110B6M5K7j4j7k69K56M9n7L2R9j20L7j21J4l7O3k6J90p1k1j01%L3J9r0K9J76
$$ plain form
5950 308 -25 -42 -220 -72 104 -65 -122 -52 -60 320 -132 -261 -150 43 -207 -102 -164 -245 -142 434 15 82 168
5973 168 -218 -22 -17 -131 27 -20 0 -170 204 -61 -167 -96 302 5 -230 101 12 133 -126 -143 -99 414 74
5996 74 -6 5 64 -486 39 -70 4 -125 -143 128 301 281 86 23 -195 68 -91 -148 164 -230 -81 -101 122
6019 122 376 -156 -92 273 345 -310 -14 -67 -183 -202 -75 -81 -199 -111 -26 149 121 -100 351 230 269 227 175 32
6043 32 92 -11 -105 74 40 -140 -48 297 -153 102 -85 88 -37 62 123 -161 34 -194 187 -143 -63 102 23
6066 23 246 61 -139 -58 -308 74 272 188 254 78 -87 68 -94 356 38 -158 -168 15 -211 -33 -29 125
6088 125 -198 95 187 290 -111 111 13 6 -220 -145 16 -162 246 -94 9 190 59 -188 122 -101 -231 26
6110 26 71 98 84 67 -202 54 103 46 78 177 57 94 -27 -13 -50 13 -13 177 106 85 -16 -16 17 36 -54 -25 151
6137A51j77k04J51j34lL99l15J29R4n2nN1k52K87l57J04J87r1R7n5jM5K9p6L8
6162D0k61M1K06q3K43r5l17J80p4J82n6j03q0k4J80j0p1R9k50j5L02R0N0j37m9
6187a2j97K61l3J7j03j07K00N0l04j74M64l6R0J6l37J17R6J01l02pJ38O1LJ05
6211A07K29n03r0J22M34m68J62R6l34LJ78J14q1L88m00K5n9j44J22k58P94o97
6233b60O7K48J23J39j30k36K39J72m09l9J20J0L8p8q8K37m59J85J73R0j28J24
6255A38l33N26j12j56R2l58J34J37k06N9k8K10m46K49j12L32o7nj78j0K50p0k60
6278b14J56j10P0J3j8M55l40J42r8q8M2p7R2P0j51J36j13%j47K27mj14J54j97
6302a14J05K40l31j2J45L08l69K37k62K35j21j97K31k21p3p5M65k43J73k58J50
$$ plain form
6137 151 -26 -230 -79 -213 -216 183 -132 -3 91 39 34 85 -167 120 -237 -133 54 -37 60 5 4 49 78 2 40
6162 40 -221 -180 26 -57 186 91 -226 -46 -120 62 6 -97 -177 -201 -21 -31 -102 -3 -253 -268 34 124 174 37 -12
6187 -12 -209 52 19 36 -67 -174 26 76 -228 -402 62 26 116 132 -205 -88 8 109 -193 -200 -62 -1 2 107
6211 107 336 -167 -257 -135 299 -169 -7 89 -245 -242 -64 50 -31 357 -43 -18 -77 -221 -99 -357 437 -260
6233 -260 -193 55 178 317 187 -49 190 362 -47 -86 34 44 82 4 -84 153 -306 -121 52 142 14 138
6255 138 -195 331 219 63 155 -203 -69 68 -138 -79 -107 103 -343 -94 -206 126 59 54 -124 -134 116 46 -214
6278 -214 -58 -168 -98 -85 -103 352 12 154 56 -32 10 -67 25 95 -56 80 -33 -33 -180 47 43 -71 83 -114
6302 -114 -9 231 -100 -112 33 341 -28 209 -53 182 61 -136 95 -126 -199 -274 191 -52 121 -137 13
6323A3J89J56n91J64P6j1p9j54K83j32l47M42k24J88Q5J9j55j2J61j50J33M5L4
6346A33N3j52J31L0k91Q9K50l13J51J55j42j87O8J28k3j55L00l87J89j54J59o9
6368c7j32L42k39J66j00PL9l39L33o6o0j00J47J9O9j00j85L56k59M6RJ46q1Q5
6392F6pJ3l02J47J78K18k43j82l6LP5P9j44n7L33o0o0N5M6k8J7n30M81R4n2j71
6418f7L51j90l51L19K7k3p9R3m8P8M8n9Q1l60N5P5K43k68J06J19K21k25k12m7
6442a13L9J97j73K14L0j20l92M51k04K07j57l63J45L47r8j39K97l75L77n35J77
6463a88K18N3j60O0K4l93P85l72L68j16l25n0J02k61R2L11p6K2j27L1O1J18j85
6486hJ6r3J32l25M65k79nL34k68P6q5L58k85N4J35l49J74L0l03J44J74k03K24
$$ plain form
6323 13 202 358 -233 -69 7 -4 -83 -237 46 -86 -433 9 -215 -27 58 77 -78 -90 71 -79 54 99 133
6346 133 186 34 165 195 -96 -7 243 -70 81 236 94 -93 -25 103 80 -75 225 -162 27 -127 32 -37
6368 -37 -169 173 -66 100 0 7 46 -293 40 -26 -86 -186 -39 -20 49 -51 -236 120 -139 -93 -84 62 -19 66
6392 66 59 72 -230 -83 95 313 70 -112 -148 -145 -70 9 -135 -192 141 81 21 76 122 94 111 -419 62 156 104 -67
6418 -67 284 94 -257 62 89 66 -13 80 32 110 158 99 180 -180 -125 -50 193 -75 31 150 371 146 -66 -113
6442 -113 -74 123 -50 164 194 74 -318 133 -71 136 -21 -384 -239 108 10 -129 168 -207 170 -365 -188
6463 -188 30 83 -77 -17 7 -386 399 27 395 279 -46 -96 6 -255 -163 148 72 94 -33 -2 59 177 -8
6486 -8 8 -85 47 -278 187 -92 -97 237 -31 45 -40 318 33 87 222 -127 47 77 -226 -82 92 -111 113
6509A13j28l2k94K74p9L6J05j47L01O4k78R1j64M03j34k66J7J73K50n67M51l53
6531a64K64kmj54K27q1L5M4n40L53J60k19K29J47j48m61M09k52M5J01j20K27J1
6554A07j28j39J71l28L63K14m57J96m1%JR4Q0k94J70j46L29j28p5j64R7L12j59
6577G5k21L92q1o9%k1j96N9J25j02J68j29O1o0K11j71K64k21l5k20Q6n2M48l68
6601e7J94k14O7n7r9J24M0J49k9j39j23J45Q6M0m36L69J43j1k53O2N3j09j75J0
6625b20K67R6k5l16k3J18L50l79K38Mk19q1J61Q5l11J49P5P9K00j34n2J2q1q9
6649i6K5r2M90k1k90o0rm1M3N4K50k65j93J76j05o7O2L01rl28j26J82J5M49n37
6674a92J89J34n7J16k00j66j1r6K41N1j00J53j90Q3N9j0J72J08m3k34oO6k08L41
$$ plain form
6509 113 -15 -47 -341 -67 -146 -110 -5 -152 149 213 -65 26 -138 265 131 -135 -118 55 305 -262 189 -164
6531 -164 100 98 94 -60 167 86 121 165 -375 -22 138 -81 148 295 147 -314 95 -157 -112 -11 -131 96 107
6554 107 -21 -160 11 -317 46 260 -197 -1 -42 -42 -41 53 133 -161 9 -137 192 64 -11 -175 -78 234 75
6577 75 -146 246 165 96 96 75 -121 -62 63 -39 129 0 61 1 212 41 305 84 49 -171 -85 -137 311 -57
6601 -57 137 -77 -10 -67 -166 -42 -2 147 118 -21 -144 1 87 127 -309 60 203 192 -61 1 54 -55 -230 -220
6625 -220 47 143 118 -198 -221 -103 247 -132 106 110 -109 -190 -29 56 -255 -106 -31 48 248 114 62 74 -7 -96
6649 -96 -71 -163 327 306 16 -44 -53 -94 -51 3 253 -12 -205 -29 -134 -201 -139 162 153 -175 -301 -119 -104 345 -192
6674 -192 -3 131 74 190 -10 -176 -187 -283 -42 9 -91 62 -128 -45 14 4 176 284 241 7 1 67 -141 200
6698B00m07L30j51JM36m85J02K12l87l26Q32O5j40k64Qr9l9L51%r3K33km5m66
6722a34Q5K65m0l99L33k92m4K37k6l8N11l05j70J11j65k23K80J11k15J41M8K26
6744B97j57m4k9l41K76L22l31K09l56K01o3r2N5K24l12L37n78M66j01o3J4R9L14
6767C47m12J50j94L14k10j65L96k35j67K3L57M9N9k84r9P0k44J36J90L3J01m3
6789A72l40J42K92m91K21K04l75Q4j69L09P4J43n41J54L89l76J94j23P0j73J37
6810cN1K32Jm93L35j0l9k38LK83l40L03l6j18MJ48j58j81K99k34M44j60O0k98
6834a45N8K40J4n9j44Q7K5j08K7qJ46k27J82j8j51KL50k1l37j08L46P6m81N36
6858B82j13k47o7N6qJ41J61m68L28l90M5L02K9K69n07K26K5o9j39p2LK75L84p37
$$ plain form
6698 200 -207 123 -28 -27 409 -76 26 238 -149 -475 357 422 282 18 26 -73 -112 239 239 146 379 377 332 -134
6722 -134 -49 216 176 -223 110 -182 -226 11 -15 -53 458 153 -17 94 -71 -294 -14 97 -118 23 71 297
6744 297 140 96 67 -274 2 324 -7 202 -154 47 -16 -108 -53 171 -141 196 -382 84 -17 -80 -66 33 347
6767 347 -65 85 -109 205 -5 -170 226 -9 -176 -153 204 253 312 28 -71 -1 -245 -109 81 114 215 172
6789 172 -168 -26 266 -225 -4 200 -175 -91 -260 49 123 266 -275 -121 268 -108 86 -37 33 -140 -3
6810 -3 48 280 281 -212 123 113 74 -164 -161 122 -218 85 49 -69 -65 83 -75 -256 43 -191 253 93 153 -145
6834 -145 -87 153 167 108 -36 51 76 -32 -5 -13 133 -94 88 70 -81 -79 271 250 -87 -195 151 227 -254 282
6858 282 169 -78 -145 -89 -97 44 205 -263 65 -325 -280 22 51 320 -187 39 64 -5 -144 -216 -213 62 446 -291
6882b91M53j40k91K54j25J75j29J34k41K71p9j1O2J0k68L19o9k9J75l34L75j37
6904H4l5r8q3k6M05j32q9j11J56o7j61K94p4j73j13J20K8M19m32O2q5L27m14L87
6928A89j16k56L33p6k27J42j3k95L66j97J82j32l0J74j28L14m24L49l02m1l2L58
6950A38j76N0j69j12K85k78N72k34k51K07l2o6l0J87k82M3L06Q0l79R0q5L0N19
6973D13l54J18K9m39O9K31m1j15j06J61N5k10K15j1j31PJ06n2K59l49K64j17O5
6996F7k81J07o1K76R8j68k11M10k2p9o3l4q1j18J50J4J84r2o5k08K48j09j3K09
7020A58k24J02l01J22K22k2j6j03N5K64l73K37J33q8k15J0j71lQL12j27m6L73
7043C07o22N06k07n0K04K6m8j25J45j50l13L66p0K53n02J63j1L4K63Mj96n0M68
$$ plain form
6882 -291 162 22 -269 -15 -140 35 -94 40 -201 70 -9 -20 42 52 -216 103 34 5 180 -154 221 84
6904 84 49 -49 -132 -158 247 115 26 -85 71 4 -157 137 63 -110 -223 -103 -75 344 -88 -26 -111 216 -198 189
6928 189 73 -183 150 74 -153 -11 -24 -319 47 -150 32 -100 -130 44 -84 230 -194 155 -147 -188 -220 138
6950 138 -38 12 -157 -269 16 -262 310 76 -175 32 0 -66 -96 91 -191 -148 158 238 -141 -51 -136 -106 413
6973 413 59 177 206 -233 -164 67 26 -89 -195 -34 21 -189 26 15 -116 -109 -3 -55 204 -145 119 2 67
6996 67 -214 -107 -168 108 206 38 -173 237 215 136 73 39 -42 -160 -10 4 188 96 31 -177 71 -38 -51 158
7020 158 -66 36 -265 -143 79 57 41 -62 -7 257 -116 121 254 166 -49 -39 -210 -213 -205 107 -20 -66 307
7043 307 -315 191 -16 -66 138 164 116 -9 136 -14 -327 39 -31 222 -280 -117 -128 -94 169 173 -23 -73 395
7066C95j78j10j32l7M6M1n8J95K2o8J91l86%K54k41k26K59L2l39M14J2l9O3k08
7090i8k06L59p3J6R2J19l83N1K31j57K05k08j66J32J1K63k55K44Rk93J83m5J57
7113A88k99R3J61j56j42K93k32J30Q7k75jj2L02k38j5ROL67o2j20m47L23J54J3
7137A27k24J79k08P0J00j17Mn5J20QJ4J11j91k6K26j87K83l02L15l27k72J97J84
7160B9n8K13j23k72K04j20K36j35K9J44J9k69K15m40K80j71l3N55j62m1J17k51
7182c4R5k89J68j53J71K33k67L16O3k76j04J81q7J46j47J18l49K63J04k13k37
7203b98M00J9k37L7J31j51R5j42J19J27l39N63k66l08K79j9p5O7j6k9j11L60j12
7226I4j36l3J83k42K92p7n1o8n8K01J3R2M7n9l81L16N1k23R4j19J03%j36J86j66
$$ plain form
7066 395 217 107 -25 -62 -16 25 -33 162 184 116 307 -79 -79 175 -66 -292 -33 -1 -340 74 86 47 110 -98
7090 -98 -304 55 -18 -2 90 209 -174 -123 108 -49 156 -52 -218 -86 -75 188 -67 177 186 -107 76 31 188
7113 188 -111 -18 143 -13 -155 138 -94 36 123 -152 -153 -165 137 -101 -116 -107 -101 266 204 84 -363 -40 114 127
7137 127 -97 82 -126 -56 44 -73 -69 -124 -4 4 18 129 -62 -88 138 -49 234 -68 247 -80 -352 -155 29
7160 29 -29 184 61 -211 -7 -127 109 -26 3 147 166 -103 112 -328 -48 -219 -252 303 141 100 217 -34
7182 -34 61 -228 -60 -213 -42 191 -76 240 303 27 -77 104 17 163 16 134 -215 48 152 -61 -298
7203 -298 102 121 -116 -79 52 -99 -4 -146 -27 100 -239 324 58 -250 29 10 -65 2 -14 -43 -154 206 94
7226 94 -42 -75 108 -134 158 81 30 -38 -96 105 118 210 257 198 -183 133 184 -39 55 -64 39 39 -97 89 -77
7251g7L27m32K55m02L29J45j46n2l3J61k07J04J17k6k75K76j42J25M0k42K38j73
7273i0LL8P7J97n63M97j45L24m65r0L14k81K06k6qk02K28J89k21l8l19L70%K65
7297B60k46k23N3J42J50p3J38j82J45Pj92p8J01j00r1J79N5J02j83K90O1n89L65
7320I1l41L23r1JJ04O0k08m4K08j98p5k4J77R1r9j23K03m65J11L75J11l39j37
7343b89K75K98l29j33J0P3M8N8L8j82K48k61J64K5j29k43K11N07l15j75j33N87
7365C53l99k56L58MJ05k48j46j55L64m2P9J68m20K36R0k87L78j67J67q9j51J25
7387F7m15L04M3j4J19P6j54r6k50K21m7mO15m13J76k6o2k6k2n7j05J72j06r7k4
7412a25J49j49k04K72K37l86N20k96j30K2K39k56m9o6P6M4P4k2J27j58J45K07
$$ plain form
7251 -77 250 -182 73 -329 0 145 -1 -53 -86 75 -132 -28 89 63 -212 64 -78 47 87 -155 83 -90
7273 -90 -87 -49 28 225 -338 159 14 338 -127 -217 97 -184 22 -4 -12 -214 14 203 -18 -56 -375 -5 -5 260
7297 260 14 -209 -156 -14 136 63 201 19 164 171 -21 -99 2 -98 -189 -10 45 147 -36 254 315 -274 91
7320 91 -250 73 -18 -17 87 147 -61 -105 103 -95 -170 -194 -17 74 -25 -148 55 -410 -299 76 187 -152 -289
7343 -289 -14 284 -45 -178 -168 -95 -47 11 49 -133 115 -146 18 43 -86 -329 -118 389 74 -101 -234 353
7365 353 -46 -302 56 60 165 -83 -229 -384 -20 -62 17 185 -235 1 91 -196 182 15 182 93 -58 67
7387 67 -348 -44 -1 -15 104 180 26 -70 -320 -99 -146 -150 465 52 228 202 140 114 92 35 -70 102 -4 -101 -125
7412 -125 24 -125 -329 -57 180 -206 314 18 -112 -90 149 -107 -156 -222 -146 -102 -28 -50 77 -81 64 271
7434B71j32m61L94L0k91J97J02J50l14j13R5j3n0%L7L36j81j33L3p5j05m3M29
7457A63j66J21p8O6K38j03j88o3K96m20K77K64n92K09k05K24j06J02j43K59l1
7478A24k39Q9R8N4J58j02l9L9k30n7l4J64K23k52k4r1k21M78l09L72R8Q3k86k
7502I4j5k78M36L6m13p8L84pk61M96l97Pq7K53q1k82K39k97J95p3J42J05j67q1
7526a30J63qj96J95J99k99k36M96j28q9j21k73L75K06Q5k11m15L69M04n62J91
7547A5j89K72k27J05j02P9j43j74L33K74k35l55L31K29k43R0l81O38k99M49m88
7568b1l23K91K73j85k68M11O2r8l01M8K08J66j43l23J29P4j8J27j45%O9J09k99
7591a57R8n1k01K51k9J68k55o0M23n99M93j82m7J97J10l68L54k34mk24M77Q9j45
$$ plain form
7434 271 139 -322 72 102 -189 8 110 260 -54 -167 -72 -85 -135 -135 -98 238 57 -76 -43 -118 -223 -266 163
7457 163 -3 118 40 106 344 241 53 -10 286 -134 143 407 -185 24 -181 43 -63 39 -104 155 124
7478 124 -115 -26 72 126 284 182 143 182 -48 -105 -139 25 248 -4 -28 -119 -340 138 -171 201 299 382 96 94
7502 94 79 -199 237 273 -140 -218 166 159 -102 394 -3 4 -83 170 89 -193 46 -251 -56 -129 13 118 -49 -130
7526 -130 33 25 -171 24 223 -76 -312 184 56 -33 -154 -427 -52 154 239 28 -387 -18 386 -176 15
7547 15 -174 98 -129 -24 -126 -47 -190 -364 -31 243 8 -347 -16 213 -30 60 -321 317 18 467 -21
7568 -21 -344 -53 220 35 -233 178 240 142 -159 -111 97 263 120 -203 -74 0 -18 109 -36 -36 33 142 -157
7591 -157 -59 -110 -311 -60 -89 79 -176 -236 187 -412 81 -101 -148 49 159 -209 145 -89 -93 -317 160 249 104
7614A04m1P3m2L2O4kk77K04K16m14o6J08J89k76J46j98M1L36m69K46l5J49K33
7637C21l57m56K78J39K86j80K5K6J2m38M95Lj70o0J03l90N40l2j05j43J49k32
7659a86K74j97Q5J14j67pJ16j92Q8k4J62Q0k38l3J87J51l73P3j48K31k12P5L33
7682A92J3r1Q2j97k9j21l8K84K15r4k29O4L37m14J55J39k99L22m10pK3K54k70
7705a19lj25K99j00O5Q8m9L28k41k31J88J87J32m48J8J64k45NN6K39j23j17N8
7728B6N8q6KK2k0k09M24m70J78K81k34J91J41k70J59o5j96k16L54J92k80R7r2
7751a3M18k93r3m56N48l62k9K73n4J90p9m47L87n7K73j34P7O5l65K75k17N53k44
7774B16J79l73J46J61k33j62Jj93L18K37m12QL39k94J84j59K49j86l01J93J31
$$ plain form
7614 104 63 136 94 126 190 188 -89 115 331 -83 -149 -41 148 -128 18 -180 -139 197 -272 -26 -61 88 321
7637 321 -36 -492 -214 -75 211 31 56 82 94 -344 151 154 -16 -76 27 -363 177 145 40 -103 46 -186
7659 -186 88 -109 -24 90 -77 -84 32 -160 -72 -96 66 146 -92 -125 62 213 -160 -87 -235 -4 -216 -141 192
7682 192 205 114 196 -1 -30 -151 -189 95 310 216 -13 51 388 -26 129 268 -31 291 -119 -126 -103 151 -119
7705 -119 -122 -247 52 -48 17 105 56 384 143 -88 100 287 419 -29 -11 153 -92 -87 -31 208 85 -32 26
7728 26 84 -2 0 22 2 -207 217 -253 -75 206 -28 163 304 34 193 128 -68 -284 70 262 -18 79 -13
7751 -13 405 112 19 -437 111 -251 -280 -7 -61 129 50 -397 -10 -67 206 72 149 214 -151 124 -93 460 216
7774 216 395 22 168 329 96 -66 -65 -258 60 297 -115 -107 232 -62 122 -37 212 26 -275 -82 49
7795D9j08m6K4j44Q0J00p1J84j61n4l1n7nl7K26j29J14p2K64j00K27k60o1L0j33
7820a71K13k75K43j95k5j4M49k81J67j38j52R8L28j30l7m2k30j71N76j39j97J77
7842E4R4j86O1r3j96O4J51K70o5j16j92J01J06o1K9m18L66M9j38L72K3k27J87
7865B35k59M38l45k26L77m50K90M4k27J62j63L04l5j03P7j55j16M51m21J08J69
7886A55m20K56J90n33M33r3k29N60l85P6P0L37l66j34j1rL4n1O3J94r2j81L30
7909A94k09k87K39m7K31k45j64J90J45J9L23m99l8N74n46J42M2l9J75k24P1j19
7931g2K76k27k47J77k30L12k09J65K3J37P1l37j01L02R0j48j30M81m27L42n3l27
7953a32L16j09j24K39L4M9n10N52l75J65j24J94j44J33m6m37L06j10N25n52K39
$$ plain form
7795 49 -59 -105 -81 -225 -145 -45 -116 68 -93 -147 -178 -235 -240 -277 -51 -180 -66 -138 126 26 253 -7 -68 -38 -171
7820 -171 42 -233 10 -185 -210 -224 225 -56 111 -27 -179 -81 247 117 80 38 -192 -363 213 74 -123 54
7842 54 148 -38 23 -70 -266 -202 -51 219 154 38 -154 -53 53 -8 21 -397 -31 18 -120 252 275 48 235
7865 235 -24 414 69 -157 220 -230 60 104 -123 39 -124 180 145 42 119 -36 -152 299 -122 -14 155
7886 155 -265 -9 181 -352 81 -12 -241 319 -66 10 80 417 51 -83 -94 -103 -69 -120 -57 137 45 -136 194
7909 194 -15 -302 -63 -110 121 -124 -288 -98 47 66 389 -110 -148 426 -120 22 64 25 200 -24 47 -72
7931 -72 204 -23 -270 -93 -323 -11 -220 -55 -32 105 176 -161 -262 40 130 -18 -148 333 -94 248 195 -132
7953 -132 184 75 -49 190 224 273 -237 315 -60 105 -19 175 31 164 118 -319 -13 -123 402 -150 89
7974H9o5j14J79k54J39R1j19k17J00L79j41j4j69M4K81l82K29K08n22N17n17K43
7996a5k8j12J95L0m8j0j55M83o31J98K72k70Q6J25k65J83j83J39m31N61R6l94
8018a74M15ok47J4j0Q1j13rK30p4k20N3J71r6j92J92J43k17L2L32j19l20L60m37
8042b11J51R7J9k13K16l67K36K23o5r2k8K38j52J39l86J73J84k14R1K81m6q8k18
8065c2o3p4j59K61L4J00j94L99l97M2jK35j3k53K61l82J57J15L7j16L43k39o9
8088hJ2K05j86P9k17m4J31K35k94P3R4M9j05j89J39k69M00K00m61M6J25j27J02
8111a0R7p7L9q9J11J31l63Q0J94l9j94OJo5K97O5m68L33O0k49%K99j10Jj8m7M0
8138B5j06l89K37M54j02k93K51j53m9J55j29m3j83M52j04l2J29l08J70K2P5k9
$$ plain form
7974 89 24 -90 89 -165 -26 65 -54 -271 -171 208 67 53 -116 -72 209 -173 56 264 -258 259 -258 -15
7996 -15 -43 -155 40 70 22 12 -143 340 -291 -93 179 -91 -5 120 -145 38 -145 -6 -437 124 220 -174
8018 -174 241 235 -12 2 -8 73 -40 -49 181 107 -113 -60 111 15 -177 15 158 -59 -27 305 186 -134 226 -211
8042 -211 -60 37 56 -157 59 -308 -72 151 86 -6 -34 204 52 191 -195 -22 162 -52 39 320 274 186 -32
8065 -32 -95 -169 -328 -67 -33 67 -127 272 -125 -83 -84 151 138 -115 146 -236 -79 36 73 -43 300 61 -8
8088 -8 4 209 23 102 -115 -159 -28 207 -87 -14 80 129 24 -165 -26 -295 105 305 -156 -110 15 -112 -10
8111 -10 87 10 49 -40 71 202 -161 -81 113 74 -120 -114 -113 -178 119 184 -284 49 109 -140 -140 159 49 50 32 -15 25
8138 25 -81 -470 -233 221 119 -174 77 -76 -125 30 -99 -142 -325 127 23 -9 120 -188 -18 4 79 50
8160E0n9k3ol41L23m2M5L24O7l95o2P2L88l93P3j94n0K75l44J16J61J96M3k50
8184b6n8J81l8p4K13k77r7
$$ plain form
8160 50 -9 -32 -38 -379 -56 -98 -53 271 338 -57 -119 -47 341 -52 21 -173 -223 52 -292 -176 -15 181 224 -26
8184 -26 -84 97 59 -15 198 -79 -176
8191a76
$$ Imaginary data points
##PAGE= N=2
##DATA TABLE= (X++(I..I)), XYDATA
0@%%%%%%qJ6j6J6k3L1l7M5n2O0p2Q8j04J25j49J72j98K28k63L01l42L90m45N01
30B64n62O33p09P93q88R88j098J222j355J500j663J842k038K257k501K775l082
47a622L432l836M304m853N513o325P346q676J0493j3133J7343k5132M4284j75301
61a46163l03639L02625L04933K5411j66482q4826n5194j0321R8112J49848l2700
72H1604j55076k6707J35335L0957j10178l2266J08356L3837q4155k7176N6893
83A1424l1432r3738M3920J59765K2928j52823j10165M6774Q6923M5348K0171l3857
95A5238j19422p0271J10391J56017k6050j47922l3414R4320L5986n4223j4237
106e3587M0130l56k8258K1413K9525m2167m6408M9934P4621k2624p3448m946L9023
$$ plain form
0 0 0 0 0 0 0 0 -8 8 -8 8 -15 16 -21 24 -28 32 -40 48 -56 69 -80 92 -106 122 -141 160 -182 208 -237 264
30 264 -298 335 -374 419 -469 519 -579 643 -712 788 -875 967 -1071 1186 -1315 1460 -1622
47 -1622 1810 -2026 2278 -2575 2938 -3387 3959 -4717 5776 -7357 9986 -15146 29138 -146163
61 -146163 -449802 -147177 157756 183167 16685 -68141 -123335 -133656 -35544 114304 81604
72 81604 -73472 -100179 35156 66113 -44065 -76331 32025 65862 -18293 -45469 11424
83 11424 -20008 -113746 -69826 89939 112867 -39956 -150121 -103347 -16424 28924 49095 15238
95 15238 -104184 -174455 -64064 91953 65903 -82019 -115433 -21113 14873 -39350 -53587
106 -53587 -13457 -13813 -42071 -20658 8867 -33300 -79708 -29774 44847 22223 -51225 -56171 -17148
119a7148p893j5864M6958L7409n8886p2207L0848P4875K419m1116j619J2983k3421
132c2662j5903L8298L2434k7082k7607K5957J8953l6455k2168M7041M0726l3504
144H028m2525J6658K6899j1836q921K7856J2006l2978k1429K3476J7296j8472
156c942o890K6947P149l5932k0910K5707K3190j0813p176R007j2385l1265O803
169c0510M5497J5164l5942k7470J3470J8047k907p54R045n196j6921M626K0894
182G043k776k0733M708K7418K261k5270q595J5121O777n216P692J2114j3140k5745
196a8341J389K8400J5126j1347j4830p012n156N868K1009J0814k1799k3997Q535
209a1341K3994j194j7981k008J3806L105r860n296J261J384L738R209O78j4517
$$ plain form
119 -17148 -25041 -40905 6053 43462 -15424 -87631 -56783 18092 20511 -20605 -22224 -9241 -32662
132 -32662 -48565 -10267 22167 -4915 -32522 -6565 12388 -24067 -46235 806 41532 8028
144 8028 -34497 -17839 9060 -2776 -11697 16159 28165 -4813 -26242 -2766 14530 -3942
156 -3942 -10832 16115 23264 -12668 -33578 -7871 15319 4506 -2670 6337 -6048 -37313 -30510
169 -30510 14987 30151 -5791 -33261 -19791 -1744 -4651 -5405 3640 -1556 -18477 -13851 7043
182 7043 4267 -16466 -11758 15660 17921 -7349 -15944 -823 5954 738 8430 20544 7404 -18341
196 -18341 -16952 11448 26574 15227 397 -6615 -11771 -5903 15106 25920 4121 -19876 -11341
209 -11341 12653 11459 -6522 -8530 5276 8381 -1479 -6775 -5514 -4130 -392 8817 9495 -5022
223e022j0877R798J2874r32n005L033k12j2663n189J5477J6328n113j7269p165
237a1937O535Q285M733K79o185p941R77R324J974q443k663R085M506r057q059
252h587M964P560K23l203J47k20l459j395L052L542J589L6k388o599m358P752
268a344J2200n7j2643p856N034Q734J561k750l146j682Q0J857J367j313j712J386
284b84K892k135l947o3K706J453p80Q40O87l544m715J388O966L896l080o436l428
301g584J916P065M191j782p117l773L469O063Q40l558j783P27J148K51k90l46
317e63k1R12J413l14k001j969P40K759K013p33k227k521q54K833L447J477l429
334I62m252p9K942K651L69j875k008m38R33J365M20q74j91m3K68O8q49J02N60
$$ plain form
223 -5022 -15899 -6101 6773 5841 836 3869 3657 -9006 -14195 1282 17610 12497 -4772 -11937
237 -11937 -5402 2883 7616 7895 1710 -6231 -5254 4070 6044 -2399 -5062 4023 8529 -528 -8587
252 -8587 -3623 3937 4160 957 1104 884 -2575 -3970 -918 2624 4213 4249 1861 -4738 -9096 -1344
268 -1344 10856 10799 -1844 -9700 -4666 4068 5629 2879 -267 -1949 -1869 -12 1355 42 -1670 -284
284 -284 2608 473 -3474 -3537 -831 622 -158 682 1369 -2175 -6890 -5502 1464 5360 2280 -4156 -7584
301 -7584 -5668 1397 5588 3806 -3311 -7084 -3615 2448 3288 -270 -2053 -1326 -178 73 -217 -563
317 -563 -584 328 1741 1427 -574 -2543 -1803 956 2969 2236 9 -2512 -3366 -533 2914 4391 962
334 962 -3290 -3369 -427 2224 2593 718 -1290 -1728 -795 570 990 116 -75 -118 150 218 -631 -529 31
353C1O36L52m47r78r68L38J921J200q02j735j271M87J608J029N5q83j314l46M13
372f74R17O66J06l28j083m20M42R48O30p03n94j46J66M14j71m28N75M63n9n37
392A84p82R1J034Q43o47r87n87K86M57Q21k07O5l79r50k5Q34M28L55n90j129K00
413f85J021O38j28r96n31M34Q10k00n89k94R92K53k45n58l55J02O06L64l86q35
433e82j10L95L70K39j90L7l88l42K28N76J67m21j66j45J20L28j19J24p3k65L68
454A51J32l87M8R1K56j39k90j36O8J96L0K76j40r4l36K31l5k57N20l05K3j84J45
477a36M6M1J25J55m01K71j57J36r2K39j71J5Qr0K6J20k36k98M24%J03k65M41l93
501h9L4m7j93L07PK23l37Q3j89K92j52J30N6k73K69O5k00P9op8N3q8j42O3Q2l6
$$ plain form
353 31 667 1019 572 -406 -1374 -1036 885 2085 1283 -452 -1723 -1236 372 1401 1456 573 -741 -1087 -674
372 -674 243 909 1015 687 -396 -816 -374 574 1204 501 -93 -239 -73 341 170 -258 317 780 721 184
392 184 -598 -507 527 1370 723 -264 -851 -565 -108 713 506 571 192 -758 -783 51 479 834 244 -885 -685
413 -685 336 974 846 -150 -681 -247 563 363 -226 -520 472 725 480 -78 -433 -331 275 639 253 -582
433 -582 -692 -297 73 312 122 159 -229 -571 -343 233 400 -21 -187 -332 -212 116 -3 121 48 -217 151
454 151 283 -104 -56 35 291 152 -138 -274 -206 -10 20 296 156 62 -274 -43 -78 -335 185 -120 -97 -281 -136
477 -136 -90 -49 76 231 -170 101 -56 80 -12 227 56 71 79 -11 15 135 -101 -399 25 25 128 -137 304 -89
501 -89 -55 -102 -295 12 19 242 -95 -12 -201 91 -61 69 125 -148 121 186 -14 65 59 -19 34 -54 -196 -133 -51 -87
527h7N28m34j18J12J68J09l12l60L32J39j18o8J44J05L4l83J08M28l5k34j47j28
549b17L26l61L62k63K30j05k80J82j05L45n39K16K86J21J59k41n27N73mN53n92
570A19j35j94K17M47l56k11k15M39j23L95j72o46K00K88J05j66K12J2l1q6l37
591b38M50p29K80O3L79p7j7p8P3j00q7J59J70l28j38l0M39N8k16l6J03k41J93
614E2j1j05R7p8Q9L03n30j64O25j95o0j75Q7k23K89k94K93K09j07m01N4J29l8
637a54M67K15l96k94qK25L69l73O3j80K82l11K93R1J24l07l24l42P66l52L51j8
659A87O5m15J60L3R4m03r9P26Q4m62p8m4M36l15K40Q0k49l16j7O32Q9j89k31j19
683a11M27m89J12J72o8k71RL78L45o90q8N39M4m10q0N51o79K94L14K52k46l64
$$ plain form
527 -87 441 7 -111 1 169 278 -34 -394 -62 77 -41 -109 35 140 174 -209 -101 327 292 58 -89 -217
549 -217 109 -252 110 -153 77 -28 -308 -126 -231 114 -425 -209 77 198 357 116 -411 162 158 711 119
570 119 -16 -210 7 454 98 -113 -328 111 -12 383 211 -435 -235 53 158 -8 204 216 185 99 -238
591 -238 212 -517 -237 -174 205 128 111 33 106 6 -81 78 248 -80 -218 -248 191 249 33 -3 100 -141 52
614 52 41 -64 33 -45 44 347 -183 -347 278 83 23 -152 -65 -288 1 -293 0 209 102 -299 -245 -116 -154
637 -154 313 528 132 -162 -170 55 424 51 114 -66 216 -95 198 289 413 106 -218 -560 206 -146 205 187
659 187 252 -163 -3 30 124 -279 -378 348 432 -30 -108 -152 284 -31 209 289 40 -276 -293 339 428 239 8 -111
683 -111 316 -173 -61 111 43 -228 -219 159 504 -186 -274 265 309 -101 -181 370 -309 -15 299 551 305 -59
705e9j86O29j9l75l09L52r0k82N16N98q17k0j40L52j61o8K56L8k77o7K78k75k68
728c94K43M5L99l18m26M18K55j99P4q4l89k20N11L67M5k97n9RM39q46J85L15K66
751C39l86o1p6%Q6P1J03J54m34R1K07K2j14n3L56k1j92m54M74l01K91Pm7O9k74
776a43l66O45K48m15l07L5j23Q4L26L04n00J06j67R6M27l66K49j88qk18L81k00
798a00m4k14K66M26k07m90O4J72K02q7J7O6m17m4M90N7L3l68L58l31L51k31J95
821A64j00M7j90L47l40P8K07m11M95o71K23r1L35l64P10n04N4q3k20N05j62K60
843B89k42j45j9O8O1L28k64o0k11O9L49j19J21k22J11l54K05k68R7J71L4K63j65
866I7k45J13l69N75J9k31j13k72K70K61K75N0k33l05K36J94n44J33qJ18K1j50
$$ plain form
705 -59 -245 384 365 -10 -319 33 -57 -339 177 775 -42 -62 -202 150 -11 -79 177 215 -62 -129 149 -126 -394
728 -394 -151 -106 293 -25 -451 -33 222 23 97 13 -376 -596 -85 282 327 30 -29 -20 419 -427 -242 73 339
751 339 -47 -108 -184 -184 -98 -27 76 230 -204 -113 94 116 2 -51 305 284 92 -362 112 -189 102 109 62 131 -143
776 -143 -509 136 384 -31 -338 -303 -426 -342 -16 288 -212 -106 -273 -177 250 -116 133 -55 -63 -281 100 -100
798 -100 -144 -358 -92 334 127 -363 -299 -127 75 -12 5 71 -346 -390 100 157 190 -178 180 -151 200 -31 164
821 164 64 111 -79 268 -72 6 213 -198 297 -374 -151 -242 93 -271 439 -65 -11 -94 -314 191 29 289
843 289 47 -98 -117 -49 12 340 76 16 -195 -126 223 104 225 3 114 -240 -35 -303 -206 -35 -1 262 97
866 97 -148 -35 -404 171 190 -41 -154 -426 -156 105 380 430 197 -108 128 322 -222 -89 -97 21 42 -108
888a08n3K94J04j55k5j58J74j21k3n6J47K49k51j08J49j27M17j24k21K3O8p9k37
911b21N76k65P7Q2n83L14L12j78k84l3P5J14k4M62o8m31J37j11K2j1J20J07m7
934A42k15j14M14k96J48O8o2j67J31L5k23J04k45L93l5J7n29K25M38m26K82o2
956B3L8k13j03J24J50j07q7M79k40Lj23o5J06m7P8O4m07J67L56m2k85R7L6K1r3
981g0N30l91j80o5Q3L17r4k85K80k35r9J25Q3O8J70k31j36K27J57m2l48J15L32
1004C11k02k72R8K0J88m52L19n7l1j0n2J05j21J12m1K23j97J51k94J6N19k06j15
1027A2j33J38o7J34l10K17Q1j0J74k83J65Kk74l8J86J05j52K23m59O37m65J2J62
1050E7j48J32k7J7r9q9M6J24L07m91j13mK82O0K85l0m23P8M1ll38l9K79j7Ll9
$$ plain form
888 -108 -161 133 237 82 57 -101 73 -48 -71 -127 20 269 18 -90 59 -68 349 225 4 27 95 16 -221
911 -221 355 90 167 249 -334 -20 292 114 -170 -203 -128 -14 -38 424 356 -75 62 -49 -27 -38 82 189 142
934 142 -73 -187 227 -69 79 147 85 -82 49 84 -139 -35 -280 113 78 95 -434 -209 229 -197 85 23
956 23 61 -152 -255 -131 19 -88 -175 304 64 67 -56 -121 -15 -62 16 80 -327 -160 196 154 -131 -34 2 23 -70
981 -70 460 69 -111 -176 -93 224 130 -155 125 -110 -209 -84 -1 67 237 6 -130 97 254 212 -136 -21 311
1004 311 109 -163 -65 -45 143 -309 10 -47 -78 -88 -140 -35 -156 -44 -85 138 -59 92 -202 -186 333 127 12
1027 12 -121 17 -50 84 -226 -9 72 62 236 -47 118 120 -154 -192 -6 99 -53 170 -289 348 -117 -105 57
1050 57 -91 41 14 31 -68 -157 -111 13 320 -171 -284 -288 -6 54 339 309 -114 -36 5 2 -336 -375 -96 -113 -110 -149
1076a49K56J53n14L58k58K55j28q6J99M8L9J45k66Q4J47k65k34J07K67j99K0k32
1098b53K41K38j35J19k41J3R9j21j81K18j76M03k20k20J17J15O9j65K73J1l40
1119a36R6j48O04l75k35j00O19r6l08L7K66p1j53o9R1n4j08L8k7L8m7J22n5J49
1143G8P7m57Q9p3K68j80j98O49qm09p2L13m6N9l50L11j81J79J21j95j83OK53q4
1167c3L5J13n8k4J52j82l0mJ38j25k15N86n03J10J42j29l55O51n64K70pm3K51
1190A76N4j35po0J5J4Q9j20J93j78l06K63K06J42l76J99m13QK61j8j87n0N10K53
1214E33n83k03K89k34L52L4j79p6l6J91n07N20l6o6q4j39NJ19K95j34q7m08L94
1237d0j07oJ44j67K03j65KJ58j30j6J7J03L20j14m70J15OJ85l49N57k18j16J11
$$ plain form
1076 -149 107 260 -254 104 -154 101 -27 -113 86 134 173 318 52 136 283 18 -216 -109 158 -41 -21 -253
1098 -253 -12 226 91 210 -31 -18 81 -40 -221 -3 -179 224 4 -216 -99 16 85 -80 193 204 -136
1119 -136 -40 -188 416 41 -194 -294 325 229 -79 -42 224 153 0 -69 22 -32 -140 -102 -129 -91 -138 -16 -71 78
1143 78 155 -302 -213 -286 -18 -198 -396 253 245 -164 -236 77 31 90 -260 51 -130 49 170 -25 -208 -202 51 -33
1167 -33 2 115 57 33 185 3 -27 -31 107 -18 -233 353 -150 -40 102 -27 -382 269 -295 -25 -32 -75 176
1190 176 230 95 88 28 43 57 146 26 219 41 -265 -2 204 346 -30 169 -244 -236 25 7 -180 -230 280 533
1214 533 -50 -253 36 -198 154 188 9 -67 -103 88 -419 101 65 -1 -85 -224 -219 -100 195 61 -26 -434 -40
1237 -40 -147 -153 -9 -176 27 -138 -136 22 -108 -124 -107 -4 316 202 -268 -153 -147 38 -311 246 28 -88 23
1260B3j37J45L3r4J58j36l0K52l81K56K0j93N3K6j62k07M74J30Kk06k6J81k92
1283a11J43j54M8P2J14k3k75m6J78M3l05K54K0j80P6L17n0J67j92k3l9k17M04
1306B21l69K97k14J06n6j10K95k30P8K50l22K10j22n9K57j66j24R8q8J92l5l2
1328G7jJ8k32j25M10k63Q8J53l03K03J97l37K21k37M41N9m14L1r1L06q3k06J49
1351F1o2n7J67K2K5N6m59K63j96K29l5l4K03m11K23k30P5M97m30J55j06l4K41
1374A63j93K02j34o4j56K71q3O4n4J56k73Nl3J78Q4r5j1J12J45k24J25r6r9o5
1398g5K31j47R9j91k9r1J18j42N1L29k82K31p0N9K1o5p5l64K31K33J51r7q1J12
1422A57j65l6P1K48l96J05o8J29Q3k75N3P9k3q1J47r1J70K16l87L3J91j74K74
$$ plain form
1260 23 -114 31 64 -30 128 -8 -38 214 -167 89 109 -84 -31 -5 -167 -374 100 230 232 26 0 181 -111
1283 -111 32 -122 -74 -2 112 89 -186 -232 -54 -11 -316 -62 -42 -222 -146 171 121 288 96 73 34 -183 221
1306 221 -148 149 -65 41 -15 -125 170 -60 18 268 -54 156 34 -25 232 66 -58 40 -48 144 109 77
1328 77 76 94 -138 -263 147 -116 -28 125 -178 25 222 -115 106 -131 310 369 -45 -14 -105 201 118 -88 61
1351 61 -1 -58 109 131 156 212 -247 16 -180 49 14 -20 183 -228 -5 -235 -160 337 -93 62 -44 -78 163
1374 163 -30 172 38 -26 -182 89 6 70 16 172 -101 -96 -129 49 133 38 27 139 284 60 185 89 -10 -75
1398 -75 156 9 108 -83 -112 -203 -85 -227 -176 153 -129 102 32 91 112 47 -28 -392 -161 72 223 126 45 157
1422 157 -8 -44 27 275 -121 -16 -84 45 128 -147 -94 -15 -38 -119 28 -63 107 323 -64 -31 160 -14 260
1445B60l20L5J33j26r8R3K1k6l17M32J15q5j02M7j3j52O8M5j93P3K96o2K6l28
1469a78K33K86n41N1j42R6M06j90k46K78l41L28kL27n09k2Q2JL53l11K2J36k54
1492a37K33j33j04N7r3J99n7J30N7j78J41j23j34k62N90j15l71K01j97N88m36
1513a44K25k55K21J65l87M71k93k23J83j44K86K1rj4m61J45L5L55m9j17j34L88
1535B65j25j17j52M5l3N0J22j53K9K9L02k88m2K5K10P8l84N6K64k84K33J2j30
1558A2M5Q2o2j16K6Lj72Q8L04k51l21L04J36j09k13M53j11M6j17j51L74K9k59
1581B0R7p0l38J49L72j92K0J14j44K38l96J74k50L38J40l36r8L97k07p8J31q7
1603fJ06L27m42J94k12L43l34K90m77O7J20o2J19K35n41K35o8J29j55M0K22j33
$$ plain form
1445 260 -60 -25 108 -18 -116 -23 -2 -28 -345 87 202 117 15 62 49 -103 -35 10 -183 -110 186 124 150 -178
1469 -178 55 341 -200 -149 -291 -195 211 21 -225 53 -288 40 38 365 -144 -166 -84 -83 270 -41 -19 117 -137
1492 -137 96 -37 -141 -84 -177 22 -35 95 152 -26 115 -8 -142 -404 186 71 -300 -99 -296 292 -144
1513 -144 81 -174 47 212 -175 296 3 -220 -37 -181 105 126 117 103 -358 -213 -178 177 128 11 -123 265
1535 265 140 23 -129 -84 -117 -67 55 -98 -69 -40 262 -26 -68 -43 167 245 -139 -83 181 -103 130 142 12
1558 12 57 139 77 -39 -13 -10 -182 -94 210 -41 -362 -58 78 -31 -244 209 98 144 27 -124 250 279 20
1581 20 117 47 -291 -142 230 38 58 172 28 266 -130 44 -206 132 272 -64 -162 235 28 -50 81 -6
1603 -6 100 427 -15 179 -33 310 -24 266 -211 -144 -24 -86 33 268 -273 -38 -106 23 -132 -92 130 -3
1625ck34L94k55P6M7J05j64k33k3J92K81l51K98P3j80NR7j84J46l7M4lJ11j24
1649G8N7l34J43P4k67N9p2L29j24l15K50J79j76j6M05l75K43j18N8l33N3J90j89
1672b01J3L13K3r2P7m45K35K52j57j88K39k2p0n1R1n3J75J77j93k4k72j16L48
1695E9J49m78K55J50l39J64K50k42j4J54m4J03K0k51J11j38K44j8m79L91l50K77
1717b6l1K6k87M84k78J97r6O7J2k40J08l5K06l40R1J68j13Lj43M14k84n7J06K50
1741B02m38L75J3o5j62mr9J0J82K9p7J69j92J18o2J07j13M02l81q6j90K23j32
1764a71K88J61o68N66l74M7N37m69r0K55j20J27J80m76J82k12K47r0oK32k46J86
1786H6M8J00l59K07l22P3L30k00k5J39p1ko3R7j39M70m97j58J71J66J20q0j45
$$ plain form
1625 -3 -237 157 -98 -22 25 130 -34 -267 -290 -98 183 -168 130 203 23 28 125 -59 87 50 94 91 202 78
1649 78 135 -199 -56 18 -249 -190 -262 67 -57 -372 -122 57 -119 -135 270 -105 138 20 78 -255 -202 -12 -201
1672 -201 -188 125 148 56 133 -312 -77 175 18 -170 69 47 -23 -74 17 -36 139 316 123 99 -173 -289 59
1695 59 208 -270 -15 135 -204 -40 210 -32 -46 108 64 167 187 -64 47 -91 153 135 -344 47 -303 -26
1717 -26 -57 -31 -318 166 -112 85 -11 56 68 -172 -64 -99 107 -233 -142 26 -87 -84 -227 187 -97 -154 -48 202
1741 202 -236 139 152 87 -75 -79 -178 -168 14 43 -34 135 -57 61 -1 106 -7 395 14 -72 -262 -39 -171
1764 -171 117 278 -390 176 -198 -151 386 -83 -173 82 -38 89 269 -207 -25 -237 10 -80 -86 146 -100 86
1786 86 134 234 -125 82 -240 -167 163 -37 -62 77 6 4 -59 38 -101 369 -128 -286 -115 51 171 91 -54
1809e4o5J15P5P6r8Q0k44j15q8L14l55O19j85l42M45j00j80j08J46j0J32j00o1
1832a03J74JO3k06M9J64m12K87J44k24j81L60J77m50M47m35L9n6J55O3M5r2k97
1855b88J39N56k21k99o3M1K34qm46J25J9L90k93J7K19k02P4J63l37M20k3j61P2
1878A28j96J79r3j32Q6M9L9J22q9L00l36j62Q6K14k97M6Q5KJ58j67P2j80q8J32
1902d2J64kj29Q9O1p6j1k10j53M62K57m23k2m7J70r7L47m46JJ17k10J79K23k97
1926i5J52Q6k36J67j28L53l30o1J74k81pL8L12K0j71n2J78o4p1j45R6l12N29j50
1950BM7J6L7o5j13Q5j1k44K10J75j15J18K0k42q1M08l73J38P2k57J73q3q1J58
1974fr9L06j44K1j80M5j13K09r2j66L12K38k41O8k35Q7L48k37Jq2k98K33j6J81
$$ plain form
1809 -54 -119 -4 71 147 49 129 -115 -230 -318 -4 -359 260 75 -267 178 78 -102 -210 -64 -74 58 -42 -103
1832 -103 71 72 135 -71 -22 142 -270 17 161 -63 -244 116 293 -157 290 -145 -106 -162 -7 56 101 9 -288
1855 -288 -149 407 186 -113 -176 -135 99 91 -355 -230 -211 179 -114 -97 122 -80 -6 157 -180 240 217 56 128
1878 128 -68 111 18 -114 -28 21 60 182 93 393 57 -105 -19 195 -102 -56 29 31 189 22 94 -86 -174 -42
1902 -42 122 120 -9 80 141 65 54 -156 -309 153 410 -13 -35 -82 88 -9 338 -108 -107 10 -200 -21 202 -95
1926 -95 57 143 -93 74 -54 299 -31 -92 82 -199 -206 -168 144 164 -7 -59 119 55 -16 -161 -65 -377 152 2
1950 2 49 65 102 37 -76 9 -2 -246 -36 139 24 142 162 -80 -161 247 -126 12 84 -173 0 -83 -164 -6
1974 -6 -105 201 57 78 -102 -57 -170 39 -53 -219 93 331 90 158 -77 10 358 121 122 40 -258 -25 -41 140
1998A40j93o0P2J50J1n4Q3p1J06j33O1J25O4m01L10k73k6l7J90L6j37O9j41J4
2022i5J53k54J60p2j04J73K7Q5k24K13j8m2l86M40K11l40J08o5K30k90J53m64
2044d01P10l16M5J57J83n06Q7J01j30J16p0J34l76K69K73k66o7oj51K99j8k23
2066a56OJ62j02K24l7j98R5N8o9K54j67J47j1l0j12L12n60k40M05r0M07n02J44
2089f0n7R8J05k09Q3Q5NJ07O3k06k86J55r4L72q4j96J49J41Ok36L5n4J70j06K3
2114IJ14j94O9P2j5K25l94NM57l54Q7L9o9K4O5N7%l50j23L81j99Q9R6k40o0L26
2140A17R3l32N13k51k31N1J64j86j5K64J42k18k25J60j45q5L02k26J03q8P5P2
2162E4k97K92J12q4j24J72o9J64k17k19J76J78l61M45j91K08k50J11k01R6n9L05
$$ plain form
1998 140 -53 -113 -41 109 120 66 149 78 184 51 112 237 301 -100 210 -63 -89 -126 64 100 -37 32 -109 -95
2022 -95 58 -196 -36 -108 -212 -39 -12 73 -151 62 44 2 -384 56 267 -73 35 -30 200 -90 63 -401
2044 -401 309 -7 38 195 378 -128 -41 60 -70 46 -24 110 -266 3 276 10 -57 -63 -214 85 67 -156
2066 -156 -150 12 -90 134 97 -101 -6 52 -17 237 70 217 206 176 64 376 -184 -424 -19 -109 298 -204 -60
2089 -60 -117 -19 86 -123 -40 45 50 157 220 14 -272 -117 -211 161 77 -119 30 171 177 -59 -24 -78 92 -14 9
2114 9 123 -71 -2 70 55 280 -114 -109 348 -6 81 120 51 75 140 197 197 -153 -276 105 -94 -5 91 -149 -209 117
2140 117 210 -122 391 140 -91 -40 124 -62 -77 187 329 111 -114 46 -99 -184 118 -108 -5 -93 -18 54
2162 54 -243 49 161 77 -47 125 56 220 3 -216 -40 138 -223 222 31 239 -11 100 -101 -5 -64 241
2184B41m6l73J29J11p1J21J1k33k1L91m83K64j51J37K47m08M1l1J12J18K1k6m7
2207E4k38K85j95l3J60l9l4L0l5J17O9j99L01L2o01L69k48L68j36p2J09ON1k47
2231a26K39M8l35J62J40l12K22O7k36L61k98P8J39j6l35L09r5q0K2Q3J04k92J86
2254C5L40j82j77k06L28Q6k3n22K00kk53L41j36K00j77n4K79m57J34M53k49K56
2276B14j75k10R4K65k39n9L06k86L21m72J19O6J61jq9j25J05j67N6K5L76k89J09
2299A05j49j89K84M9j96j26J14P8n4L53k72r5l03M38j79k1P6k3j5L09l21K0l6
2322a53K02o16M98N03o33L0K52J32k11K89k60j91K01J20k80L6J94j60J48J00p
2343A94j93K40j14k97Ol2J70L9k3j05J80k88K68j36L06Q3l24k2J02K90l95k28
$$ plain form
2184 241 195 -178 -49 62 -9 112 123 -110 -131 260 -223 41 -110 27 274 -134 -93 -124 -12 106 127 101 54
2207 54 -184 101 -94 -127 33 -6 -40 -10 -45 72 141 -58 243 275 -326 43 -205 163 27 -45 64 70 121 -126
2231 -126 113 161 -174 -12 128 -184 38 105 -131 230 -68 10 149 133 -202 107 12 -68 -46 37 141 -151 35
2254 35 375 193 16 -190 138 224 201 -321 -121 -123 -376 -35 -171 29 -148 -202 77 -380 -246 207 -42 214
2276 214 39 -171 -77 188 -51 -110 196 -90 231 -241 -122 -56 105 104 15 -110 -5 -172 -116 -91 285 -4 105
2299 105 -44 -233 51 100 -96 -222 -108 -30 -84 269 -3 -98 -401 37 -142 -163 -87 -110 -125 184 -137 -117 -153
2322 -153 49 -567 -69 434 -199 -169 83 215 4 293 33 -158 43 163 -117 -81 113 -47 101 201 194
2343 194 1 241 127 -170 -164 -196 -26 13 -10 -115 65 -223 45 -91 215 298 -26 -48 54 344 -51 -279
2365b79L34k30L06j34J61l90J89J19l33M36o6J93m05Q2Q7k19Q1J11j70J87nK14
2387B69l52N8k4k32J04L35j86J78j39n5K27Q4k54Q6m15M52k68J44J11q9L52l71
2409A5K6k51J10O7j47L1j94J16K72o9K57k56JJ8l53K37J28J00M6K3j94L3j94R1
2433h7j9K63l45j65L73r1N9O3J34J2n41L19J21j49J26r6K30l43J50J33k83K55
2455A19J07l29J33l67J56K32p2O0J21j68K18J01j39n63O99k0n15J70Q6Ll0k70
2477b68L34OO5j79P5J20Kj24M8k28J58J07j44J19r4J04k71J69l0N6J27K9n0P1
2501B02m20JK70m21K23N1J48l4k34K75l00K37N9j43o7J65J56l05O7k1PM58j41
2524B33k69J89k1J4k40Qj23J80P3J56k75J29l14L48p6r3J60o5R1k22NJ12J57j41
$$ plain form
2365 -279 55 -175 131 -3 158 -232 -43 76 -257 179 113 306 -99 -17 70 -149 -68 43 -127 60 55 269
2387 269 -83 -25 -49 -281 -177 158 -28 150 11 -44 183 267 13 99 -316 136 -132 12 123 34 386 15
2409 15 41 -210 -100 -33 -180 -149 -343 -227 45 -24 233 -23 -22 -4 -357 -120 8 108 154 177 -17 16 -178 -87
2433 -87 -106 157 -188 -353 20 -71 -12 51 185 197 -344 -25 96 -53 73 -23 207 -136 14 147 -136 119
2455 119 226 -103 30 -337 -181 51 -21 39 160 -8 210 311 172 -391 308 288 -227 -57 29 32 2 -268
2477 -268 66 72 137 -42 33 153 155 31 79 -149 9 116 -28 91 -3 101 -170 -1 -31 25 152 181 131 202
2501 202 -218 -217 53 -368 -145 -94 54 20 -214 61 -239 -2 57 -86 -153 12 168 -137 -70 -91 -84 374 233
2524 233 -36 153 132 146 -94 -86 -209 -29 44 200 -75 54 -260 88 12 -81 79 14 105 -117 -112 0 157 16
2548A6j02Nn6L29n72N19m71L15L59l10k49M48k75J27p6Q9J50l21k66M76rm5j90
2571a09n2K23Q9o2q7k52L3K14j48NL33l38K02q4l5J66j52J17J48k79J27QJ24J9
2595B10k55j22J08q2K13o6m11L52q0J01J08k8k24K35j09J72j97mJ63j80K90j45
2617D9R7j32J27N6k24R0j97K70n6l4j68K79P5k25j08J5K73j54K04k04J92j42l87
2640c04O20l04J15l50O3N7J01j36J8k04L46N0K77l03k63K49J70J31j26j83J77
2661B01N9m67L20p0P9j75Q0j46L54Mq3m40J78n0K80j79N0M33k96k26j53K79q8
2684e6P8J16l0j29J33o6P9k84MN8j94K29M35l65K02l90O5N7R3k34J57P8J25q8
2708G3m8K17N5k02j2J80j63K89o72K53J10k4Q8j2l10K24j13Lk9j77J11J7J85K66
$$ plain form
2548 16 -86 -81 -137 192 -380 139 -332 -17 342 32 -217 231 -44 83 7 96 246 -75 -341 135 126 81 -109
2571 -109 -161 62 151 89 2 -250 -217 -3 -151 -146 187 -151 51 -33 -68 98 -54 63 211 -68 59 67 191 210
2595 210 -45 -167 -59 -141 72 6 -405 -53 -133 -32 76 48 -176 59 -50 122 -75 -79 84 -96 194 49
2617 49 146 14 141 197 -27 63 -134 136 80 46 -122 157 232 7 -101 -86 187 33 237 33 225 83 -304
2640 -304 316 12 127 -223 -160 -103 -2 -138 -120 -324 22 72 349 46 -217 32 202 333 207 24 201
2661 201 260 -207 113 43 122 -53 27 -119 235 239 156 -284 -106 -156 124 -55 -5 428 132 -94 -247 32 -56
2684 -56 22 138 108 -21 112 46 125 -159 -155 -97 -291 -62 373 8 210 -180 -115 -58 35 -199 -42 36 161 73
2708 73 25 242 297 95 83 263 100 389 -283 -30 80 56 144 132 -178 46 -67 -64 -93 -270 -159 -142 43 309
2732C09n27M37K4l15p9R2K71m8k9k24p9K04j66L01m04L99m48K05kK40k76K1L75
2755B81l76K87l87O8J95j60K77k43J22j39K80q8j38j29J65M0P3J7k06l41L31q8
2777a59j04J54Q8L50m91L72k24J69k08J84k8n7Oj25OJ07mK64n40J7L14J14q3j68
2801d6K36l35q0L32k18L6L08r5M3l7j77k17K96j23m3M32n16j39L83J33j37j88
2823a52J39j82L44m32L37j00J00k6j30J10n6L54p1j07J0k56M45k94ql42L13j33
2845a37Q6L32k85k42L9K26j15L35j27K23k79m46J39K01L50n02O7L0J07L8M9l54
2867b65K28R7j55j1k51K85K42lj36M5L0j2l33L81j00J3l32K25J89m49L95J18j35
2890F6k92L17j12n4l8K14j87K57K0j71J32l27K78m92N34L4k94J55m9k59J34M50
$$ plain form
2732 309 -218 219 243 -72 -151 -59 212 164 135 -89 -168 36 -130 171 -233 166 -282 -77 -79 161 -115 -94 281
2755 281 -95 192 -195 -127 68 -92 185 -58 64 -75 205 117 -21 -150 15 55 128 145 -61 -402 -71 -159
2777 -159 -263 -109 -21 329 -162 210 -14 155 -53 131 103 46 52 -73 -67 40 36 300 -240 -223 91 205 122 -46
2801 -46 190 -145 -225 107 -111 -75 233 138 181 144 -33 -250 46 -77 -120 312 -204 -343 40 173 36 -152
2823 -152 -13 -195 149 -283 54 -46 54 28 -102 8 -48 306 235 128 138 -118 327 33 25 -317 -4 -137
2845 -137 -51 281 -4 -246 -207 19 -96 239 112 335 56 -390 -251 -50 300 -202 -135 -105 2 40 89 -265
2867 -265 -37 60 -95 -106 -357 -72 170 167 31 76 106 94 -239 142 42 55 -277 -52 137 -312 83 201 66
2890 66 -226 91 -21 -75 -113 101 -86 171 191 20 152 -175 103 -389 145 179 -115 40 -9 -268 -134 316
2912C16k25j88J65L4p7K62k70J33k2l20K63p7j83L08l90K09k22M91l13L6nj78
2934b53J69J82K04m92N3J07Q4k67L27k77L23j2k86L90j75k26J26n2q2O4k10L83
2956H0k2j46K39q0l14N67O4l96N5J89k99L14j46k65K35j12K54l92K55J49k16J18
2978A31j68j88J99J34m12M09j58K17l1J0k38R8K28k39K87k36K26k32n7J09p5K01
3000B15k94K40k13r6N05m57L33m21J30J57j85N4o7J66N5j18M61k20j87J67q67
3021f42O84j8n1L3k1m6J72Nj11o1M1j02L22l81J32j93QJ90l72M80j40Nj6lj08
3046a93qk12J87K02L1Q0k03J00j15L20K33m59m12K65J46J22j5k70L24k23J23N9
3068H2j35O1J71r6K74k99j26J5J59n23M04lK94n17K78j02Q7lj80J61K56k68P7
$$ plain form
2912 316 91 -97 68 102 25 287 17 150 128 -192 71 -6 -189 119 -271 -62 -284 207 -106 -70 -75 -253
2934 -253 -84 98 302 -190 -137 -30 54 -213 114 -163 160 148 -138 252 77 -149 -23 -75 -157 -93 -303 80
2956 80 58 -88 151 71 -243 324 388 -8 47 236 -63 251 105 -160 75 -37 217 -175 80 229 13 131
2978 131 -37 -225 -26 108 -304 105 -53 164 133 143 -95 3 231 -8 279 43 269 37 -20 89 14 215
3000 215 -79 161 -52 -148 357 -100 233 -188 -58 99 -86 -32 -99 67 122 4 465 245 58 225 -642
3021 -642 42 24 -27 6 -15 -61 111 116 5 -56 -15 -117 205 -176 -44 -237 -229 -39 -411 69 -71 -66 -82 -85 -193
3046 -193 -201 -413 -226 -24 7 87 -116 -16 -131 189 422 -37 -449 -184 -38 84 69 -201 123 -100 23 82
3068 82 -53 8 179 83 357 58 -68 -53 106 -417 -13 -16 278 -239 39 -63 24 21 -159 2 258 -10 67
3091F7l4L7Q0K5l69O0j2M4J40n7K2J02j08L1Qj23l9J89N9j55L0M2O5p6k10L81
3117A99k66o2J37J92j49n8k7K33j59J03k01Q5L3p7j01K24o3k4L5k06L58J1j58
3140E9k99J7J18P5P6M5l89J85Q9K35m59Q8L41l82K9J63Pp3q1L37m28K31j08K41
3164A17k28J93l82L66k2m6R7j22n8L02k74j69L04j14K5k90J79K9P9m04M81j3j3
3187C7K14l35L02Mk36J43m60P6J20J64L11m03K74k25m7J68k22J75J24k2P8j44
3209I6n9P9j35k2p4K11k48L77j65j24j1qK04L8k47kj39K69o5J80Q5j23o23P12
3233B06n5l50l4J21K88J24k41J21j73j14n7j3PK26J6n3j00m0k0q5n1J97J99m30
3257c11L95Ml3r1n1J17n1L34m29KJ62J71k44P3k05J46r4O8M7j69J53j1p1k06L98
$$ plain form
3091 67 33 70 150 175 -194 -134 -146 -102 38 -19 3 105 -3 28 36 -87 -126 63 122 -33 -3 39 104 28 -182 199
3117 199 -67 -129 8 200 51 -7 -34 199 40 143 -58 27 60 -17 -118 106 43 19 54 -152 206 217 59
3140 59 -240 -223 -105 -30 46 91 -298 -113 -24 211 -248 -160 181 -201 -172 -9 -2 -75 -156 181 -247 -16 -124 117
3164 117 -111 82 -300 66 44 -2 95 -27 -85 217 -57 -226 78 -36 -11 -301 -122 -93 -14 -418 63 50 37
3187 37 251 -84 218 222 -14 129 -331 -255 -135 29 340 -63 211 -14 -61 107 -115 60 184 162 240 96
3209 96 37 116 -19 -41 -115 96 -152 225 60 -64 -75 -83 121 159 -88 -90 -229 40 -25 155 240 117 -506 206
3233 206 151 -199 -233 -112 176 300 59 180 7 -107 -164 -177 -170 56 72 19 -81 -121 -141 -226 -277 -80 119 -311
3257 -311 84 88 55 -36 -87 30 -21 313 -116 -114 48 219 -25 48 -157 -11 -105 -37 10 -159 -6 -17 -88 -294 104
3282A04o3k5k1Q8j64J77o7M45o57L60k13l52M90M6j00l25K55J56l48K05k78M3
3304b44K26O3R6j44j19P4J14j96j9NJ25jj61L82j35k5m8k33L65k82K72l22L59
3327A52L9m30J86R6K39l07m37K80l9M68j92K1L05l06p6J10M3j76r3K48j00j95
3349a64M26k37j23o1J48k6l8L0J4K28j24l28L2M22R3q9n98J03N80l67J42k89L06
3372H0k35J87j20J16n3K12m08Q7L67j21j22L06n19M50k87K65l35K5R4j0Q8J65
3394B32m13Q9j7L74m27l17N92k19j64J68J49j35J00K50j62k96K38j57P8K66j05
3415A24K7k36m0J21Q2j53P4J60n9j49q2K7J58K9n1k9k4K7R4k7j13o8qO6j35L98
3441B13m62K00j21R3m9M24k50j15p6J30J23j60K0K47l72P5L21l38J82j95J18k06
$$ plain form
3282 104 41 16 -5 83 -81 96 29 474 -183 177 -36 -388 102 148 48 -277 -22 134 -214 -9 -287 -244
3304 -244 -18 45 141 -3 -122 -48 66 -130 -149 -144 -19 -20 -181 201 66 41 -7 -240 125 -157 115 -207 152
3327 152 191 -239 -53 43 282 -25 -462 -182 -221 247 55 76 381 75 -1 109 152 -24 -117 131 31 -164
3349 -164 262 25 -98 -159 -11 -37 -75 -45 -31 197 73 -255 -223 199 292 203 -395 -292 288 -79 63 -226 80
3372 80 -155 32 -88 28 -25 187 -221 -134 233 112 -10 296 -223 227 -60 205 -130 -105 -11 -21 67 232
3394 232 -181 -92 -109 265 -162 -479 113 -106 -270 -102 47 -88 12 262 100 -196 42 -115 -37 229 124
3415 124 151 -85 -125 -4 78 -75 -1 159 100 -49 -131 -104 54 83 32 3 -21 6 100 73 -40 -108 -116 -50 -185 213
3441 213 -249 -49 -170 -77 -126 298 48 -67 -143 -13 110 -50 -30 217 -155 -80 241 -97 85 -110 8 -198
3463a98J96q2J66pJ44j3O9m92J50J06j07M8K27l35k40L86J76j26k26n7K18O2k5
3486D0j19J45J17N0m43L32K9l33M02k36J61n0k89K43k22N04l10QO4k7m16K47L26
3509B23j32Q2k2J21r5j16J89j69j96J57K18j33m32J80j02p1J8J08K50J18j83L69
3531C82l08q6j34M08l34J50j08p6l56K30L09k32J13R4j64o1L91l38J67lJ52k96
3553a00J18J29j26j8M2m01N34j83k33J8m8m7M28J7p8n4J9k3RK31m32L18l08qK82
3578H6Lj5p4j75j39N41j28Kj59J41K61l07k7j01K18k06j57L53j09J21k10K92k93
3601h2J01P7n0j03r9P5rJ59j36mK15k20L20n00R3l6M9L94q2L4l89j00L26K86m2
3626B77m94K70m4j59J39J52k06J39j86o3n6K11k65K65p9K67l35L28J13j22o45
$$ plain form
3463 -198 -2 -84 82 75 219 206 275 -217 -67 39 -68 -20 207 -128 -368 18 194 68 -158 -215 3 65 40
3486 40 -79 66 183 233 -210 122 151 -182 220 -16 145 95 -194 49 -173 331 21 29 93 66 -350 -103 223
3509 223 91 173 151 272 177 61 250 81 -115 42 260 127 -305 -125 -227 -298 -280 -172 78 196 13 382
3531 382 74 -12 -146 262 -72 78 -30 -106 -462 -232 77 -155 -42 52 -112 -173 218 -120 47 44 196 -100
3553 -100 18 147 21 3 45 -356 178 -5 -238 -220 -268 -315 113 130 52 -2 17 -6 3 234 -198 120 -188 -196 86
3578 86 89 74 0 -175 -314 227 99 101 -58 83 344 37 10 -91 127 -79 -236 117 8 129 -81 211 -82
3601 -82 19 96 46 -57 -156 -81 -90 69 -67 -71 144 -76 244 -256 -163 -199 -150 244 162 196 -193 -293 33 319 277
3626 277 -217 53 9 -150 -11 141 -65 74 -112 -175 -231 -20 -285 -20 -99 168 -167 161 274 152 -493
3647d93M73r0K69J28k54Oj19P1J17J80k63L53l12k02m1K22m9j06NR0r7r8L51K09
3671C50m01j40N51m03l7M4K27j14m25M30N9j84k56K00J4J45j19p5K57j0l5p7j05
3694a04J88P4r4m7qk52L91k44L35l05OM11l54N0j41k41L41O3L9N8j49K25k83Q
3718c3P2l64J46O3Q4q0J07M50n92J6J30m52K77K85l12L77PJ49k83L6P8j35j77
3741a51n5L21j56J06j01L63j90k18J41l72M92l40K72Q4j55j82M30l32J02L94m78
3762b5J31P5l15J46J56j74r8J6K11q1k24J4J40m7k7Q6J09j54R4J17k83J75j86
3785a44J76j41K3K46l86M46l35%J86N2l4kl40K91j63K97%k90J60L7j42j82k7K29
3809d3J64J26k11J22n16O2L71j62J51j83K14j98m4K43l66L81j57o6K82k08K12
$$ plain form
3647 -493 -20 -110 159 287 33 39 -80 -9 108 288 25 378 66 -136 -177 45 -4 -110 -105 -15 -112 -210 141 350
3671 350 -51 -191 360 -43 -80 -36 191 77 -348 82 141 -43 -299 -99 -85 60 -59 -134 123 113 78 1 -104
3694 -104 84 158 64 17 9 -243 148 -96 239 -66 -60 351 -3 47 -94 -335 6 69 108 166 17 242 -41 -33
3718 -33 39 -325 -179 -116 -32 -112 -5 445 -147 -131 -1 -453 -176 109 -203 174 181 330 47 83 161 26 -151
3741 -151 -206 115 -41 65 -36 327 137 -81 60 -312 180 -160 112 196 41 -141 289 -43 59 453 -25
3762 -25 106 181 -134 12 168 -6 -104 -88 123 42 -182 -168 -28 -75 -102 -16 93 -61 33 150 -133 42 -144
3785 -144 32 -109 -86 160 -226 220 -115 -115 71 123 89 87 -253 38 -125 172 172 -118 42 79 -63 -245 -272 -43
3809 -43 121 247 36 158 -358 -296 75 -87 64 -119 95 -103 -147 96 -270 111 -46 -112 170 -38 174
3830A74j91j61K59J5k19m6Q6P6K10j83L02m37j04O7J85R1k20j06K77k19K41J6
3852A13O9k48NJ89k00Q0Pj81K30k71M58l04J18p7k75K55K63o08N03J5o2j68L29
3875B40k17n4J26K5lm71K50R7J13q4L4K05k97j2J23%J39l67p9J71Nl52J57M6J75
3900c0O5j34J31J95k20M6l25N05l64j47J00L21j65k7J31J78j9j57k13L59m33K07
3922DM29m41J06j08l1m3L02n5j44O6j11M67o47K43l0J67l39M41o8Q6l22n8K57
3945A71j13M8l11L59k82J49l01Q2J77J46k42o0M7nK57j54j16NM01p04L86n9l3
3968a52K02k33K66q5M9j65n4J64k84L03k9k16J18K06j40q1J17M4l3J78j36q3M6
3991BJ60J80n37L39j6j90k10K17M6O7j79L8O3p9L09j95j7K18o34O46n51J46J78
$$ plain form
3830 174 -17 -178 81 96 -123 -169 -83 -7 203 20 322 -115 -219 -152 33 124 -96 -202 75 -144 97 113
3852 113 182 -66 -61 128 -72 8 15 -166 64 -207 251 -53 65 -12 -287 -32 231 -377 126 141 79 -89 240
3875 240 23 -31 95 120 117 -354 -104 -7 106 22 56 261 -36 -48 75 75 214 -153 -232 -61 -56 -408 -251 -205 -30
3900 -30 35 -99 32 227 7 53 -272 233 -131 -278 -178 143 -22 -49 82 260 241 84 -129 230 -203 4
3922 4 433 -8 98 -10 -41 -84 218 163 19 85 -26 441 -206 37 7 174 -165 276 208 294 -28 -86 171
3945 171 58 106 -205 154 -128 21 -280 -198 -21 125 -117 -177 -130 -135 122 -32 -148 -143 258 -446 -60 -119 -152
3968 -152 50 -183 83 -2 47 -118 -172 -8 -292 11 -18 -234 -116 90 -50 -131 -14 30 -3 175 39 -44 2
3991 2 162 342 -195 144 128 -62 -272 -55 -9 58 -121 -83 -20 -99 210 15 -2 216 -418 228 -323 -177 1
4014An8J31k46K09K6Rj30J31Ko1K75l88K27m8k23J11m1k1K18q4J97J49n01Q7K33
4039B05k44K6R0j14J29k5J52j54k38J71o4J35r0j38K33j68m1K47j30r0J77l98
4061c29N05n5k57K01J95n90N24k30Q2j34j66K32j65r5K79m2j18J01M7J05k06n0
4083a66J26J30m5m94N04j0j47J48r4L6J51j38j5O4n0n5N9k00L42p0k6j61q1R0
4107a02L36j18r4L04k02k91L52l13J67N5p6q9qM7K04j49o4R4J97l18N2J86k53
4130h3J93l54L84n9j91J64J01j87r0J93k28K19j00m6n3L35j22K33m45Q3J23j18
4152d8K43m27N87m12K82j08op9j10j17J16K62k78k1k6L02k6l91J74K81p9J54l05
4175c2l0l22N61j07j4M8j37J28j76n6N3j82J58J9L23l24J2J94R8l72K95o8O9m29
$$ plain form
4014 1 -57 74 -172 37 63 72 -58 73 75 14 289 -99 128 80 -143 -32 -73 -94 124 40 237 386 -115 -28 205
4039 205 -39 -13 77 -37 92 67 219 65 -173 -2 -66 69 -21 -159 74 -94 -135 112 -18 -108 69 -329
4061 -329 176 121 -136 65 260 -330 194 -36 46 -88 -254 -22 -187 -282 -3 -45 -163 -62 -15 90 -116 -166
4083 -166 -40 90 45 -449 55 45 -102 46 -48 -12 139 1 -14 50 0 -55 4 -196 146 76 50 -111 -192 -102
4107 -102 234 116 22 326 124 -167 185 -128 39 94 18 -71 -79 -32 172 23 -41 53 250 -68 -16 170 -83
4130 -83 110 -244 140 81 -110 54 155 -32 -122 71 -157 62 -38 -84 -137 198 76 309 -136 -53 70 -48
4152 -48 195 -232 355 -57 225 117 111 32 -78 -195 -79 183 -95 -116 -142 160 134 -257 -83 198 119 273 -32
4175 -32 -62 -384 177 70 56 104 -33 95 -81 -137 -84 -266 -108 -89 234 -90 -78 116 214 -158 137 69 138 -291
4199b91M35j62P3M9M5j11M22k60k42j9J66o0j12L52m33L03l39K56l33L6L88J54
4221C17m67K10N0M8o67P07j51K52o09K42j2l11M36j30R0n2J46r5j01J24Q7j15
4243aR2j50j48j54N08k45p7L13k61L16j59l22K10J43j17L51k10K55m27M7J1Q3
4265E8j54J49Q9r9R6J51m11R7k46N13j63l8L99o50N14o69M85L8L9P6k54j7Q9O4
4289A56m33J26k9J46k7R5j87NO8K86k51J65Kr1K24k51J38j40m6K26j29O5p3q3
4313c8L03l04k12K31J93j26j42L80n85K95J21m00K17j75K57j8j83L3M14l06n7
4334a02J57M4K15l58J02j05r3K73j91k6K97k79J46k53J95l0j65K35J2R3m70J07
4356a96j2J61J09k29j05L84j46J7j75M49p5l37Q6J65Oj5r0j63K41j46J16P7k42
$$ plain form
4199 -291 144 -18 55 104 149 38 460 200 -42 -61 105 45 -67 285 -148 155 -184 72 -261 -225 163 317
4221 317 -150 60 110 158 -509 198 47 299 -310 -68 -80 -391 45 -85 5 -47 99 4 -97 27 114 -1
4243 -1 91 -59 -207 -361 147 -98 -175 138 -123 193 34 -288 -78 65 -52 299 89 344 -83 -36 -25 58
4265 58 -96 53 142 43 139 290 -121 -24 -270 243 80 42 441 -209 305 -364 121 159 198 274 20 3 92 156
4289 156 -277 -151 -180 -34 -61 34 -153 -148 -80 206 -45 120 122 31 255 4 142 2 -44 182 53 118 45 -38
4313 -38 265 -39 -251 -20 173 47 -95 285 -300 -5 116 -284 -67 -242 15 -3 -186 -153 261 -45 -102
4334 -102 55 99 314 -44 58 -47 -140 133 -58 -84 213 -66 80 -173 22 -8 -173 62 74 167 -303 -196
4356 -196 -208 -47 62 -167 -272 112 -34 -17 -192 257 182 -155 -69 96 102 87 -3 -166 75 -71 45 122 -120
4379a20O1Q3K87n08J89j27J44k01J43J26k51M7k19L34J18k5q3J78j47O7N8l27
4401a73m4N60n92L83l50L60K55j65j55Q5k10K68j57j69L08j53k07L22j55J36j08
4422C9Q3m8m9L36m64k3K9J30l7r2j87K68l6m2j95K84Q4n9m7J1L8j76O0o7J0j29
4448b79J59M25j42j01m3K25j18j47k9K87l98j49J80J09K13j53j59K53j88j79K49
4469A5M6j9KR3l08K2J10J22l31L31J18k73k8k32M57k60K57j71M5J00l29N23k51
4492C9L4j92K86l90N25m45J36l42L52L67l50K24k91k5o1P6O7l03L33j25l70N83
4514A28L1j11Q5l21oj13L00J6n9j1J77P1P5j26J36j73q4n8k95L54q1m7K74n5j71
4539f4K86l84Q9Mo7JL62k22n9k8K02k71M40j22nk07J3J70m4K33l79l4K39l18K98
$$ plain form
4379 -120 -59 24 311 -197 -8 -135 9 -192 -49 77 -174 -127 -346 -12 106 81 -2 176 29 96 154 -173
4401 -173 -217 343 -249 134 -216 144 399 234 79 164 -46 222 65 -104 204 51 -156 166 11 147 39
4422 39 122 74 25 361 -103 -126 -97 33 -4 -96 -283 -15 -51 -93 -288 -4 80 21 -26 -15 23 -153 -93 -160 -150 -279
4448 -279 -120 305 163 62 19 244 126 -21 -50 237 -161 -310 -130 -21 192 39 -120 133 -55 -234 15
4469 15 61 42 44 137 -171 -149 -39 83 -248 83 201 -72 -100 -332 125 -135 122 -49 -4 96 -233 290 39
4492 39 73 -119 167 -223 302 -143 -7 -349 3 370 20 244 -47 -72 -133 -57 10 -293 40 -85 -455 128
4514 128 159 48 133 -188 -194 -307 -7 9 -50 -61 116 187 262 136 272 99 15 -43 -338 16 -65 -112 162 107 -64
4539 -64 222 -162 -73 -69 -136 -135 227 5 -54 -82 120 -151 289 167 162 -45 -32 138 94 327 -52 -86 153 -165 133
4564A33P7k82J66J30j53J0j38k0L37q6k33J80m98N17J24n24K40r2o6K27K95m51
4586a07J76J88n75M64k0J80k71K02n71K56r4J08J33O4p1P4r6j54K17K7j88k15
4608b73L70k76M3J89k80J92r1Rk13R2R6J48m2M9l06M51k12K03k57r1J37Q0J4l37
4632c05K40p9K72%j46n2L6J80O3pk64J85L28l83k28R5p3J77o5LJ2mkl84L58j65
4658b08L63K78n45j28N00j84j36K07k58O4j8l14M28J30n7K2l2K3n7n0P4j9J07
4681A90L1L9k80l9K62k81J25M9K53l79j5R0K43m36K50o2J33J88l75J64P6l07j25
4704b06O4O9K31N9j57j98K49j55m9L20j91j14J71j42p0J88k61J5JK26j58J24O4
4727H0j37q8ML45j33Q8m16M80j87k52K31j99L80k95J60k0oJ02k55L96l63j50L07
$$ plain form
4564 133 210 -72 94 224 71 81 -57 -77 260 174 -59 121 -377 140 264 -260 -20 -112 -178 49 344 -107
4586 -107 69 257 -318 146 126 306 35 237 -334 -78 -172 -64 69 133 62 136 40 -114 103 130 -58 -273
4608 -273 97 -179 -136 53 -227 -35 -126 -117 -330 -238 -142 6 -36 13 -293 158 -54 149 -108 -199 -62 18 32 -305
4632 -305 -65 -144 128 128 -18 -70 -34 146 209 202 -62 123 451 68 -160 -65 -138 39 -26 -23 -11 -15 -17 -401 -43 -208
4658 -208 155 433 -112 -240 260 76 -60 147 -111 -47 -65 -379 49 179 122 144 112 135 78 28 102 83 190
4681 190 221 260 -20 -59 203 -78 47 96 349 -30 -45 45 288 -148 102 40 173 361 -14 150 226 -81 -206
4704 -206 -142 -73 158 217 60 -138 111 -44 -93 227 36 -78 93 -49 -119 69 -192 -177 -176 50 -108 16 80
4727 80 -57 -145 -141 204 71 159 -257 223 36 -216 15 -184 196 -99 61 41 35 137 -118 278 -85 -235 72
4750G2n3N9K75j90J45k67l8l65J79J02K30L8k57K48l67J78k01K84k3L50n27K91
4772A63l55J41PK7N7J62j94K52k05Q8k88J52k72O14m99J43K40k48j24J69O5l6
4794E9j07KJ76j91J69q6k47L74j86K01k60K29Q9l1k49J57j33p5M09j64l0n4l37
4817b85K61j29K23j21n3K91j39L05k00j1l87J66P8j38K73m9J6k7j81L42q1n6j65
4840f7j37K50j98K07nj11J7J27m25K85O9J66m89M03j59j57L52J12j74j59J08M2
4862E7P8j99Q5J41m20L70j73L09k09r2j67K66l1j55k07M27j90J1J56J91j17q3
4884D8L35n10R8j41j05K12K00j66J76r6k57N8L32q3r2Q8l26L71j31M4O4l39J32
4907h8j38K59L46n02J27K47j90J13j72l16N12n4L2k67PJ77j84K7L22j06k24M98
$$ plain form
4750 72 19 78 353 163 308 41 3 -362 -183 -81 149 187 -70 178 -189 -11 -212 72 49 399 -128 163
4772 163 -192 -51 -44 -17 40 202 8 260 55 143 -145 7 -265 349 -150 -7 233 -15 -139 30 95 59
4794 59 -48 -46 130 -61 108 22 -225 149 -37 164 -96 133 222 191 -58 99 -34 -109 300 136 106 52 -285
4817 -285 -24 -153 70 -51 -104 187 48 353 153 142 -245 -79 -1 -139 134 85 101 74 -107 235 154 98 -67
4840 -67 -204 46 -152 55 50 -61 -44 83 -342 -57 12 178 -311 92 -67 -224 128 240 66 -93 15 57
4862 57 135 -64 21 162 -258 112 -61 248 39 -53 -220 46 15 -140 -347 80 -110 -99 57 248 131 48
4884 48 383 -127 -29 -170 -275 -63 137 -29 147 51 -206 -148 184 101 9 97 -229 142 11 55 119 -220 -88
4907 -88 -226 33 379 -123 4 251 61 174 2 -314 198 144 176 -91 -84 93 -91 -64 258 152 -72 426
4929D26m55Q9k24R6r9k05N11j81k17J55j03K34j03p1j9L56n26M89J06m36M3J47
4951A3K62j71l03M13l51MN4L40m86J27k08J73K36j79J65j59J03l83M05J39l05
4972a11k6L42j77J1Q0p5j39J03J82j35j47J41j59M73m97q0L63j12p1j08J62M%
4995B4n7R2k90P0M69k91l4j99K13p1k80M68l45ln2J43L8J46j1M7k64L5j43K60
5019c5M28n10J2N2k10M50l05O9P9P5pk33J38J66l12L07j0k00K69j86P1L4k40j05
5043b03L4K35m7K06j78m99O09J4l13J06M2j89M33k59j23J80j67J9O9j82L45j14
5065A8J4o0p5PJ06P4j33l4J87N4j99L81j51m05K49J88P2n12N60n46O1K56k8J63
5089B47l33j2n9MK79j32N9k6L4M7j76J04j78J33J09j13j32M01l43l9QJ80j32o2
$$ plain form
4929 426 -29 60 -164 -68 -167 -372 139 -42 -259 -104 -207 27 -76 -147 -166 190 -336 153 259 -177 -134 13
4951 13 275 104 -199 214 -137 -133 -79 261 -225 -98 -306 -133 103 -76 89 -70 33 -350 55 194 -111
4972 -111 -137 205 28 39 119 44 -95 8 190 55 -92 49 -110 363 -134 -214 149 37 -34 -142 20 24 24
4995 24 -33 59 -231 -161 308 17 -17 -216 -3 -74 -354 114 -231 -234 -286 -143 -105 41 30 77 -187 -152 -295 -35
5019 -35 393 -117 -105 -53 -263 187 -118 -49 30 105 98 -135 3 169 -143 164 154 -46 223 37 108 142 -98 -203
5043 -203 -169 66 19 225 47 -452 157 171 -142 -36 6 -183 250 -9 -132 48 -119 -100 -31 -213 132 18
5065 18 32 -28 -103 -96 10 84 -49 -83 104 158 -41 340 189 -216 33 221 293 -219 341 -205 -144 112 84 247
5089 247 -86 -98 -157 -153 126 -6 53 27 61 108 -68 36 -142 -9 100 -13 -145 256 -87 -126 -118 62 -70 -132
5113a32m3L32%k11j58J27Q9J79rk59m1PJ26n5p2K26j27J17k99M35j43k1k84J44
5137g2L25k22Q6p2l20J70L30K3m62O5L28j07k03J53k30L03K3p6j76j14m7M20k06
5160h1P2L31n34j19N33j88k6K94k44M8l38L12L4J2j35n2K99j74M9M0l65L03k13
5183a42J71j72K85j41k77K65j9j24l9L42m03J9L53k6l85K84m4K2J83L3N3p8q2
5206G8J38l31L29k99J39k3o9l17J63K04j8K60n47K25J86jk06J49joj89J03J54
5229A21n7L95m00m28L61j35L8K70n1j71J4J38J2J2k4j35L1N7J40p9k52Q3K39n2
5253A27j40p8J48k7j43L27j24m40K28M9K82k20J25k54Nj11J83K75k15j89M25j34
5275I9l43J58r3J86J46j99K39l90J05l07K79J71q5m4R9O9l44L02k63M1M19N1p88
$$ plain form
5113 -132 -175 157 157 -54 -212 -85 4 183 174 -85 -126 -119 7 -48 -120 106 -21 96 -203 232 89 68 -216 -72
5137 -72 253 31 117 45 -275 -105 225 248 -214 -149 179 72 -131 22 -208 95 118 42 -134 -248 -295 125 -81
5160 -81 -9 322 -212 -331 202 14 -12 282 38 86 -252 60 94 106 -29 -81 218 44 93 133 -232 71 -142
5183 -142 29 -143 142 1 -276 -11 -30 -154 -193 149 -254 -235 118 92 -293 -9 -53 -31 152 185 238 160 78
5206 78 216 -115 214 -85 54 31 -38 -355 -192 12 -6 254 -293 -68 118 117 -89 60 59 53 -136 -33 121
5229 121 64 459 59 -369 -8 -143 -105 165 114 -57 -43 95 107 119 95 -40 -9 48 188 109 -143 -60 179 127
5253 127 -13 -91 57 30 -113 214 90 -350 -122 -73 209 -11 114 -140 -135 -246 -63 212 -3 -192 233 99
5275 99 -244 -86 -179 7 153 -46 193 -197 -92 -399 -120 51 -34 -78 21 90 -254 48 -215 -174 245 296 -492
5298d92N75l78O42k19J5k57J51j01J19q8j92L89j24J46K07n69L8K36m08N50k29
5319A1J57K38n05K82j48q1J46K30l16k04R1q7L03j54N6J23M6l65J82J68j89K1
5341EL50n97Q2L50k88qK71J64n20M6L36j76K9q2k26K24J78N6m00N21q4n92M48
5364H7j67J35Mn3j14K89m6q2M02m86P3R1p3J40l49jj48N11j83k36L21m6M9m75
5388c57M3J31K22p7l8L9j93J19Q6K12k89J38r6K87l79nK91k37r0K85o6j4J06k02
5412h4J93j15l56J30N70j34j60l4k52K74q9k36M10j85L38k73n4K46p1M3KM2j84
5435B1p5j49L51m49K33l0N7Q5j18J30k74N27k78r6L37m21L35L9k05k85Q15p05
5457a55K0N5L48k00L7J11j21K2k3k36N9ro8p0J77J8j78Q3QJ08k78N86k07J8q5
$$ plain form
5298 -492 83 -295 347 128 143 -114 37 -64 55 -33 -225 164 40 186 393 -176 -138 98 -310 240 11
5319 11 168 406 -99 183 35 -46 100 330 14 -190 -99 -186 117 -37 19 142 188 -177 5 173 -16 5
5341 5 355 -242 -160 190 -98 -106 165 329 -191 -145 191 15 44 -38 -264 -40 138 194 -206 315 231 -361 87
5364 87 -80 55 59 6 -108 181 135 53 455 -31 42 133 60 200 -149 -150 -298 213 30 -206 115 69 118 -357
5388 -357 -314 -183 39 -38 -76 -37 -230 -111 -25 187 -102 36 -60 227 -152 -157 134 -103 -193 92 26 12 118 -84
5412 -84 109 -6 -362 -232 338 204 44 10 -242 32 -57 -293 117 -68 270 -3 -57 189 118 161 163 205 21
5435 21 -54 -203 148 -301 -68 -98 -41 44 -74 56 -218 309 31 -65 272 -149 186 225 20 -265 550 -155
5457 -155 -135 -80 268 68 105 216 95 117 94 -142 -83 -92 -160 -230 -53 -35 -213 -130 -122 -14 -292 294 87 105 20
5482B0j14N5J34l17J88j22m4j40M43l89K50l00K84J56k16K83l32O7J18o3km8J48
5505E9J86k70J2M7K5Q3m10K45P4P5j62Q5L10o57J25P6r1m4K74m8J69l02N4k02
5529b87K65J3j46J68k6m7k89L75J10k92J76J12%k41O7J37k9j31J65n3J81L0k70
5552a2j36m7K99J7Pl59N20k32R3k94N04j62k25L06n31N1K89o0k85K22M26j50j27
5575A14K4n23L50J4m79O20k22m6Ro3p3K43q2K17l21L68j69J4j97J75J19o9J26
5598A49m72J89M23l14J67l05K02R9k42M67k34J38m24J41L2L7J58j23K8M0K30l92
5620fj3q3n4K52j85m1j7J94R2m82N11RlJ8l30j36K49J08k09L15j49m7O4k32M01
5645B26l13J08j30k3K4j90M43j12j28Jm4m2l55K49K39k46O26j43l32J95m63O08
$$ plain form
5482 20 -94 -39 95 -222 -34 -156 -200 -340 103 -286 -36 -336 -52 104 -112 171 -161 -94 24 -39 -41 -89 59
5505 59 245 -25 -13 34 59 142 -268 -23 51 126 -36 49 359 -298 -173 -97 -188 -232 42 -6 163 -139 -85 -287
5529 -287 -22 -9 -155 13 -13 -60 -349 26 136 -156 20 132 132 -109 -42 95 66 -65 100 47 228 258 -12
5552 -12 -148 -195 104 121 128 -231 289 57 150 -144 360 198 -27 279 -252 -201 88 28 -257 -35 391 241 114
5575 114 138 -385 -35 -21 -500 120 -102 -148 -139 -202 -275 -32 -114 103 -218 150 -19 -5 -202 -27 92 23 149
5598 149 -323 -134 289 -25 142 -163 39 138 -104 363 129 267 -157 -16 16 53 211 88 116 156 386 -6
5620 -6 -19 -102 -156 96 -89 -130 -147 47 139 -343 168 177 174 192 -138 -274 -25 83 -126 189 40 -7 57 -175 226
5645 226 -87 21 -109 -132 -108 -298 145 33 -95 -94 -138 -180 -535 -286 -47 -293 333 190 -142 53 -410 198
5667A98k14k0j24K11J13o1Q2j93m1q6J04k87P11l82J20j49k5J91j31j57M3J45
5689D8l47J70J62k94L17J2l99L34J7OJ8q9J45p7J7j76K2J63k54l7L9R4O6K04k29
5714f8M4J42j86L71J11l36p9O4J64k55M18j20l73q6o2J70J75k64K27k0K37m21
5736a47J39l0K54r8j48J68Jj11K92m40L21j58k67J84N5K79m06J51l3j90j50N66
5758B32j85j00K3k47J04Q8l22K53L00k00Q6m08K91j60K98J93n0l28k51L20j01
5779a64N19n80R0j25L02l42K32j34K80l59L11Lj45J59p7k64N40l16J29L1j89J33
5801C4J95j88j88J66k11K51J89k87M4J7J3j04j6J06l02O05om49K20J89m52J90
5823A6k27J55j80N02m29K41k4nj05k56K57J69m2l64L89j70K60J2j82J11k88k3
$$ plain form
5667 198 -16 -36 -160 51 164 103 185 -8 -49 -135 -31 -318 393 11 131 -18 -43 148 17 -140 -97 48
5689 48 -299 -129 33 -261 56 68 -331 3 20 26 44 -45 100 23 40 -136 -114 49 -205 -242 -203 -109 -43 161 -68
5714 -68 -24 118 -68 303 414 78 -1 63 227 -28 390 270 -103 -189 -251 -81 94 -170 57 37 274 -147
5736 -147 -8 -38 216 118 -30 138 139 28 320 -120 201 43 -224 -40 15 294 -112 39 6 -184 -334 232
5758 232 47 -53 -30 -277 -173 -85 -407 -154 146 -54 32 -376 -85 -245 53 246 196 -132 -383 -63 -164
5779 -164 355 -225 -135 -260 42 -300 -68 -202 78 -281 30 33 -112 47 -30 -294 246 -70 59 90 -99 34
5801 34 229 41 -147 19 -192 59 248 -39 5 22 35 -69 -85 21 -281 324 318 -131 89 278 -174 16
5823 16 -211 -56 -236 266 -163 78 54 49 -56 -312 -55 114 72 -292 97 -73 187 199 17 128 -160 -183
5845a83J93R0PK34m20Q5k19M11K6m32L02J75j54k10L71k98L24j20P0j28J83q4
5867B23n67P0L99j27K7R4j65k74J74M1K48R6k13J05o7K9k36l3k5K66K15j71p9
5890C0K8Ll3j38J24Q6p0J16j44R7k10J62j44P4j1K43j81J3j77m9M64j92L00l69
5914B2l3j73qM80j03j26k7L7j13M68m70k10M45j00j22k08K50l5Q6R4P0k66j73
5937b15Q8O2jo3J70J08M2k12K53l2k92k20K15r6N03l28K77m42M05m25l2J32j67
5960b70J36J35J03j55m7o6K20k82j10J91J87P9K75q4m79m4j24N21P5m55l3L17
5982I0J93m19k9J47N8q7Q9K29l99J84Q6k06k22K71K34j07j05j7J91r4k18J03R9
6005G1J22L3k61j75M41l33J22k60n4M17p3L3J70j86O2l31K93l17N1nN21n06K44
$$ plain form
5845 -183 10 100 107 341 -79 6 -213 198 224 -208 94 269 115 -95 276 -22 302 182 252 124 307 223
5867 223 -344 -274 125 -2 25 119 -46 -320 -146 -105 143 239 26 131 64 93 -143 -176 -201 65 280 109 30
5890 30 58 61 28 -110 14 100 30 146 2 99 -111 51 -93 -19 -30 213 32 45 -132 -181 283 91 391 22
5914 22 -11 -184 -192 288 185 59 32 69 -44 424 -46 -256 189 89 -33 -241 9 -26 60 154 224 -42 -215
5937 -215 -127 -65 -66 -129 41 149 191 -21 232 200 -92 -312 -97 -193 310 -18 259 -183 222 -203 -235 -103 -270
5960 -270 -134 1 104 -51 -98 -164 56 -226 -336 -145 42 121 396 312 -167 -211 -335 186 261 -194 -227 90
5982 90 283 -136 -165 -18 40 -47 42 271 -128 56 142 -64 -286 -15 219 112 7 -10 181 87 -131 -28 71
6005 71 193 226 -35 -210 231 -102 20 -240 -294 123 50 83 253 67 129 -202 91 -226 -175 -180 341 -165 79
6028G9m21N15n8j28O2Q1Qp4m2k11N77j92k22L3r6n6L28j17k8p6K46k97jJ64k93
6053b19K99m44N03Jj68Pj49Q7j31J08J92K67l11k09J05K64j63K56m24L8K43j76
6075b4R2J1lk28J81p4K07j53j56L06m86M66m22O1L91p9Rk20K34j79%J67j73j39
6099b11J50K40N2N0j47j25J42k68j20J94J50J30k89K78k72Q6O6j22Q0j98j30J12
6121a52j18L75L9j55K01k67R1J28k26K58J28J16m76k3K27r6k54R8K13p0L57m02
6143hj4L71m61K2P3J5K1j84Kj39K69l8M1K63j05j37k45L60j2q6m18O92k57P2k30
6168a33K81K4l68K03m16P57k69r7j10J99L5r0j9K02o2j83j03K62l10J9L55r4j39
6191e6K7K71l43o2K59j01J2k32N5l3N21m03J5k20L11j82k7L41j72J13M8k95J24
$$ plain form
6028 79 -342 173 115 -13 49 130 138 64 22 -189 388 196 -26 7 -89 -145 183 66 38 -38 208 -89 -90 74 -219
6053 -219 80 -364 139 140 -28 -21 -170 -83 -214 -106 86 353 42 -167 -62 202 39 295 -129 -91 152 -24
6075 -24 68 79 76 -152 29 -45 162 9 -147 159 -327 139 -283 -222 169 90 99 -121 113 -66 -66 101 -72 -211
6099 -211 -61 179 231 281 134 9 151 -117 -237 -43 107 237 -52 226 -46 40 106 -16 64 -134 -264 -152
6121 -152 -270 105 144 -11 190 -77 14 142 -84 174 302 418 -58 -81 146 50 -204 -106 107 37 394 -8
6143 -8 -22 349 -112 -90 -17 -2 19 -165 -163 -302 -33 -71 -30 233 128 -9 -254 106 94 8 -410 282 25 97 -133
6168 -133 148 172 -196 7 -409 348 79 -18 -128 71 106 16 -3 199 137 -46 -149 113 -197 -178 177 83 -56
6191 -56 -29 242 -101 -163 96 -5 7 -225 -170 -203 318 -85 -70 -290 21 -161 -188 153 -19 94 142 -153 -29
6214b9j5p8k51K84L86k33K29m58P8k06J70l9J77mk31K02j12K32k74J09J32k5P4
6237A18k62J57k22L5K45J5K00m88N3N2J69J58l13N3J02l62K22j56K3J68j12Q4
6259f1r4K83j59J36nk07O7L6J72j09K00m09J34Q5n0j52NO77m11j61NJ22k0j22
6283c8K22j40Po3j29K54l60K12K91k44j6j08n4J31K53l17L47l19J73J16j70O6
6305A14l44kL33j84L30j33R1Q9n97K43j56J9L2j1K86O2M1l42M13k81J24l40N91
$$ plain form
6214 -29 -44 -122 -373 -89 297 64 293 -165 -87 -293 -123 -162 15 11 -220 -18 -130 102 -172 -63 69 44 118
6237 118 -144 13 -209 -174 71 86 286 -202 -149 -97 72 230 -83 -30 72 -290 -68 -224 -201 -33 -145 -61
6259 -61 -155 128 -31 105 100 -107 -40 -4 168 59 259 -150 -16 69 19 -133 -128 549 138 -23 -18 104 84 -38
6283 -38 184 44 51 -12 -141 113 -247 -35 256 12 -4 -112 -166 -35 218 -99 248 -71 102 218 48 114
6305 114 -230 -232 101 -83 247 114 205 294 -303 -60 -216 -197 -165 -176 110 172 213 -129 284 3 127 -213 378
$$ [...]
8191h7
##END NTUPLES=NMR FID
##END=
