##TITLE=1H_CG-1104-C5
 DMSO, 8 sc, 
 31.5.2019
##JCAMPDX= 6.0         $$ Bruker NMR JCAMP-DX V2.0
##DATA TYPE= NMR FID
##DATA CLASS= NTUPLES
##ORIGIN= UXNMR, Bruker Analytische Messtechnik GmbH
##OWNER= root
$$ XWIN-NMR		Version 3.5
$$ Fri May 31 13:53:34 2019 Russian Standard Time (UT+4h)  she@DPX200
##.OBSERVE FREQUENCY= 200.13155
##.OBSERVE NUCLEUS= ^1H
##.DELAY= (6, 6)
##.ACQUISITION MODE= SIMULTANEOUS
##.ACQUISITION SCHEME= undefined
##.AVERAGES= 8
##.DIGITISER RES= 18
##SPECTROMETER/DATA SYSTEM= spect
##.PULSE SEQUENCE= zg30
##.SOLVENT NAME= DMSO
##.SHIFT REFERENCE= (INTERNAL, DMSO, 0, 15.7039)
##AUDIT TRAIL= $$ (NUMBER, WHEN, WHO, WHERE, WHAT)
$$ ##TITLE= Audit trail, XWIN-NMR		Version 3.5
$$ ##JCAMPDX= 5.01
$$ ##ORIGIN= Bruker BioSpin GmbH
$$ ##OWNER= she
$$ F:/spectra/data/she/nmr/H-F/1/audita.txt
$$ ##AUDIT TRAIL=  $$ (NUMBER, WHEN, WHO, WHERE, WHAT)
(   1,<2019-05-31 13:51:31.73 +0400>,<she>,<DPX200>,
      <created by zg, POWCHK disabled, PULCHK disabled
       configuration hash MD5:
       00 E9 B6 7A A2 85 ED C7 34 08 36 98 17 FE 4E 26
       data hash MD5: 16K
       00 45 BE 28 3B 44 76 ED D3 62 13 92 B1 D9 EA D6>)
$$ ##END=
$$ 
$$ hash MD5
$$ A3 62 0B D5 4F 31 62 74 2D 45 1A 72 51 A7 08 EE
##$RELAX= 
##$RELAX= 
##$RELAX= 
##$RELAX= 
##$RELAX= 
##$RELAX= 
$$ Bruker specific parameters
$$ --------------------------
##$DU= <F:/spectra>
##$EXPNO= 1
##$NAME= <H-F>
##$PROCNO= 1
##$TYPE= <nmr>
##$USER= <she>
##$AMP= (0..31)
100 100 100 100 100 100 100 100 100 100 100 100 100 100 100 100 100 100 
100 100 100 100 100 100 100 100 100 100 100 100 100 100 
##$AQSEQ= 0
##$AQ_mod= 1
##$AUNM= <au_zg>
##$AUTOPOS= <>
##$BF1= 200.13
##$BF2= 200.13
##$BF3= 200.13
##$BF4= 200.13
##$BF5= 200.13
##$BF6= 200.13
##$BF7= 200.13
##$BF8= 200.13
##$BYTORDA= 1
##$CFDGTYP= 0
##$CFRGTYP= 5
##$CHEMSTR= <none>
##$CNST= (0..31)
1 1 145 1 1 1 1 1 1 1 1 1 1 1 1 1 1 1 1 1 1 1 1 1 1 1 1 1 1 1 1 1 
##$CPDPRG= <>
##$CPDPRG1= <>
##$CPDPRG2= <>
##$CPDPRG3= <>
##$CPDPRG4= <mlev>
##$CPDPRG5= <mlev>
##$CPDPRG6= <mlev>
##$CPDPRG7= <mlev>
##$CPDPRG8= <mlev>
##$CPDPRGB= <>
##$CPDPRGT= <>
##$D= (0..31)
0 1.2 0 0 0 0 0 0 0 0 0 0.03 0 0 0 0 0 0 0 0 0 0 0 0 0 0 0 0 0 0 0 0 
##$DATE= 1559296290
##$DBL= (0..7)
120 120 120 120 120 120 120 120 
##$DBP= (0..7)
150 150 150 150 150 150 150 150 
##$DBP07= 0
##$DBPNAM0= <>
##$DBPNAM1= <>
##$DBPNAM2= <>
##$DBPNAM3= <>
##$DBPNAM4= <>
##$DBPNAM5= <>
##$DBPNAM6= <>
##$DBPNAM7= <>
##$DBPOAL= (0..7)
0.5 0.5 0.5 0.5 0.5 0.5 0.5 0.5 
##$DBPOFFS= (0..7)
0 0 0 0 0 0 0 0 
##$DE= 6
##$DECBNUC= <off>
##$DECIM= 24
##$DECNUC= <off>
##$DECSTAT= 4
##$DIGMOD= 1
##$DIGTYP= 9
##$DL= (0..7)
0 120 120 120 120 120 120 120 
##$DP= (0..7)
150 150 150 150 150 150 150 150 
##$DP07= 0
##$DPNAME0= <>
##$DPNAME1= <>
##$DPNAME2= <>
##$DPNAME3= <>
##$DPNAME4= <>
##$DPNAME5= <>
##$DPNAME6= <>
##$DPNAME7= <>
##$DPOAL= (0..7)
0.5 0.5 0.5 0.5 0.5 0.5 0.5 0.5 
##$DPOFFS= (0..7)
0 0 0 0 0 0 0 0 
##$DQDMODE= 0
##$DR= 18
##$DS= 0
##$DSLIST= <SSSSSSSSSSSSSSS>
##$DSPFIRM= 0
$$ [...]
##$SUBNAM2= <"">
##$SUBNAM3= <"">
##$SUBNAM4= <"">
##$SUBNAM5= <"">
##$SUBNAM6= <"">
##$SUBNAM7= <"">
##$SUBNAM8= <"">
##$SUBNAM9= <"">
##$SW= 24.9336996594482
##$SWIBOX= (0..15)
0 0 2 0 0 0 0 0 0 0 0 0 0 0 0 0 
##$SW_h= 4990.01996007984
##$TD= 16384
##$TD0= 1
##$TE= 0
##$TE2= 300
##$TE3= 300
##$TEG= 300
##$TL= (0..7)
0 120 120 120 120 120 120 120 
##$TP= (0..7)
150 150 150 150 150 150 150 150 
##$TP07= 0
##$TPNAME0= <>
##$TPNAME1= <>
##$TPNAME2= <>
##$TPNAME3= <>
##$TPNAME4= <>
##$TPNAME5= <>
##$TPNAME6= <>
##$TPNAME7= <>
##$TPOAL= (0..7)
0.5 0.5 0.5 0.5 0.5 0.5 0.5 0.5 
##$TPOFFS= (0..7)
0 0 0 0 0 0 0 0 
##$TUNHIN= 0
##$TUNHOUT= 0
##$TUNXOUT= 0
##$USERA1= <user>
##$USERA2= <user>
##$USERA3= <user>
##$USERA4= <user>
##$USERA5= <user>
##$V9= 5
##$VALIST= <valist>
##$VCLIST= <CCCCCCCCCCCCCCC>
##$VD= 0
##$VDLIST= <DDDDDDDDDDDDDDD>
##$VPLIST= <PPPPPPPPPPPPPPP>
##$VTLIST= <TTTTTTTTTTTTTTT>
##$WBST= 1024
##$WBSW= 4
##$XGAIN= (0..3)
0 0 0 0 
##$XL= 0
##$YL= 0
##$YMAX_a= 28855
##$YMIN_a= -32852
##$ZGOPTNS= <>
##$ZL1= 120
##$ZL2= 120
##$ZL3= 120
##$ZL4= 120
##$ABSF1= 10
##$ABSF2= 0
##$ABSG= 5
##$ABSL= 3
##$ALPHA= 0
##$AQORDER= 0
##$ASSFAC= 0
##$ASSFACI= 0
##$ASSFACX= 0
##$ASSWID= 0
##$AUNMP= <proc_1d>
##$AZFE= 0.1
##$AZFW= 0.1
##$BCFW= 1
##$BC_mod= 2
##$BYTORDP= 1
##$COROFFS= 0
##$CY= 11.3945322036743
##$DATMOD= 1
##$DC= 2
##$DFILT= <>
##$DTYPP= 0
##$F1P= 18.9103706918063
##$F2P= -1.10871071338519
##$FCOR= 0.5
##$FTSIZE= 0
##$FT_mod= 4
##$GAMMA= 1
##$GB= 0.15
##$INTBC= 1
##$INTSCL= 1
##$ISEN= 128
##$LB= 0.24
##$LEV0= 0
##$LPBIN= 0
##$MAXI= 10000
##$MC2= 0
##$MEAN= 0
##$ME_mod= 0
##$MI= 1.114404
##$NCOEF= 0
##$NC_proc= 0
##$NLEV= 6
##$NOISF1= 3.799351
##$NOISF2= 2.8
##$NSP= 1
##$NTH_PI= 0
##$NZP= 0
##$OFFSET= 15.70392
##$PC= 1
##$PHC0= -8663.705
##$PHC1= 21.60023
##$PH_mod= 1
##$PKNL= yes
##$PPARMOD= 0
##$PSCAL= 0
##$PSIGN= 0
##$REVERSE= no
##$SF= 200.130013532006
##$SI= 16384
##$SIGF1= 3
##$SIGF2= 2
##$SINO= 400
##$SIOLD= 16384
##$SREGLST= <1H.CDCl3>
##$SSB= 0
##$STSI= 0
##$STSR= 0
##$SW_p= 3612.71676300578
##$SYMM= 0
##$S_DEV= 0
##$TDeff= 0
##$TDoff= 0
##$TI= <>
##$TILT= no
##$TM1= 0
##$TM2= 0
##$TOPLEV= 0
##$USERP1= <user>
##$USERP2= <user>
##$USERP3= <user>
##$USERP4= <user>
##$USERP5= <user>
##$WDW= 1
##$XDIM= 8192
##$YMAX_p= 0
##$YMIN_p= 0
$$ End of Bruker specific parameters
$$ ---------------------------------
##NTUPLES= NMR FID
##VAR_NAME=  TIME,          FID/REAL,        FID/IMAG
##SYMBOL=    X,             R,               I
##VAR_TYPE=  INDEPENDENT,   DEPENDENT,       DEPENDENT
##VAR_FORM=  AFFN,          ASDF,            ASDF
##VAR_DIM=   8192,          8192,            8192
##UNITS=     SECONDS,       ARBITRARY UNITS, ARBITRARY UNITS
##FACTOR=    0.0002004,     1,               1
##FIRST=     0,             0,               0
##LAST=      1.6414764,     0,               0
##MIN=       0,             -32852,          0
##MAX=       1.6414764,     28855,           0
$$ Real data points
##PAGE= N=1
##DATA TABLE= (X++(R..R)), XYDATA
0 0 0 0 0 0 0 0 0 0 0 0 0 0 0 8 -8 8 -8 8 -8 12 -16 16 -16 24 -24 31 -32 40 -40 48 -56 61 -68 76 -85 95
36 95 -107 117 -131 145 -160 178 -195 217 -240 265 -296 329 -368 413 -466 530 -607 707 -835 1011
56 1011 -1270 1683 -2464 4443 -21369 -29156 9652 11887 -7125 -32852 -30869 -11799 6406 2689
70 2689 -10670 -21265 -19023 -10914 -511 3233 -700 -11414 -18512 -13934 1767 10827 2883 -12904
84 -12904 -17127 -6452 7420 9334 -984 -10816 -9501 -1871 3264 3506 1289 -2729 -6838 -7759 -2502
99 -2502 5859 7370 -3336 -14808 -11867 2847 11436 3355 -12535 -17391 -5427 7591 5492 -6884
113 -6884 -13276 -7984 -85 867 -4361 -6942 -4293 -3002 -6073 -7209 -2654 1725 -17 -6708 -10269
128 -10269 -5485 2232 3171 -2668 -6642 -5389 -1881 392 802 387 -557 -3478 -6218 -3048 4678 7552
144 7552 975 -7765 -8385 632 9023 6471 -3557 -8113 -2959 3769 4788 1374 -1528 -1495 -1400 -3044
160 -3044 -1987 4066 7170 679 -9075 -9747 1210 11937 8350 -6916 -15278 -6353 8727 12567
174 12567 1783 -11030 -12038 -1340 8159 7245 -707 -7623 -8807 -2928 5282 8001 1851 -8071
188 -8071 -11979 -4216 8159 10778 -210 -12068 -11182 684 9969 6452 -4920 -10282 -5116 2290
202 2290 4321 2022 -915 -3114 -4588 -4530 -338 6088 6597 -2233 -10955 -7937 4426 12252 6159 -7697
218 -7697 -13091 -3428 9235 10785 1566 -7252 -7514 -208 6294 6570 2130 -2453 -4731 -2699 3541
233 3541 7959 5468 -1923 -6617 -3260 5083 8937 3719 -3546 -4424 481 4646 4311 1304 -406 43
249 43 -170 -712 1573 5235 4552 -1061 -5589 -2999 5004 9046 3139 -5772 -6433 1494 8079 6128 -1343
266 -1343 -5598 -2047 3653 4822 2073 69 -254 -302 -61 1000 3303 4277 1210 -3353 -3139 2541 6759
283 6759 4893 -927 -4767 -2413 3225 5955 3910 33 -2962 -3184 334 5198 6426 1993 -5058
298 -5058 -7337 -582 8948 9383 -655 -9643 -7484 3471 10538 5827 -4970 -8864 -2504 5176 6144
313 6144 1294 -3451 -3839 -1215 786 1834 2828 1754 -2122 -4722 -2363 3065 5844 2249 -4374 -6158
329 -6158 -691 5217 5380 519 -4108 -4353 -500 3524 4308 2075 -1925 -4747 -2779 3390 6985 3397
345 3397 -4122 -7341 -1917 6751 8253 445 -6813 -5490 2152 6890 3950 -2430 -4580 -1217 2213
360 2213 2415 1295 621 -420 -1861 -2331 68 3754 4179 -656 -5277 -3870 2171 5805 3231 -2755
376 -2755 -5609 -2222 2910 4604 2219 -1504 -3811 -2863 761 3770 3663 130 -3997 -4486 422 5332
392 5332 4433 -918 -4976 -3448 1778 4938 2742 -1110 -2367 -1185 346 1436 2140 1968 368 -2328
408 -2328 -3168 688 5653 5190 -1057 -6109 -3935 3563 7970 3824 -3976 -6277 -950 5306 6160 1191
424 1191 -4032 -4075 223 4006 4294 1646 -2053 -3644 -1229 3087 4652 2196 -2341 -4245 -986 3714
440 3714 4516 935 -2595 -2929 -356 2194 2538 1288 57 -1214 -2259 -909 2607 4478 1890 -3298
456 -3298 -5325 -946 5823 6718 117 -6217 -5293 1664 6998 4951 -1834 -5342 -2466 2606 4773 2983
472 2983 -688 -3021 -2138 733 3393 3858 1293 -2473 -3208 29 3579 3879 876 -2379 -2397 494 2806
489 2806 2483 1083 -631 -1829 -1483 602 2850 3100 231 -3467 -3469 1030 4834 3208 -2035 -5156 -2590
506 -2590 2969 4870 1102 -3596 -3900 -640 2451 2404 -14 -2031 -1909 -826 298 1377 1556 -202
522 -202 -2391 -2699 -396 2746 3317 136 -3476 -3233 259 3456 3458 175 -3162 -3082 275 3640 4154 1230
540 1230 -3072 -4120 -273 4664 5437 1255 -3991 -4559 765 5814 4887 -537 -4260 -2861 1830 4650
556 4650 2787 -855 -2275 -1198 403 1536 1732 978 -405 -1831 -2047 116 2961 2658 -802 -3832
572 -3832 -3228 631 3803 2644 -1715 -4372 -2769 1008 3346 2060 -1770 -4242 -2749 1109 3667
587 3667 2445 -1774 -4740 -2837 1894 4237 1823 -2720 -4426 -1470 2783 3298 201 -2606 -2632 -651
603 -651 1206 1425 372 -692 -1571 -2174 -1322 1052 2145 426 -2835 -4196 -1945 2054 3038 -332 -4332
620 -4332 -4818 -1729 1976 2552 -754 -4259 -4587 -1976 1092 2013 -426 -3896 -4760 -2297 1010 2143
636 2143 -111 -3598 -4485 -2032 757 1569 -17 -2428 -3324 -2073 -136 1017 1014 -619 -2949 -3502 -962
653 -962 2134 2685 -145 -3963 -4285 -338 3483 2750 -1478 -4745 -3536 828 3618 1564 -2549 -4325
669 -4325 -2590 748 2508 724 -2423 -3634 -2123 179 1393 428 -1909 -3202 -2271 -367 982 740
685 740 -1020 -2642 -2540 -1033 647 1409 319 -1986 -3146 -1708 1111 2820 1614 -2037 -4223 -2008
701 -2008 2494 4394 1871 -2758 -4470 -1087 3739 4531 834 -3128 -3428 97 3724 3502 312 -2247
717 -2247 -2136 -28 2153 2436 775 -1156 -1754 -786 864 1976 1208 -851 -2063 -1688 -111 1566 1599
734 1599 -420 -2393 -2606 -905 1359 1956 -317 -3208 -3494 -892 1806 2100 -863 -4042 -3747 -355
750 -355 2244 1412 -1665 -3906 -2901 30 1674 504 -1692 -2945 -2485 -597 835 645 -662 -2180
766 -2180 -2814 -1664 654 1635 280 -2082 -3366 -2001 953 2581 820 -2400 -3769 -2031 1491 3304
782 3304 1335 -2378 -3828 -1696 1959 3678 1374 -2549 -3590 -868 2523 3263 1015 -2029 -2731 -483
798 -483 1947 2293 987 -823 -1614 -778 722 1571 1561 252 -1345 -1906 -446 1652 2317 851 -1904
815 -1904 -3100 -1068 2085 2878 501 -2730 -3558 -794 2615 2816 -376 -3478 -3348 -292 2773 2357
831 2357 -907 -3382 -2567 291 2437 1693 -1095 -2777 -1699 697 1953 1340 -400 -1630 -1162 335
847 335 1285 1413 831 -490 -1184 -506 1044 2204 1886 -267 -2102 -1294 1315 3134 2279 -561 -2787
864 -2787 -1686 1703 3432 1832 -1306 -2984 -1544 1524 3014 1213 -1624 -2881 -1652 879 2110
879 2110 798 -1504 -2456 -1810 -98 1197 822 -954 -2197 -2116 -898 757 1269 -123 -2238 -2829 -1361
896 -1361 904 2012 335 -2490 -3192 -1029 1740 2437 68 -2753 -2993 -154 2399 2281 -192 -2367
912 -2367 -2178 457 2386 1713 -254 -1843 -1479 415 1926 1526 62 -1013 -1161 -175 1186 1599 825
929 825 -371 -1327 -1141 578 2113 1745 -437 -2278 -1879 600 2911 2248 -926 -3131 -2157 1013 3357
946 3357 2170 -1511 -3547 -1903 1478 3216 1603 -1744 -3250 -1343 1599 2573 1059 -1244 -2320
961 -2320 -1023 998 1756 873 -425 -1371 -1077 187 1229 1384 565 -789 -1646 -789 1193 2144 1244 -848
979 -848 -2248 -1090 1576 2780 1170 -1397 -2511 -782 2138 2927 770 -1763 -2271 -316 2122 2505
995 2505 418 -1757 -1713 72 1758 1856 270 -1389 -1444 -115 1171 1372 696 -719 -1483 -843 499 1477
1013 1477 1309 -401 -1980 -1669 416 2019 1706 -485 -2519 -2091 514 2556 1850 -759 -2697 -2022
1029 -2022 836 2709 1523 -1050 -2600 -1524 924 2370 1318 -866 -1816 -1107 401 1559 1276 -169
1045 -169 -1128 -1025 -284 990 1656 724 -756 -1595 -863 896 2210 1435 -902 -2229 -1171 1152 2568
1062 2568 1429 -1371 -2680 -867 1867 2714 888 -1872 -2539 -397 2104 2248 240 -1837 -1963 -20
1078 -20 1906 1594 -228 -1475 -1278 13 1224 1117 32 -770 -887 -506 329 1101 932 -193 -1099 -1208
1096 -1208 0 1544 1729 41 -1754 -1782 25 2109 2254 -103 -2267 -1943 463 2544 2256 -321
1112 -321 -2435 -1669 939 2615 1856 -357 -1989 -1334 832 2033 1410 -64 -1272 -1132 388 1531
1128 1531 1482 539 -684 -1327 -442 1113 1789 1041 -490 -1568 -976 969 2254 1334 -709 -1971 -1070
1145 -1070 1268 2554 1247 -1177 -2043 -706 1443 2280 793 -1342 -1709 -268 1402 1740 522 -1027
1161 -1027 -1266 -160 948 1277 783 -356 -1052 -664 324 1196 1173 241 -1114 -1336 29 1564 1802 451
1179 451 -1578 -1924 -64 2038 2151 276 -2007 -2155 165 2446 2174 -284 -2281 -1966 493 2450
1195 2450 1802 -540 -2069 -1414 437 1705 1228 -438 -1348 -920 38 900 969 223 -687 -971 -618 248
1213 248 1181 1027 -299 -1449 -1208 152 1567 1482 -298 -1899 -1450 512 1903 1510 -682 -2216 -1390
1230 -1390 929 2012 1112 -911 -2028 -988 1205 1840 655 -1074 -1561 -567 985 1539 459 -716
1246 -716 -1041 -394 579 1094 693 -138 -797 -807 -31 1134 1343 275 -1012 -1293 -187 1422 1928 312
1264 312 -1460 -1581 -37 1789 1947 251 -1670 -1552 196 1847 1760 119 -1563 -1479 224 1559 1435
1281 1435 83 -1098 -1173 15 1131 1085 350 -624 -1096 -605 520 1175 885 -191 -1303 -1315 151 1572
1299 1572 1354 -245 -1687 -1560 424 2097 1482 -719 -2044 -1347 789 2151 1120 -1062 -1919 -742
1315 -742 1098 1731 736 -918 -1517 -391 950 1294 563 -671 -1118 -379 519 884 588 -127 -720 -778 -23
1334 -23 732 934 461 -703 -1393 -582 962 1584 660 -1111 -1966 -656 1375 1956 483 -1535 -2107 -470
1352 -470 1727 1963 -3 -1798 -1756 -129 1607 1592 -66 -1500 -1329 -41 1027 1196 233 -825 -1004
1369 -1004 -362 496 1063 744 -351 -1016 -782 174 1126 1179 20 -1218 -1117 138 1285 1397 120 -1452
1387 -1452 -1315 302 1676 1373 -215 -1563 -1146 642 1724 1040 -501 -1364 -725 642 1393 646 -454
1404 -454 -845 -531 328 967 772 -34 -595 -639 -46 852 1210 444 -602 -1048 -329 1024 1711 691 -933
1423 -933 -1439 -322 1282 1883 708 -1187 -1614 -169 1550 1851 472 -1273 -1609 -10 1541 1625 191
1440 191 -1149 -1158 115 1158 1045 98 -623 -741 -278 515 748 494 -52 -555 -815 -114 929 1002 206 -950
1460 -950 -1222 -254 1259 1512 105 -1373 -1462 16 1564 1479 -253 -1538 -1160 362 1605 1293 -395
1477 -395 -1451 -793 731 1436 985 -385 -1179 -477 700 1212 629 -205 -746 -407 302 788 685 296 -419
1496 -419 -732 -237 696 1089 682 -420 -1273 -689 782 1561 744 -759 -1580 -660 1029 1631 549 -1037
1514 -1037 -1510 -544 1048 1552 384 -1063 -1340 -407 884 1229 467 -747 -1086 -369 471 986 733 -266
1532 -266 -961 -752 120 911 1022 130 -891 -1022 -72 1100 1381 366 -1142 -1373 31 1441 1403 82
1550 82 -1340 -1262 272 1578 1215 -199 -1199 -859 491 1345 815 -369 -881 -498 265 857 604 -199
1568 -199 -571 -449 -68 430 646 252 -405 -686 -426 227 952 660 -427 -1168 -909 323 1218 889 -633
1587 -633 -1614 -832 646 1563 862 -896 -1802 -761 984 1571 529 -936 -1564 -363 928 1230 245
1604 245 -768 -1068 -365 696 828 298 -332 -615 -482 60 740 712 99 -531 -918 -256 726 1099 243 -773
1624 -773 -1065 -382 857 1317 264 -1009 -1191 -314 1006 1339 51 -1203 -1163 4 967 935 -163 -1120
1642 -1120 -923 94 860 609 -91 -828 -766 14 516 479 104 -403 -762 -383 300 733 472 -338 -1016 -777
1662 -777 439 1168 624 -502 -1288 -779 616 1447 709 -670 -1360 -722 752 1519 692 -809 -1277 -407
1680 -407 750 1322 511 -689 -1039 -300 502 805 564 -306 -652 -466 41 553 800 262 -520 -842 -332
1699 -332 514 948 504 -688 -1236 -516 723 1293 475 -931 -1504 -390 1088 1232 168 -1128 -1295 -139
1717 -139 1127 1071 -104 -1096 -907 29 959 795 -259 -837 -592 24 601 588 21 -458 -499 -156 206 587
1737 587 427 -225 -657 -503 92 838 903 -111 -1051 -825 202 1084 970 -247 -1327 -899 420 1277 829
1756 829 -500 -1383 -800 574 1236 613 -486 -1151 -693 441 894 486 -399 -750 -615 62 721 597 44
1775 44 -540 -743 -313 568 806 257 -536 -960 -530 486 1043 381 -696 -1134 -444 697 1190 412 -885
1794 -885 -1081 -184 815 1037 164 -910 -953 8 752 653 83 -585 -714 -52 457 427 142 -356 -554 -280 259
1815 259 444 328 -112 -682 -745 -31 719 638 -99 -895 -1032 -24 1075 875 -332 -1232 -1113 150 1215
1834 1215 813 -547 -1411 -967 326 1181 668 -620 -1189 -684 380 896 467 -489 -974 -573 105 455
1852 455 363 -138 -598 -650 -248 238 593 325 -439 -930 -615 215 796 588 -415 -1140 -834 402 1027 542
1872 542 -572 -1259 -685 641 1046 312 -764 -1131 -489 653 916 36 -785 -833 -272 463 704 52 -589
1891 -589 -674 -192 266 558 371 -257 -595 -473 42 505 663 -19 -748 -753 48 798 863 36 -984 -806 223
1912 223 1118 912 -60 -956 -839 271 1120 863 -130 -857 -558 331 974 702 -105 -573 -507 144 633 568
1932 568 76 -400 -454 -265 344 738 401 -163 -702 -571 190 882 709 -257 -996 -758 304 1118 775 -533
1952 -533 -1061 -572 504 1044 514 -659 -1091 -287 662 834 235 -553 -823 -81 621 565 114 -392 -479 -52
1972 -52 375 418 138 -121 -234 -335 -23 401 439 123 -355 -618 -186 653 786 162 -658 -922 -185 815 993
1993 993 103 -903 -937 -43 1042 955 -86 -1050 -758 159 932 776 -115 -854 -596 200 606 656 50 -468
2013 -468 -540 -54 443 554 380 -277 -605 -294 394 685 507 -169 -668 -490 274 875 711 -140 -810 -628
2033 -628 387 1031 638 -381 -873 -447 542 1000 360 -502 -771 -225 472 843 302 -392 -514 -142 227
2052 227 474 369 -34 -373 -305 43 466 684 199 -402 -606 -58 627 820 253 -652 -746 -44 792 951 172
2073 172 -737 -963 39 849 905 -57 -869 -909 91 856 701 -174 -755 -709 -1 649 449 -212 -549 -452 -224
2094 -224 227 300 100 -230 -572 -543 -126 389 447 -118 -717 -794 -135 685 669 -243 -971 -796 51 755 676 -324
2116 -324 -993 -674 160 780 469 -340 -923 -506 351 645 339 -382 -694 -451 364 583 207 -259 -465 -351
2136 -351 126 327 80 -8 -278 -451 -246 281 501 158 -457 -768 -379 491 792 191 -658 -867 -220 643
2156 643 868 41 -786 -753 -135 574 609 28 -638 -641 -21 519 593 156 -488 -557 -134 461 555 290 -191 -421
2178 -421 -145 263 592 427 29 -429 -482 100 624 618 83 -648 -744 132 884 722 -155 -895 -671 295 929
2199 929 416 -406 -808 -399 297 610 265 -388 -581 -200 121 349 279 -123 -459 -285 -6 333 342 -48 -458
2220 -458 -404 -125 168 399 152 -380 -554 -221 241 555 450 -393 -882 -378 528 862 327 -514 -970 -284
2240 -284 730 898 93 -773 -820 3 766 660 -107 -544 -408 -79 306 429 99 -198 -365 -293 136 434
2260 434 445 -109 -556 -512 50 573 539 -45 -475 -492 21 500 643 34 -612 -609 -3 614 640 106 -668 -637 114
2283 114 660 541 -237 -659 -476 291 583 267 -249 -338 -200 105 279 160 92 -101 -381 -285 230 545 351
2304 351 -238 -621 -364 387 780 279 -462 -606 -149 550 717 136 -451 -560 -153 401 670 285 -479 -684
2324 -684 -200 463 624 212 -492 -644 -103 464 467 17 -334 -405 -110 130 138 184 146 -238 -420 -257 273 591
2346 591 278 -434 -729 -194 653 722 95 -601 -618 32 709 566 -165 -520 -489 126 617 517 -73 -483 -411
2367 -411 48 487 495 -35 -555 -285 102 430 380 -63 -372 -262 130 257 163 16 -137 -205 -207 -15 344 348 -61
2390 -61 -605 -504 142 769 480 -336 -910 -416 488 776 147 -506 -703 -217 463 497 82 -357 -419 -192 162
2411 162 428 268 -212 -469 -332 72 576 422 -184 -465 -309 175 428 415 10 -367 -331 -127 249 483 281
2432 281 -382 -656 -313 367 714 168 -639 -755 -41 664 531 -136 -716 -500 176 458 137 -231 -255 -187 -8
2453 -8 82 142 58 -80 -266 -357 120 399 210 -167 -485 -308 215 532 215 -175 -373 -274 96 495 435 -137 -448
2476 -448 -460 56 693 581 -183 -721 -467 341 776 441 -382 -704 -151 521 608 55 -292 -313 44 262 254 176
2498 176 150 -28 -311 -120 228 449 340 -262 -545 -112 490 543 120 -393 -505 -84 328 441 71 -209 -449
2519 -449 -256 218 420 149 -354 -640 -425 274 571 -26 -623 -640 -101 360 226 -291 -455 -394 -60 -9 -42
2540 -42 -92 -240 -331 -370 -201 120 229 -102 -660 -743 -53 487 224 -396 -826 -451 233 403 17 -471 -635 -313
2562 -313 22 235 60 -246 -564 -491 -186 296 224 -248 -633 -571 30 385 124 -432 -502 -326 -91 87 -6 -81
2584 -81 -222 -426 -504 -149 369 359 -312 -765 -507 199 624 228 -659 -859 -255 477 424 -126 -575 -601 -48 278
2606 278 185 -139 -344 -396 -249 135 217 67 -260 -375 -322 166 328 -23 -390 -382 -187 135 127 -31 -148 -191 -255
2629 -255 -264 114 343 64 -433 -555 -305 343 496 -191 -858 -696 -15 533 254 -466 -811 -388 129 227 -72
2650 -72 -405 -480 -347 -173 -84 -47 -133 -493 -666 -373 52 147 -158 -580 -759 -334 69 64 -180 -410 -548 -388 -114
2673 -114 27 -8 -263 -617 -591 -145 265 153 -435 -876 -441 212 490 2 -645 -626 -104 241 146 -235 -421
2694 -421 -233 -58 -100 -98 16 9 -241 -394 -228 38 337 -104 -608 -563 -43 281 224 -280 -587 -436 17 184
2716 184 83 -203 -460 -548 -232 279 245 -127 -569 -635 -103 464 425 -320 -661 -415 197 451 189 -312 -305 -32
2738 -32 186 163 98 102 101 -117 -233 2 463 528 72 -350 -251 298 687 495 -102 -386 -93 469 484 258 -80
2761 -80 -216 -94 240 460 367 14 -390 -252 194 524 287 -202 -375 -219 302 426 22 -322 -246 -20 140
2782 140 167 -40 -31 -34 -145 -143 123 321 161 -204 -412 -134 435 582 64 -490 -426 156 497 341 -125 -388 -158
2805 -158 228 365 214 54 -155 -273 -56 223 347 208 -286 -416 -54 334 405 33 -207 -272 -37 236 234
2826 234 64 -24 -172 -218 -29 278 383 111 -328 -480 14 616 498 -203 -599 -294 304 634 258 -289 -353
2847 -353 44 279 337 51 -194 -119 26 80 99 234 64 -134 -176 4 284 247 17 -218 -194 107 232 120
2869 120 29 -68 -166 -13 85 271 214 -87 -357 -213 211 540 151 -385 -539 -66 534 540 -24 -500 -309 180
2891 180 419 241 -132 -275 -5 82 152 190 128 -134 -186 -192 67 307 293 -226 -360 -217 79 261 229 -207 -409
2914 -409 -138 34 106 163 -49 -300 -360 -68 236 272 19 -442 -436 38 435 212 -210 -481 -273 237 294 -22
2936 -22 -258 -211 -61 -10 42 9 -22 -93 -203 -227 87 282 223 -203 -410 -167 319 443 81 -339 -364 11 296
2959 296 271 -49 -276 -227 -41 245 247 41 -264 -427 -102 248 372 47 -387 -437 -36 302 214 -101 -317 -199
2981 -199 -42 100 79 34 -3 -56 -305 -162 123 260 54 -364 -486 -112 364 367 -88 -514 -360 -6 376 134
3003 134 -217 -386 -246 6 136 175 -111 -443 -225 -53 184 185 -69 -296 -238 88 225 163 -71 -205 -158 131
3025 131 142 2 89 31 -168 -94 43 152 208 -27 -273 -222 121 475 146 -260 -391 -81 358 374 16 -326
3047 -326 -330 -23 253 237 56 -194 -176 -84 112 240 133 -142 -284 -200 -18 232 169 -169 -247 -210 55 153 102 -46
3071 -46 -246 -206 -8 135 272 121 -271 -293 -25 283 372 26 -285 -293 137 453 271 -107 -284 -203 239 316 39
3094 39 -135 -132 -59 0 120 97 24 -7 -125 -193 86 266 74 -154 -251 -84 124 184 114 -195 -241 -110 17 219
3118 219 192 -105 -379 -229 120 330 165 -249 -474 -166 259 344 95 -368 -421 -72 215 224 -42 -212 -276 -34
3140 -34 91 29 -43 -60 -157 -266 -115 135 183 -23 -270 -352 -150 183 247 -124 -353 -386 -102 143 154 -110 -308
3163 -308 -357 -172 112 188 -45 -311 -351 -53 194 206 -76 -346 -233 71 151 85 -76 -179 -182 14 148 37 -6
3186 -6 -99 -156 -126 29 155 135 -30 -253 -242 82 273 160 -237 -306 -230 183 295 60 -200 -298 -140 74 240
3209 240 24 -189 -224 -112 63 203 -58 -177 -354 -149 -17 115 63 -249 -275 -231 -81 14 33 -55 -210 -274 -149
3232 -149 -18 127 70 -208 -362 -160 99 239 -63 -350 -394 -98 263 149 -141 -302 -304 -108 164 137 -136 -173
3254 -173 -287 -41 26 20 -120 -276 -230 -160 27 -12 -143 -194 -189 -120 -44 37 12 -90 -160 -218 -88 98 119 -84 -289
3279 -289 -263 -21 157 177 -154 -392 -184 70 177 100 -224 -275 -123 175 217 49 -125 -171 -93 120 160 71 -10
3302 -10 -174 -118 49 225 157 50 -154 -138 -9 200 223 106 -120 -114 -81 210 242 129 -147 -169 -58 183 278 122
3326 122 -183 -186 2 229 229 -13 -266 -224 45 213 171 -4 -103 -100 77 91 67 72 -13 -85 -136 32 61 165 -5 -121
3352 -121 -154 52 165 133 23 -148 -157 -1 262 188 -66 -270 -162 145 276 134 -148 -249 -130 41 268 165
3374 165 -135 -239 -59 88 165 92 -106 -147 -44 125 47 56 -37 -33 -183 -53 44 134 109 -115 -261 -136 73 187
3398 187 140 -212 -251 -198 112 179 46 -160 -308 -109 126 152 31 -166 -261 -65 130 179 -37 -152 -144 -6 63
3421 63 122 1 -101 -39 -18 -11 186 98 -38 -66 -60 63 132 190 -12 -115 -85 40 202 156 -7 -117 -180 74 219
3446 219 177 -76 -267 -157 52 213 80 -43 -153 -91 125 149 54 -40 -85 -47 55 143 102 -18 -86 -113 -64 59
3470 59 55 15 -148 -215 -156 39 151 86 -112 -169 -138 47 239 95 -184 -345 -150 149 132 17 -210 -226 -89 78
3494 78 58 -32 -210 -238 -53 116 25 -44 -82 -102 -95 13 -1 31 -43 -132 -83 -20 151 91 -7 -102 -141 1 185 153 -12
3521 -12 -132 -195 -4 166 150 1 -217 -221 -5 247 140 -116 -258 -145 34 112 196 -120 -190 -123 71 75 71 -43
3545 -43 -144 -118 -65 75 77 35 -163 -196 -84 -1 78 95 -32 -145 -125 49 163 136 -79 -212 -159 102 131 56 -88
3570 -88 -211 -72 137 202 54 -100 -98 -37 118 155 87 23 -54 8 30 126 69 12 -76 -18 -21 -8 139 48 -115 -95 -25
3597 -25 64 187 56 -165 -164 40 188 196 12 -220 -189 39 147 112 -43 -266 -164 63 220 43 -36 -137 -112
3620 -112 -37 106 45 -56 -171 -110 -50 110 55 -23 -27 -49 -50 -57 138 143 -92 -93 -94 42 248 117 -158 -179 -125 57 223
3647 223 177 -104 -226 -38 190 224 97 -70 -168 6 197 166 105 -28 -72 -75 83 122 24 -48 -140 -92 62 94 51
3672 51 55 -81 -71 -3 103 118 -60 -77 -136 -101 106 159 -72 -158 -183 -34 104 117 -81 -234 -158 -11 91 133 -48
3697 -48 -207 -63 41 90 75 63 -147 -150 -2 112 116 67 -29 -83 -2 54 100 183 46 -83 -132 124 170 110 -39 -160
3723 -160 -117 45 233 132 -33 -152 -163 28 177 128 -147 -167 -80 96 180 53 -92 -110 8 58 116 83 -70
3746 -70 -47 22 -43 33 19 82 -40 -134 -84 3 87 21 -44 -155 -60 57 127 96 -97 -201 -53 134 184 24 -197 -191
3772 -191 42 153 158 -38 -147 -164 -25 189 61 -21 -121 -123 0 114 99 10 -59 -38 -86 14 92 80 -52 -84 -65
3797 -65 0 126 87 28 -89 -20 38 149 133 -30 -149 -89 98 182 117 -8 -136 -106 42 83 102 -85 -139 -80 40
3822 40 5 -36 -71 -155 -111 11 41 46 -69 -88 -124 -102 65 37 -29 -44 -201 -60 44 83 -31 -170 -211 -117 81 175
3848 175 -32 -173 -145 -24 142 96 -34 -185 -65 74 90 59 17 -103 -26 39 142 102 31 -30 -52 -5 67 84 95
3873 95 66 -49 -128 -17 117 158 12 -52 -99 23 164 100 -49 -182 -172 -29 154 137 -20 -163 -191 -21 122
3896 122 139 -52 -93 -67 15 164 58 4 -96 -6 47 104 62 21 -36 -64 -12 101 135 35 -66 -66 -18 56 69 93 -3
3923 -3 -126 -78 70 180 90 -76 -154 -42 127 191 30 -60 -121 -3 153 110 9 -77 -47 -38 65 111 42 -37 -44 -29
3949 -29 21 97 99 -35 -30 -22 -14 81 78 -63 -62 -143 -15 122 148 73 -118 -133 19 140 127 -37 -122 -80 21 103 22 -61 -119
3978 -119 -127 38 63 117 -23 -73 -82 0 -4 -33 23 -43 -138 -66 14 1 26 -65 -63 -72 9 102 11 -68 -90 -49 27 126 47 -101 -135
4009 -135 -68 38 137 35 -93 -97 -49 112 124 -1 -108 -126 47 152 62 56 -72 -82 3 116 70 -11 -21 -12 -18 -7 56
4036 56 60 16 -23 -93 -24 107 124 45 -97 -164 -33 192 91 -13 -160 -73 -36 84 121 -40 -91 -114 -6 76 94 -49
4062 -49 -23 -67 -32 114 115 -3 -127 -100 9 -7 25 70 -16 -46 -13 38 77 22 -15 -101 -71 106 68 73 -66 -65 -75 57
4090 57 131 24 -70 -101 -69 108 157 32 -71 -85 -58 22 171 34 -37 -10 22 -8 136 23 -43 -97 -21 36 66 95
4116 95 18 -78 -121 7 116 117 17 -53 -28 -65 98 118 62 -156 -61 29 136 99 27 -100 -151 75 143 68 -15 -54 -46
4143 -46 33 34 26 -26 -15 13 -13 52 25 38 44 26 -28 113 84 0 4 -18 -41 58 157 67 -2 -11 -58 14 145 43 -67 -77 -88
4174 -88 51 123 57 -43 -96 54 83 63 21 -76 -21 -45 117 88 57 8 -40 -5 70 82 62 44 12 -59 33 86 50 127
4202 127 -50 -25 43 123 126 44 -57 -48 -63 85 96 46 -64 -16 -16 65 102 -1 -20 11 33 91 122 -30 -97 -33 10 18 12
4231 12 77 -2 12 -49 42 -5 52 0 -96 -85 -1 42 83 -94 -113 -85 31 152 66 36 -45 -131 59 191 20 -44 -62
4258 -62 -69 111 153 84 9 -95 53 40 69 66 2 -10 -45 100 98 95 16 -7 13 -15 86 108 53 -99 -37 -48 44 84 113
4287 113 -74 -72 -34 36 72 3 -91 -149 -7 52 13 21 -95 -51 -19 -30 38 -25 -83 -122 -48 15 17 19 5 -44 -8 41 95 -64
4317 -64 -23 -47 -46 -12 52 83 -22 -48 -78 -3 79 58 -1 -64 -65 28 135 27 -43 -118 4 75 118 69 -54 -75 -26 51 51
4346 51 -3 40 -66 -50 68 17 53 14 -7 -49 -4 -14 73 -23 19 -63 -75 -3 33 -44 -52 -188 -68 98 36 -20 -32 -108
4374 -108 -69 44 80 -18 -120 -85 25 19 46 -6 -33 -18 16 -33 17 20 -70 -19 2 -34 90 22 8 -101 -14 16 72 25
4402 25 -18 -43 -79 -9 93 14 44 -26 -46 35 100 57 -34 -64 -39 61 92 91 23 -111 -27 23 120 36 22 -57 -41 60 58
4431 58 76 10 17 -16 20 20 45 -16 -69 -107 -51 26 46 22 -11 -104 -59 43 13 71 2 -100 8 66 -7 -22 -62 -110 -37 64
4461 64 80 9 8 -20 3 18 72 24 -55 -19 -53 -19 21 82 -31 1 -60 28 101 103 21 16 -22 66 77 140 60 -67 -14 5 44
4492 44 48 -11 -114 -11 -35 62 49 37 -54 48 -1 69 55 17 -32 -43 84 48 42 -6 -34 -68 -14 8 3 -27 14 -47 -27 -21
4522 -21 92 -18 -30 24 -104 -20 77 21 -74 -39 -76 50 129 35 -29 -23 -19 21 102 46 -56 -51 -32 -6 18 36 -74 -9 -7
4551 -7 46 54 21 22 -48 30 42 -16 35 69 -24 -14 -60 142 40 13 0 -44 29 29 74 -37 11 -52 50 67 87 6 -27 13
4581 13 18 29 19 -12 -40 -17 -15 11 42 0 -99 -60 40 36 -32 46 -39 -119 3 27 6 48 -34 -66 -7 -9 33 56 -57 -93 -82
4612 -82 82 37 18 10 -55 24 30 69 -25 -1 -13 -56 82 68 45 -57 15 -1 18 21 32 -43 -33 33 -12 23 -4 -55 0 15
4642 15 -26 57 78 30 -79 -24 -11 0 59 15 -126 -49 -68 11 42 -26 -97 -66 -36 77 22 38 -76 -89 13 -8 24 -33
4670 -33 -25 -41 49 26 13 11 19 -40 12 58 36 32 -73 -82 -38 16 94 55 12 -74 -37 5 43 36 -26 -24 -44 50 57 28 -64 -62 24 47
4704 47 45 -8 -78 -21 35 57 4 3 -8 -84 -59 28 26 45 4 -7 -17 -32 -1 1 27 -50 -96 2 25 9 -1 -68 -47 -34 72 75
4736 75 -73 -45 10 7 22 14 -41 -30 -27 -17 -14 48 22 -48 25 -7 24 -11 -44 -75 24 6 26 -14 -30 25 -70 -61 -36 36 43 69 -35
4769 -35 -54 -38 41 96 -43 -66 -82 39 59 15 -13 -65 15 3 60 28 -25 -32 -7 -22 46 68 -46 -24 23 16 56 8 -15 -70
4799 -70 2 -11 37 81 68 -38 -81 -18 -3 66 11 -35 -69 15 -29 32 39 -58 16 52 15 7 3 -38 -55 24 140 -11 -45 -18
4829 -18 -16 35 101 24 3 -59 -17 -8 17 65 -23 -27 24 -19 7 72 4 25 -77 -49 24 15 16 -35 -106 -46 30 55 104 12 -114 -44
4861 -44 -44 46 56 -3 -48 -76 7 49 88 21 -9 110 28 54 -29 37 26 -9 10 35 -11 83 20 -25 5 -7 78 21 2 -88
4891 -88 -65 81 84 -11 -22 -23 43 11 76 -18 -44 29 -5 30 25 -14 -33 61 45 23 29 16 -38 -19 7 1 95 -33 5 -51 -51 8
4923 8 -22 20 22 19 -65 62 -62 52 -44 -73 -76 0 63 38 -6 -81 55 -15 48 37 -5 -53 -77 26 37 7 -22 -88 -60 -21
4953 -21 63 64 -6 1 14 34 101 105 -27 -81 34 10 -18 3 48 -55 28 23 -41 32 60 -24 -49 1 59 34 -23 -51 -117 29
4983 29 57 14 1 -37 12 1 -25 -4 -20 -47 -10 -89 -2 9 6 -61 47 -21 -34 71 -9 -97 48 -32 -48 -16 32 47 -93
5012 -93 -17 -45 -8 83 -1 -75 -25 29 80 -36 24 -84 27 65 25 2 -5 -33 21 29 -18 66 -45 -50 18 30 26 67 16 -27
5042 -27 -2 -45 -12 59 -19 29 -78 3 81 62 10 -2 -44 -22 3 71 48 -57 -5 -55 1 -21 -34 -74 -76 -6 55 22 21 19 -23
5073 -23 13 19 -10 -7 -39 -37 8 48 61 7 24 21 -30 68 70 22 -20 -57 -22 17 88 -14 -59 8 3 -11 66 31 -20 -13 -33 -28 43 71
5107 71 -52 -41 -62 -3 45 100 41 -66 29 52 24 37 -51 -27 -22 -38 5 -4 12 -32 -85 47 32 62 -22 -83 -74 -7 28 93
5137 93 6 -22 -43 42 6 36 -44 -75 44 -58 6 -15 4 -33 -40 20 11 19 18 -86 -95 45 33 -15 -58 -52 -56 -70 29 12 26 -31
5169 -31 40 -23 -54 92 117 -43 -103 -12 29 70 13 21 7 -84 27 -19 59 -1 19 -20 -9 34 7 -19 24 -62 -33 -2 39
5198 39 2 -2 -9 -23 -27 42 31 26 -4 -10 -86 41 17 -51 11 -77 -24 17 14 -40 -127 -16 67 32 -73 -83 -59 13 22 1 -41 -18
5230 -18 -57 -60 22 -26 3 18 -15 -55 7 -11 16 8 -13 -20 -17 82 49 -53 -29 -37 45 73 -111 -97 -41 15 -11 -20 7 -1 -98 -62 33
5263 33 24 48 -47 -20 -19 38 6 23 -42 -11 -12 45 -26 8 77 -62 -45 -33 33 -55 -9 -13 -50 -31 -45 -4 -16 -111 -67 -5 -55 47
5295 47 8 -11 -13 5 45 8 -3 35 -8 -39 14 60 14 -46 -40 -51 -36 1 1 -107 -72 6 -25 -39 21 3 -13 -12 29 -89 45
5326 45 -88 1 -49 2 77 11 37 -89 -33 -5 31 -71 -18 -58 -4 35 80 19 -16 -61 -40 29 -4 59 73 -94 -46 20
5354 20 11 17 -17 -53 -91 -22 28 60 -28 -11 42 -27 39 52 7 -1 -55 -42 -20 75 83 -51 -22 -55 17 52 -9 -95 -51 86 -10
5385 -10 40 2 -42 -11 20 5 -27 -37 2 -37 -44 47 2 16 -34 -34 -13 -26 -52 19 -14 -66 -56 67 43 -48 8 -33 -61 4 61
5416 61 55 -3 -21 -79 14 -17 55 -3 -85 -23 40 30 16 -54 13 -20 35 20 -27 3 18 -57 -55 11 -27 32 14 -40 7 25 0
5447 0 13 -76 -109 47 -5 9 15 24 -81 7 -4 -26 11 33 -43 -94 -6 81 -51 -33 -37 -63 -1 33 -26 -56 -37 -1 -4 -21 81
5478 81 -12 -22 -32 -5 -67 60 -16 -34 -52 33 39 23 -12 -85 -33 4 16 16 36 -38 17 -29 18 36 10 -18 -84 58 65 60 -69
5509 -69 -25 -38 -64 80 1 -2 6 -33 8 57 23 -12 19 51 30 -31 -7 44 -11 -29 -26 -3 30 -3 -8 -47 -57 31 81 -46 -77
5540 -77 -44 3 38 7 26 -58 -46 -52 24 -18 -25 8 -79 -80 18 53 -50 -13 -65 34 32 -21 -42 0 -54 -12 0 -42 26 25 -19 -92
5572 -92 -72 -45 52 21 -32 -41 -27 64 84 88 -6 -60 -47 33 19 10 -43 -44 -4 25 55 21 -14 -37 -49 30 3 4 -41 -39 -49 27 39
5605 39 80 29 -15 -28 2 -28 19 56 -36 -11 -35 83 45 -37 29 -19 66 56 2 -7 -34 20 71 43 -6 4 -41 5 56 22
5635 22 25 38 -15 -16 -1 6 -27 47 -7 -10 24 42 9 21 -31 -21 -29 -25 -7 -20 -30 -10 29 56 13 40 -50 -71 -4 68 26 49 -86
5668 -86 -78 14 82 -27 -1 9 -32 -7 43 20 17 -10 -25 39 18 33 38 -7 2 78 8 32 21 -30 11 47 -10 76 59 11 -39 -42
5700 -42 -68 12 -29 3 45 -7 30 10 42 22 -5 3 77 -66 25 -16 -68 -13 25 -9 -27 -25 0 -30 30 -12 55 -15 -54 -15 -28
5731 -28 95 91 14 -25 0 -30 67 49 17 -8 34 36 9 46 38 3 24 -27 74 45 12 -26 -66 48 -7 -20 36 -29 -42 -26
5761 -26 20 25 -50 -55 -12 -7 -36 -13 9 49 -23 -38 -38 43 66 -42 -59 -43 50 -36 -64 -47 -32 -61 -18 21 27 -39 -26 -19 -32 65 23
5794 23 -62 -60 -12 31 3 -15 2 -64 32 59 61 107 -29 -7 -32 -42 50 8 18 36 -76 18 21 8 -38 -10 13 -15 95 71
5824 71 -9 -47 -34 -36 -7 16 2 -12 -21 -7 15 -3 -11 -41 3 19 40 -9 70 6 -6 -40 33 46 26 -3 -43 50 1 23 44 -7
5856 -7 -25 12 -40 37 86 -25 -17 -40 11 -36 -29 -21 5 0 -73 67 30 9 -24 -58 25 69 12 18 -66 -59 41 36 18 17 19 -57 -14 50
5890 50 67 10 -55 -21 -49 50 3 6 -27 -15 39 11 36 26 1 9 44 -35 48 -13 23 -2 38 67 47 25 -76 -47 5 -30 3
5921 3 -11 39 -2 -82 46 30 3 5 -63 -54 26 59 -105 -25 102 -52 -8 -16 -64 -78 -53 -9 -31 60 13 30 -14 -89 46 0
5951 0 15 -20 -86 -7 -12 -11 18 35 4 -31 32 13 -59 -32 -85 -31 20 -22 -18 -12 -53 -69 32 15 30 -17 -38 -30 -9 -18 -54 25 -29
5984 -29 -48 -85 -14 -3 -40 -26 -25 -37 21 -17 17 -48 -5 -10 4 -26 -4 -22 -89 9 -16 95 -15 -57 -48 -31 13 -36 13 -24 -44
6015 -44 -47 -41 -33 -43 -1 -58 -6 -28 -24 31 5 -80 -35 27 9 -47 -42 -50 -37 -2 71 30 -38 4 -20 -25 -58 8 -68 -65 -16 -37 -1 -21
6049 -21 30 -36 -30 -45 -11 -13 54 -34 33 -5 12 36 2 -63 -43 -22 -16 4 9 -11 -97 0 50 0 -45 6 -60 -48 16 -18 47 -22
6081 -22 -34 -51 -64 70 -45 -10 -39 -38 -3 31 1 35 -14 -50 -14 -23 -8 19 -1 -23 -35 -1 12 -32 -47 -22 -51 27 82 -30
6111 -30 13 -12 38 41 -31 -4 -24 15 37 18 9 -93 -53 -82 43 -37 10 -49 16 -60 -54 14 -30 -5 -70 -71 -33 9 52 0 -52
6142 -52 17 -18 -16 40 -12 -35 -29 -33 15 18 48 -27 3 46 31 58 -29 -30 -14 -69 -23 -1 18 13 24 10 64 18 59 4 -15 -23 6 61
6176 61 52 76 22 -20 35 28 48 30 -19 -35 16 50 -8 -44 -1 -50 -11 21 -10 -20 -58 -54 57 42 -2 71 -7 48 -4 41 14
6207 14 11 26 37 100 -8 -9 16 -3 -18 -36 22 49 66 -30 -10 -3 23 -14 -16 -44 -24 -35 14 -26 27 14 -67 20 5 18 38 94
6239 94 -22 -24 -22 8 -62 0 -5 -12 9 12 -30 -55 15 -16 11 60 20 -46 1 27 -22 10 69 6 -9 17 -47 10 48 31 -84 -53
6271 -53 -8 -50 -41 -51 -36 87 -6 52 28 15 23 11 36 11 55 14 -29 53 -12 -31 -5 20 42 2 -8 14 6 55 -2 -26 -33 4
6303 4 6 -16 -19 -48 4 -10 71 14 53 44 26 21 114 -22 -4 79 20 -32 30 44 -37 -65 -25 27 26 -16 74 -3 -52 26 -25 26 14
6336 14 21 -47 1 39 1 -1 49 -4 -24 37 23 -80 -27 -69 4 44 75 -9 -60 -17 -44 3 29 29 -74 29 38 22 15 18 44 -49
6368 -49 -22 -21 66 -7 -49 -32 11 16 10 51 -11 48 -18 47 56 -66 13 -28 -7 -6 -18 26 16 -21 -7 32 -29 -2 -28 60 -71 31
6400 31 7 28 -16 35 0 45 32 31 -26 -28 19 -45 36 -23 7 -37 -26 -15 9 21 9 4 7 -20 1 -16 70 -84 45 -40 47
6431 47 -23 14 -12 10 -5 77 -24 14 68 -32 17 18 70 22 26 -87 -1 22 -11 -27 -17 -25 52 17 26 5 26 7 -5 21 42
6462 42 35 61 -35 -23 -54 29 81 54 29 -31 37 31 -22 22 24 -24 35 -8 8 1 -37 -37 -11 18 13 -19 44 -39 5 79 32 52 -107
6495 -107 -20 35 -39 -12 -23 4 23 -24 -28 -18 -11 50 -32 9 27 3 -33 50 -38 -2 -25 80 22 -67 0 -24 -9 69 34 -29
6525 -29 41 24 39 82 -4 -40 -9 63 43 11 35 20 -21 -63 55 57 19 -41 -11 -41 -30 2 38 39 -32 0 -3 23 70 2 -46
6556 -46 9 35 0 -8 -70 -25 -83 6 18 18 40 -12 -30 -11 19 -23 10 8 65 0 57 30 46 19 -43 -13 -21 41 23 -17 -17 30 43
6589 43 47 -26 -2 -18 -70 -25 7 42 -53 -19 33 5 51 45 -26 -18 -32 14 -19 21 26 16 -69 8 -52 -2 48 -6 -14 38 24 83 35
6622 35 -13 -3 2 17 43 -66 -27 -27 -1 17 43 -19 -51 -18 -11 27 32 14 -27 -18 -8 75 39 -31 -6 -58 -2 -32 -3 -37 -21 -76
6654 -76 -48 24 28 65 -45 -39 -29 15 2 -11 -33 -25 -24 67 22 -44 34 3 -27 -51 16 1 -90 13 36 60 58 -14 3 -13 -35 -3
6686 -3 7 28 -25 -82 -13 -25 -16 -6 -23 -55 -29 -55 -51 -15 -1 -40 -77 50 56 40 22 -34 -38 35 70 1 8 4 21 52 41 -15 -47
6719 -47 -15 -50 13 52 -2 21 15 -6 51 -28 -6 25 30 -11 -11 -27 28 -3 -67 -67 -37 -46 -35 27 34 -45 3 -3 44 16 -78 -18 -47 29
6753 29 34 41 54 20 23 -28 6 1 19 -17 -26 11 13 -82 -27 -15 7 71 8 -48 -21 0 2 32 -8 49 34 -15 53 20 -5 42 53 -50
6787 -50 2 -31 32 34 -20 -68 -75 -37 40 60 20 -14 -66 34 14 -55 33 -53 -18 39 -3 16 32 -67 -18 -72 1 59 0 -39 29
6818 29 -10 -37 60 13 -23 42 -31 -17 9 22 -36 0 43 9 -12 -38 -42 17 28 -21 -16 70 -5 -19 -7 -54 2 -56 23 -9 12
6849 12 -38 -41 -17 -18 25 -63 10 5 37 2 -47 -46 7 75 30 -40 -34 -27 -5 49 -16 60 59 7 -16 2 9 -1 25 -16 -25 44 13 -2 21
6884 21 7 -5 -33 -39 20 38 -14 -5 -8 -20 -17 -4 17 -20 11 44 44 -39 -69 2 14 -37 27 -33 -30 -13 2 19 -20 8 -45 1 4 17
6918 17 15 -35 -67 7 10 49 44 -6 -39 -13 19 12 -49 46 -40 -51 4 -2 0 -16 -8 26 -16 -41 10 -39 -14 9 51 -9 4 -55 -37 -11
6952 -11 -58 0 26 14 -54 44 -45 58 19 -24 -25 -53 -31 11 24 -8 -1 -5 18 -29 22 -36 -4 -12 47 16 56 -4 -34 10 -24 30
6984 30 -42 -41 21 0 21 -35 -10 19 -51 -38 12 -48 7 43 10 -41 55 40 14 -11 31 44 20 30 9 -10 33 -12 -55 -47 27
7015 27 11 -32 -8 -22 -58 -19 -3 19 -46 -24 12 4 -42 16 17 -85 -1 -12 23 47 -13 -37 35 18 28 -27 -3 -38 -18 2 44
7046 44 -2 -6 26 23 -22 16 -39 -9 69 -14 34 -5 7 1 -11 0 -5 -13 63 -7 -15 -42 -15 5 0 -25 -33 9 33 -7 -16 44 -29 -12 35
7081 35 37 -9 -14 -73 -76 65 38 -65 -23 36 7 16 15 2 -9 46 20 26 37 -3 -2 -19 9 34 38 31 0 18 -16 -39 -12 53 35 -33
7115 -33 -59 -14 -12 90 32 -29 -51 -42 16 -15 -34 -1 -37 19 -19 -18 79 14 17 9 9 13 18 93 -2 0 21 -54 34 -38 15 45 -27 59
7149 59 -4 -64 -14 -10 19 8 9 2 8 12 -16 -78 -31 -25 38 37 18 -38 15 38 -59 2 -28 -32 -26 77 -34 -66 22 -4 -18 -2 -43 -36
7183 -36 -23 -40 2 -4 -51 53 -17 19 -1 -9 -44 -10 -29 10 4 42 -48 -12 83 42 43 53 3 36 -4 -7 20 49 11 -26 23 29 -46
7216 -46 29 61 -1 -40 -6 38 53 -32 -17 15 15 17 -8 -7 -9 -24 -52 -36 0 -14 -33 -71 -52 8 -37 33 -46 -9 -11 27 3 0 12
7249 12 87 16 37 1 -56 -18 16 4 0 38 -37 24 2 55 47 42 19 -62 7 5 -37 21 -4 13 42 0 43 -28 55 -18 5 -61
7281 -61 17 15 18 -27 45 16 -63 25 2 51 38 57 11 20 1 44 -56 -83 -27 -21 26 -19 40 12 2 -24 23 33 25 -5 29 30 75
7314 75 -22 -8 50 -6 -50 29 25 -12 -29 64 27 -2 -76 -15 -19 -1 18 -13 -1 50 -7 -8 32 -20 66 6 -107 35 -8 6 0
7345 0 69 -8 11 -20 -32 32 -35 6 23 -17 40 23 -7 5 -3 45 13 30 -4 17 52 39 41 18 0 -14 15 42 66 17 5 -17
7377 -17 32 -14 32 11 -3 -74 -21 25 38 53 19 -77 -15 -1 33 52 -26 2 -32 11 -51 24 25 6 -67 5 -47 -26 72 -10 12
7408 12 11 65 -26 -37 28 81 54 34 -10 54 30 -5 -55 -2 30 -13 3 -44 0 27 10 23 59 21 2 53 90 29 31 -49 -37
7439 -37 45 43 -2 23 11 25 -6 62 45 9 24 45 7 46 -27 30 64 -39 -41 -20 33 -56 6 -38 34 35 -55 2 2 -40 14 -3
7471 -3 -16 -17 -63 2 3 -1 75 -15 -24 12 23 5 55 -13 27 -46 55 20 -13 51 18 -54 48 16 -38 -26 41 -3 48 21 -10 46
7503 46 -12 -7 2 3 30 -14 -3 16 -50 -23 -16 -5 42 -27 -25 -37 -31 63 -19 -22 -8 59 -10 -6 -7 86 9 21 -8 -50 -43 15 -26 -21 -39 11
7539 11 6 23 43 -54 22 -34 31 5 56 -14 25 12 56 -10 -60 56 65 18 4 10 -19 -52 -39 90 15 -38 -9 -9 39 36 -3 -34
7571 -34 -17 -8 19 -29 -12 7 -18 -28 -64 72 -56 -5 -53 7 -37 90 -31 -28 -31 -23 27 -7 34 -7 29 -23 -53 -24 61 3
7601 3 -69 -67 -51 47 -7 -30 18 5 29 -7 -22 -45 64 2 -45 47 -32 -6 -24 -5 -32 11 9 -13 39 -89 52 0 30 -21
7631 -21 1 87 -47 31 -10 9 15 44 -25 14 -13 23 -23 -9 -34 46 34 -10 -49 -21 14 6 20 -13 -107 -31 36 48 75 -15 19
7662 19 10 36 50 -27 -69 48 -47 -77 -20 16 -12 -35 -19 -58 25 38 11 57 -16 -12 21 -38 -119 -11 -27 -31 64 -2 35 3 -22
7693 -22 -9 18 -49 8 -78 -14 21 81 -25 27 35 4 8 -113 24 -5 -14 15 -32 -51 -39 13 -53 -14 -20 -41 2 -65 -8 -69 19
7724 19 -75 26 -3 -27 -51 43 -19 18 7 -28 13 -13 44 57 6 -45 35 -22 8 -27 -32 16 -54 59 62 -14 3 10 7 22 -15
7755 -15 57 2 -1 -7 -33 -37 75 77 42 60 -59 -27 -28 63 50 -15 18 -33 -73 4 5 17 14 21 -47 35 18 39 -4 8 -36 -35 73
7788 73 -33 -59 -30 23 -35 25 -19 -14 -7 -31 18 74 1 37 25 -4 -57 -77 -9 -9 -19 -19 99 -8 13 1 -18 -28 -12 4 -29
7819 -29 43 -8 16 23 -41 -17 -14 -45 -31 23 56 -20 -20 -30 26 21 6 -1 -28 -41 -97 -34 20 33 -19 5 4 29 47 24 -19 17 -37
7852 -37 7 -4 7 13 -38 30 1 -27 -26 -18 9 17 5 -72 23 19 53 29 7 -17 -46 65 -18 12 -25 41 -22 -17 23 -30 -28 19 -27
7885 -27 56 27 9 43 25 37 -10 -13 -41 11 -15 16 20 45 -26 -9 20 10 -23 32 -32 -78 26 6 31 34 -5 -4 -48 -68 9 -2
7917 -2 18 44 4 -63 24 3 37 -34 47 21 -11 18 -23 11 23 -63 -78 -34 -33 6 18 63 52 49 -41 -15 19 30 -60 29 19 -23
7949 -23 -12 -24 12 17 1 16 17 35 -5 18 -8 8 -32 -42 12 54 -4 -2 19 -17 -27 44 -13 -16 45 69 -59 -9 37 -21 -19 40
7981 40 24 36 -2 57 -11 15 7 -41 27 20 11 15 16 26 -31 -42 29 44 59 34 -21 -51 12 -4 33 29 14 -6 -46 2 59 13 -32
8014 -32 35 -19 1 48 39 71 37 -53 -49 -5 -71 -16 -65 -34 48 59 16 10 6 50 18 32 -9 33 -22 4 -5 -23 23 8 -32 35 -12
8047 -12 2 26 -54 -1 -5 3 20 48 60 28 14 19 -27 69 16 51 -60 51 -16 -78 -18 35 27 13 25 4 -20 52 -38 -76 33
8078 33 62 -55 -32 13 20 -20 -14 42 -8 -12 -10 -35 10 7 -28 12 17 -4 39 -34 -30 -77 20 -17 -30 10 -32 -7 45 -32 -3 35 -16
8111 -16 17 29 -9 -15 -21 -10 -16 -4 -56 60 66 14 -48 22 24 -11 31 45 22 81 3 -3 15 10 30 -8 -5 44 -2 6 -24 33 -34 -35 -18
8146 -18 43 -49 23 8 -34 -1 22 -29 -55 80 13 -1 24 12 -28 -17 25 -18 3 -48 -20 -60 55 30 -59 46 -29 12 -44
8175 -44 -10 2 5 2 -73 38 20 -16 -24 1 -40 4 48 -68 24 3
8191C
$$ Imaginary data points
##PAGE= N=2
##DATA TABLE= (X++(I..I)), XYDATA
0 0 0 0 0 0 0 0 0 0 0 0 0 0 0 0 0 0 0 0 0 0 0 0 0 0 2 -4 5 -5 8 -8 8 -8 8 -8 12 -13 13 -13 16 -20 21 -21 25 -28 30 -33
46 -33 38 -41 47 -54 62 -70 81 -94 114 -142 188 -266 432 -928 5115 28855 22208 -4245 -20953
65 -20953 -11221 11796 23916 13844 -4343 -11668 -3697 9299 16477 12558 1752 -7093 -6665 2918
79 2918 14244 14835 1963 -10571 -8782 4019 13226 9370 -3134 -10895 -6534 2681 6518 3515
93 3515 -2207 -6953 -8219 -4681 1396 5116 1122 -9285 -14715 -6682 6249 8301 -3438 -15688
107 -15688 -14123 -242 9454 3534 -9304 -12744 -4631 3706 3481 -2753 -6026 -3042 -194 -1298 -2047
122 -2047 1001 3415 783 -4181 -5360 203 6577 5715 -1166 -4710 -1822 3023 4921 3472 796
137 796 -960 -1686 -1328 2226 6967 6221 -1242 -7030 -3991 5124 10118 4454 -5531 -7406 281 6878
153 6878 5786 254 -3146 -2243 -159 294 1252 4426 4512 -1992 -8170 -4898 5854 11824 4148 -9846
169 -9846 -12778 63 13268 11090 -3272 -13376 -8607 5050 11857 5287 -5447 -9400 -5017 2901
183 2901 7765 5289 -3092 -9847 -8108 1472 10177 7301 -5513 -13744 -7690 5380 10615 2437 -9424
198 -9424 -11272 -2241 5547 4429 -1255 -4934 -5263 -4048 -2058 1205 4142 1770 -6617 -11319 -4683
213 -4683 6881 9492 -722 -12879 -12697 493 10804 6719 -5747 -12270 -7361 2209 6420 2393
227 2393 -4256 -7191 -5794 -1626 3137 4282 -668 -7306 -8650 -2681 4752 5339 -2132 -8710 -6634
242 -6634 170 3522 971 -3341 -4613 -2625 -1407 -1635 -276 1855 84 -4961 -6882 -2162 4723
257 4723 5553 -2047 -9179 -6250 3038 7358 1952 -5978 -7304 -1228 4643 3676 -1027 -3072 -1984 -779
273 -779 -206 749 1788 1535 -1546 -4493 -2435 3331 5556 1258 -4665 -5768 -998 4570 4884 366
289 366 -3636 -4153 -1883 2011 4818 3255 -2165 -6725 -5128 2678 9158 5461 -5497 -10881 -3871
304 -3871 7311 10154 1456 -8685 -8304 1171 7842 5131 -1836 -5316 -3083 1019 2852 2239 1489
319 1489 -167 -3025 -3689 255 4684 4746 -523 -5710 -4624 2218 6595 3609 -2567 -5439 -2963 2012
335 2012 4625 2971 -889 -3768 -3916 -474 4610 5305 -354 -6614 -6134 1045 7709 5363 -3711 -8842
351 -8842 -3741 4539 6551 792 -5476 -5297 15 3349 1882 -640 -1624 -1932 -2201 -1421 942 3084
367 3084 1672 -3211 -5822 -2135 3739 4939 161 -5299 -5490 -204 4380 3646 -666 -3962 -4039 -1259
383 -1259 2358 3703 1362 -2490 -4768 -2851 2388 5304 1897 -3816 -5647 -1709 3628 4580 547
398 547 -3606 -3280 -589 1324 1526 1050 -46 -1554 -2860 -2026 1714 4730 1997 -4329 -6682 -1750
414 -1750 5079 6273 -192 -7011 -6048 1164 5909 3564 -2692 -6198 -3661 1714 4200 2011 -1876
429 -1876 -4360 -3759 -26 3267 2810 -1136 -4585 -4089 172 3955 2612 -2011 -4495 -2750 710 2601
445 2601 1550 -826 -1883 -1981 -1629 207 2760 2794 -885 -4579 -3927 1525 6342 4201 -3241 -7110 -2881
462 -2881 4544 7090 2137 -4699 -5674 -318 4669 4545 699 -2933 -3359 -711 2536 3601 2107 -1084
478 -1084 -3501 -2413 1600 4073 2344 -1445 -3506 -1864 1552 2980 1361 -1051 -2083 -1947 -629
493 -629 1409 2414 1018 -1985 -4111 -2338 2228 4264 775 -4217 -5016 -652 4201 3782 -1350 -5050
509 -5050 -3277 1169 3246 1583 -1511 -2890 -1555 358 1264 1295 534 -1227 -2364 -1395 1311 3136
525 3136 2116 -1420 -3777 -1822 2284 4016 2036 -1707 -3549 -1692 2252 4153 2432 -1375 -4075
540 -4075 -2897 1806 5197 3364 -1976 -5400 -3161 2600 5643 2290 -3691 -5296 -1657 3166 4085
555 4085 540 -3309 -3427 -775 1193 1554 763 -550 -1666 -1925 -958 1089 2747 1229 -2276 -3623
571 -3623 -1239 2692 4186 1390 -2859 -3638 -138 3575 4102 1249 -2292 -2951 277 3996 4602 1662
587 1662 -2111 -3020 550 4886 5125 1109 -2759 -2356 1867 5234 4022 -161 -2103 -602 2164 3375
603 3375 2530 729 -266 -307 25 1246 2857 2890 442 -2075 -1810 1362 4250 3484 -786 -3525 -1917
620 -1917 2132 4560 3073 -963 -3321 -1693 1947 3964 2936 -267 -2871 -1919 1580 4074 3256 -25
636 -25 -2729 -1996 1423 3723 2770 169 -1722 -1452 604 2460 2330 1091 -754 -1994 -1288 1550 3486
653 3486 2204 -1333 -3711 -2275 2106 4351 1740 -2904 -4361 -1387 2923 3856 174 -3658 -3698 -344
669 -344 2637 2635 -192 -3079 -2827 -119 1998 1932 1 -2001 -2143 -302 1690 2074 807 -995 -1796 -741
687 -741 1254 2228 1825 104 -1591 -1528 769 3133 3144 727 -2316 -2730 702 4384 4227 135 -3547
704 -3547 -3030 1463 5127 3647 -1078 -3930 -2131 2159 4366 2312 -1599 -3123 -1282 1356 2601
719 2601 1585 -719 -2118 -1505 100 1466 1596 63 -1849 -2088 -674 1062 1736 748 -1429 -2581
735 -2581 -1538 667 2104 1352 -1245 -3149 -2016 1080 2776 1427 -1978 -3786 -1945 1790 3038
750 3038 647 -2487 -3434 -1167 1833 2274 -72 -2305 -2527 -983 1003 1550 324 -1426 -2188 -1862 -260
767 -260 1483 1354 -874 -2872 -2746 -544 1865 1921 -836 -3633 -3302 -464 2347 2301 -919 -4091 -3708
784 -3708 -424 2470 2211 -1274 -4442 -3760 -91 2439 1374 -1873 -4118 -3338 -406 1515 453 -1687
800 -1687 -3128 -2951 -1354 32 79 -933 -2209 -3189 -2708 -799 605 70 -1968 -3978 -3664 -927 1633
817 1633 824 -2339 -4491 -3560 -141 2286 863 -2877 -4616 -2609 893 2643 628 -2813 -3918 -1626
833 -1626 1498 2324 397 -2366 -2963 -673 1700 1919 182 -1563 -1939 -600 1019 1390 614 -408 -1255
850 -1255 -1226 -91 1178 1487 256 -1692 -2466 -774 1676 2234 214 -2562 -3315 -1080 2073 2412 -409
867 -409 -3281 -3337 -765 1973 2032 -873 -3230 -2960 -669 1530 1573 -555 -2649 -2590 -805 851 1311 88
885 88 -1765 -2315 -1098 537 1469 947 -849 -2314 -1769 317 2091 1896 -446 -2683 -2049 784 2757
902 2757 1940 -1001 -2925 -1750 1464 3042 1418 -1466 -2758 -1279 1537 2472 701 -1613 -2220 -908
918 -908 1044 1716 413 -1370 -1838 -998 150 1031 710 -609 -1565 -1669 -762 768 1473 159 -2013 -2688
936 -2688 -1221 1289 2374 450 -2661 -3458 -1129 2023 2835 347 -3143 -3595 -479 2677 2672 -135 -3053
953 -3053 -3058 45 2660 2205 -353 -2266 -2087 -16 1923 1665 34 -1219 -1374 -380 918 1469 841 -363
971 -363 -1301 -1206 182 1763 1818 90 -1736 -1904 39 2282 2248 -175 -2321 -2050 460 2579 2147 -671
989 -671 -2651 -1792 815 2425 1643 -990 -2491 -1373 974 1992 1022 -938 -1930 -1157 608 1392 868
1006 868 -319 -1356 -1366 -152 1168 1392 333 -1211 -1961 -723 1447 2100 711 -1494 -2463 -896 1835
1023 1835 2675 798 -1831 -2519 -673 2047 2768 535 -2014 -2291 -224 2047 2372 390 -1712 -1747 -129
1040 -129 1418 1662 642 -910 -1279 -497 573 1347 1159 -166 -1401 -1346 -80 1503 1794 233 -1755
1057 -1755 -2118 -192 1945 2088 37 -2347 -2341 140 2431 1896 -654 -2669 -2100 648 2499 1418 -1173
1074 -1173 -2408 -1390 945 2049 841 -1260 -1829 -757 735 1349 582 -642 -1235 -683 145 785 939
1091 939 192 -794 -1189 -595 737 1651 943 -981 -2004 -922 1087 2299 1261 -1288 -2582 -1027 1637
1108 1637 2627 995 -1644 -2697 -773 1971 2438 549 -1725 -2288 -653 1556 1935 365 -1256 -1628
1124 -1628 -701 878 1541 697 -677 -1381 -1096 148 1367 1250 -133 -1357 -1531 -285 1488 1787 86
1141 86 -1702 -1856 -181 1927 2070 76 -2034 -1763 351 2146 1835 -181 -1934 -1344 711 1879 1362
1158 1362 -245 -1390 -984 592 1511 1118 63 -784 -869 47 1060 1312 766 -372 -1152 -658 930 1841
1176 1841 1187 -441 -1781 -1162 1129 2489 1428 -912 -2218 -1227 1361 2795 1320 -1428 -2403 -898
1192 -898 1635 2648 945 -1550 -2170 -373 1505 1921 599 -1128 -1446 -329 884 1112 640 -249 -928
1209 -928 -689 153 878 1186 517 -834 -1343 -376 1005 1706 842 -964 -1884 -573 1496 2060 614 -1416
1227 -1416 -2031 -343 1794 2012 208 -1635 -1727 49 1857 1695 -212 -1623 -1253 290 1557 1248 -214
1244 -214 -1281 -917 178 967 953 152 -752 -887 -296 543 1136 757 -527 -1379 -890 555 1566 1238 -679
1263 -679 -1991 -1161 858 1903 1079 -880 -2117 -1074 1107 1985 910 -979 -1974 -948 1019 1772
1279 1772 736 -843 -1510 -844 660 1379 721 -319 -1009 -845 41 1071 1196 189 -765 -1169 -497 994
1297 994 1747 683 -994 -1577 -611 1285 2182 743 -1429 -1876 -167 1729 2112 321 -1642 -1664 215
1314 215 1733 1547 -31 -1492 -1220 334 1456 1053 -183 -1091 -969 113 913 675 2 -621 -832 -456
1332 -456 357 713 454 -316 -1088 -1102 15 1248 1077 -370 -1754 -1614 71 1724 1353 -723 -2176 -1632
1350 -1632 451 2004 1286 -1027 -2330 -1260 796 1807 912 -1006 -1869 -941 625 1134 678 -493
1366 -493 -1331 -901 188 915 777 17 -1007 -1180 -392 639 1001 456 -830 -1462 -700 651 1288 572
1384 572 -964 -1734 -981 853 1547 454 -1200 -1818 -667 1056 1430 87 -1348 -1365 -346 975 1129
1401 1129 -58 -1061 -1020 -158 629 882 209 -589 -862 -465 252 843 698 -271 -1091 -869 196 1176 1138
1420 1138 -274 -1520 -1203 349 1525 1258 -309 -1757 -1315 510 1779 1092 -675 -1758 -1185 728
1436 728 1758 836 -805 -1613 -838 659 1281 562 -590 -991 -554 178 737 683 -53 -539 -710 -525 393
1455 393 1098 701 -385 -1092 -750 470 1528 969 -647 -1551 -748 870 1827 984 -855 -1631 -480 1266
1473 1266 1693 601 -1013 -1482 -164 1348 1441 191 -958 -1154 -37 1084 1050 115 -766 -751 -172 700
1491 700 730 263 -352 -671 -540 150 859 771 -44 -964 -1083 -110 1209 1219 -136 -1410 -1297 77 1473
1510 1473 1322 -275 -1580 -1206 338 1560 1228 -296 -1507 -1034 310 1286 1068 -127 -1110 -884 210
1527 210 992 918 228 -642 -927 -201 669 1102 651 -396 -1086 -525 574 1309 915 -391 -1326 -959 758
1546 758 1647 866 -695 -1528 -784 967 1640 570 -951 -1399 -346 958 1323 271 -949 -996 -179 624
1564 624 797 218 -633 -748 -185 234 575 409 -246 -706 -570 -50 530 843 181 -813 -1081 -183 842 1236
1584 1236 359 -1075 -1421 -73 1320 1430 163 -1355 -1495 129 1659 1397 -203 -1368 -1111 351
1600 351 1494 981 -288 -1033 -735 274 964 757 -113 -650 -532 -102 553 812 351 -323 -672 -532 190
1619 190 878 744 -286 -958 -752 187 1086 924 -386 -1328 -929 322 1192 809 -573 -1486 -706 614
1637 614 1177 578 -682 -1300 -505 604 946 313 -507 -857 -428 443 784 328 -273 -562 -558 73 704 692
1657 692 40 -732 -880 -132 935 1166 140 -958 -1019 -222 1118 1321 49 -1252 -1184 27 1342 1309
1675 1309 -67 -1348 -1101 130 1096 1004 -142 -1174 -919 118 886 635 -76 -702 -728 -191 417 629
1693 629 343 -224 -797 -705 123 779 693 -75 -1026 -1128 120 1098 990 -162 -1251 -1161 307 1451 954
1712 954 -474 -1381 -886 513 1471 753 -732 -1173 -444 638 1137 502 -557 -915 -237 478 697 333
1730 333 -238 -621 -315 154 404 579 148 -477 -577 -159 457 821 502 -546 -1039 -410 710 1081 385
1749 385 -743 -1361 -383 1022 1186 216 -1036 -1275 -268 1052 1163 112 -964 -1027 -188 853 920 -4
1767 -4 -727 -717 -185 493 812 350 -451 -632 -446 153 836 666 -139 -755 -670 62 889 939 -49 -1013 -848 210
1789 210 1041 1002 -130 -1113 -839 377 1171 794 -291 -987 -543 580 1002 443 -284 -687 -361 353 677
1808 677 406 -170 -381 -382 55 530 529 167 -236 -426 -204 498 936 379 -331 -868 -388 656 1289 556 -641
1829 -641 -1115 -331 926 1399 577 -914 -1246 -104 1106 1314 284 -952 -983 56 1029 1019 164 -653
1847 -653 -700 15 700 795 262 -144 -527 -287 303 619 565 121 -444 -683 -62 665 840 245 -634 -1025 -186
1868 -186 975 1047 122 -941 -1046 13 1082 997 -143 -985 -840 200 992 831 -220 -910 -565 298
1886 298 792 684 -164 -717 -458 198 516 545 36 -449 -483 -27 424 647 394 -329 -770 -380 513 915 532
1907 532 -436 -1008 -466 687 1070 488 -594 -1069 -402 764 1163 329 -677 -875 -308 727 1048 381
1925 381 -547 -687 -192 470 829 392 -238 -497 -333 75 624 632 137 -426 -604 -101 635 947 369 -689
1945 -689 -864 -81 829 1079 329 -882 -881 45 1034 1000 94 -895 -806 343 1075 721 -115 -692 -491 362 867
1966 867 514 -175 -477 -301 245 557 364 -88 -294 -307 -112 241 434 276 -157 -514 -445 187 654 499 -334
1987 -334 -852 -641 262 947 555 -489 -1206 -593 431 1022 450 -686 -1171 -472 566 919 272 -677 -1035
2006 -1035 -431 568 718 155 -443 -694 -403 223 436 267 -154 -597 -710 -125 508 537 6 -589 -768 -276
2026 -276 475 644 60 -696 -965 -322 571 823 31 -847 -836 -182 706 797 -141 -919 -703 33 652 543 -93
2047 -93 -597 -412 98 458 389 107 -303 -392 -170 318 492 391 -129 -640 -370 308 755 567 -176 -767 -536
2068 -536 362 1003 585 -320 -851 -568 499 1070 571 -424 -967 -462 624 1097 419 -527 -784 -249 556
2087 556 759 264 -391 -449 -148 265 512 417 18 -210 -294 -33 416 618 428 -316 -566 -265 503 960 552
2108 552 -397 -785 -202 690 1065 444 -519 -824 -90 809 923 279 -515 -712 17 815 827 120 -532 -497 0
2129 0 596 592 20 -364 -341 -4 400 494 102 -142 -274 -183 117 480 499 -4 -467 -449 147 837 757 -56 -709
2152 -709 -497 429 1040 725 -198 -750 -269 552 986 624 -102 -573 -141 588 886 626 11 -350 -246 385
2172 385 790 616 68 -189 -228 240 731 652 330 -123 -336 -89 531 887 514 -154 -550 -276 640 1115 516
2193 516 -393 -725 -121 802 1105 290 -637 -556 252 834 783 137 -376 -186 285 575 590 261 -57 -170 144
2214 144 465 567 402 36 -244 9 349 529 544 221 -299 -252 259 650 709 265 -407 -480 163 948 936 16
2236 16 -735 -592 383 1158 782 -204 -795 -415 477 1010 520 -340 -564 -128 353 554 446 -1 -367 -295 7
2257 7 396 510 287 -306 -546 -152 329 712 298 -277 -618 -179 367 605 417 -197 -598 -290 366 724 448
2278 448 -236 -699 -368 528 804 275 -419 -586 -82 623 642 85 -353 -312 11 389 394 140 -13 -116 -198 -32
2300 -32 423 522 119 -320 -436 -28 635 678 -56 -665 -430 216 716 525 -112 -691 -429 249 586 466 -66
2321 -66 -526 -538 158 652 482 -88 -631 -594 240 621 311 -144 -477 -221 97 291 169 3 -96 -256 -324 -13
2343 -13 502 439 -13 -574 -579 116 791 560 -266 -736 -362 436 782 339 -453 -651 -219 368 589 153 -386
2364 -386 -553 -171 284 467 259 -316 -591 -168 339 404 153 -381 -470 -132 313 288 61 -150 -210 -160 10 257
2386 257 300 136 -205 -563 -135 478 753 152 -608 -743 60 815 666 -133 -746 -455 199 645 507 -94
2406 -94 -500 -343 29 452 471 95 -287 -392 -88 349 575 209 -360 -546 -85 321 474 192 -242 -449 -261
2427 -261 121 312 330 -32 -515 -483 -21 598 570 -141 -797 -620 275 758 313 -485 -683 -236 427 476 -46
2448 -46 -424 -335 -65 121 204 55 -84 -175 -291 -213 289 357 25 -415 -433 -77 326 445 -12 -408 -380 -63 281
2471 281 434 129 -343 -579 -167 341 633 267 -477 -794 -99 601 688 -21 -679 -679 244 773 447 -182 -458
2492 -458 -225 261 402 139 27 7 -124 -259 60 365 430 68 -404 -410 62 608 373 -158 -493 -330 163
2513 163 437 324 -175 -397 -267 58 374 408 43 -467 -426 77 579 530 -93 -612 -363 329 494 149 -245
2534 -245 -367 -36 217 242 -13 -28 -97 -162 -147 126 239 253 -105 -541 -318 395 593 140 -536 -627 -35 572
2556 572 492 -171 -528 -411 -8 344 255 -54 -341 -412 -250 168 402 125 -488 -581 -213 280 338 -92 -540 -532
2578 -532 -150 130 5 -61 -250 -358 -326 -221 -12 257 92 -506 -768 -294 486 533 -102 -909 -728 71 621
2599 621 292 -444 -774 -415 228 336 -15 -291 -358 -293 -52 231 88 -121 -326 -338 -107 273 224 -89 -473
2620 -473 -305 -10 202 95 -142 -247 -193 -53 -2 208 229 -53 -420 -375 53 556 443 -342 -781 -264 478
2641 478 658 144 -629 -593 -29 505 411 -74 -304 -258 -10 251 242 184 -7 -259 -248 208 463 388 -22 -369 -247
2664 -247 216 639 365 -121 -203 -127 111 348 345 126 -131 -199 -60 317 603 253 -363 -422 -2 606 534 -71
2686 -71 -589 -290 349 428 110 -225 -392 -82 97 112 -37 12 -23 -242 -275 -10 205 168 -196 -599 -358 168
2708 168 418 83 -414 -510 -180 259 325 24 -292 -353 -244 84 396 251 -237 -481 -278 239 661 367 -332
2729 -332 -497 21 561 557 55 -345 -228 268 366 224 89 87 67 -62 -87 146 430 393 -234 -435 -17 501 582
2752 582 149 -378 -375 139 470 434 52 -247 -282 37 365 347 131 -210 -338 -35 401 511 58 -317 -320 72
2774 72 500 443 -39 -300 -65 203 366 246 -12 54 61 125 62 303 407 191 -179 -188 148 568 537 -114 -436
2797 -436 -154 466 621 269 -278 -336 26 410 377 87 -101 -239 -79 141 381 282 4 -313 -254 115 466
2818 466 277 -198 -370 -210 95 240 164 -157 -104 -189 -118 2 284 203 -150 -392 -304 182 573 251 -447 -561
2840 -561 -108 431 511 -58 -577 -344 157 336 197 -156 -345 -119 33 103 -49 47 -77 -258 -219 63 220
2861 220 124 -160 -372 -225 164 246 -1 -153 -170 -156 55 135 165 0 -209 -335 -66 451 408 -58 -456 -367 204
2884 204 629 374 -304 -552 -155 417 508 93 -306 -287 16 226 244 105 13 -143 -147 -31 158 249 93 -270
2906 -270 -389 -41 296 311 35 -289 -331 -16 275 225 64 -85 -267 -159 137 301 177 -192 -332 -178 258
2927 258 468 129 -328 -375 -9 336 331 -105 -288 -77 164 158 127 59 -19 23 -103 -61 158 269 22 -325 -317 25
2951 25 348 372 -107 -386 -165 248 387 228 -150 -337 -158 210 291 207 -51 -262 -337 94 363 261 -121 -447
2973 -447 -283 253 363 176 -279 -321 -128 77 174 30 -40 -49 -109 -216 7 287 256 -93 -411 -286 114 442
2995 442 290 -276 -513 -191 313 419 144 -312 -296 -28 265 185 101 -168 -281 -55 206 303 148 -96 -273
3016 -273 -85 296 364 145 -186 -153 -3 265 165 16 -35 -41 -108 -8 101 158 50 -180 -352 -134 221 343
3038 343 -63 -449 -405 -13 378 213 -250 -480 -203 63 234 107 -179 -336 -192 44 100 83 45 -248 -270 -64
3060 -64 184 252 11 -175 -245 -61 192 211 47 -114 -195 -39 163 148 214 -45 -220 -226 193 383 290 -89 -251
3083 -251 -90 361 501 181 -239 -349 28 353 341 18 -190 -75 35 114 122 7 -27 -82 -95 14 109 243 27
3106 27 -192 -97 -24 186 196 29 -235 -156 86 157 236 59 -235 -229 -5 225 371 81 -309 -331 2 398 297
3129 297 -66 -319 -280 134 391 208 -134 -254 -83 115 176 118 -55 -97 -134 -144 85 220 123 -107 -298 -211 45
3152 45 301 162 -251 -294 -158 60 245 160 -145 -328 -159 83 256 158 -80 -267 -200 123 269 122 -169 -300
3174 -300 -119 235 241 81 -54 -125 -46 124 169 56 -3 -52 -90 -23 176 200 148 -102 -201 -73 252 261 -5 -239 -261
3199 -261 -60 185 311 -33 -273 -210 35 222 268 -65 -259 -181 51 133 221 14 -258 -253 66 182 239 19 -183
3222 -183 -151 -17 155 168 96 -7 -106 -80 -4 191 218 63 -268 -208 25 333 233 -43 -274 -246 149 386 157
3245 157 -154 -238 -183 138 287 154 -212 -213 -29 108 178 47 -104 -187 -10 19 50 154 -105 -188 -96 46 59 75
3269 75 -10 -98 -225 -75 2 81 118 -125 -240 -107 147 213 86 -221 -374 -83 187 184 -3 -332 -265 15 167
3292 167 130 -79 -220 -229 2 113 145 -80 -199 -140 -39 46 102 -5 -167 -222 -194 45 165 111 -120 -300 -235 -27
3316 -27 103 130 -125 -313 -184 -59 246 135 -112 -330 -267 61 147 88 -72 -381 -153 62 177 41 -127 -171
3338 -171 -146 59 109 42 12 -36 -126 -76 92 125 48 -143 -214 -99 105 139 -27 -165 -248 -110 146 178 18 -230
3362 -230 -201 -63 121 185 33 -316 -270 -55 134 202 -93 -300 -315 -63 87 69 -85 -226 -228 -44 -15 13 -100
3385 -100 -157 -260 -203 -78 -2 18 -75 -258 -292 -76 44 38 -97 -265 -340 -127 120 97 -121 -350 -212 -73 161
3408 161 104 -89 -311 -215 -85 131 98 -211 -270 -186 8 26 64 -180 -236 -169 -50 -71 2 -83 -217 -199 -180 -6 -30
3433 -30 -26 -156 -282 -172 -7 91 -21 -202 -344 -109 51 191 -20 -254 -258 -73 107 106 -57 -231 -201 -15 64
3456 64 79 -44 -186 -152 -62 70 140 44 -111 -100 -113 14 99 127 -47 -186 -159 -75 73 169 -61 -209 -229 -39 135
3481 135 203 -34 -236 -289 9 290 166 -15 -304 -149 30 235 131 -130 -253 -161 36 155 69 -11 -32 -29 -25
3504 -25 82 138 30 -48 -51 30 61 132 55 -44 -86 -56 55 203 108 -28 -145 -162 60 200 167 -120 -200 -141 118 198
3530 198 95 -179 -236 -61 84 132 53 -228 -218 -61 130 70 50 -79 -123 -65 103 139 21 28 -58 -113 24 124
3554 124 130 -1 -94 -116 -44 253 201 14 -97 -86 18 154 307 58 -127 -175 14 225 200 82 -148 -78 73
3577 73 123 161 29 -157 -34 109 24 109 6 -33 -53 41 53 115 76 -18 -135 -69 75 91 72 -53 -238 -210 55
3602 55 198 28 -85 -190 -99 60 158 72 -128 -145 -40 72 194 -14 -219 -81 -2 84 140 58 -121 -98 -1 73
3626 73 89 88 15 -30 -12 18 140 179 124 -48 -70 -14 139 271 128 -67 -133 42 164 249 87 -98 -186 2 142
3651 142 218 17 -79 -108 25 136 65 -39 -152 -67 -23 46 -4 -37 -105 -132 -58 41 38 -32 -76 -113 -147 25 135 38 -35
3678 -35 -136 -98 -30 173 148 -66 -171 -84 125 145 118 -50 -143 6 150 193 50 -39 -129 -19 90 153 140 -24
3702 -24 -61 23 84 102 153 -15 -44 -45 12 143 73 15 -84 -133 -54 103 163 36 -133 -211 -149 163 168 -2 -216 -213 -65
3729 -65 61 203 -37 -211 -170 -4 96 102 -89 -109 -154 19 74 50 -22 -122 -74 -55 61 36 60 -16 -73 -106 46
3754 46 89 47 31 -35 -67 -22 113 108 -37 -106 -165 22 151 83 -102 -208 -162 48 150 125 -73 -151 -38 85 217
3779 217 100 -38 -93 -5 74 118 70 -59 -127 -22 60 122 146 112 10 -109 18 57 179 62 -90 -146 -3 94
3803 94 149 93 -78 -159 -58 93 161 59 -108 -166 -44 163 94 57 -95 -136 -41 108 54 -17 -94 -85 -24 32 78 40
3829 40 -112 7 -50 -7 109 8 -45 -39 -75 -11 70 126 -33 -97 -67 29 140 51 -62 -151 -14 96 191 127 -47 -183
3855 -183 -71 155 120 23 -92 -145 -99 61 154 45 -46 -51 -60 21 37 -54 -9 -76 -113 -78 29 7 57 -30 -251 -155 39
3882 39 120 34 -146 -206 -101 54 149 25 -151 -174 -44 98 148 6 -95 -73 -15 51 45 -26 -156 -130 -5 0 -4 -4 -24
3909 -24 -55 -138 -18 109 81 -13 -98 -46 -86 76 60 31 -51 -41 -50 70 68 -45 -144 -150 7 189 63 -119 -123 -92 -24 124
3937 124 58 -67 -66 -19 8 94 67 -100 -56 -59 4 16 40 25 -15 -6 -9 35 40 54 -118 -95 -58 7 85 65 -40 -208 -10
3966 -10 79 147 0 -79 -180 -105 60 94 -42 -109 -89 -67 66 103 -56 -94 -42 -56 83 17 -49 -26 -18 -70 -99 71 38
3993 38 2 -102 -33 -40 79 89 -33 -78 -99 -74 47 103 -19 -106 -95 16 59 97 -21 -141 -112 34 86 33 -16 -105
4019 -105 -77 113 67 8 -150 -172 -140 -7 58 42 -23 -103 -65 7 32 45 3 -50 -103 -133 27 105 86 -81 -82 -38 62
4046 62 136 16 -64 -153 -39 3 92 44 -115 -127 -26 27 132 32 -103 -146 -41 75 104 49 -38 -99 -50 120 31
4071 31 78 37 -3 -132 -31 95 32 13 -47 -45 -66 45 124 -49 -69 -51 19 86 127 -1 -79 -62 32 93 93 -37 -132 -75
4099 -75 39 127 81 -6 -85 -16 24 61 104 19 -41 -28 24 4 63 -4 -45 -89 -24 124 118 79 -12 -64 -3 19 166 37 -30
4128 -30 -111 -79 44 108 86 -75 -102 -84 87 78 6 -132 -122 -29 34 71 29 -45 -92 -66 -4 61 -12 8 -77 -39 -24 24 26
4157 26 -23 -80 -56 -40 32 86 42 -41 -26 18 14 74 -15 -7 -155 -9 79 34 60 1 -53 50 129 25 -29 -78 -33 14 74
4186 74 24 -16 -84 -70 -8 47 84 8 -63 -64 -2 7 89 43 -88 -38 -64 -18 59 76 -45 -87 -89 -38 95 65 -111 -92 -89 17
4216 17 79 46 -50 -60 4 7 55 -10 -134 -145 -1 33 44 -3 -26 -62 -52 9 56 31 71 -5 -78 -25 153 47 19 -70 -104
4245 -104 -62 14 86 31 -93 -92 36 137 56 7 -82 -30 72 65 127 -67 -90 -46 33 74 49 -29 -57 -57 24 63 79 27 -57
4274 -57 -108 -73 -8 -3 32 -77 -65 -145 -14 83 49 -1 -89 -84 -36 77 -11 -76 -143 -29 -5 137 59 -47 -92 -104 0 128
4302 128 6 -72 -114 -52 63 5 42 -49 -2 -1 20 21 32 35 35 -36 -23 21 91 88 38 -8 -1 41 57 43 -92 -53 22 108 43
4333 43 -15 -73 -60 -6 45 31 -60 -18 -58 -42 30 14 -65 -23 -129 -95 58 45 -24 -79 -30 -139 29 7 29 -94 -52 -132
4361 -132 -43 -19 54 24 -63 -78 -29 109 106 -75 -66 -60 40 82 -7 -86 -87 -100 84 45 72 -41 -81 -28 90 67 62 -3 -27
4390 -27 -18 27 53 25 -7 49 -48 -28 8 39 -107 -2 -83 -40 58 79 60 23 -81 -40 92 61 6 -36 -86 -12 40 78 21
4419 21 -65 -30 -53 53 73 -21 -31 -84 -2 -4 53 45 -68 -64 -28 -26 64 -6 -28 -79 -27 79 -5 87 13 -23 -108 15 73 22
4449 22 -9 -58 -94 -42 103 -9 10 -67 -56 13 78 39 -56 -27 -41 -16 20 62 -28 2 -54 -5 59 46 -1 36 -42 -7 26
4478 26 73 61 -3 -25 0 22 109 37 -44 -85 -17 58 24 32 -67 -39 22 64 80 49 -109 -75 -39 40 79 -14 34 -57 36 25
4508 25 12 -10 -20 -42 -51 -18 83 13 -18 -9 -59 22 28 33 -45 -24 -48 -9 79 179 -15 -67 -45 10 16 61 -8 -91 -84 90 115
4539 115 104 81 -10 -49 41 12 23 18 -52 -49 15 82 -22 33 -37 -7 -23 22 102 70 16 21 -1 32 28 30 82 -64 -46 10 45
4570 45 47 33 -41 13 -13 112 36 -35 -96 -16 38 35 -25 -48 -1 58 86 35 -20 -6 -27 42 80 55 71 94 -126 -75 87 -2
4600 -2 69 28 -44 -58 10 93 13 79 11 -25 -12 110 24 27 -17 -35 -3 81 97 21 -4 -51 -15 45 48 4 16 -19 30 -15 57
4631 57 -31 -49 51 38 -12 87 -19 -43 -8 -27 -32 92 57 6 -64 -101 -21 71 5 -26 -96 -36 70 74 9 72 -19 -28 74
4660 74 48 -8 1 -42 -26 62 75 24 13 -23 26 37 52 36 23 -14 17 -50 60 -21 17 35 -7 20 65 45 5 36 -17 -8 16
4691 16 77 9 -49 -24 40 79 19 -35 -38 -25 13 15 84 -23 -1 -63 -96 34 37 33 -68 -1 -21 13 10 -28 -3 25 -65 -30 -2
4722 -2 85 -15 -7 -55 10 53 99 -39 -8 -4 35 23 38 -46 -71 19 14 23 30 16 -101 -10 75 54 17 -20 -77 -6 104 61 30
4753 30 -23 -9 42 20 15 37 33 -4 -35 10 12 -5 9 -62 -103 -10 101 108 -19 -59 -36 12 47 54 32 4 -33 -10 128 91 118
4784 118 57 30 49 -13 91 14 -36 -61 -43 101 29 63 -9 -9 5 42 91 26 33 29 -25 88 -8 72 8 -28 -22 1 41 37 25
4815 25 -34 -30 27 77 58 20 -15 36 19 69 -6 -52 -71 -39 -4 40 3 -36 -11 -15 -6 23 74 39 -12 -44 20 -6 28 17 -88
4846 -88 -14 -29 43 73 3 6 -13 0 80 77 47 21 -49 25 50 76 36 -68 -95 28 11 71 -14 -26 37 22 8 33 11 -69
4876 -69 -23 -73 -47 101 -7 40 -46 -67 -25 1 116 21 -39 -108 17 55 14 -11 -20 -22 26 23 32 16 -20 0 -9 29 17 -1 49
4907 49 26 -7 82 36 -33 -66 12 -18 26 23 1 0 21 10 21 37 -32 25 -14 59 17 25 10 13 -79 -77 55 67 12 -48 -58 -2
4939 -2 51 -1 -59 -50 3 -14 25 58 -10 -14 -87 19 17 46 73 -16 -32 -1 22 21 -24 -23 -81 25 -28 31 -2 11 -6 -46 52 22
4971 22 15 -35 -54 -129 35 -7 87 -30 -69 -1 15 2 12 -37 6 -40 -43 40 14 -19 9 19 -33 31 2 -4 -45 -42 3 44 -27
5002 -27 -2 -71 15 -63 14 24 -17 -2 -49 -50 8 64 26 -30 -84 -39 35 22 -40 -26 16 -7 4 -7 -102 -17 -33 47 -44 58
5032 58 -19 -56 12 -43 25 51 -4 -9 29 -91 -7 42 5 58 8 51 1 51 19 4 -12 12 29 6 47 -32 -70 -46 50 22
5062 22 -61 -34 -73 -63 34 47 15 -33 -39 -29 80 37 2 5 -78 4 -2 60 10 33 33 -55 28 39 18 -14 7 -69 -19 -30 75
5093 75 12 -54 -12 -23 54 34 15 27 -76 9 63 82 10 -66 -76 32 -31 37 13 -12 16 -16 107 -12 22 49 -40 -7
5121 -7 16 -70 -25 23 0 -53 -21 17 17 -48 -42 -108 -36 53 31 -18 -103 -42 -1 30 16 24 -31 -83 -61 45 91 -54 -6 53 58 25
5153 25 113 11 -35 -26 18 22 64 20 44 54 -24 80 13 38 57 28 62 53 26 80 -23 -45 2 77 66 -26 45 -36 -14 68
5183 68 -10 -48 32 -40 -7 14 23 18 33 -17 -22 40 50 5 -17 -37 -70 49 -49 36 -46 -19 -16 -11 -2 34 32 -13 -54 91 -1 58 41
5216 41 7 47 6 42 30 36 -57 -17 114 71 19 48 18 1 48 83 28 32 -40 48 14 57 79 -19 9 -58 12 28 8 -34 -13
5247 -13 -10 50 89 1 45 -21 -104 -12 -17 56 22 32 -22 0 12 103 45 42 -4 32 93 91 28 19 28 107 50 34 -26 1 57 1 43
5280 43 0 16 34 3 -21 113 71 111 54 42 -37 65 13 45 70 38 17 37 82 28 8 -34 55 7 40 36 34 -2 51 31
5310 31 68 16 -13 11 -4 0 -29 -1 -47 10 -20 54 0 27 35 37 -21 36 56 33 57 -44 -54 58 89 87 0 -54 -8 -49 -10
5341 -10 41 -6 2 13 -78 -36 22 18 32 28 -34 27 98 20 -10 -39 7 57 32 112 -16 57 101 -30 -16 20 4 72 -6 24 -22
5372 -22 53 20 -15 -64 22 68 54 -18 -57 -20 41 100 -7 51 2 -1 50 14 2 -23 57 -20 -32 24 40 14 16 -20 23 45 27
5403 27 5 19 -22 -2 54 71 91 -3 -8 -6 57 7 13 -50 -29 1 44 108 69 -73 -5 74 60 28 12 -44 -1 10 53 42 -12
5434 -12 48 -58 -47 -23 -10 5 9 1 -39 -9 -24 40 13 15 25 -38 108 -7 0 -22 -13 -15 -41 16 -19 22 9 -1 17 71 -32
5465 -32 -23 39 -45 70 52 -29 -17 -54 11 8 37 -32 -55 34 66 -15 97 18 -2 32 -15 32 -3 -23 -85 19 -33 41 15 -7
5495 -7 -45 24 -44 -28 22 -1 -28 -63 9 -7 -16 -29 -19 -19 -19 61 57 -6 -51 14 38 22 70 64 -5 8 1 -1 -35 -4 72 -26 12 28
5529 28 31 47 14 -53 31 31 22 -4 -9 -49 -71 -10 69 0 -31 4 -15 -16 9 -21 13 14 -28 7 26 93 23 -42 23 10 51 42 -51 50
5563 50 -32 -64 20 -10 20 21 15 -45 -23 25 66 -38 -15 30 64 82 25 -57 -25 -15 25 34 36 12 -6 -16 -12 1 63 -23 -34 18
5595 18 0 16 12 51 -49 -104 -36 61 -27 -14 1 -61 45 82 -17 -26 24 4 -30 -15 45 9 -31 -31 -10 82 7 -66 2 18 27
5626 27 54 12 -15 -2 -21 11 20 15 28 47 -25 41 10 30 23 -23 22 19 55 19 17 7 -29 44 46 57 14 -26 14 43 80 71 71 -1
5660 -1 -19 -93 64 45 -8 15 -28 -28 45 24 49 -12 19 -39 -7 10 -7 -54 67 -19 23 -11 38 73 -22 10 -15 55 -9 23
5690 23 -18 24 -76 23 34 65 -3 -49 -4 2 2 -8 26 -34 0 28 25 -32 -27 18 5 37 -14 4 -34 -6 -10 78 36 -24 7 -2 38
5723 38 -3 48 28 -46 1 -8 -9 19 11 -13 1 32 -10 49 8 -25 -10 -15 22 31 12 2 48 -36 74 11 46 8 58 -27 -14 -33
5755 -33 10 61 -59 -9 -29 35 -15 54 -64 1 -68 -6 2 1 -17 -94 -83 32 95 -21 -3 -1 9 64 31 6 -31 -69 -22 74
5785 74 25 62 44 13 25 53 51 -16 -13 -39 -9 -1 0 -7 -41 -51 -16 41 48 -28 -61 -89 -9 -47 3 -30 44 34 -95 1 -39 -33 -16
5818 -16 17 -29 -46 57 24 -32 -40 25 14 31 -21 -8 -2 -26 46 33 81 49 -3 3 16 76 15 -18 11 2 23 27 3 3 -9 -42 30
5851 30 -18 2 6 -5 -14 -27 -27 16 55 -11 -67 -17 23 -19 -5 -42 -22 -28 86 -24 -25 -49 11 53 25 -2 19 3 28 -6 9 4
5883 4 29 11 2 24 2 -80 63 16 -15 77 44 46 76 -35 -57 -9 -23 13 38 113 12 -75 -27 -6 -16 15 -41 -47 29 84 22
5914 22 39 -75 45 -31 10 5 -29 -59 -26 -12 9 -51 22 -6 -34 6 17 20 12 -15 -52 1 -21 46 -8 -79 -9 -2 34 -11 71
5945 71 -61 5 4 20 12 -29 -41 -23 -9 43 100 63 -13 -13 -16 -10 9 27 -8 -35 -54 1 42 -5 32 -46 -17 34 -4 -9 -39 -22 -30
5978 -30 -39 -4 7 -32 -27 9 10 51 -5 -24 8 -42 12 -73 50 -28 -37 -56 -28 -36 10 1 -28 -20 2 55 59 -43 -70 8 8 -59 5 49
6012 49 -9 -7 48 27 -34 21 4 22 -48 -51 0 -8 -14 7 -31 -19 36 1 -85 -102 -21 16 20 -37 9 -13 -51 -39 -52 -25 -13 -16 -63
6045 -63 -15 45 31 4 -60 -11 51 15 34 21 -103 18 5 57 13 -2 -59 -39 30 31 16 -16 -18 -23 -20 6 25 12 -44 14 74
6076 74 72 6 50 -41 -16 -32 10 85 65 72 -4 -41 51 38 -16 19 -1 8 2 9 10 -8 5 -23 -42 -5 -13 -28 -44 24 -34 54 -5 -15
6110 -15 -24 38 66 6 36 9 -29 3 -65 25 -1 -84 19 -38 42 15 -23 -11 -42 36 36 52 58 37 0 -26 -26 32 28 64 66 12 81
6143 81 -45 119 -14 -27 -2 46 19 46 -23 -36 18 -13 29 -42 4 -32 -1 -45 1 -56 38 -12 -56 -12 29 30 22 -7 -91 -5
6173 -5 -6 -15 50 19 -62 18 6 37 -57 -22 30 -63 28 66 22 -38 -16 -13 27 31 -14 12 -15 -12 107 44 -69 8 -15 45 -3 16
6205 16 6 39 28 20 -31 23 5 5 54 -25 -17 -22 21 -36 8 -32 95 -17 -49 -7 -46 -5 21 19 71 18 -7 -13 56 23 25 -1 -29
6238 -29 -15 -51 -20 -46 -41 -116 -3 -18 -72 44 51 32 35 -91 34 20 39 21 -29 -48 5 69 44 -10 -57 5 -26 20 -28 -15
6268 -15 -19 23 97 -22 47 -29 -20 -55 20 -13 -37 -58 -4 -29 28 42 -42 21 -75 -4 17 -35 6 1 -18 -40 15 -13 -61 26 -12
6299 -12 -2 -75 23 58 -22 -3 -36 -47 61 0 21 -50 -14 -87 -54 24 -6 -69 -13 -28 53 76 -43 -66 13 31 13 10 15 -1
6329 -1 -3 -41 18 -30 -94 -31 78 -77 -19 -25 21 -8 4 -67 72 -12 36 -18 -105 11 -14 64 -23 43 -54 8 -56 43 5 19
6359 19 -38 -14 42 68 30 51 -7 82 25 21 -8 15 -44 -18 1 -17 -44 19 -3 -27 -11 -34 13 14 -14 -53 -25 3 25 -1 8 -81
6391 -81 -30 -21 -6 -19 -44 -36 2 -6 -47 -75 -31 22 -39 -38 -21 -49 -25 1 32 5 -5 0 0 -78 -15 -49 38 16 -54 -54 -63 15 63 15
6425 15 26 0 -72 -27 27 37 -55 -60 -57 38 30 -14 18 -23 -27 16 9 -10 -79 -17 14 4 42 22 -7 -38 -20 17 41 26 -29 -22 -13 -34
6459 -34 17 -20 -4 41 -66 -11 30 -18 16 -6 -36 -13 20 38 -18 56 -24 12 16 47 1 -56 -3 19 -56 12 26 27 -11 -31 -5
6490 -5 1 21 8 -7 -47 -25 32 57 40 -8 23 -28 36 43 -36 -25 -1 8 80 58 -20 4 -57 40 59 13 9 24 -67 -15 51 37 -40
6523 -40 -97 -1 4 -74 42 -7 -76 -36 24 -46 -58 -43 -5 30 43 -47 -24 7 15 -36 35 31 9 -22 38 9 -38 37 39 -23 -38 37
6555 37 4 28 -29 -17 -29 46 -4 27 7 21 27 24 73 4 83 25 12 -58 -46 -3 68 82 13 -49 -24 -17 45 29 -57 4 -22 -19
6587 -19 23 -67 14 -42 -74 94 -8 -6 19 -31 -16 8 21 12 60 -11 67 8 45 31 35 50 -24 -16 14 30 -46 5 8 -65 25 38
6619 38 23 -50 -18 64 51 41 67 -21 36 -38 29 61 41 -13 31 43 50 -9 -31 -73 -76 -21 0 -8 40 35 -13 -59 -21 21 13 -1 -37
6652 -37 -6 -8 -2 26 -11 -43 -16 23 33 15 6 -1 -1 -31 -26 25 -16 -10 11 24 17 -4 -37 -15 48 -13 -37 73 58 47 18 -4 -16 75
6686 75 26 11 -6 67 -23 58 14 25 95 -29 72 0 34 16 -58 -39 5 -4 -23 -14 -9 40 7 4 -30 15 17 12 54 -11 -30 30
6718 30 -4 -34 35 -38 22 31 51 -63 9 27 39 -46 -11 -67 -16 66 88 57 -56 15 14 -34 -85 52 -16 -26 4 0 13 20 -18
6749 -18 -65 68 69 18 21 -104 30 18 26 -9 -49 9 35 31 6 -36 15 -28 16 68 44 -40 50 29 -41 19 5 65 -17 -4 17
6780 17 -24 8 86 -13 17 -41 2 -30 1 89 35 -6 5 -44 -6 -4 -38 -91 27 7 -26 61 9 -12 -16 82 2 67 19 -47 -73
6811 -73 96 48 -20 49 35 -47 -35 35 26 53 -47 -44 4 -39 -16 28 22 1 -87 60 58 -4 -49 -73 -56 26 -50 25 39 -63
6841 -63 -25 -14 -36 37 -36 -8 13 2 3 -11 -7 -13 44 25 37 -26 20 -9 -34 23 -19 -26 -5 19 0 15 16 25 -26 10 -72 15 -19
6874 -19 1 -41 -98 -35 -29 40 48 -27 -11 -48 1 14 1 -40 2 24 0 20 -49 28 -66 -28 -45 -38 51 0 -39 -38 18 17 -3 33 -30
6907 -30 -109 20 92 51 11 -39 -5 46 -2 -15 -2 49 -29 35 40 8 -39 38 0 46 17 17 -8 -3 -16 -40 14 1 12 -25 -5
6938 -5 -23 -27 -20 32 -9 1 -23 40 35 44 -11 -1 -7 -23 7 -8 -39 -79 -42 59 -4 -6 -5 -72 -10 54 19 -59 -25 -12 -5 -50 9 59
6972 59 -41 -2 -41 -19 14 7 48 -16 -15 8 33 15 2 -63 -19 -50 11 10 -21 -44 -50 -30 -37 38 74 -51 -50 -2 5 -5 -7 -52 29
7005 29 -14 77 -40 -53 17 -34 30 -45 -37 2 39 -67 43 -2 36 -17 -30 -24 10 -47 -26 18 -14 24 -39 -21 52 -50 -7
7034 -7 10 -21 -8 44 19 7 21 0 -4 5 2 -51 -20 -2 63 40 44 -21 33 40 10 25 11 11 2 -6 -42 -11 47 37 -55 -23 -6 -47 24
7069 24 47 -35 -36 5 16 27 -5 -24 -66 -20 45 40 -18 10 3 30 -19 12 69 -2 -17 -28 26 -23 -10 -24 -28 -22 37 63 -38 3
7101 3 -2 35 -55 11 42 -44 -57 -37 18 53 -11 -24 44 -30 40 -19 37 -36 -48 -41 64 13 4 4 11 -17 12 -8 5 7 -15 -1 9
7134 9 5 31 -77 -37 7 36 -6 32 -36 -52 27 -24 17 -5 36 -40 11 19 -27 72 17 -6 -62 15 9 41 10 -47 -45 -74 40 -27
7166 -27 16 -18 -59 -7 -29 34 34 41 34 -23 59 -33 18 -29 59 -32 26 31 49 -29 -15 67 -30 3 70 -37 8 -58 24 35 -14 40
7198 40 -54 44 -24 39 -17 -20 -23 -2 9 -28 6 11 -48 24 25 -14 14 15 -23 26 50 68 -15 5 56 9 -28 -26 24 34 -23 -2 -10 8
7232 8 27 -11 -43 29 15 23 21 -46 -60 -15 -3 -31 62 -2 45 19 12 -5 -11 48 3 -61 -25 17 -34 64 21 35 -21 -12 27 -62 -13
7265 -13 32 -33 -63 -16 10 -40 -18 -38 -4 28 21 -43 34 -18 41 94 -8 -25 38 -54 -4 18 9 52 -23 29 -10 36 21 -71 -19
7296 -19 -46 26 20 30 28 22 -26 29 85 40 21 -11 -54 -18 -26 42 25 -28 37 27 -35 14 7 13 9 -27 21 -34 29 35 -69 16 5 51
7330 51 76 2 -21 -8 48 8 -21 -36 64 27 19 50 43 -15 23 -56 -6 120 -5 31 9 23 -71 -44 31 7 -13 3 -66 -22
7360 -22 61 -23 -48 26 34 54 33 -10 23 -59 0 43 21 20 1 -20 18 8 54 -22 -44 -10 -25 12 6 -34 32 66 -42 -20 8
7391 8 -4 18 -20 -76 53 12 6 -27 -71 -15 78 61 50 -26 40 23 77 36 -36 -7 -15 -8 10 -2 12 27 4 37 6 1 37 -23
7423 -23 14 -31 4 36 32 51 -30 -11 0 23 59 -47 10 -21 31 7 45 -32 -44 -38 31 44 -18 -20 16 -51 -39 9 -59 -54 1 -99
7455 -99 -7 -4 -19 -9 -30 -21 -52 -19 -18 17 -11 -69 8 -32 -43 28 35 41 9 -12 16 62 12 -45 21 -4 24 7 -8 -33 -48 -53 -18
7488 -18 -64 25 -3 -28 -2 41 -40 -36 -3 -52 -64 -1 26 11 0 6 -37 -5 21 8 -44 18 7 5 27 -5 7 -41 35 30 -3 -60
7520 -60 -1 3 -27 18 -22 -6 -24 -37 -71 32 7 -69 -4 -19 -64 35 -23 17 -43 -33 -22 24 56 33 56 -37 -44 -7 41 -31 1
7551 1 -21 78 -22 4 14 -6 5 -16 -8 -3 -22 -33 -33 -70 -15 -42 24 -19 -25 27 -43 15 -25 13 10 -66 22 0 18 21 -14 -25 40
7584 40 -45 -23 -48 -11 -33 -39 -12 -5 -7 -15 -46 -30 -5 -15 13 -47 25 -1 -77 9 -59 -4 -18 26 55 -44 14 -36 -35 -1 -7 7 -31
7617 -31 -9 -14 -26 -46 36 20 18 -11 -35 36 -36 20 -14 38 6 -66 -44 2 14 -45 -6 -38 46 -23 -44 48 40 -28 35 -12 -55 40
7649 40 45 9 14 -19 -19 57 -26 14 55 -29 -16 -55 8 -54 23 59 69 -19 -30 -9 -9 -3 48 -26 -28 49 -37 -61 -22 47 -40 17 1
7682 1 -11 27 16 -37 58 4 46 37 -29 -55 -68 54 -47 -22 -3 -51 77 -4 -20 55 -13 -16 -15 -16 0 20 19 9 32 -32 56 6
7714 6 -28 -44 -11 59 28 62 -20 -7 -26 34 43 -15 -21 6 -44 34 -32 41 -18 -22 -14 29 11 -4 -4 48 16 27 -10 5 42 -41 -16
7747 -16 -10 -43 -34 1 24 17 -30 7 48 35 28 29 -24 -15 -11 17 -20 -42 -86 29 -10 -7 54 9 -47 30 -2 -4 -1 -27 -48 -25 -47 -20 -71
7782 -71 -40 1 -10 -6 2 24 -28 -42 18 21 41 96 -3 19 19 23 -84 -30 34 -34 -16 -17 -19 -69 1 -1 -8 44 20 19 69 -2 3 -6 -48 -67
7818 -67 69 63 16 27 -41 -12 -49 -2 -51 -39 -9 11 -46 9 43 15 45 9 -31 28 -20 -13 69 61 64 33 59 -24 -16 -20 51 8 16
7851 16 17 21 22 53 -4 -27 -4 -42 26 29 5 24 -17 13 50 19 -19 -41 38 62 82 7 0 -54 -6 5 -23 21 23 -3 -23 54 74
7884 74 6 -10 4 31 1 44 -23 -23 64 -11 72 -30 -22 12 -31 7 -13 1 -74 4 -24 -25 -43 52 28 19 -8 -43 7 18 1 56
7916 56 38 6 10 41 15 39 -77 9 -4 -4 -2 -23 -10 7 34 54 -52 29 -42 -18 -21 21 43 32 -2 -17 67 -17 -2 -25 31
7947 31 0 -1 3 31 0 19 -40 -53 10 13 19 -28 -70 -57 -18 -66 -10 16 60 -20 5 33 24 36 -18 52 35 39 -73 -31 13 -7 9
7980 9 28 -72 0 -5 7 69 -8 -26 20 -31 -77 -6 -20 28 51 36 6 -23 -44 -35 -46 -12 46 -25 90 54 -38 -22 -64 39
8010 39 -5 13 70 -45 45 -4 -16 -6 -63 98 10 -24 120 -76 17 7 89 -47 34 34 19 6 -9 3 -7 65 10 5 -4
8039 -4 10 2 -53 33 5 -51 19 43 -4 -18 -5 47 -47 -10 12 23 23 -25 -61 24 -14 -61 -38 -18 5 64 -2 -10 -34 10 -18 -14 -35
8072 -35 -44 56 -25 -6 -60 -14 8 -5 -34 19 37 12 24 17 47 -5 -14 47 20 3 27 8 22 -70 -25 -28 16 -43 25 10 42 56
8104 56 10 41 -8 -12 -69 20 12 15 47 9 44 0 14 -30 -22 -8 -23 -7 28 6 -29 10 -21 11 14 13 -44 -62 7 -32 15 -18 -68
8137 -68 4 49 -33 14 -32 -60 29 36 -57 9 25 4 32 71 -36 46 31 38 -6 28 36 71 47 -54 29 12 7 -8 -27 -25 39 68
8169 68 31 44 40 6 20 54 14 25 10 66 -17 -6 -62 10 -52 7 -44 -12 -35 -27 -19 29
8191B9
##END NTUPLES=NMR FID
##END=
