##TITLE=1H_CG-1104-C3
 DMSO, 8 sc, 
 30.5.2019
##JCAMPDX= 6.0         $$ Bruker NMR JCAMP-DX V2.0
##DATA TYPE= NMR FID
##DATA CLASS= NTUPLES
##ORIGIN= UXNMR, Bruker Analytische Messtechnik GmbH
##OWNER= root
$$ XWIN-NMR		Version 3.5
$$ Thu May 30 14:04:08 2019 Russian Standard Time (UT+4h)  she@DPX200
##.OBSERVE FREQUENCY= 200.13155
##.OBSERVE NUCLEUS= ^1H
##.DELAY= (6, 6)
##.ACQUISITION MODE= SIMULTANEOUS
##.ACQUISITION SCHEME= undefined
##.AVERAGES= 8
##.DIGITISER RES= 18
##SPECTROMETER/DATA SYSTEM= spect
##.PULSE SEQUENCE= zg30
##.SOLVENT NAME= DMSO
##.SHIFT REFERENCE= (INTERNAL, DMSO, 0, 15.7039)
##AUDIT TRAIL= $$ (NUMBER, WHEN, WHO, WHERE, WHAT)
$$ ##TITLE= Audit trail, XWIN-NMR		Version 3.5
$$ ##JCAMPDX= 5.01
$$ ##ORIGIN= Bruker BioSpin GmbH
$$ ##OWNER= she
$$ F:/spectra/data/she/nmr/H-F/1/audita.txt
$$ ##AUDIT TRAIL=  $$ (NUMBER, WHEN, WHO, WHERE, WHAT)
(   1,<2019-05-30 14:02:52.62 +0400>,<she>,<DPX200>,
      <created by zg, POWCHK disabled, PULCHK disabled
       configuration hash MD5:
       00 E9 B6 7A A2 85 ED C7 34 08 36 98 17 FE 4E 26
       data hash MD5: 16K
       EC 12 1D CD 20 BC A0 91 F9 29 BF AC DE FC 81 C7>)
$$ ##END=
$$ 
$$ hash MD5
$$ 15 C5 B3 67 D7 BA 86 1F F8 61 44 3D A1 71 DE B0
##$RELAX= 
##$RELAX= 
##$RELAX= 
##$RELAX= 
##$RELAX= 
##$RELAX= 
$$ Bruker specific parameters
$$ --------------------------
##$DU= <F:/spectra>
##$EXPNO= 1
##$NAME= <H-F>
##$PROCNO= 1
##$TYPE= <nmr>
##$USER= <she>
##$AMP= (0..31)
100 100 100 100 100 100 100 100 100 100 100 100 100 100 100 100 100 100 
100 100 100 100 100 100 100 100 100 100 100 100 100 100 
##$AQSEQ= 0
##$AQ_mod= 1
##$AUNM= <au_zg>
##$AUTOPOS= <>
##$BF1= 200.13
##$BF2= 200.13
##$BF3= 200.13
##$BF4= 200.13
##$BF5= 200.13
##$BF6= 200.13
##$BF7= 200.13
##$BF8= 200.13
##$BYTORDA= 1
##$CFDGTYP= 0
##$CFRGTYP= 5
##$CHEMSTR= <none>
##$CNST= (0..31)
1 1 145 1 1 1 1 1 1 1 1 1 1 1 1 1 1 1 1 1 1 1 1 1 1 1 1 1 1 1 1 1 
##$CPDPRG= <>
##$CPDPRG1= <>
##$CPDPRG2= <>
##$CPDPRG3= <>
##$CPDPRG4= <mlev>
##$CPDPRG5= <mlev>
##$CPDPRG6= <mlev>
##$CPDPRG7= <mlev>
##$CPDPRG8= <mlev>
##$CPDPRGB= <>
##$CPDPRGT= <>
##$D= (0..31)
0 1.2 0 0 0 0 0 0 0 0 0 0.03 0 0 0 0 0 0 0 0 0 0 0 0 0 0 0 0 0 0 0 0 
##$DATE= 1559210571
##$DBL= (0..7)
120 120 120 120 120 120 120 120 
##$DBP= (0..7)
150 150 150 150 150 150 150 150 
##$DBP07= 0
##$DBPNAM0= <>
##$DBPNAM1= <>
##$DBPNAM2= <>
##$DBPNAM3= <>
##$DBPNAM4= <>
##$DBPNAM5= <>
##$DBPNAM6= <>
##$DBPNAM7= <>
##$DBPOAL= (0..7)
0.5 0.5 0.5 0.5 0.5 0.5 0.5 0.5 
##$DBPOFFS= (0..7)
0 0 0 0 0 0 0 0 
##$DE= 6
##$DECBNUC= <off>
##$DECIM= 24
##$DECNUC= <off>
##$DECSTAT= 4
##$DIGMOD= 1
##$DIGTYP= 9
##$DL= (0..7)
0 120 120 120 120 120 120 120 
##$DP= (0..7)
150 150 150 150 150 150 150 150 
##$DP07= 0
##$DPNAME0= <>
##$DPNAME1= <>
##$DPNAME2= <>
##$DPNAME3= <>
##$DPNAME4= <>
##$DPNAME5= <>
##$DPNAME6= <>
##$DPNAME7= <>
##$DPOAL= (0..7)
0.5 0.5 0.5 0.5 0.5 0.5 0.5 0.5 
##$DPOFFS= (0..7)
0 0 0 0 0 0 0 0 
##$DQDMODE= 0
##$DR= 18
##$DS= 0
##$DSLIST= <SSSSSSSSSSSSSSS>
##$DSPFIRM= 0
$$ [...]
##$SUBNAM2= <"">
##$SUBNAM3= <"">
##$SUBNAM4= <"">
##$SUBNAM5= <"">
##$SUBNAM6= <"">
##$SUBNAM7= <"">
##$SUBNAM8= <"">
##$SUBNAM9= <"">
##$SW= 24.9336996594482
##$SWIBOX= (0..15)
0 0 2 0 0 0 0 0 0 0 0 0 0 0 0 0 
##$SW_h= 4990.01996007984
##$TD= 16384
##$TD0= 1
##$TE= 0
##$TE2= 300
##$TE3= 300
##$TEG= 300
##$TL= (0..7)
0 120 120 120 120 120 120 120 
##$TP= (0..7)
150 150 150 150 150 150 150 150 
##$TP07= 0
##$TPNAME0= <>
##$TPNAME1= <>
##$TPNAME2= <>
##$TPNAME3= <>
##$TPNAME4= <>
##$TPNAME5= <>
##$TPNAME6= <>
##$TPNAME7= <>
##$TPOAL= (0..7)
0.5 0.5 0.5 0.5 0.5 0.5 0.5 0.5 
##$TPOFFS= (0..7)
0 0 0 0 0 0 0 0 
##$TUNHIN= 0
##$TUNHOUT= 0
##$TUNXOUT= 0
##$USERA1= <user>
##$USERA2= <user>
##$USERA3= <user>
##$USERA4= <user>
##$USERA5= <user>
##$V9= 5
##$VALIST= <valist>
##$VCLIST= <CCCCCCCCCCCCCCC>
##$VD= 0
##$VDLIST= <DDDDDDDDDDDDDDD>
##$VPLIST= <PPPPPPPPPPPPPPP>
##$VTLIST= <TTTTTTTTTTTTTTT>
##$WBST= 1024
##$WBSW= 4
##$XGAIN= (0..3)
0 0 0 0 
##$XL= 0
##$YL= 0
##$YMAX_a= 228795
##$YMIN_a= -265869
##$ZGOPTNS= <>
##$ZL1= 120
##$ZL2= 120
##$ZL3= 120
##$ZL4= 120
##$ABSF1= 10
##$ABSF2= 0
##$ABSG= 5
##$ABSL= 3
##$ALPHA= 0
##$AQORDER= 0
##$ASSFAC= 0
##$ASSFACI= 0
##$ASSFACX= 0
##$ASSWID= 0
##$AUNMP= <proc_1d>
##$AZFE= 0.1
##$AZFW= 0.1
##$BCFW= 1
##$BC_mod= 2
##$BYTORDP= 1
##$COROFFS= 0
##$CY= 11.3945322036743
##$DATMOD= 1
##$DC= 2
##$DFILT= <>
##$DTYPP= 0
##$F1P= 18.9103706918063
##$F2P= -1.10871071338519
##$FCOR= 0.5
##$FTSIZE= 0
##$FT_mod= 4
##$GAMMA= 1
##$GB= 0.15
##$INTBC= 1
##$INTSCL= 1
##$ISEN= 128
##$LB= 0.24
##$LEV0= 0
##$LPBIN= 0
##$MAXI= 10000
##$MC2= 0
##$MEAN= 0
##$ME_mod= 0
##$MI= 1.114404
##$NCOEF= 0
##$NC_proc= 0
##$NLEV= 6
##$NOISF1= 3.799351
##$NOISF2= 2.8
##$NSP= 1
##$NTH_PI= 0
##$NZP= 0
##$OFFSET= 15.70392
##$PC= 1
##$PHC0= -8505.658
##$PHC1= 23.60023
##$PH_mod= 1
##$PKNL= yes
##$PPARMOD= 0
##$PSCAL= 0
##$PSIGN= 0
##$REVERSE= no
##$SF= 200.130013532006
##$SI= 16384
##$SIGF1= 3
##$SIGF2= 2
##$SINO= 400
##$SIOLD= 16384
##$SREGLST= <1H.CDCl3>
##$SSB= 0
##$STSI= 0
##$STSR= 0
##$SW_p= 3612.71676300578
##$SYMM= 0
##$S_DEV= 0
##$TDeff= 0
##$TDoff= 0
##$TI= <>
##$TILT= no
##$TM1= 0
##$TM2= 0
##$TOPLEV= 0
##$USERP1= <user>
##$USERP2= <user>
##$USERP3= <user>
##$USERP4= <user>
##$USERP5= <user>
##$WDW= 1
##$XDIM= 8192
##$YMAX_p= 0
##$YMIN_p= 0
$$ End of Bruker specific parameters
$$ ---------------------------------
##NTUPLES= NMR FID
##VAR_NAME=  TIME,          FID/REAL,        FID/IMAG
##SYMBOL=    X,             R,               I
##VAR_TYPE=  INDEPENDENT,   DEPENDENT,       DEPENDENT
##VAR_FORM=  AFFN,          ASDF,            ASDF
##VAR_DIM=   8192,          8192,            8192
##UNITS=     SECONDS,       ARBITRARY UNITS, ARBITRARY UNITS
##FACTOR=    0.0002004,     1,               1
##FIRST=     0,             0,               0
##LAST=      1.6414764,     0,               0
##MIN=       0,             -265869,         0
##MAX=       1.6414764,     228795,          0
$$ Real data points
##PAGE= N=1
##DATA TABLE= (X++(R..R)), XYDATA
$$ [...]
1906b53N62O7k69J21m49O4J53K25j53Q3l5n00o0N49K49no12J29J45K39K25m85
$$ -253 309 376 107 228 -221 -157 -4 221 68 151 116 -384 -444 105 354 349 -263 -134 11 250 475 -10
1928a0L3r7j62J45N72m5m60l82J91K8M59ok53l47j45L93M99k66j45n05N9K67M9
$$ -10 23 -74 -236 -91 481 436 -24 -406 -215 -187 272 266 13 -334 -479 -86 413 147 2 -503 -444 -177 -128
1951a28J13l00l39M53M20K34l89J80j67k00L44JP4n29K41l99K58J88j32K49p1
$$ -128 -15 -315 -654 -201 219 453 64 244 77 -123 221 222 296 -233 8 -391 -133 55 -77 172 101
1972A01m95N13R6k29j63J02k55L89L49l84q6r9L51J57j93R8j54j15l96K85M28
$$ 101 -394 119 215 -14 -177 -75 -330 59 408 24 -62 -161 190 347 154 252 98 -17 -413 -128 300
1993C00q4j26Kp51R07j53K05Jl63m41L03O51n8j45l88k62pP86JO3r08M13k08O01
$$ 300 216 90 92 -659 248 95 300 301 -62 -503 -200 451 393 248 -140 -402 -409 377 378 441 -467 -54 -262 339
2017C39j2k56k1p5k8Q6K53j20j03j04m31M02J99J26k91K2R9k54L11n5j68j0j70
$$ 339 327 71 50 -25 -53 33 286 166 63 -41 -472 -70 129 255 -36 -14 85 -169 142 87 -81 -91 -261
2040b61j5N8M90l38n6O2l6L48l19K00j91l3J78k05K76J04n25j05J62K90Q7k62
$$ -261 -276 -218 272 -66 -122 -60 -96 252 -67 133 -58 -91 87 -118 158 262 -263 -368 -206 84 171 -91
2062i1n6j01M87k65j02J97m26k0L40K6M14n56k60o5M91K1L03k72m02o6O70k03
$$ -91 -147 -248 239 -26 -128 69 -357 -377 -37 -11 403 -153 -413 -478 13 34 337 65 -337 -403 267 64
2084F4K66k14m48M52p4pj20J4L6k77j31K50N62l93l6j97NN05j71L51m60j49J47
$$ 64 330 116 -332 120 46 39 -81 -67 -31 -308 -439 -189 373 -20 -56 -253 -248 257 86 437 -23 -172 -25
2107b5n6K68oj85j46l8K19P7K62k60k50j16J88L84k63J2j76j02J73J1K58j09l45
$$ -25 -81 187 181 -4 -150 -188 31 108 370 110 -140 -256 -68 316 53 65 -111 -213 -40 -29 229 120 -225
2130b25J80Q3k26J57m1m3M4M2J43k42j06L00l1L2J43j79j22K37k63L53j02k97
$$ -225 -45 38 -188 -31 -72 -115 -71 -29 114 -128 -234 66 35 67 210 31 -91 146 -117 236 134 -163
2152a63L72m28j53L39Pk94J48K63l12J35K37j42J28M3j00m0j4j7J98m39q8l2J32
$$ -163 209 -219 -372 -33 -26 -320 -172 91 -221 -86 151 9 137 180 80 40 26 9 207 -232 -320 -352 -220
2175b20K46K12k73k59L41J13l2K90n62m24L47r1N04p1Jl69L0K46j27R1J57j19
$$ -220 26 238 -35 -294 47 160 128 418 -144 -568 -221 -312 192 121 122 -247 -217 29 -98 -7 150 31
2197C1j25J78j43L67m96j34O39m94J0R4R6m13J94J70J0K02m18j2l4L09J24k03
$$ 31 -94 84 -59 308 -188 -322 317 -177 -167 -73 23 -390 -196 -26 -16 186 -232 -244 -278 31 155 -48
2219d8R9j83J14q0J6K42m3Rj24L5J1q2J30Jm33j9L84L48l5l94k34N17j18L5R2
$$ -48 51 -132 -18 -98 -82 160 117 126 2 37 48 -34 96 97 -336 -355 29 377 342 -52 -286 231 113 148 240
2244B40l83J28OJ76l4J4n49N71l65K78nj34j41l8M58k11j88Q6J02k29J45j6m3
$$ 240 -143 -15 -9 167 133 147 -402 169 -196 82 77 -57 -198 -236 222 11 -177 -91 11 -218 -73 -89 -132
2267a32k3j86J53J27Pj66M83k34l95L35o5K1K75k34Rj39q8L95P6l48L51m90K68
$$ -132 -155 -341 -188 -61 -54 -220 263 29 -366 -31 -96 -75 200 -34 -25 -164 -252 143 219 -129 222 -268 0
2290@J57k68K27k77j31K51K18k77j05J96n34N72J31j22q5j73P1j01L58rq5k19
$$ 0 157 -111 116 -161 -292 -41 177 -100 -205 -9 -543 29 160 38 -47 -220 -149 -250 108 99 14 -205
2312b05o1L06J03l6k36J08k7M0j03k92M57K6k65r7K84J35P3k62L44o12N11K5j4
$$ -205 -266 40 143 107 -129 -21 -48 -8 -111 -403 54 80 -185 -282 2 137 210 -52 292 -320 191 216 202
2335B02j63J31k85j38N20q2J07l09k26K14J09L9r3n0k37J45K35p7Q1m45M85j07
$$ 202 39 170 -115 -253 267 185 292 -17 -243 -29 80 119 26 -24 -261 -116 119 42 123 -322 163 56
2357E6O5j02L0j13m43N25K33n1r4l8J34k13L38j80m09K97J13k93L28K48o66j22
$$ 56 121 19 49 -64 -507 18 251 200 106 68 202 -11 327 147 -262 35 148 -145 183 431 -235 -357
2379c57K54K20r3l0o5K53o6k21K56j01j06J73k11K16Jj26l1k19N1J86L05m30L26
$$ -357 -103 117 24 -6 -71 182 116 -105 151 50 -56 117 -94 122 123 -3 -34 -253 -202 -16 289 -141 185
2402A85Pm19J84K15J8j49j02J53r3k56K35M37p13L40l01L68K07k13j83j25J77
$$ 185 192 -227 -43 172 190 41 -61 92 -1 -257 -22 415 -298 42 -259 109 316 103 -80 -205 -28
2423b8J90l3P8n30J71j59K40L75Ll52O9j45J54K21l77J01r5N6K54j71m15M40n3
$$ -28 162 129 207 -323 -152 -311 -71 304 307 -45 24 -121 33 254 -123 -22 -117 -61 193 22 -393 47 -6
2446fK4l79K59J66m7j12k31J14K71n1K8O0k37J40J49o26N0M48q7o5L01n1L1j71
$$ -6 18 -361 -102 64 17 -95 -326 -212 59 8 36 96 -141 -1 148 -478 -428 20 -67 -132 169 118 149 -22
2470b2r9j10L04j55J90M5l76J60j00M28j58m42K35K00k24J14p1mK17l93N74l50
$$ -22 -121 -231 73 -82 108 153 -223 -63 -163 265 107 -335 -100 100 -124 -10 -81 -85 132 -261 313 -37
2492c7k99K91O9r8K39ok87L64l49N7K37j5j71J23k36j59N25k68L1m7J14k31j72
$$ -37 -336 -45 24 -74 165 159 -128 236 -113 -56 181 166 -5 118 -118 -277 248 -20 11 -36 78 -153 -325
2515c25M30Lk06K14k32O4L63j70O5l51P3L1l9P1l13K41j09k5Q7M3M7j40L99k23
$$ -325 105 108 -98 116 -116 -52 311 141 206 -145 -72 -41 -80 -9 -322 -81 -190 -215 -128 -85 -38 -178 221 -2
2539bJ22p7q4l3J9J31J34j50p6ql07J86PO7j90J13K57Q4k70R6J61n35K86j56J41
$$ -2 120 43 -41 -74 -55 76 210 60 -16 -24 -331 -145 -138 -71 -261 -148 109 193 -77 19 180 -355 -69 -225 -84
2564h4K58l55N9l11K38P4K51o7M3l76L09Q6N7q9j07j19J71J44j03j26Q7Ko7J33
$$ -84 174 -181 -122 -433 -195 -121 130 63 106 -270 39 125 182 93 -14 -133 38 182 79 -47 40 42 -25 108
2588A08k7P8l26J77j62J19J64N3j9l69J28k06M13K34l19J11j02J7k96L40k24K14
$$ 108 81 159 -167 10 -152 -33 131 184 165 -204 -76 -282 131 365 46 157 55 72 -224 116 -108 106
2610A06k37J84r2l8p0J15O5M4l15L18o8J19L8q8J36k62J03k7p3K43l39R8Q5k1
$$ 106 -131 53 -39 -77 -147 -32 33 77 -238 80 12 131 169 81 217 -45 58 31 -42 201 -138 -40 45 24
2634B4q3L1J35kM4n1l9j65K92n2%%r6j6k42K95m98J82K16J24l2J2K85k31k37P9
$$ 24 -59 -28 107 105 149 98 59 -106 186 134 134 134 38 22 -220 75 -423 -241 -25 99 67 79 364 133 -104 -25
2660b5k17J51K25K8r5l97M44j16m2j23n0K29k7J18P9K7l31j12L3L01K01m17m4
$$ -25 -242 -91 134 162 67 -330 114 -2 -44 -167 -217 12 -15 103 182 209 -122 -234 -201 100 301 -116 -160
2683a60R8J26J07q6K1q9j87J85N2Q6m66J54K00n4K33k99L8q0J69o6j15K31k81
$$ -160 -62 64 171 85 106 17 -170 15 67 153 -313 -159 41 -13 220 -79 -41 -121 48 -18 -133 98 -183
2706a83L58k31q6J51P6o7j61r3J28J19l10K11J1r2K8J13J62L4Nj81k41K32J05
$$ -183 175 -56 -142 9 85 18 -143 -236 -108 11 -299 -88 -77 -169 -141 -28 134 168 173 -8 -249 -17 88
2729H8K3j62J84K97j18n07K21M5K39k71m5J6J83k46%l36L33J71j06L02m18K74
$$ 88 111 -51 133 430 312 -195 26 71 310 39 -6 10 193 -53 -53 -389 -56 115 9 311 -107 167
2751A67j50N9j42J70j00j63L5J65K21k91J79l63J07L73j57j94J47k38J84J17J18
$$ 167 17 76 -66 104 4 -159 -124 41 262 -29 150 -213 -106 267 110 -84 63 -175 9 126 244
2772B44k29j07k90L11J08K68L1l08qJ05k93J37L14l50m9j04M30j87k0o5L28k77
$$ 244 15 -92 -382 -71 37 305 336 28 20 125 -168 -31 283 -67 -116 -220 210 23 3 -62 266 -11
2794a1J06K23m52J33J22l83L01J67k39K52j78k46L65j13jj8L8j17QJ00K0j25p5
$$ -11 95 318 -134 -1 121 -262 39 206 -33 219 41 -205 160 47 46 28 66 -51 -43 57 77 -48 -123
2817a23J95j23L21k53J02L06l86j73M64n58L7K29j58q9J93J86j19N4j06q2n8J3
$$ -123 72 -51 270 17 119 425 39 -134 330 -228 -191 38 -120 -209 -16 170 51 105 -1 -83 -141 -128
2839a28J42L54k58j09j18K26m01m3L55r3K52k18J22k76L39j51L61l30Q0n1m30
$$ -128 14 368 110 1 -117 109 -292 -335 20 -73 179 -39 83 -193 146 -5 356 26 106 55 -375
2860c75J68j6M13j87k3K34k57J8l27M29J01r5j54J77Q2k13O7j83K3P5J81m63K21
$$ -375 -207 -223 190 3 -20 214 -43 -25 -352 77 178 83 -71 106 188 -25 42 -141 -118 -43 138 -325 -104
2883a04Q9j30J67L5j85J29p9m8J84J8j71K28J48n55L27l4j57j23K10k01Q3K79
$$ -104 -15 -145 22 57 -128 1 -78 -126 58 76 -95 133 281 -274 53 19 -138 -261 -51 -252 -169 110
2905A10%j41J60j52K95o28L37n1J35K24k39k12J78J51k05J3J8L00m62L32Oj41
$$ 110 110 -31 129 -23 272 -356 -19 -70 65 289 50 -162 16 167 -38 -25 -7 293 -169 163 169 28
2927B8l65K33R6o7k7m2R3j70K27P3Q1p1j1j89Q6K04l21N6l26L55J5J22j95M6J18
$$ 28 -337 -104 -8 -75 -102 -144 -51 -221 6 79 160 89 78 -111 -25 179 -142 -86 -412 -57 -42 80 -115 -69 49
2952D9r8L71j48k86Lj4M01l04kO0l7j99K14m5J15K7j49m4J62L8j10j69q2J60R7
$$ 49 -49 322 174 -112 -109 -123 278 -26 -28 32 -5 -204 10 -35 80 107 -42 -86 76 114 4 -165 -247 -87 10
2977A0K8J84j63j84j8L03j63k51K63m2J44k58L37l02K13r8k66P2L56j25P7j08
$$ 10 38 222 59 -125 -143 160 -3 -254 9 -33 111 -147 190 -112 101 3 -263 -191 165 40 117 9
2999IRj0m9O49o87R0k84R6j6M00m76J88O0j53J46K02j56p6n0R9K31j16k36J01
$$ 9 18 8 -41 608 -79 11 -273 -177 -193 207 -269 -81 -21 -174 -28 174 18 -58 -108 -9 222 106 -130 -29
3023b9J13p9j52L04j75n6K64J0k83L1L52o49N67j05j3L6m93L76J28l52L82M2J14
$$ -29 84 5 -147 157 -18 -74 190 200 -83 -52 300 -349 218 113 100 136 -357 19 147 -205 177 219 333
3046C33l05k85P6L55n2j13J09R8l71L09j96K45k17k81J21k19L97L4j9r9m2K47
$$ 333 28 -257 -181 174 122 9 118 216 -155 154 -42 203 -14 -295 -174 -393 4 38 19 -80 -122 125
3068A25p1J99j92j17J49O9J81n08J11l67O12J18m47J98k22Q0J65J90l64j36K52
$$ 125 54 253 61 -56 93 162 343 -165 -54 -421 191 309 -138 60 -162 -82 83 273 -91 -227 25
3089B5l6o0j25P2J87k94o5O20o31M23l13QM71l45J80j14J2J54J31j67Q6l11L50
$$ 25 -11 -71 -196 -124 63 -231 -296 324 -307 116 -197 -189 282 -63 117 3 15 169 300 133 219 -92 258
3112B58j34l7j44J27p6p4J75p8k96M84j61r6K24l72N2K30k53j9J01Q1p9q7j38
$$ 258 124 87 -57 70 -6 -80 95 17 -279 205 44 -52 172 -200 -148 82 -171 -190 -89 -8 -87 -174 -312
3135c12p8P37k43j97J3K02J59q4n5k09Q6k2K6p2L30l47n0K82p9J3l93L32Q6O0
$$ -312 -390 347 104 -93 -80 122 281 197 142 -67 19 -3 23 -49 281 -66 -116 166 87 100 -293 39 125 185
3159A85k14L35j85K80k47j96J83k14K56k99m5O9K94J02j45l27J77J9k48N25l27
$$ 185 -29 306 121 401 154 -42 141 -73 183 -116 -161 -92 202 304 159 -168 9 28 -220 305 -22
3180b2j24L22j14p7j6NJ85r1K91n64L07j69K38J32K0k57p5q2J95r6k8J7l2k04
$$ -22 -146 176 62 -15 -31 -26 159 68 359 -205 102 -67 171 303 323 66 -9 -91 104 8 -20 -3 -35 -239
3204b39L9J95n8j39K05J06k95J13l4P2K48k15k97J89J56L51l51j03L5k41nK74
$$ -239 -200 -5 -63 -202 3 109 -186 -73 -107 -35 213 -2 -299 -110 46 397 46 -57 -22 -263 -268 6
3226Fj44L04j78J64m80M54k35L37M2l29J69l7q6j3j61J72k5J84j02k01J7K94k23
$$ 6 -138 166 -12 152 -328 126 -109 228 270 -59 110 73 -13 -26 -187 -15 -40 144 42 -159 -142 152 -71
3249g1L1K00j52j09j28M01K15l71k4J8q4P5k98M13l62J71J05k7J68k37l0pK26
$$ -71 -40 160 8 -101 -229 172 387 16 -8 10 -74 1 -297 116 -246 -75 30 3 171 -66 -96 -103 123
3272A23q2k41K88Q2j97j01l3L64m53L86m6j42K3k05J15J31J38j89j2J67J33l63
$$ 123 41 -200 88 170 -27 -128 -161 203 -250 136 90 -52 -29 -234 -119 12 150 -39 -51 116 249 -114
3294a14K73k18J86Oo1j07J23j24n1J13j50R3P9M3j81J6L30j23m60L45J50o7K43
$$ -114 159 -59 127 133 72 -35 88 -36 -87 26 -124 -31 48 91 -90 -74 256 133 -327 18 168 101 344
3317C44l38k28J74Q7j69K88o7lk97L21k00R8O7q4Rk78R6K41n2L3j15j31M60l30
$$ 344 6 -222 -48 39 -130 158 91 88 -209 112 -88 10 77 -7 2 -276 -180 61 9 42 -73 -204 256 -74
3341g4k9K7N9L6J71n8K10m22L59j32k03k45M09k26R6J03k54K09J66m32K11j75
$$ -74 -103 -76 -17 19 190 132 342 -80 279 147 -56 -301 108 -118 -22 81 -173 36 202 -230 -19 -194
3363a94J78N5j21J91j43k18K83l9K1K66l90L9K3p2Q0j1k0K22j74R5k01Q1JJ66
$$ -194 -16 39 -82 109 -34 -252 31 -8 13 279 -111 -72 -49 -121 -41 -52 -72 150 -24 71 -130 -49 -48 118
3387A18K9l8k47K8m5K50j89o7P9J53k9j54l8P3K40k13J16Q6j76K08l89K11N0K02
$$ 118 147 109 -138 -110 -155 95 -94 -161 -82 71 42 -112 -150 -77 163 -50 66 152 -24 184 -205 6 56 258
3411B58m56J04L01m65J93j84M92k1O2m74N04l85k0j6Q9P4q7j48J54J28j03j32
$$ 258 -198 -94 207 -258 -65 -249 243 222 284 -190 314 -71 -91 -107 -18 56 -31 -179 -25 103 0 -132
3433a32Q6R7m3K43k52O4M5j16j63R1k00L32j98M47k09j34J91j78J42j07J86k11
$$ -132 -46 51 8 251 -1 63 108 -8 -171 -80 -280 52 -146 301 92 -42 149 -29 113 6 192 -19
3455a9l6k0l0K01Q3%k35N1j64m11L58m6K83j35J89n7K08m42L66q6J84m27K16j42
$$ -19 -55 -75 -105 96 179 179 -56 -5 -169 -580 -222 -268 15 -120 69 12 220 -222 144 58 242 -185 31 -111
3479a11J17M30k53j66j02pJ81Q8j71Q0m73J63K34p8k46K92K63j22j55J13p8L0
$$ -111 6 436 183 17 -85 -92 89 177 6 86 -387 -224 10 -68 -314 -22 241 119 -36 77 -1 29
3501B9j37K32j95P8n0N8J3j57J00J38k69J87J52j24pR6j48K8j62j6K46k12k06
$$ 29 -108 124 -71 7 -43 15 28 -129 -29 109 -160 27 179 55 48 144 -4 24 -138 -154 92 -120 -326
3524c26L76J52j32kJ39l2k44J67j22J62j44k98M29k28j33J47J31J99k31R9o5M2
$$ -326 50 202 70 68 207 175 -69 98 -24 138 -6 -304 125 -103 -236 -89 42 241 10 109 44 86
3546H6p0k8J05k63oR9O2m5L96l30qL07j33n4J29M8l74M5J95q5k27N5l47K83K03
$$ 86 16 -12 93 -170 -176 -77 -15 -60 336 6 -2 305 172 118 247 295 -79 -34 161 76 -151 -96 -443 -160 43
3571D3m09K59K56J79m54k88L71K3J48j70p2J49O8r2J07J30j79N5J51k79K14k23
$$ 43 -366 -107 149 328 -126 -414 -43 -20 128 -42 -114 35 103 11 118 248 69 124 275 -4 210 -13
3593a3j50K76k24J37k3m5K39j46j2K6m13L07N2l9J36N2j67K37k92J70M0r6j26
$$ -13 -163 113 -111 26 3 -42 197 51 39 65 -348 -41 11 -28 108 160 -7 230 -62 108 148 52 -74
3616g4r1J26j24J87Q0J22k07k13R8K32l76J10J94j11r8J82j09l3J46k06J64o1
$$ -74 -165 -39 -163 24 104 226 19 -194 -96 136 -240 -130 64 -47 -145 37 -72 -105 41 -165 -1 -62
3638f2J10o3K37l98j42J56M49%m85N38j05k0J3j26j98k8K53k7J14k2l10L21l27
$$ -62 48 -15 222 -176 -318 -162 287 287 -198 340 235 215 228 102 -96 -124 129 102 216 194 -116 205 -122
3661a22K05j66K44k00J14j15M36o13M4K5J02R2MK54m69K04r5K46l8k74Q8LQ7J92
$$ -122 83 -83 161 -39 75 -40 396 -217 -173 -148 -46 46 50 304 -165 39 -56 190 152 -122 -34 -31 56 248
3685B48l22J06K16j81j06j03K3M6o7J73Oq7l06L83j74R6M6j31j79L15j01K98k21
$$ 248 -74 32 248 67 -39 -142 -119 -73 -140 33 39 -48 -354 29 -145 -49 -3 -134 -313 2 -99 199 -22
3708b2J06q1R8J09j18j22j13L81M9l42m2K10k73J05P1k2J42l89J51q9L06j03j70
$$ -22 84 3 101 210 92 -30 -143 238 287 -55 -97 113 -160 -55 16 -6 136 -253 -102 -191 115 12 -158
3731a58n3K61p7p7J07j27J56J61k78J33R9m37J27K37q8j14J79J89r1J51l33k16
$$ -158 -211 50 -27 -104 3 -124 32 193 -85 48 147 -290 -163 74 -14 -128 51 240 149 300 -33 -249
3753b49p9L53K4l0j2j73L69k16J3Rm4o4rj44J97n1J96k22J70o0K0J05O3Q1j60
$$ -249 -328 25 49 19 7 -166 203 -13 0 9 -35 -99 -108 -252 -55 -106 90 -132 38 -22 -2 103 166 247 87
3778H7P1K6k00j03K65p5j58L47k04j15k03K06L4J09j83L43l36K95o4k26K09l48
$$ 87 158 184 -16 -119 146 71 -87 260 56 -59 -262 -56 -22 87 -96 247 -89 206 142 -84 125 -223
3800b23L88p1O4j39k6k9k0J01m9j28K55k01k34L56j17P1p0K70j24j20K64l03L89
$$ -223 165 94 158 19 -7 -36 -56 45 -4 -132 123 -78 -312 44 -73 -2 -72 198 74 -46 218 -85 304
3823C04J08m98q4K06j71J52O5L6l35j79N56k57J28o3J5k7k0K29l23N1O5l5q1M87
$$ 304 412 -86 -170 36 -135 17 82 118 -217 -396 160 -97 31 -32 -17 -44 -64 165 -158 -107 -42 -77 -158 329
3847C29l70K77m57K27P4j4k02K29r3q8J83k22L9K22J19j96k12ml07O89k33j31
$$ 329 -41 236 -221 6 80 66 -136 93 0 -88 95 -127 -88 134 253 57 -155 -159 -466 223 -10 -141
3869a41N3j22MP0R4j1r2p0P3P3J87J3k29L57k13j1j05J09J57j28n1n7k0j52K58
$$ -141 -88 -210 -206 -136 -42 -53 -145 -215 -142 -69 118 131 -98 259 46 35 -70 39 196 68 17 -40 -60 -212 46
3894D6J91n63Q5L87l34K68r9J8n6Q3k5n8k2J54J15m1l00j7K20k6j2Q8l04p6L64
$$ 46 237 -326 -241 146 -188 80 -19 -1 -57 26 1 -57 -79 75 190 149 -151 -168 52 26 14 102 -202 -278 86
3919H6j23m4r0J23K30l3q5j61rP4l02L76j52Lk25K43J48n7r7j21N20k98j72J65
$$ 86 -37 -81 -171 -48 182 149 64 -97 -106 -32 -334 42 -110 -107 -332 -89 59 2 -95 -216 304 6 -166 -1
3943aj07J64k89P8m7K25K58n60J27K49P2l84K61r2l00L18L6o2K50j34k18K31l7
$$ -1 -108 56 -233 -155 -202 23 281 -279 -152 97 169 -215 46 -46 -346 -28 8 -54 196 62 -156 75 38
3966C8j84J78k66O4J36K63mp8n29L20q8M1J32J12m16K53K19l65J13N8j84J74J97
$$ 38 -146 32 -234 -170 -34 229 225 147 -382 -62 -150 -109 23 135 -281 -28 191 -174 -61 -3 -187 -13 184
3989A84l92J88K53l84O8J45J78m73M25l29L91k1o77L36Q5K75k75p5J23OK2o2j4
$$ 184 -208 -20 233 -151 -83 62 240 -233 192 -137 254 233 -444 -108 -23 252 -23 -98 25 31 53 -9 -23
4012b3J66J5P0n3k04k21J07O9K58p1k43L35o0k41P9j10K09l0N2q8J49j26q7J21
$$ -23 143 158 228 175 -29 -250 -143 -74 184 113 -130 205 145 -96 -17 -127 82 52 104 16 165 39 -48 73
4036G3l7NK4k5k50M3L26K19o14J03j0K49J01k99R4J45k74L77k12k3j88N10l88
$$ 73 36 41 65 40 -210 -167 159 378 -236 -133 -143 106 207 -92 2 147 -127 250 38 15 -173 337 -51
4059e1J25j65L22Q8n71O8J72P1r6O6P5j3l3k94J05nnK36L07m09J29r7Ml09L24
$$ -51 74 -91 231 319 -252 -184 -12 59 -37 29 104 91 58 -236 -131 -136 -141 95 402 -7 122 25 29 -280 44
4084D4j65r4J83J2J65Ml01j96L85r6Q0m85N11j16J09Q4J44j72q2J87j33Q7j03
$$ 44 -121 -215 -32 -20 145 149 -152 -348 37 -59 21 -464 47 -69 40 124 268 96 14 201 68 155 52
4107E2J60l54J81k6J29j70ML0j19k69N52j28l88N21j60r9K69l10j08k01J64L41
$$ 52 212 -142 39 13 142 -28 -24 6 -113 -382 170 42 -346 175 15 -84 185 -125 -233 -434 -270 71
4129G1j0l7n5J9l01J79J19O8Rp7j36L08j40l5N8K34k45j40j76Q5K94j28K17l83
$$ 71 61 24 -31 -12 -313 -134 -15 53 62 -15 -151 157 17 -18 40 274 29 -111 -287 -202 92 -36 181 -202
4153b02R7J19J52j36PL1J29j50J93o1r1k04K76m53P6J47k9J84k04J50j28M75k39
$$ -202 -105 14 166 30 37 68 197 47 240 179 88 -116 160 -293 -217 -70 -99 85 -119 31 -97 378 139
4176A39k15K55l46J92j8o7J80m7p8n0J38j28j7L25j51k89K38j30j45N59l94o4
$$ 139 -76 179 -167 25 7 -60 120 73 -5 -55 83 -45 -62 263 112 -177 61 -69 -214 345 -49 -113
4198a13M1n3K66q3j90K86k13j28J00J08K01RM8k23k2m6J54l04J40P6l10J05p9
$$ -113 -72 -125 141 58 -132 154 -59 -187 -87 21 222 231 279 56 34 -12 142 -162 -22 54 -256 -151 -230
4221b30O39o52J79j11J64j16J07J70k12J05K79k86jJ67j44M4m31M70l44M3K17
$$ -230 409 -243 -64 -175 -11 -127 -20 150 -62 43 322 36 35 202 58 102 -329 141 -203 -160 57
4242E7j58J6J30O8N6L6m90J81j31J77J84p5J65m0k55q7K22Q3j01l9j93K25N4J2
$$ 57 -101 -85 45 113 169 205 -285 -104 -235 -58 126 51 216 176 -79 -166 56 139 38 -1 -194 31 85 97
4266I7N9m13O0J50o1K18n0K98j85l40K24J53j65K36k64j36K83l49L54k85j52K60
$$ 97 156 -257 -197 -47 -108 110 60 358 173 -167 57 210 45 281 17 -119 164 -185 169 -116 -268 -8
4288hk3J63k05J31L7Q9m9k05J38k97p1O32l77l16M77k52J10J89k08q5J64J08R
$$ -8 -31 132 -73 58 95 184 135 -70 68 -229 -300 332 -45 -361 116 -136 -26 163 -45 -130 34 142 151
4311A51N9l51L71j27k29J99r0K44j66j16M1R1k37K4R3J15R8m69L50q4J50k50K3
$$ 151 210 -141 230 103 -126 73 -17 227 61 -55 -14 77 -160 -136 -43 72 170 -299 51 -33 117 -133 -110
4334a10N6j46K95l3J18k95J18j39K32l6k9j54K66l15J72M3J07r7K8j56J7j20J72
$$ -110 -54 -200 95 62 180 -115 3 -136 96 60 31 -123 143 -172 0 43 150 53 81 -75 -58 -178 -6
4357fl2j86L99j92k40L55j67K01N5n14L34J33l48P5J13K16j42Q9q2M7j78L97k79
$$ -6 -38 -224 175 -17 -257 98 -69 132 187 -327 7 140 -208 -133 -20 196 54 143 61 108 -70 327 48
4380D8R2j26j17r3J80K02j97J10k64J83j79Q8j69J37J33j14K66K27n31L45l04
$$ 48 140 14 -103 -196 -16 186 -11 99 -165 18 -161 -73 -242 -105 28 -86 180 407 -124 221 -83
4401h3K77R3j43j67m8K4J29j82K31l40J93K62k25K02j42J09n8J9m85N04k04j93
$$ -83 194 287 144 -23 -71 -47 82 -100 131 -209 -16 246 21 223 81 190 132 151 -334 170 -34 -227
4423b27J89N7n8q3K58k54jqJ78j96J21L3J09j72j85j20J18mK3K15J97k51k72M58
$$ -227 -38 19 -39 -122 136 -118 -119 -127 51 -145 -24 9 118 -54 -239 -359 -241 -245 -222 -7 190 -61 -333 125
4447A25r6l6k20K25k2R7q5j74M1R8k3J22j30N1J64J73p0l89J95q6R2L8L7K22m73
$$ 125 29 -7 -227 -2 -24 73 -12 -186 -145 -47 -70 52 -78 -27 137 310 240 -149 46 -40 52 90 127 349 -124
4472a24L09l39J67m3J53j97p1J2q5K80j58J46r8k1L7L58k88k09J60M3k86J18J54
$$ -124 185 -154 13 -30 123 -74 -145 -133 -218 62 -96 50 -48 -69 -32 326 38 -171 -11 32 -254 -136 18
4495A8j10K18O7j76k85L27m9J45k11j76m2L46Q5O0k25R7k37L06J91k2k91j19j52
$$ 18 -92 126 193 17 -268 59 10 155 -56 -232 -274 72 157 217 -8 89 -148 158 349 327 36 -83 -235
4518b35M54l30j8K89q2o8r4J06l37K92m8J52l1r6K38j38j71K91k10J06l7j76J52
$$ -235 219 -111 -129 160 78 10 -84 22 -315 -23 -71 81 50 -46 192 54 -117 174 -36 70 33 -143 9
4541Il21M10m9J33l34J20J85k97o0jJ96Q5k75J12j23K96l77L70J91k84J17k68
$$ 9 -312 98 49 182 -152 -32 153 -144 -204 -205 -9 76 -199 -87 -210 86 -291 79 270 -14 103 -165
4563a65N2L57j63l75K34k00K40N5M5j51K78j82o4q8L41j47J77l30N31l30P6n05
$$ -165 -113 244 81 -294 -60 -260 -20 35 80 -71 207 25 -39 -127 214 67 244 -86 445 115 191 -314
4585c14K54L27l00J44R7j93J14N9j54j96K61q0j47J40l8N9r1J33o8%J20m65K05
$$ -314 -60 267 -33 111 208 15 129 188 34 -162 99 19 -128 12 -26 33 -58 75 7 7 127 -338 -133
4608a33k7O9O4J63o2rk9p1J22m8J85n52K14m7j15J52j34N4J74j6K26j01P4j24
$$ -133 -160 -91 -27 136 74 65 36 -35 87 39 224 -328 -114 -161 -276 -124 -258 -204 -30 -46 180 79 153 29
4632B9k21M06R4m5n86N63l79J82l18K75J20j2k94J70J67j86j52J95l16K31j43
$$ 29 -192 214 308 263 -323 240 -139 43 -275 0 120 108 -186 -16 151 -35 -187 8 -308 -77 -220
4653b20L17k10L4L12Lj78k35K62n12O60k72k0m1L34n31M47j50j14M0J05n4r4J21
$$ -220 97 -113 -79 233 236 58 -177 85 -427 233 -39 -59 -100 234 -297 150 0 -114 -74 31 -23 -117 4
4676Dk96K98N2o9j53K18k49L3l4n3K84n2j35l6N31m90m4M68l24O4j93K59m69K07
$$ 4 -292 6 58 -11 -164 54 -195 -162 -196 -249 35 -17 -152 -188 343 -147 -191 277 -47 17 -176 83 -386 -179
4700a79J42n2q6M78j78j19Nl30J00M90k60r5j38K86r5r7O5n8N4l5K35j01kPj61
$$ -179 -37 -89 -175 303 125 6 11 -319 -219 271 11 -84 -222 64 -31 -128 -63 -121 -67 -102 133 32 30 37 -124
4725a24m7J86q4LJ69k98J41K99o19M51j35q5J57j13K49j87k44M03k95K24m6j34
$$ -124 -171 15 -69 -66 103 -195 -54 245 -374 77 -58 -143 14 -99 150 -37 -281 122 -173 51 5 -129
4747a29K04k13K15K92n09K29K9l3j95j68M3J14Q5o2J25Q0k42l32M10o0J03L5K7
$$ -129 75 -138 77 369 -140 89 118 85 -110 -278 -235 -121 -36 -98 27 107 -135 -467 -57 -117 -14 21 48
4770D8J09j05j27J82J61l90L11n39M61l93J00K60K1q0l00M60j17k40J4k4L88k43
$$ 48 157 52 -75 107 268 -122 189 -350 111 -282 -182 78 99 19 -281 179 62 -178 -164 -188 200 -43
4792d3J53j15Kj06l9J27j01j05N42k02j97K16M2l9Lk63o7L13j17J24q6j2K40k61
$$ -43 110 -5 -3 -109 -148 -21 -122 -227 315 113 -84 132 174 135 138 -125 -192 121 4 128 42 30 270 9
4816IJ89o6P7l49K46j74K06j07L7R2j73k48K19n5J13J4k56J64k58L81O5J49k89
$$ 9 198 132 209 -140 106 -68 138 31 68 160 -13 -261 -42 -97 16 30 -226 -62 -320 61 126 275 -14
4839a4n6j91K61J66l63R8ln6R4j29Q0J97Q3j64R3p6r9j61J90q6J09R2k75P0l5
$$ -14 -70 -261 0 166 -197 -99 -102 -158 -64 -193 -113 84 167 3 96 20 -79 -240 -50 -136 -27 65 -210 -140 -175
4864a75K26J8k45K10J67m62K07l2J0q9J82Q7k37j49L12M6j64L3M36l51O8L1j13
$$ -175 51 69 -176 34 201 -261 -54 -86 -76 -165 17 104 -133 -282 30 76 -88 -55 381 30 98 129 16
4887A6J26j56m3K48j52Q3n8jJ15n7k08J56J85q3l98L89j95l6M1j9j11J27j42P6
$$ 16 142 -14 -57 191 39 122 64 63 178 121 -87 69 254 171 -227 162 -33 -69 -28 -47 -158 -31 -173 -97
4911i7J00j12K22k39J84j92j28M18k14J47J33m61N78m03o3L25L7k12K7m6o7j71
$$ -97 3 -109 113 -126 58 -134 -262 156 -58 89 222 -239 339 -64 -127 198 235 23 50 4 -63 -234
4933b34K80j37K56k48j76L45Q2m17N02m37J97M9K7j43O9j72l18K63K69k67J42
$$ -234 46 -91 165 -83 -259 86 168 -249 253 -184 13 62 89 -54 15 -157 -475 -212 57 -210 -68
4954f8J09L11n20j36N51n7p5k41K12n4N7L48m93l17M31o8K59l56J99J06k70k19
$$ -68 41 352 -168 -304 247 190 115 -126 86 32 89 437 -56 -373 58 -10 249 -107 92 198 -72 -291
4976b91K6Q8K95n6j40J89k42J77J45O2q3k87J41J60j25j26L0J55k84L62n13J00
$$ -291 -265 -177 118 62 -78 111 -131 46 191 253 170 -117 24 184 59 -67 -37 118 -166 196 -317 -217
4998b17K51j5Pj35j1J3J25k5j55P9oK79J65n04J85m25M04J03q1j5j75K08r2J14
$$ -217 34 19 26 -109 -120 -107 18 -7 -162 -83 -89 190 355 -149 36 -389 15 118 37 22 -153 55 -37 77
5022G7l2k13J72R7kM9k53J05P0M7l75J13R4K13k72J07j30M56n73L30l0o8k4K33
$$ 77 45 -168 4 101 99 148 -105 0 70 117 -258 -145 -51 162 -110 -3 -133 323 -250 80 50 -18 -42 191
5046A91m47N4J3K05P3j20J01l83M99j97k26L5K91O7R9l39j15K10J15l71L86l42
$$ 191 -256 -202 -189 16 89 -31 70 -313 186 -11 -237 -202 89 156 255 -84 -199 11 126 -245 141 -201
5068b01j07K63l2j26J16r4M45k66j23K09k33M45l25l29N11k94K60m26M84j99k03
$$ -201 -308 -45 -77 -203 -87 -181 264 -2 -125 84 -149 296 -29 -358 153 -141 119 -307 177 -22 -225
5089b25N97l18k4m96L63K82m18K44p0mK60o43P25j00l01J63K00o6j81L97l83J36
$$ -225 372 54 30 -466 -103 179 -239 5 -65 -69 191 -452 273 173 -128 35 235 169 -12 385 2 138
5111A38k37Q7k06J3J21L76p45L04M36k87J37m09J82m2j8K86Q5q5J13k05J08J6
$$ 138 -99 -12 -218 -205 -84 292 -453 -149 287 0 137 -272 -90 -132 -150 136 221 136 249 44 152 168
5133A68kl35J18J93k45K65k70P0q6N4l9J26l69J57O8K27k90l6p4N38n11J18K74
$$ 168 166 -169 -51 142 -103 162 -108 -38 -124 -70 -109 17 -352 -195 -127 100 -190 -226 -300 238 -273 -155 119
5156A19p6m2k18K10k57J4K85K0p4k7K4J27N7l2J2j77J87j70r6K03j53J27J95k15
$$ 119 43 1 -217 -7 -264 -250 35 55 -19 -46 -22 105 162 130 142 -35 152 -18 -114 89 -64 63 258 43
5180D3J51j12j81K29K8j24k42K66j98K03L8j02j83J83K54j33K00n45J00j04K98
$$ 43 194 82 -99 130 158 34 -208 58 -140 63 101 -1 -184 -1 253 120 320 -225 -125 -229 69
5201F9o6P3N7k70r2J97M5P4j25J65M1l41J88j48M96l48J39j59r5m2p0J96k0M42
$$ 69 3 76 133 -137 -229 -32 13 87 -38 127 168 -173 15 -133 363 15 154 -5 -100 -142 -212 -16 -36 406
5225D06n66l00M55R3j69K47k30r1M5q5M02J98m85k13o7M35J12j55J1l06M83K4
$$ 406 -160 -460 -5 88 -81 166 -64 -155 -110 -195 207 405 -80 -293 -360 75 187 32 43 -263 220 244
5247B44l39k4J30j48N27j94j86J74l86J17o8L13l12J16J5L2L49n44R9K19p1j33
$$ 244 -95 -119 11 -137 390 196 10 184 -202 -85 -153 160 -152 -36 -21 11 360 -184 -85 134 63 -70
5269g0j4J43j19J26j26q1J02j38N48k48j11k89M2L88q7J26l34L54j33K6j12J88
$$ -70 -84 59 -60 66 -60 -141 -39 -177 371 123 12 -277 -235 153 66 192 -142 212 79 105 -7 181
5291A81j07k84L17J71n5m25L34j9m36M62l49J60J78n32M13Nk9k21L26o7m3N6K20
$$ 181 74 -210 107 278 223 -202 132 113 -323 139 -210 -50 128 -404 9 14 -15 -236 90 23 -20 36 256
5314B56k23K3r9L4l0mk5O1K84j57j46m1R9J4K7j25J46L45m75K06K2k74r7K19k22
$$ 256 33 56 -43 -9 -39 -43 -68 -7 277 120 -26 -67 32 46 73 -52 94 439 -36 170 192 -82 -179 40 -182
5339a82n4J94n4J50l95O78n37N57m12K26l35J58QJ40k69J32O0j03O8l97L76j43
$$ -182 -236 -42 -96 54 -341 337 -200 357 -55 171 -164 -6 2 142 -127 5 65 -38 30 -367 9 -134
5361a34N38j84j07k18j86M19r3k84M45K6m02n4L64mn0r0j08j38K78n8m8J32k26
$$ -134 404 220 113 -105 -291 128 35 -249 196 222 -180 -234 130 126 76 -14 -122 -260 18 -40 -88 44 -182
5384a82Q2J34M9j09r7J46N9K7N4n73M25j4Q9l72K68k54Q7N1K08l27K00J50J5m
$$ -182 -100 34 83 -26 -123 23 82 109 163 -410 15 1 90 -282 -14 -268 -181 -130 78 -249 -49 101 116 112
5408A12j56J62k92K59k27K59k50J88L06p80O03k62K50m2l23K29j6j81J11On3q2
$$ 112 -44 118 -174 85 -142 117 -133 55 361 -419 184 -78 172 130 -193 36 20 -161 -50 -44 -97 -179
5430a79L31j08q6r6J5J24j87K97p0j84%K40j04k84K77n2m5J87j36K4R8J6npk10
$$ -179 152 44 -42 -138 -123 1 -186 111 41 -143 -143 97 -7 -291 -14 -66 -111 76 -60 -36 62 78 73 66 -144
5455a44J91j80J35j20J13l08K28l45M15L46l59l43L03R5l22J12J29J17k63M42
$$ -144 47 -133 2 -118 -5 -313 -85 -430 -15 331 -28 -371 -68 27 -295 -183 -54 63 -200 242
5475B42l44q8J08O7k81L13Q3j14k87L17l3O3j38J2j22K42j15K2K6k18K97p5m17
$$ 242 -102 -190 -82 -15 -296 17 100 -14 -301 16 -17 46 -92 -80 -202 40 -75 -53 -27 -245 52 -23 -440
5498d40M61J03j57J89j51J57k47K57j31R7k22J63k93J39r5K33j21J7J67k14r6
$$ -440 21 124 -33 156 5 162 -85 172 41 138 -84 79 -214 -75 -170 63 -58 -41 126 -88 -184
5519a84K57L7j56K07m40L03j4n3q9K02m47k3M9K00O4K31m8l8L5m22L20j77L73
$$ -184 73 110 -46 161 -279 24 10 -43 -132 70 -377 -400 -351 -151 -87 144 96 58 93 -329 -9 -186 187
5542A87k3j76k9k8P4j81N4j01M07l23K70j77J25J69k15k65R3M74o11M12l21J44
$$ 187 164 -12 -41 -69 5 -176 -122 -223 184 -139 131 -46 79 248 33 -232 -139 335 -276 136 -185 -41
5564d1j48P4M0K1j77K26K0j47L14k01J32l17K72k22K10J23q0j03j94K00O7j2j19
$$ -41 -189 -115 -75 -54 -231 -5 15 -132 182 -19 113 -204 68 -154 56 179 99 -4 -198 2 69 57 -62
5587f2J35j24O8j27J33j96K13j18K6l95N58k59O27p87L79k26L73r1j69j6K37j07
$$ -62 73 -51 17 -110 23 -173 40 -78 -52 -447 111 -148 479 -308 71 -155 218 127 -42 -58 179 72
5609G2k03q1K34q4M93j33j0l97K81k19L74n38K88M87n75J70l70OJ41J65r0m2r0
$$ 72 -131 -212 22 -62 431 298 288 -109 172 -47 327 -211 77 564 -11 159 -211 -205 -64 101 11 -31 -121
5632a21j26K30j28k75L83k70L46M4k2k6j16J78j57L18j81r0j82L19J30l01J80
$$ -121 -247 -17 -145 -420 -37 -307 39 83 61 35 -81 97 -60 258 77 -13 -195 124 254 -47 133
5653A33k72J93m13K67K87J08n31K84rj97J67M6M05n94J40Q6n3j96j8K86l7Q5k48
$$ 133 -139 54 -359 -92 195 303 -228 56 47 -150 17 63 468 -126 14 100 47 -149 -167 119 82 167 -81
5676h1L1J08K08m3r2J43l33l5L36m4j92k67O67m05P3J39j97l19O16l55j97L48
$$ -81 -50 58 266 223 131 274 -59 -94 242 198 6 -261 406 1 74 213 16 -303 313 -42 -239 109
5698A09J06L2j64R3l29J30R3L2L0K20m53n5k34L74J60j01J26k04j07M8R6k30L35
$$ 109 215 247 83 176 -153 -23 70 102 132 352 -101 -156 -390 -16 144 43 169 -35 -142 -94 2 -228 107
5721A07k29K8p0K35n5j83L62j95K13k78J30j50M5J91j60M72l87j9k52j88L98J15
$$ 107 -122 -94 -164 71 16 -167 195 0 213 -65 65 -85 -40 151 -9 463 76 57 -195 -383 15 130
5743A30O3m32L89m28K12j84L93L2k83K13J05J67k66l78L55r1J47j64j60L32m36
$$ 130 193 -239 150 -278 -66 -250 143 175 -108 105 210 377 111 -267 88 -3 144 -20 -180 152 -284
5764b84J00P2q4L95j72l1k5l0K34O6k19J8j60k8M40j28p4n6o9R6l41K38M3o0K39
$$ -284 -184 -112 -196 199 27 -4 -29 -59 175 241 22 40 -120 -148 292 164 90 34 -35 61 -280 -42 1 -59 180
5789A80j35L3l80N66k68L3l50L47j21ll2m1L36k9Q4J9l77L27j56m81P95l01q9
$$ 180 45 78 -302 264 -4 29 -321 26 -95 -98 -130 -171 165 136 220 239 -138 189 33 -448 347 46 -43
5812d3J2K7k64JJ00K54k46J66K9j58j04K97j56Lk44K36P3K94m77k65L87L49j58
$$ -43 -31 -4 -268 -267 -167 87 -159 7 36 -122 -226 71 -85 -82 -326 -90 -17 277 -200 -465 -78 271 113
5835A13k44J09Q9j57P9l34M36j57k2N4K1p6J08j62K36P2N2m26K61j07m0m9l1r5
$$ 113 -131 -22 67 -90 -11 -345 91 -66 -88 -34 -13 -89 19 -143 93 165 217 -209 52 -55 -95 -144 -175 -270
5859b70M54j93O6k50J01J23k1N3J64k83l4n4rK38k64J50m7J04k36K57J36k0k61
$$ -270 184 -9 57 -193 -92 31 10 63 227 -56 -90 -144 -153 85 -179 -29 -76 28 -208 49 185 165 -96
5882i6J33q9k18J96j5J65j59o2N1J52J8m33N94k61J15k63K79l69M81R3l40K04
$$ -96 37 -52 -270 -74 -89 76 -83 -145 -94 58 76 -357 237 -24 91 -172 107 -262 219 312 -28 176
5904A76q6J06l50M98k05j70M0j38J51l03J50m4L68o1j54J9l5J88k88M53l25k6
$$ 176 90 196 -154 344 139 -31 9 -129 22 -281 -131 -175 193 132 -22 -3 -38 150 -138 315 -10 -36
5926c6j6K17J8j03O1j20q6o3L4Q1OR5K73m79K4K97m10J01J49k2kJ56r9j92K08
$$ -36 -52 165 183 80 141 21 -65 -128 -94 -13 -7 88 361 -118 -94 203 -207 -106 43 21 19 175 76 -116 92
5951I2n5k26L03j99mJ50k51L78j38p1j17K40r5l3R7J04j65R8l28N04j77k32L16
$$ 92 37 -189 114 -85 -89 61 -190 188 50 -21 -138 102 7 -26 71 175 10 108 -220 284 107 -125 191
5974A91o9J30l45J15L70k37l0j16k10K00N8j34N6j53K07j16K41m2n4k56O4MK61
$$ 191 122 252 -93 22 392 155 125 9 -201 -1 57 -77 -21 -174 33 -83 158 116 62 -194 -130 -126 135
5997A35j72J59n7p0l35M14J05l71K3L0J62K86j88Jm24O14k94J55m21K55l8n4Q5
$$ 135 -37 122 65 -5 -340 74 179 -192 -169 -139 23 309 121 122 -302 312 18 173 -248 7 -31 -85 0
6020@r0K0J0l2J66j02K69J06j34j10j23J31r2q9L54k62r3Q4n0O1n0r1J85r2j1
$$ 0 -90 -70 -60 -92 74 -28 241 347 213 103 -20 111 19 -70 284 22 -71 13 -37 24 -26 -117 68 -24 -35
6045c5p0j11J25J60j12K0k6j88K99J48k59K08k63J16k12J06k97J66N7Q5L01l93
$$ -35 -105 -216 -91 69 -43 -23 -49 -237 62 210 -49 159 -104 12 -200 -94 -391 -225 -168 -83 218 -175
6067a75K71j44k72J11J19K31n59N37j20N1m08J95J73M8J61p5j7Mj12pm99M17%
$$ -175 96 -48 -320 -209 -90 141 -418 119 -1 50 -358 -163 10 58 219 144 127 131 19 12 -487 -70 -70
6090g0k02L60l69J18L32m17J42p8%j52L63N0k74K33p1J58j58m7L94l72J08j34
$$ -70 -272 88 -281 -163 169 -248 -106 -184 -184 -336 27 77 -197 36 -35 123 -35 -82 312 -60 48 -86
6112h6R9n7J20J49k62j13J05j4l0J76k18R8k09K00N9o7P4l5k4J56j77K26j34m2
$$ -86 13 -44 76 225 -37 -150 -45 -59 -89 87 -131 -33 -242 -42 17 -50 24 -11 -35 121 -56 170 36 -6
6136fJ31k56K41m25K08K04j35M49l95J80m88J18J12K93k30mj02N1P3M1m36J5L04
$$ -6 125 -131 110 -315 -107 97 -38 411 16 196 -292 -174 -62 231 1 -3 -105 -54 19 60 -376 -361 -57
6159e7P6Lj47K3O4K6j69J11K5j10M67k21J9j31j12M8J45m9P7l13K32P6o6j35K65
$$ -57 19 22 -125 -102 -38 -12 -181 -70 -45 -155 312 91 110 -21 -133 -85 60 11 88 -225 7 83 17 -118 147
6184A47o1p0M2k56J86j42K65M2P9k78J36m50N49k14J18j69j85K00J72l92K34K35
$$ 147 86 16 58 -198 -12 -154 111 153 232 -46 90 -360 189 -25 93 -76 -261 -61 111 -281 -47 188
6206A88L2k50K82n53J76k29J95jJ94J7k2N7o7m4K0L1j02R3j81J24j96K17R1o1
$$ 188 220 -30 252 -301 -125 -354 -159 -160 34 51 29 86 19 -25 -5 26 -76 17 -164 -40 -236 -19 72 11
6230A1R7k58k9J04J63m84M71j46R9K24k86j84j57N35m1j96K48k93K34n5L8n2j49
$$ 11 108 -150 -179 -75 88 -396 75 -71 28 252 -34 -218 -375 160 119 -77 171 -122 112 57 95 43 -106
6253a06J64k3j18K77j04k6O5q2J75l85M6K8J3j49K46P4m6J34j61o5K02j65N0P3
$$ -106 58 35 -83 194 90 64 129 47 222 -163 -117 -89 -76 -225 21 95 49 183 22 -43 159 -6 44 117
6277A17l3L0m7K0k18P1J45J07l51O1K48k49J24k5j79K97Kk00P5k25o7K02j55K60
$$ 117 84 114 67 87 -131 -60 85 192 -159 -98 150 -99 25 0 -179 118 120 -80 -5 -230 -297 -95 -250 10
6301A0M2j06J42k65J2Q8J77O4j75K90m74R3K1K72j62l63L31j98M04j61Q0R1l43
$$ 10 52 -54 88 -177 -165 -77 100 164 -11 279 -195 -102 -81 191 29 -334 -3 -201 203 42 122 213 -130
6324a30J4M67l86J45O7k46J08J31l2l13N2m7K65R5J09n90L10k80K41J02k40J57
$$ -130 -116 351 -35 110 177 -69 39 170 138 -175 -123 -170 95 190 299 -291 19 -261 -20 82 -158 -1
6346ak7o6j15K83m6j55rK57j09K09k58j38L48P4m7n0n3j27l57M18Q7j56J79m8
$$ -1 -28 -94 -209 74 28 -127 -136 121 12 221 -37 -175 173 247 200 150 97 -30 -387 31 118 -38 141 93
6370I3q1n2K26M5l29k2m9j51L78J3n5j01N5J93j38M7J62j64K14k53N8j16K55J9
$$ 93 12 -40 186 231 -98 -120 -169 -320 58 71 16 -85 -30 163 25 72 234 70 284 31 89 -27 228 247
6394B47q0j34Q5j50j22M2M35m78P7j3K36J14j12k12Q4L3k27J9J17r2L13o8N2L7
$$ 247 167 33 118 -32 -154 -112 323 -155 -78 -91 145 259 147 -65 19 52 -175 -156 -39 -131 182 114 166 203
6418B03k14M8j74J85l3o8L85k25j82l7K51O9j55j33K02j63j00O7J85k09K09N8
$$ 203 -11 37 -137 48 15 -53 332 107 -75 -112 139 208 53 -80 122 -41 -141 -74 111 -98 111 169
6440A69J48k64k72Q5J69k15j11L38j34K05L7l68K41J34j30L5k96J83K21l31K9
$$ 169 317 53 -219 -134 35 -180 -291 47 -87 118 155 -213 28 162 32 67 -229 -46 175 -156 -127
6461a27K38j64pRN7L33p8l82K13l72J69J02L33k89l51K81P4l5L67l31j38K53k77
$$ -127 111 -53 -60 -51 6 339 261 -121 92 -280 -111 -9 324 35 -316 -35 39 4 371 40 -98 155 -122
6484a22N5M9j47J56O3%j95R2j3P2K98m35J90r5K14l74L16j52L46k68j71K48q2
$$ -122 -67 -18 -165 -9 54 54 -141 -49 -62 10 308 -127 63 -32 182 -192 124 -28 318 50 -121 127 45
6507D5l81K11o8K47M4j84K72k44m7P1J38m7n7l76J89J42L0j01kK96j82j9J58j35
$$ 45 -336 -125 -193 54 98 -86 186 -58 -105 -34 104 57 0 -376 -187 -45 -15 -116 -118 178 -4 -23 135 0
6531@J94k53j18J77K18R0m67K24k13j07n6K41j57N35l03Q9j41J09J64j71K42l40
$$ 0 194 -59 -177 0 218 308 -159 65 -148 -255 -311 -70 -227 308 5 94 -47 62 226 55 297 -43
6553d3J26k84J94K03j91J16j48j08K05l07L12j39O4K37n1M9m73J63J90j87N6J92
$$ -43 83 -201 -7 196 5 121 -27 -135 70 -237 75 -64 0 237 186 235 -238 -75 115 -72 -16 176
6575A76l37k25N95j39l77L63j6Rq4mR2k53K74R1j66p4k12J12l9J35K52j40J14
$$ 176 -161 -386 209 70 -307 56 40 49 -35 -39 53 -200 74 165 -1 -75 -287 -175 -214 -79 173 33 147
6598A47k48M07k63k32R1j03J24j06J88r7K10k0j15K09l25M34k62P3m31K69l50
$$ 147 -101 306 43 -189 -98 -201 -77 -183 5 -92 118 98 -17 192 -133 301 39 112 -319 -50 -400
6619d00Q38l71k15Q7J25M1k33J3J10j17L09k86k52L53K44l46L64l07k43J42J67
$$ -400 438 67 -148 -61 64 105 -128 -115 -5 -122 187 -99 -351 2 246 -100 264 -43 -286 -144 23
6640B3KR4j22K04j19r5K87l89J93j08nl8l8j3K51k17M75o73L74J4J31j75K46l96
$$ 23 25 119 -3 201 82 -13 274 -115 78 -30 -35 -73 -111 -124 127 -90 385 -288 86 100 231 56 302 -94
6664i4r6J76N8m4J00J43j43l5l79L23K18R9m57J88J7K0j32R7k13r0J44J4P9J86
$$ -94 -190 -14 44 0 100 243 100 65 -314 9 227 326 -131 57 74 94 -38 59 -154 -244 -100 -86 -7 179
6688A79j5j12K26l07J23L7l50K58M9j4oR7k75J85R6j09Q8l10J87l02L7K41L2k09
$$ 179 164 52 278 -29 94 131 -219 39 88 74 68 165 -110 75 171 62 150 -160 27 -275 -238 3 35 -174
6712a74K46K4k17K97l01J32j52oL66R2j81j70P6k06L7K44k27J97r3j1M9R8l58
$$ -174 72 96 -121 176 -125 7 -145 -151 215 307 126 -44 32 -174 -137 107 -120 77 -16 -27 22 120 -238
6735b38L44p9K3j92O4K08m0k29J00k23J55J28j9J31j42j63L33j18k14J50m4N7
$$ -238 106 27 50 -142 -78 130 90 -139 -39 -262 -107 21 2 133 -9 -172 161 43 -171 -21 -65 -8
6757hj92K78J24l61L46k08M6M4M8j26M05l26j55N7r1k04M49p3k66L96Nk87K48
$$ -8 -200 78 202 -159 187 -21 25 69 117 -9 396 70 -85 -28 -119 -323 126 53 -213 183 188 -99 149
6780A49j61M0k98L81k30J32l6p7m9L44k55O1p0j54L94k20l2J03j53%O6M2R8jm2
$$ 149 -12 28 -270 111 -119 13 -23 -100 -149 195 -60 1 -69 -223 171 -49 -81 22 -131 -131 -65 -23 75 74 32
6805C2n5N2j3K7L24l88K88l46M65j79m53JJ38L6j20L25q7k3p3L08m74K96l19O16
$$ 32 -23 29 16 43 367 -21 267 -79 386 207 -246 -245 -107 -71 -191 134 47 24 -49 259 -215 81 -238 378
6829C78n42J28J15MO5k68O8K21l94J86j07J15O8k19J96j18K68j09m07N14P3q4
$$ 378 -164 -36 79 83 148 -120 -52 169 -225 -39 -146 -31 37 -182 14 -104 164 55 -352 162 235 151
6851A51k64j73L56O3k14J95j95L7l8j8J94l8j54J33j89p8L62k55O9j23J31K39
$$ 151 -113 -286 70 133 -81 114 -81 -44 -82 -100 94 56 -98 35 -154 -232 130 -125 -56 -179 -48 191
6873A91k53M91n64J36L4j94L4L25l99Q8J29k9oP6j51j18M08l77N44m46m4l5L91
$$ 191 -62 429 -135 1 35 -159 -125 200 -199 -111 18 -11 -17 59 -92 -210 198 -179 365 -81 -125 -160 231
6896B31j66j77j09K62r0j8J35j38L37l46J29l2k04K60j21K08l98J48k0L86r6k2
$$ 231 65 -112 -221 41 -49 -67 68 -70 267 -79 50 18 -186 74 -47 161 -237 -89 -109 277 181 159
6918A59o9J01j20kR4j43l4K52m06R3J02J36l11K3K78j38J36J0j78M2nl69L95j82
$$ 159 90 191 71 69 163 20 -14 238 -168 -75 27 163 -148 -125 153 15 151 161 -17 25 20 -349 46 -136
6942a36j1R3n1l5j27N56n23P2L42k53J16j91K93j77j42J25K16k3o2K97m92K34
$$ -136 -147 -54 -105 -140 -267 289 -234 -162 180 -73 43 -148 145 -32 -174 -49 167 144 82 379 -113 121
6964A21o7P6j02J02j12q7L5Q2k65J47J94j84j34K33l08K61j4L19k72J10k6l50
$$ 121 54 130 28 130 18 -69 -34 48 -217 -70 124 -60 -194 39 -269 -8 -22 297 25 135 109 -241
6986b41K86k3l53R3kL70R6j96O1m39K75L8n8R6k7R9K03j74j89J56k20l2O2J68
$$ -241 45 22 -331 -238 -240 130 226 30 91 -348 -73 -35 -93 3 -24 75 278 104 -85 71 -149 -181 -119 49
7010D9o9P0P8p9O2k32J68N0j17K2J11j83J75m4k05OJ04J69o1J1k68K04q1N3j76
$$ 49 -20 50 128 49 111 -121 47 97 -20 2 113 -70 105 61 -144 -138 -34 135 74 85 -183 21 -60 -7 -183
7035a83R7j38K70O1o5n0r3J47KK9k51M61j25k84J69k89J01N9K27n77P13j14k48
$$ -183 -86 -224 46 107 42 -8 -101 46 48 77 -174 287 162 -122 47 -242 -141 -82 145 -432 281 167 -81
7058h1O4k36J97N5J76l67L71j49J21k64o9L45l52N91n19K06l08M8P9O2K88l21
$$ -81 -17 -253 -56 -1 175 -192 179 30 151 -113 -182 163 -189 402 -117 89 -219 -171 -92 -30 258 -63
7080f3N1O8P2l34K20L28m47K63j53K85%r1n0k04m3o8K30oj82O6J74k18l05L55
$$ -63 -12 56 128 -206 14 342 -105 158 5 290 290 199 149 -55 -98 -166 64 58 -124 -58 116 -102 -407 -52
7104e2J66j54J16J80kk92j26J10ol2L29r2m01K78j01K67l02O4j06M26m20O6J65
$$ -52 114 -40 76 256 254 -38 -164 -54 -60 -92 237 145 -256 22 -79 188 -114 -50 -156 270 -150 -84 81
7127H1p9j31l0L54m25K11KK85j46L5j92J20J4O4k40J97q0J92m6n08L39j30L66
$$ 81 2 -129 -159 195 -230 -19 -17 268 122 157 -35 85 99 163 -77 120 40 232 186 -322 17 -113 253
7150B53q6j86J47j11j74J48K06k26q0L16r2J84n95K03L37qk06j19j6l62K17N29
$$ 253 167 -19 128 17 -157 -9 197 -29 -109 207 115 299 -296 -93 244 236 30 -89 -105 -467 -250 279
7172B79l12J15p5j59P5N6J26j10P9j35j03L38P3k90R8M8j1j23J9j2K10j99K60
$$ 279 -33 82 7 -152 -77 -21 105 -5 74 -61 -164 174 247 -43 55 103 92 -31 -12 -24 186 -13 247
7195B47q6n61L22J64l64K27j46O8j15K35J73k92K10q5j0j01JJ75k87J12J66k1
$$ 247 161 -400 -78 86 -278 -51 -197 -129 -244 -9 164 -128 82 -3 -13 -114 -113 62 -225 -113 53 32
7217C2j41K70k41j9l5R2K7n3K03k71J94k55L06LP3k60J60J42k89K46l05n7M26
$$ 32 -109 161 -80 -99 -134 -42 -15 -68 135 -136 58 -197 109 112 185 -75 85 227 -62 184 -121 -178 248
7240B48o8m64M53j87l1J10j63k17K59P5L25m93L91k35M7k04M6J93k59P1J56j11
$$ 248 180 -284 169 -18 -49 61 -102 -319 -60 15 340 -153 238 3 50 -154 -108 85 -174 -103 53 -58
7262e8N7J8l23N2J99J43jJ5j42Pn8J09J16J66n48J94J15M6K30l33jN0j01R3K6
$$ -58 -1 17 -306 -254 -55 88 87 102 -40 -33 -91 18 134 300 -248 -54 61 107 337 4 3 53 -48 45 71
7287G1J06P2p7m33l3K96r9l07L43J34j00Q3K93k44J15j80k66N16m52J45N1m7M1
$$ 71 177 249 172 -261 -294 2 -97 -404 -61 73 -27 56 349 105 220 40 -226 290 -162 -17 34 -13 28
7310B8J06N8m08J39L5L2j58J16r0J82n7Q3j32M7j62J80k3K1J68j52j01m8lm3K93
$$ 28 134 192 -216 -77 -42 -10 -168 -52 -142 40 -17 66 -66 -19 -181 -1 -24 -3 165 13 -88 -136 -139 -182 111
7335A11j54Lj58J53k7j1m6J90mJ26k65J47J4k33P3j72N42j22j21j94J19K01p5
$$ 111 -43 -40 -198 -45 -72 -83 -129 61 57 183 -82 65 79 -154 -81 -253 289 167 46 -148 -29 172 97
7358I7j9J17j00Q5j26J01L2l77J22O8J11rk25K4j55J25L38j68k7N1o4L24m74M9
$$ 97 78 195 95 180 54 155 187 -190 -68 0 111 102 -123 -99 -254 -129 209 41 14 65 1 325 -149 -100
7382a00q8M51m08j4L59k74K76j44k23K55k10o1J83L8j13k3K77R7m06J89q6J1Q8
$$ -100 -188 263 -145 -159 200 -74 202 58 -165 90 -120 -181 2 40 -73 -96 181 278 -128 61 -25 -14 74
7405G4J18k66N8O6M9q0j20J56jj05j0K09l88O71o54K0M3J00N0p1N1j18N8m7L76
$$ 74 192 -74 -16 50 99 19 -101 55 54 -51 -61 148 -240 431 -223 -203 -160 -60 -10 -81 -30 -148 -90 -137 239
7430B39m37J08J67l2k87M16k97K72j68k8M9j98L56j49P5J40l76L14j26n5o3J20
$$ 239 -198 -90 77 45 -242 174 -123 149 -19 -47 2 -196 160 11 86 226 -150 164 38 -17 -80 40
7452D0L2j99lK38RR1r4k51J9K01k25J00K42j35J2l9J25j25J14l89K78J13j58J33
$$ 40 72 -127 -130 108 117 208 114 -137 -118 83 -142 -42 200 65 77 38 163 38 152 -237 41 154 -4 129
7476A29l44J75J80k35M4K04k40l4K31k63K45l1P0pm6k34L60K2j75j26J8j4L8k6
$$ 129 -215 -40 140 -95 -51 153 -87 -121 110 -153 92 61 131 124 78 -156 204 226 51 -75 -57 -71 -33 -59
7500e9p2j7k5j65M64n5k04K58k26KL09k93P0r7L02k73M07l33J71m4l46K95p4p7
$$ -59 -131 -148 -173 -338 126 71 -133 125 -101 -99 210 -83 -13 -110 192 -81 326 -7 164 120 -226 69 -5 -82
7524h2m3k7K08n2j51L1K05p3K47l20J27J53m90m3L38J21p5j29l16O96k38j33K13
$$ -82 -125 -152 56 4 -147 -116 89 16 263 -57 70 223 -267 -310 28 149 74 -55 -371 325 87 -46 167
7547A67M0k36K53j80N3k36j45N39k81J08j40K99l17J37L3j69K53k16K10k44J18
$$ 167 207 -29 224 44 97 -139 -284 255 -26 82 -58 241 -76 61 94 -75 178 -38 172 -72 46
7568D6j54P1m8n0L95k74p8J4l16L02J2R9P2j25j85J24J01Q4q9K20k99o1P5j26
$$ 46 -108 -37 -85 -135 260 -14 -92 -78 -394 -92 -80 19 91 -34 -219 -95 6 90 1 221 -78 -139 -64 -190
7592a90K46M5j42j51K75R3r6J9l87K57k72M5M93l02R7k32M03l00j0j51O1K66j72
$$ -190 56 101 -41 -192 83 176 80 99 -288 -31 -303 -258 235 -67 30 -202 201 -99 -109 -260 -199 67 -105
7615a05K83Q9o25L16j14M3L34k55L65l47j3J59k29K00l30K04m7J21Nk10k7N03
$$ -105 178 267 -358 -42 -156 -113 221 -34 331 -16 -29 130 -99 101 -229 -25 -72 49 54 -156 -183 320
7637C20j16jo03M9K91J09K35j52j20k4M1J08P8k49r0O6m3n1J75L4k99J40r9M22
$$ 320 204 203 -400 -351 -60 49 284 132 12 -12 29 137 215 -34 -124 -58 -101 -152 23 57 -242 -102 -201 221
7661B21k16k72K38j25n9j7M25k96q5L7J39L0o2K19J32m19j22L51j00j68L15l19
$$ 221 5 -267 -29 -154 -213 -230 195 -101 -186 -149 -10 20 -42 177 309 -110 -232 119 19 -149 166 -153
7683a53L26o6k6K73j21p60N64J61j33j8k54M3m7P6k56P65m19k29R6ML15j98J0
$$ -153 173 107 81 354 233 -527 37 198 65 47 -207 -164 -211 -135 -391 374 -45 -274 -178 -174 141 -57 -47
7706d7qK00j61K13j24j25N17m28m1m2p8J43j31J84mk6j15J52J91j25k71K41q1
$$ -47 -55 145 -16 197 73 -52 465 37 -4 -46 -124 19 -112 72 68 42 -73 79 270 145 -126 115 34
7729C4k12J45K48l44J44mK26j89j87j08K33k07q3R6L12j52K1r0R9O7rJJ07N8k01
$$ 34 -178 -33 215 -129 15 11 237 48 -139 -247 -14 -221 -304 -208 104 -48 -27 -117 -18 49 40 41 148 206 5
7754EM9k00L19m08L85r6L0P7j85J89K6j44j91N11r2l72J6J53m71K62J26l8j25
$$ 5 54 -146 173 -235 150 54 84 161 -24 165 191 47 -144 367 275 -97 -81 72 -399 -137 -11 -49 -174
7777a74j21K18OJ16k11L13r1J13k99m5O4K37l9k26J81K8j39J32J24l87M23j13
$$ -174 -295 -77 -71 45 -166 147 56 169 -130 -175 -111 126 87 -139 42 70 -69 63 187 -200 223 110
7799A10k57Nl2K08l56M34k61J70K4j33R5j26J78j8Q5j81J23m5M7Nq2r0J82m5k62
$$ 110 -147 -142 -174 34 -322 112 -149 21 45 -88 7 -119 59 41 126 -55 68 23 70 75 -7 -97 85 40 -222
7824b22L60j12k09M82m57q2m1K7K05N4K08l59l8N57k96l98L35j71L61o2J0k97
$$ -222 138 26 -183 299 -158 -240 -281 -254 -49 5 213 -146 -184 373 77 -321 14 -157 204 142 152 -145
7846a45J76J78l50M1Q1k67L17l87L03n5J60K98l32j88K42J85l80j26L50J05P8
$$ -145 31 209 -141 -100 -19 -286 31 -356 -53 -108 52 350 18 -170 72 257 -123 -249 101 206 284
7867B84o5j69q4L14l11K24j21r5J81j25J11k62K57j01J24k79L02m30L05K7k15
$$ 284 219 50 -34 280 -31 193 72 -23 158 33 144 -118 139 38 162 -117 185 -245 60 87 -128
7888a28K80o1k18K18K12k68J21k35K49q8j70J59r2o6j85K07j6N4K72m34jM06k70
$$ -128 152 91 -127 91 303 35 156 -79 170 82 -88 71 -21 -87 -272 -65 -81 -27 245 -189 -190 216 -54
7911e4J74j34M0j89J58K16j40j33j03L53l23PJ42K3K85j96m08K09n5L53k86oJ88
$$ -54 120 -14 26 -163 -5 211 71 -62 -165 188 -135 -128 14 37 322 126 -282 -73 -128 225 -61 -67 121
7934A21j84J5m1J41p9LK48j49k58J00K91k52l40L61M15m29Q7Kl7j52J29j69n0
$$ 121 -63 -48 -89 52 -27 -24 224 75 -183 -83 208 -44 -384 -23 392 -37 50 52 15 -137 -8 -177 -227
7957b27K11L27n40J45j09j1P2J33J79q2o4l34L37q6q4R4O2L3o0j78K42j36J82
$$ -227 -16 311 -229 -84 -193 -204 -132 1 180 98 34 -300 37 -49 -133 -39 23 56 -4 -182 60 -76 106
7980A06j60P1O5o2j50J20R9j03P7j21K85j93k46O4K71k59j26K37k80N81k96J35
$$ 106 -54 17 82 20 -130 -10 89 -14 63 -58 227 34 -212 -148 123 -136 -262 -25 -305 276 -20 115
8002A15k56K35k3k07L24k42j88M88j22k2K5j28J68j94K25l13K75l6q5q8K51j59
$$ 115 -141 94 71 -136 188 -54 -242 246 124 102 127 -1 167 -27 198 -115 160 124 39 -49 202 43
8024D3J68m46K38k04L0OM65l75K66j81m3O8k19j23L31L1J09L6J01k4m88K98M2
$$ 43 211 -235 3 -201 -171 -165 300 -75 191 10 -33 35 -184 -307 24 55 164 200 301 277 -211 87 129
8047A29r2k9J1j06J71l25J90K5q2p0K94j63P3k23j1K75k37j48j6L76Q9Q5j68J76
$$ 129 37 8 19 -87 84 -241 -51 -26 -108 -178 116 -47 26 -197 -208 67 -170 -318 -334 42 131 216 48 224
8071B24j04J9k82K63J00l36M6J6J06j63o9Q2J09j67L20l18J6R9N8J45j37j67O9
$$ 224 120 139 -143 120 220 -116 -70 -54 52 -111 -180 -98 11 -156 164 -154 -138 -39 19 164 27 -140 -71
8094g1M29l79j6j3J25l78M22M6%j92m2%k1k03K11n2M2R7l1m8K05J4l20J79M6M39
$$ -71 358 -21 -37 -50 75 -303 119 165 165 -27 -69 -69 -90 -293 -82 -134 -92 5 -26 -74 131 145 -175 4 50 489
8120D89n75J00j18J07o0k9N4M9J91j66j46o9j94K37K36j52J55m2J53j30j21K8
$$ 489 -86 14 -104 3 -57 -86 -32 17 208 42 -104 -173 -367 -130 106 -46 109 67 220 90 -31 -3
8142cJ07l7M1j05k12K61j7J61m36J20K48k01J66p8J95kk96j8k9K41J73j82j41
$$ -3 104 67 108 3 -209 52 35 196 -240 -120 128 -73 93 15 210 208 -88 -106 -135 106 279 97 -44
8165d4mK0MQ0K4k26J36J39k61J6L7J67L2M2L5k24j65L15j02K52l48J05j53j81
$$ -44 -48 -28 -24 56 80 -146 -10 129 -132 -116 -79 88 120 162 197 -27 -192 123 21 273 -75 30 -123 -304
8189c04M58k19
$$ -304 154 -65
8191f5
$$ Imaginary data points
##PAGE= N=2
##DATA TABLE= (X++(I..I)), XYDATA
0@%%%%%%%%%Qj6J6j8K6l2L6m4N1n9P2q6J00j14J31j54J75j99K29k59K91l28L67
$$ 0 0 0 0 0 0 0 0 0 0 8 -8 8 -10 16 -16 20 -24 27 -32 40 -46 54 -60 71 -83 92 -107 122 -137 154 -174 193
32A93m09M60n15N74o39P08p85Q72r68J072j187J313j453J613j792J994k227K499
$$ 193 -216 244 -271 303 -336 372 -413 459 -509 563 -624 689 -764 849 -943 1051 -1176 1323
50A323k817L200l668M254n019O058p566R964j4379K5219j00002j82436J25925
$$ 1323 -1494 1706 -1962 2292 -2727 3331 -4235 5729 -8650 16569 -83433 -265869 -139944
63a39944J84262R1706r8060j50344p1369P2264J17544O6696l2301q4833p6150
$$ -139944 44318 136024 37964 -112380 -183749 -111485 6059 72755 40454 -44379 -120529
74a20529K590P7400R3285J9933p1417r9319j7435Q0151R0390P779o2130o1110
$$ -120529 -117939 -40539 52746 72679 1262 -98057 -115492 -35341 55049 62828 698 -60412
86f0412n766M2070M5916J4998j2175k8684l1434r171L6058N3877J6991m6149o5281
$$ -60412 -66178 -24108 21808 36806 24631 -4053 -35487 -44658 -8600 45277 62268 16119 -49162
99d9162r474O6462O5952j2263p2545m6583K8515O7081L0155l8005n6516j2886
$$ -49162 -58636 7826 73778 61515 -11030 -57613 -29098 37983 68138 30133 -26383 -39269
111c9269L5587L9969J0908k5233l7784j7896J8702M2746K8684k0752o0630l6087
$$ -39269 -3682 36287 47195 21962 -15822 -33718 -15016 27730 56414 35662 -24968 -61055
123f1055L6026P1816K7397m9103p4863j8693N7582O8222L623n6553n2560j357
$$ -61055 -25029 46787 74184 25081 -49782 -68475 -10893 57329 60952 4399 -48161 -49518
135d9518M2583M1104M457k8488l4078j6567J1633L5826K8946q327l9876l4948
$$ -49518 -6935 34169 38626 10138 -23940 -40507 -28874 6952 35898 27571 -12305 -47253
147d7253L935M1490L6689p318m1800l0781O341L0400K5374m44k1330k2717j0326
$$ -47253 -43318 -1828 34861 27543 -14257 -45038 -38697 -8297 17077 16633 -4697 -27414 -37740
160c7740Q343K6127K4862o114l7926l2339J0581M7893L4148k2766n6853k3306
$$ -37740 -29397 -3270 21592 15478 -22448 -54787 -44206 3687 37835 15069 -41784 -65090
172f5090L6501N2979R067m1818m3484M412M2624L0520j0563l2294k2452O981K9390
$$ -65090 -28589 24390 33457 -8361 -51845 -47433 -4809 25711 15148 -17146 -39598 -32617 -3227
185c227K5002k621k7379k9285q36L6466L9057l426m5385l6919J3113N0830L3351
$$ -3227 21775 19154 -8225 -37510 -38346 -1880 37177 33751 -11634 -48553 -35440 15390 48741
198D8741j9947m8022k1389K3169L6095J5035j1788k1618j4026j725R759K1824
$$ 48741 28794 -19228 -40617 -17448 18647 33682 21894 276 -13750 -15475 -5716 16108
210A6108K1594n048l6528l1893R693M7132L6913j4886n2886l3785J9529M8245
$$ 16108 37702 32654 -3874 -35767 -26074 21058 57971 43085 -9801 -43586 -24057 24188
222B4188K8568j3193l9413l0285L524L2191L5739R094l0608m8149j5961L9050
$$ 24188 52756 39563 150 -30135 -26611 5580 41319 50413 19805 -28344 -44305 -5255
234e255N4629J1661m4796n4400m710M8614M4857n627m1360l1279O175K9941K1539
$$ -5255 49374 61035 16239 -38161 -42871 5743 50600 44973 3613 -27666 -21491 8450 29989
247B9989k981j7562j6649o717R840K0842J2676j1437k4788j1779J4806K5948O797
$$ 29989 27008 9446 -7203 -13920 -4080 16762 29438 18001 -6787 -18566 -3760 22188 28985
260B8985k0102k1709J774J9019J3619n479j4763o926M925P515K997J655m17p672
$$ 28985 8883 -12826 -11052 7967 21586 16107 1344 -5582 -657 6858 9855 11510 11093 3421
274C421j0183K13J3537J6495j656k4623k0173R440L0504J7564j4521l2694j6411
$$ 3421 -6762 -6549 6988 23483 21827 -2796 -22969 -13529 16975 34539 20018 -12676 -29087
287b9087J6974L1547J4130j5299k9009j7641R552L0624K2884q019l3237k8791
$$ -29087 -12113 19434 33564 18265 -10744 -28385 -18833 11791 34675 26656 -6581 -35372
299c5372O080L8964L1724j1050m2268k8508J3620M0410K4007j5979l5489j7399
$$ -35372 -29292 9672 41396 30346 -11922 -40430 -26810 13600 37607 21628 -13861 -31260
311c1260J3697K5888J3847p308j8780j2571Q91J1492J4233O836q852j7415r225
$$ -31260 -17563 8325 22172 14864 -3916 -16487 -15596 -4104 10129 16965 8113 -9302 -18527
324a8527P199J8416J1809p527j8712j0940P864J6468R345m637j4146r654K600
$$ -18527 -11328 7088 18897 11370 -7342 -18282 -10418 6050 15395 10758 -3388 -13042 -10442
337a0442J1734J1148J859j2591j6450o42J7584J8271k760k2398j8701R752K7849
$$ -10442 1292 12440 14299 1708 -14742 -15384 2200 20471 17711 -4687 -23388 -13636 14213
350A4213J3172j7307k6487o407K0334K3985J843k1323j8855N68J6122J7275L547
$$ 14213 27385 10078 -16409 -22816 -2482 21503 23346 2023 -16832 -16264 -142 17133 20680
363B0680j3908j8783p259J2055K2243J1571j3210k7295j1121J6736K6940R295
$$ 20680 6772 -12011 -19270 -7215 15028 26599 13389 -13906 -25027 -8291 18649 27944
375B7944j7331k4840p101J5655J9345N968q614j4170r879J558J1555J4237N917
$$ 27944 10613 -14227 -21328 -5673 13672 19640 11026 -3144 -13023 -11465 90 14327 20244
388B0244j1557k1135r470J4849K4437Q279j5965k4675p675J5928K1839O348j1825
$$ 20244 8687 -12448 -21918 -7069 17368 25647 9682 -14993 -22668 -6740 15099 21447 9622
401I622j7841r612O897J7491J3684m002j8831j8159K956K4297J9083p996k6143
$$ 9622 -8219 -17831 -10934 6557 20241 16239 -2592 -20751 -17795 6502 25585 17589 -8554
414h554j5520J2504K5572R683j6317k0984k427J5393J4751p0j2419j0663M46R931
$$ -8554 -24074 -11570 14002 23685 7368 -13616 -16043 -650 14101 14031 1612 -9051 -8605 1326
428A326Q695J593p684j0783k583R645J1876J542j0489j1998q26J2160J1424j711
$$ 1326 10021 11614 3930 -6853 -9436 209 12085 13627 3138 -8860 -9686 2474 13898 12187
442A2187j0198q539l58P216P999K363l313p487p353j264J0448J3290J924j3702
$$ 12187 1989 -6550 -6908 308 8307 10670 7357 -130 -7483 -8747 1701 14991 16915 3213
456C213j7521l155J7750K0987Q54k0670k0970r93K0728K1189P3k0485j9538j522
$$ 3213 -14308 -17463 287 21274 22128 1458 -19512 -20505 223 21412 21485 1000 -18538 -20060
470b0060J7368K0186L911j6812k1342n024J5646K1701N578j5433k1561m255J5676
$$ -20060 -2692 17494 21405 4593 -16749 -21773 -6127 15574 21152 5719 -15842 -20097 -4421
483d421J7599L591j3235j5152k257J1124J1034K299o860q753l084M170P147M099
$$ -4421 13178 16769 3534 -11618 -13875 -2751 8283 10582 3722 -5031 -8115 -3945 3202 7301
497G301j502n780o095O36O972O261l01p328o733J485Q891N592l180p281m722K641
$$ 7301 5799 19 -6076 -5440 1532 7793 7492 164 -6569 -5084 3807 9399 6219 -1062 -5784 -3143
513c143P000M872k494o732n192L43P557R084l59j0862j1194R06J4012J3443k745
$$ -3143 3857 8729 6235 -497 -5689 -5346 2211 11295 10936 74 -11120 -10214 3798 17241 14496
528A4496j8229j3538O355J8725J2079p255j8685j1024P174J6919J0662m812j5690
$$ 14496 -3733 -17271 -10916 7809 19888 12633 -6052 -17076 -9902 7017 17679 12867 -2823
541b823j3045K954J6024J4161j599j6330j5040J542J6628J4150l071j4354j1372
$$ -2823 -15868 -12914 3110 17271 15672 -658 -15698 -14156 2472 16622 13551 -803 -12175
554a2175J604J1416R273l42p424p005l349K505P569O830l11q115j0226j241J0506
$$ -12175 -10571 845 10118 9776 2352 -4653 -8002 -5497 2072 8902 8591 476 -9750 -10991 -485
569d85J1415K55j1738j1341L32J1038J0012j535r735r000K13Q214R327J16r334
$$ -485 10930 11185 -553 -11894 -11562 -524 9488 7953 -1782 -10782 -10569 -2355 6972 7088 -2246
584b246r847K38J0003R831j477j2614r907N240J3616O013p525j3049m036R321
$$ -2246 -12093 -11855 -1852 7979 6502 -6112 -16019 -10779 2837 8850 1325 -11724 -15760 -6439
598f439J1209J532q803r362j400P330Q590K241n718r050l537N213J0112M666m961
$$ -6439 4770 6302 -2501 -11863 -13263 -5933 2657 4898 -820 -9870 -13407 -8194 1918 6584 1623
613A623j0167m996M601J0117O126l666q934o237J888P652Q133O98p546q302k759
$$ 1623 -8544 -13540 -8939 1178 7304 3638 -5296 -11533 -9645 -1993 6140 6838 -708 -9010 -11769
628a1769O200J1104N099o600j1984n974O519J2869P258o005j3524p610N927J3204
$$ -11769 -5569 5535 10634 4034 -7950 -13924 -7405 5464 12722 6717 -6807 -14417 -8490 4714
642D714P611n031j2985p604M417J1980P814l830j1911p915L952J1244O518m267
$$ 4714 12325 7294 -5691 -13295 -8878 3102 10916 7086 -4825 -12740 -8788 2456 8974 4707
656D707j0035o126M413R143M626m948q014l214M069P375K061m791n565j014L614
$$ 4707 -5328 -11454 -7041 2102 6728 1780 -6234 -9448 -5379 1996 4057 -734 -6299 -7313 -3699
671c699N171O40m187l896M00K626K844J192j668l295j999J586L624L590l30n284
$$ -3699 1472 2112 -2075 -5971 -5571 -2945 -101 1091 -577 -3872 -5871 -4285 -661 2929 2599 -2685
687b685m251Q55N620N565R3o355n972m90O748P870J349o310j0145k502R172J1291
$$ -2685 -6936 -6081 -461 5104 5197 -1158 -7130 -7620 -872 6998 8347 2037 -8108 -10610 -1438 9853
703I853K439r877j2379j678J1246J2367J78j0370j1518q56J0220J0256J35q295
$$ 9853 12292 2415 -9964 -11642 -396 11971 12149 1779 -9739 -10595 -375 9881 10016 1721
717A721q728k179O922Q906J786o088q199k278M434P195K777m544o193k220K365
$$ 1721 -7007 -9186 -2264 6642 8428 2340 -5859 -8137 -3703 3492 6269 1725 -4468 -6688 -4323
732d323M376K609j464l395k840m05K449L996R77k844m381j761L242N063J336l876
$$ -4323 53 2662 1198 -2197 -5037 -5442 -2993 1003 1980 -864 -5245 -7006 -3764 1299 2635 -1241
748a241n051k01M025M830l16m210m151Q44M553L765k69m376m666O74O104M957
$$ -1241 -6292 -6493 -2468 2362 2046 -2164 -6315 -5471 -918 2847 2578 -1798 -6464 -5790 314 5271
764E271j092o414n301J782P882N778k880q406m700L101Q459N257l203q157m707
$$ 5271 4179 -2235 -7536 -5754 2128 7906 5026 -3380 -8080 -4979 3480 8737 5534 -2623 -7330
779g330K644P591N860k324p536n579J779O769O081j114o719n428R63N488M627
$$ -7330 -4686 2905 8765 6441 -1095 -6674 -4895 1874 7955 6841 122 -5306 -4343 1145 5772
794E772J91l843m593j659K658M729K668j191n263l988J033N384M464k54n506n338
$$ 5772 5963 2120 -2473 -4132 -1474 3255 5923 4732 -531 -4519 -3486 1898 6362 6108 602 -4736
810d736j20N389N666N30n590o041l42N954N890j3n367o138J08O172N206j001n899
$$ -4736 -4856 533 6199 6729 1139 -4902 -5244 710 6600 6587 1220 -4918 -4810 1362 6568 5567 -332
827c32m511J876N626L778k651n205k327K451M980J852l232m440q86K854L983J334
$$ -332 -4843 -2967 2659 6437 3786 -1419 -3746 -1295 3685 5537 2305 -2135 -3021 -167 3816 5150
843E150k795m112j461L231L670O53k419l679j148K131L208J317j072l003k449
$$ 5150 2355 -1757 -3218 13 3683 4336 1917 -1762 -2910 -779 2429 3746 2674 -329 -2778
858b778R2K951L379N38l055m885j407L676N277J595l705n840k139L506O056K520
$$ -2778 -2686 265 3644 4182 1127 -3758 -5165 -1489 3788 5383 1678 -4162 -6301 -2795 3261 5781
874E781l269o337l716L323O595L537k878o955l687K606P150L518k795o683l035
$$ 5781 2512 -3825 -7541 -4218 2377 5914 3036 -3919 -7606 -5000 2150 5668 2873 -3810 -6845
889f845K526N372L411j998n255k668J683L872L123q89m223k584J431L498K322
$$ -6845 -4319 1053 4464 2466 -2789 -5457 -3774 98 3221 2332 -1891 -4475 -3044 454 2776
904B776j076l268j515J479K468R64j100j530j058Q32J647Q67l19j001j448j55
$$ 2776 1700 -1568 -3083 -1604 864 1828 728 -802 -1860 -1028 619 1486 1167 166 -1282 -1437
920a437J562J813K03j163k540n26K296K770J68k535k697q37K569L856P99l327
$$ -1437 125 1938 2141 978 -1562 -2088 208 2978 3146 611 -2086 -2923 -354 3502 4301 974
936I74m545n94L829N132O75m368n454q37M688O006J79n083n459l47N115M983P40
$$ 974 -3571 -4165 -336 4796 5471 1103 -4351 -5188 -500 5506 5685 602 -4857 -5204 -89 4894 5634
953E634m656n166l69L992M530Q72l222m562j314L239L897R04k285l028j302J245
$$ 5634 978 -4188 -4557 -565 3965 4837 1615 -2947 -4261 -1022 2875 3779 1494 -1534 -2836 -1591
969a591K762J425m19j992k256l75J943K627Q11j683k982j247K043L192J441k379
$$ -1591 1171 2596 2177 185 -2071 -2446 -503 2124 2935 1252 -1730 -2977 -934 2258 3699 1320
985A320l320j200K001L559M92j922k665j172K439L022O73k770l148J6K780L018
$$ 1320 -2000 -3200 -1199 2360 2852 930 -1735 -2907 -468 2554 3227 457 -2691 -2675 105 3123
1001C123k88l097l142J238L106K504q95l246k588J265L494K128j250l124k532
$$ 3123 2835 -262 -3404 -2166 940 3444 2549 -697 -3285 -2020 1474 3602 2352 -772 -3304
1016c304Q94L394K386n59l586k948N01L753K925j084k496k703J60K593K592J23
$$ -3304 -2410 984 3370 2811 -775 -3723 -3222 531 3456 2372 -124 -2827 -2667 -74 2518 2641
1032B641k198k040j263J247K825J713j005l083k263O82L566K535p65l078k727
$$ 2641 443 -1597 -2860 -1613 1212 2925 1920 -1163 -3426 -2744 822 3357 2592 -486 -3213
1047c213J9K920L400J76k869l556l74K921L919N06l256l734n17L558L792P3l524
$$ -3213 -3194 -274 3126 3302 433 -3123 -3497 -576 3343 3849 593 -3141 -3658 -100 3692 3765 241
1064B41l276O74K831K167j56k839j993N49K892J358r89k269j106J160J772J003
$$ 241 -3035 -2361 470 2637 2481 -358 -2351 -1802 1090 2448 1459 -810 -1916 -756 1016 2019
1080B019j349j506p53J210J836K50j098j241m14M91J069N71l1j347o38l10O76
$$ 2019 670 -836 -1589 -379 1457 1707 609 -632 -1046 -555 514 1085 1054 -293 -931 -1241 -565
1097e65J859O31j254k369j207K018K720R81j249l602r60J676L071J847j591l812
$$ -565 1294 1925 671 -1698 -2905 -887 1833 2814 1565 -2037 -2997 -1321 1750 3597 2006 -1806
1113a806j700J492M139K105j860m321k111K124M079K078j882l948j915J459L720
$$ -1806 -3506 -2014 2125 4230 2370 -1951 -4062 -1938 2141 4219 2337 -1611 -3526 -2067 1653
1128A653J502j206k560j665P09K546J957r21j530k387N78J766J745j95j691j510
$$ 1653 3155 1949 -611 -2276 -1567 979 2936 2015 485 -1902 -1324 442 2187 1992 301 -1209
1144a209J97J364P57K34n87p77o51N58R10O44o89j238l71L22J395M16n40j569
$$ -1209 -1012 352 1109 1343 756 -21 -672 -114 796 1440 751 -487 -858 -536 859 1275 735 -834
1162h34m22R67J432M07j041j526m70J079J433J056j420k413n61J903K185L93j712
$$ -834 -1256 -289 1143 1550 509 -1017 -1487 -408 1025 2081 661 -1752 -2313 -410 1775 2168 456
1179D56k677n95K621K958j58k607k413m34K609K696K33k344k722m07K357K844
$$ 456 -2221 -2816 -195 2763 2605 -2 -2415 -2849 -240 2456 2689 345 -2377 -2784 -427 2417
1195B417M11k221k515o35K209K134O16j373k098o70J039J373J112k31j212j562
$$ 2417 2828 607 -1908 -2543 -334 1800 2416 1043 -1055 -1725 -686 687 1799 1568 356 -1206
1211a206l44J112K031N40j201k094q88J277K323R13j426k254o52R65K037J060
$$ -1206 -1550 -438 1593 2133 932 -1162 -2050 -773 1550 2463 1037 -1217 -1869 -904 1133 2193
1227B193j032k388p04R97K363Q23j539j961r23J852K024J6j893j654M50J449J539
$$ 2193 1161 -1227 -1931 -934 1429 2252 713 -1248 -2171 -319 1705 1721 -172 -1826 -1376 73 1612
1244A612m15j493r74J51J992P73l23j852q28L29J482J416r44j404j295O83J560
$$ 1612 1197 -296 -1270 -1119 873 1646 1323 -529 -1357 -1028 454 1870 926 -478 -1773 -1090 470
1261D70J258k45j609j090N3J318J485Q0j203j235m11O26J836Q52p31k095q73L07
$$ 470 1728 1483 -126 -1216 -1163 155 1640 1720 517 -718 -1129 -503 1333 2185 1454 -641 -1514 -1207
1279a207K183J042j89k058j858M62J986J613l1j684j946k09K306J798j05j523
$$ -1207 976 2018 1829 -229 -2087 -1625 361 1974 1943 259 -1687 -1896 410 2208 2103 580
1295E80k593J41J853K290m48j612j758k48K046J620l51j580j434L62J006J455
$$ 580 -2013 -1872 -19 2271 1823 211 -1547 -1795 251 1871 1520 -60 -1494 -1132 -126 1329
1311A329j53j210j008K83J603O5l29r54n35M14P19K52l58l53P6j63N01M09J72
$$ 1329 1176 -34 -1042 -759 844 909 580 -374 -909 -495 224 476 118 -235 -159 -322 179 588 760
1330G60p11m09n07O43P66N23o39j183j14Q2J631K75l20j589j045J083J745J039
$$ 760 49 -360 -867 -224 542 1065 426 -757 -871 -789 842 1117 797 -792 -1837 -754 991 2030
1348B030j284j545j258J239J873J341j399k044j173J531K010R12j325j923p10
$$ 2030 746 -799 -2057 -818 1055 2396 997 -1047 -2220 -689 1321 2233 908 -1015 -1725
1363a725P46K013P84r32j420r10P07J333R13o50j281q78L10R05J182l28m84j042
$$ -1725 -979 1034 1818 886 -534 -1444 -737 596 1509 859 -422 -1300 -990 -85 1097 769 285 -757
1381g57J07L39R57L53o28q68m94L96J115K56j12j112j083R87J142L37l65q70m71
$$ -757 -650 -311 646 999 371 -497 -991 -595 520 776 664 -448 -1531 -544 598 935 570 -300 -771
1400g71K57R57M88q88o36n06O05Q26P30n59j094n45R65J002K39p88j332K29N56
$$ -771 -514 443 931 43 -593 -1099 -494 332 1062 503 -591 -1136 -171 831 1070 282 -1050 -821 -265
1419b65J459j21q54j496k37J383J643mj525j164j13J124J427L99j364j417j09
$$ -265 1194 1073 219 -1277 -1514 -131 1512 1508 -17 -1181 -1294 -170 1257 1656 292 -1125 -1234
1436a234R79J109K30n45r28o04O22Q40L01Kp66r45K66M91R06J18n85j020m12N51
$$ -1234 -255 854 1084 539 -389 -993 -371 469 770 772 6 -939 -673 -182 724 842 257 -763 -1175 -624
1456f24J204P71o86j311n84N67J315P97q66j187n65K38J781M14n31j391l67Q24
$$ -624 580 1351 665 -646 -1230 -663 652 1449 583 -604 -1169 -931 850 1264 733 -658 -1025 -201
1474b01R77M06j064r83k6O13J114Or82q21L84M93N34p1o94o65N03Q52J04L2n37
$$ -201 776 1182 118 -865 -891 -278 836 842 -140 -961 -577 -84 450 379 -315 -980 -477 375 479 511 -26
1495b6m15NN62L44L23o74o49j14M57N28K27l57n05m60K25P88O08j84r01m87m1
$$ -26 -441 -436 126 470 793 119 -530 -644 -187 341 568 211 -294 -754 -529 259 867 683 -218 -705 -746
1516g46J042O08k80q00q10p9J149R11K78j471j070P4J016J259O1q68j663J95J147
$$ -746 296 904 624 -176 -986 -1065 84 995 1273 -198 -1268 -1194 -178 1081 1142 274 -1389 -1194 -47
1535d7J237J11j139j275K67J074L26L57q31o32n96J066Q38o8n35n65j19L41R56
$$ -47 1190 1301 162 -1113 -846 228 554 911 80 -552 -1148 -82 756 688 153 -412 -531 -190 766
1554G66j02m90l94k01O02O0n2K2j94j34j80M37m8Pl70K2L9L76J36J05o94k50L97
$$ 766 664 174 -220 -421 181 241 189 211 17 -117 -297 140 92 99 -271 -249 -210 166 302 407 -287 -537 -140
1577a40J03Q48l22r97l87O43N04N30k39p39j004L31J121R27n90r30q67R86Q67
$$ -140 -37 811 489 -508 -895 -252 252 782 543 -196 -1200 -869 252 1179 589 -341 -1208 -222 645
1596F45O03q26q83q11O88J046K93R1j194n32K39P37M59o6o98n05j95P82L64K74
$$ 645 1248 422 -461 -1272 -584 462 755 846 -348 -880 -641 96 555 489 -209 -714 -909 -127 237 511
1616E11n79k02n23M77P57q1J60n01o60M89K52N41j18o13k35k58P15M04o3n21p22
$$ 511 -68 -270 -793 -316 441 360 520 19 -641 -152 100 641 523 -90 -325 -583 132 536 473 -48 -770
1637g70J33Q56J14j21m74j8j37N99K46j83n00m35N26M37J93n32k06n72O89P08
$$ -770 -637 219 333 212 -262 -280 -417 182 428 245 -255 -690 -164 273 466 -66 -272 -844 -155 553
1657E53j93k62p17J27P24P6L95l01j112l4O69O39J39o29n55j69O07N93J46p95
$$ 553 360 98 -619 -492 232 308 703 402 -710 -744 -75 564 703 74 -481 -650 -43 550 696 -99
1677i9J32q94K15Q43K01k57k46k95j2L32N78L79p62l93l63M74R52k36l7p88k60
$$ -99 33 -861 -646 197 398 141 -105 -400 -412 -80 498 877 115 -278 -641 -167 785 549 512 -276 -536
1698e36J68P12M99r5j359l90J045K78M80l55r10m19M90R18K54m05r30j38M03N70
$$ -536 -368 344 843 748 -611 -1001 44 322 802 447 -463 -882 -392 526 780 375 -555 -693 -290 280
1718B80j07K00p62M8K66%K37k9n38p1O18J50Pm73k4L32j93Q5J91l48k28J24J54
$$ 280 173 373 -389 -341 -75 -75 162 133 -405 -476 142 292 299 -174 -198 134 -59 26 217 -131 -359 -235 -81
1741h1J99K96l08k27n21L55J48O20J01q35k58k32J180M0Nn33o10K77K07O94K08
$$ -81 118 414 106 -121 -642 -287 -139 481 582 -253 -511 -743 437 477 482 -51 -661 -384 -177 517 725
1762G25q49k17m61R34P14k58n59o92r9P17Q50mq90n04m3P30L25J92p19m38K57
$$ 725 -124 -341 -802 132 846 588 29 -663 -762 -45 805 801 -89 -593 -636 94 419 611 -108 -546 -289
1783b89M9N36p9Q8n34J29Q7L41k7p9l73L4K08m98M19J9n7m12K33O5K51J55m04
$$ -289 -240 296 217 305 -229 -100 -13 328 301 222 -151 -117 91 -407 12 31 -26 -438 -205 -140 111 266 -138
1806a38j96l4O01j93K53k32o23L11K54N6j22k7k48J84L85j53N26n98q27L02M80
$$ -138 -334 -368 233 40 293 61 -562 -251 3 59 -63 -90 -338 -154 231 78 604 6 -821 -519 -39
1827c9N00k64p07j34J49R84K23o48m94m0R3K35O57m1r69r0J40P46K84k22m28n41
$$ -39 461 197 -510 -644 -495 489 712 64 -430 -470 -377 -142 515 474 -495 -585 -445 301 585 363 -65 -606
1849f06M93K41K27m05q2l8k86K87K54M81m35J0l51mO9L88J52o67r8j53N05K08
$$ -606 -113 128 355 -50 -132 -170 -456 -169 85 566 131 141 -210 -214 -145 243 395 -272 -370 -523 -18 190
1871A90M89r07j69O8L14L46j18j93m75J10K48N92n82k07j23p6O82L94m94j80j03
$$ 190 679 -228 -397 -329 -15 331 213 20 -455 -345 -97 495 -87 -294 -417 -493 189 583 89 -91 -194
1892a94K15L42l1k23n40K63J41M04j8m50l18L17mL17K44j94m72j56J58M59P3j9
$$ -194 21 363 332 109 -431 -168 -27 377 359 -91 -409 -92 -96 221 465 271 -201 -357 -199 260 333 314
1914C14j69k05l24K84O50k40k66j74J00p3N40O9k76n08J97K8N34r2k72k95k37
$$ 314 145 -60 -384 -100 550 310 44 -130 -30 -103 437 506 230 -278 -81 -53 481 389 117 -178 -415
1935d15J72K98K92j71j77m32L71L78J91j69k67j91m65R32M1O0l68k53m9N23J32
$$ -415 -243 55 347 176 -1 -433 -62 316 507 338 71 -120 -585 347 388 448 80 -173 -222 301 433
1956D33J3m42j11o5M79l16K8L3O3P7r6K54l49m4j57j5O28l25L07N1k01k11K5J43
$$ 433 446 4 -107 -172 307 -9 19 52 115 192 96 350 1 -43 -200 -215 413 88 395 446 245 34 59 202
1980B02J05j36k48M4k7L74j85k15K9q1L49oOj16k67l3K39L72l11k1j44j81N75
$$ 202 307 171 -77 -33 -60 314 129 -86 -57 -138 211 205 211 95 -172 -205 34 406 95 74 -70 -251 324
2003C24j05j74p8k53O1K75M31p6k16p15N1K06L86K18m40R6k41L61q8J26r4k24
$$ 324 219 45 -33 -286 -225 50 481 405 189 -526 -475 -269 117 335 -105 -9 -250 111 23 149 55 -169
2025a69j04o6K27L64l11J26j08l4K19J78j4k56O6k86L36K77l19j97j23J88K11
$$ -169 -273 -339 -112 252 -59 67 -41 -75 144 322 308 52 118 -168 168 445 126 -71 -194 -6 205
2046B05k03J54j86lj56J87N6j41K66l72P3K15QJ98m12J13j64L60J76o15L69l08
$$ 205 2 156 -30 -33 -189 -2 54 -87 179 -193 -120 95 103 301 -111 2 -162 198 374 -241 128 -180
2068a80J97J01o9L01n72J67m0L99N2l24l49J71L64k36K34j52k67J13J31m42O00
$$ -180 17 118 49 350 -222 -55 -95 304 356 32 -317 -146 218 -18 216 64 -203 -90 41 -401 199
2089A99k14J04j57j98J37L54q9m1j0j69k0l22O12m11L96k62P8K80MJ5l50r0J97
$$ 199 -15 89 -68 -266 -129 225 136 95 85 -84 -104 -426 186 -225 171 -91 -13 267 271 286 -64 -154 43
2112D3J48K65n59j7j20OJ75o8J51j83J25j25J54J37j78J83l57P3L81j07k93K52
$$ 43 191 456 -103 -120 -240 -234 -59 -127 24 -159 -34 -159 -5 132 -46 137 -220 -147 234 127 -166 86
2134H6l04K56P4j65K42n67L22J3J79k35N6j72L8K36J10j8k94J54K20k23L3J45
$$ 86 -218 38 112 -53 189 -378 -56 -43 136 -99 -43 -215 -177 59 169 151 -143 11 231 8 41 186
2156A86J64l23L6r4L47k77k5j04R9q5J45J12K7l39QJ29j4K66k55K42n20m2L44
$$ 186 350 27 63 -31 316 39 14 -90 9 -76 69 181 208 -131 -123 6 -8 258 3 245 -275 -317 27
2179B7K23m3l4m56J18q7N51j56p5m07J71j53N35Q0m78J18N8J93k1rQ1j23R7Q8
$$ 27 250 207 173 -283 -165 -252 299 143 68 -339 -168 -321 214 294 -184 -66 -8 185 164 155 236 113 210 298
2203B98j75j46j5L16n51K38K00J6k0l94J93P1k74L8K96O0l09NN27k56j89J2j19
$$ 298 123 -23 -38 278 -273 -35 165 181 161 -233 -40 31 -243 -205 91 151 -158 -153 374 118 -71 -59 -178
2226a78j47M54j06P3O3l14k20M89N5j24J03l52P4J31K55j66j90j16k46L63L67
$$ -178 -325 129 23 96 159 -155 -375 114 169 45 148 -204 -130 1 256 90 -100 -216 -462 -99 268
2247B68l35k12J71L9m0J83Q4j67k8j33L92j03K44j33m92K73R0p2k3K36l07P0k31
$$ 268 -67 -279 -108 -69 -109 74 158 -9 -37 -170 222 119 363 230 -262 11 101 29 6 242 -65 5 -226
2270b26M8K90l7j26K43k67j96M02O0j16M0o4rRJ58j48j1l33L81q3L07j75k98J21
$$ -226 -178 112 75 -51 192 -75 -271 131 191 75 115 51 42 51 209 61 50 -283 98 15 322 147 -151 -30
2294c0l4m8M55k49J13j64l16L94j01J80k38k6J69k60R7J00k70K18J81J11k39l81
$$ -30 -64 -112 343 94 207 43 -273 121 20 200 -38 -64 105 -155 -58 42 -228 -10 171 282 43 -338
2316c38K36K03J81k46P1l19J44M6J18K9J51q9j57k96K74J75j62J18j80K51n54
$$ -338 -102 101 282 36 107 -212 -68 -22 96 125 276 187 30 -266 8 183 21 139 -41 210 -344
2337c44N42k85K07j47k41K13J27M3P5j05m74J8K98J69j46q6l13L73l9K83r0Om48
$$ -344 198 -87 120 -27 -268 -55 72 115 190 85 -389 -371 -73 96 -50 -136 -449 -76 -115 168 78 84 -364
2360c64J2J57K79M8P0n58K13K84N0m3l72J11L7p5K84K0l02L51L7j18k03L58k51
$$ -364 -352 -195 84 132 202 -356 -143 141 191 148 -224 -113 -76 -151 133 153 -149 202 239 121 -82 276 25
2383B5J55j4q8K3o1j2k22J96KJ5K12m43J47J52R6n9Qj39q4j3J57q1Q3j15K4O1
$$ 25 180 166 78 101 40 28 -194 2 4 19 231 -212 -65 87 183 124 132 -7 -91 -104 53 -28 55 -60 -36 25
2409B5j1j30J20J17k42J5j44M61j62K14o44o3K83p6M84k5m92M8q8L94M13l61l10
$$ 25 14 -116 4 121 -121 -106 -250 211 49 263 -381 -444 -161 -237 247 222 -270 -222 -310 84 497 136 -174
2432a74L5k7L85L4n20K78r3QM6q0J45j9k42R8K7M6J35L8l29K12O4l1q0o5N9O2
$$ -174 -139 -166 219 253 -267 11 -82 -74 -28 -108 37 18 -224 -126 -99 -53 82 120 -209 3 67 36 -44 -109 -50 12
2458A2J49o0q3J08j94K12r0N4k31K31l67Q7L12l81O26l99j51j14L39J97j66j6
$$ 12 161 101 18 126 -68 144 54 108 -123 108 -259 -172 140 -241 385 -14 -165 -279 60 257 91 75
2480G5N9r8K74m0k75l1k42K55Rp2K27L3o80KN82M6R8k25L68j71p9j65L31k58n3
$$ 75 134 36 310 270 -5 -36 -278 -23 -14 -86 141 174 -506 -504 78 124 222 -3 365 194 115 -50 281 23 -30
2505c0k66M65j6K1k02J3O5k81M03m01M04n27J66n8K50J28j19jj2j12M53m79K10
$$ -30 -296 169 153 174 -28 -15 50 -231 172 -229 175 -352 -186 -244 6 134 15 14 2 -110 343 -136 74
2528G4J58k64PJ72j70L67l67N9P6k12M07j34R3j19k42L80pm82K85L26m66jJ31
$$ 74 232 -32 -25 147 -23 344 -23 36 112 -100 307 173 266 147 -95 285 278 -204 81 407 -59 -60 71
2551G1J68k3k95j0L83l5m16J35l38K69JM58m24l38J87Jm7J67J86j14l8J33j85
$$ 71 239 216 -79 -89 294 259 -157 -22 -360 -91 -90 368 -56 -394 -207 -206 -253 -86 100 -14 -52 81 -104
2574a04K49k31m36N00p3K18n0l7J6L1l11K43q6J57o6j53j41J14K70j96j64R3j04
$$ -104 145 -86 -522 -22 -95 123 73 36 52 83 -228 15 -71 86 20 -133 -274 -160 110 -86 -250 -157 -261
2597b61K62j94J16K27k33nJ39k3j14K89k87L42m66K51K45l72l5k9lr4j17M90K6
$$ -261 1 -193 -77 150 -83 -88 51 28 -86 203 -84 258 -208 43 288 -84 -119 -148 -151 -245 -362 128 154
2620A54o2j93N4m9j21J75L01k98Q8K42n25J70j71o7L11k8J58k88J68l02N16Q0
$$ 154 92 -101 -47 -96 -217 -42 259 -39 49 291 -234 -64 -235 -302 9 -19 139 -149 19 -283 233 313
2642C13j71k13J13j56K60m31J36K34k22O6L51j10r2j86k54K53L11k72J72j81k32
$$ 313 142 -71 42 -114 146 -285 -149 85 -137 -71 280 170 78 -108 -362 -109 202 -70 102 -79 -311
2663c11K99j04K04l65K22L7j41j06J56L5j54r6jJ98J01N2J02j52K7J78k22K01
$$ -311 -12 -116 88 -277 -55 -18 -159 -265 -109 -74 -228 -324 -325 -127 -26 26 128 -24 3 181 -41 160
2685A60j98r6q3N31o03K99p0K32j96R9J73l28R0J39l1k61K09R9L4l86J5M00l03
$$ 160 -38 -134 -217 314 -289 10 -60 172 -24 75 248 -80 10 149 118 -143 66 165 199 -187 -172 228 -75
2708g5J6m5J26R2j15J22k20K97q2k24K16l7j96K28P0l03K13q0L3K3k56L64l66
$$ -75 -59 -104 22 114 -1 121 -99 198 116 -108 108 71 -125 103 173 -130 83 3 36 59 -197 167 -199
2731a99K15K71l05L5O0j4k6Q0j85j37N20m89P5P0J2lK14k90pJ85j85L24m87K16
$$ -199 16 287 -18 17 77 63 37 117 -68 -205 315 -174 -99 -29 -17 -20 194 -96 -103 82 -103 221 -266 -50
2755e0k9Q6k77K00M68n14J94k81J47K44k26J31j97J96j72J03j70J24j7j80J23
$$ -50 -79 7 -270 -70 398 -116 78 -203 -56 188 -38 93 -104 92 -80 23 -147 -23 -40 -220 -97
2776i7p6M11j07j92q6l2J31J87m7p9J04j47L38j72m59J96K06j24j30J05J40L00
$$ -97 -173 238 131 -61 -147 -179 -48 139 92 13 117 -30 308 136 -323 -127 79 -45 -175 -70 70 370
2798C70n03P3K59l41n5K94O5k7l7k08k77N62k61L19N9l46J56j06n0P0J62j92K
$$ 370 -133 -60 199 -142 -197 97 162 135 98 -110 -387 175 -86 233 292 -54 102 -4 -54 16 178 -14 -12
2821a2K13L9K4j40j90O0k45N4M51j59p7K50m95L31p0L30m29LJ51r6K45j96j59
$$ -12 201 240 264 124 -66 -6 -251 -197 254 95 18 268 -227 104 34 364 -65 -62 89 -7 238 42 -117
2844a17J05m4L6JJ26M7j38k4j98m7K05J4m2J34K15J4o1k20j79J48K81o74K33J04
$$ -117 -12 -56 -20 -19 107 154 16 -8 -206 -253 -48 -34 -76 58 273 287 226 6 -173 -25 256 -418 -185 -81
2868h1r2J16j54J37J22j62J3nL5R6l63M36P2j37l27M24L4J10m06k0J96j7j65K90
$$ -81 -173 -57 -211 -74 48 -114 -101 -106 -71 25 -338 98 170 33 -294 130 164 274 -132 -152 44 27 -138 152
2892A52r3N9k4j58M8J18l06K11k16Q9J99q9J89k19J78j03j77K31j20j84M17m14
$$ 152 59 118 94 -64 -16 102 -204 7 -209 -120 79 -10 179 -40 138 35 -142 89 -31 -215 202 -212
2914b12M16m7j68j03J26M4j9j64J0L71k10k74K53J16J14l65j24L3L13mk08k8K
$$ -212 204 157 -11 -114 12 56 37 -127 -117 254 44 -230 23 139 253 -112 -236 -203 110 106 -102 -130 -128
2937a28k7J27pK21j30K2J5k26J37J73l6j17j38J62l51M30j23l04J33K31K47k97
$$ -128 -155 -28 -35 186 56 78 93 -133 4 177 141 24 -114 48 -303 127 4 -300 -167 64 311 14
2959A4k06q9L86N0p3Q5j03j85M8L53k00k90M3N9J41m5P1j63k7%n1J3L16k47J90
$$ 14 -192 -281 105 155 82 167 64 -121 -73 280 80 -210 -167 -108 33 -12 59 -104 -131 -131 -182 -169 147 -100 90
2984I0M3k63K67j31K12m71K30n1m9Q8L20j96Pj48j36K58k5j82L85m4k14j7J0m9
$$ 90 133 -130 137 6 218 -253 -23 -74 -123 -35 285 89 96 -52 -188 70 45 -137 248 204 -10 -27 -17 -66
3008f6j27N7J33P6Q4O0k0l07J67l80M09J86k16o7J18r6j15J04k41L9J37J64k45
$$ -66 -193 -136 -3 73 157 217 197 -110 57 -323 86 272 56 -11 107 11 -104 0 -241 -202 -65 99 -146
3031a46P4qj72M10k91L53l15k42K95O1o4J21k19O5j93L62J16j20q9K24l15mN4
$$ -146 -72 -80 -252 158 -133 220 -95 -337 -42 19 -45 76 -143 -78 -271 91 207 87 -2 222 -93 -97 -43
3054d3J66m11L42j9k73O55n37J10Jj05J28J22l40K63J00l84J55l6K33k01l0k31
$$ -43 123 -288 54 35 -238 417 -120 -10 -9 -114 14 136 -204 59 159 -225 -70 -106 127 -74 -104 -335
3076c35J59N6K75K66j47k35N7j04j64M22j87q3j09K78k41kj60K85k12O9J2l1r
$$ -335 -176 -120 155 421 274 39 96 -8 -172 250 63 -20 -129 149 -92 -94 -254 31 -181 -112 -100 -131 -140
3099a40M07j67K3M9j63l10L37j39mN7k9J11l26J23QK22K7j00j58K79J90k21K42
$$ -140 267 100 123 172 9 -301 36 -103 -107 -50 -79 32 -294 -171 -163 59 86 -14 -172 107 297 76 318
3122C18n4k46n4k79K98j32L79j74m47K30n9M76k05K1j59n1J14L36l23j87J96J78
$$ 318 264 18 -36 -315 -17 -149 230 56 -391 -161 -220 256 51 72 -87 -138 -24 312 -11 -198 -2 176
3144A76k02J88l81L37l76PJ52K73k27K09Q9j93J2j59J80k25K40j71J07k86J8K69
$$ 176 -26 162 -219 118 -258 -251 -99 174 -53 156 245 52 64 -95 85 -140 100 -71 36 -250 -232 37
3166C7J58k47L51l42O1r8j58L14j83K12O2k1j81P7Q5j52j04J06J21l55L21l37
$$ 37 195 -52 299 -43 18 -80 -238 76 -107 105 167 146 -35 42 127 -25 -129 -23 98 -257 64 -273
3188b73K54K70k06k36J48K24p6j01p9r9N4O6j30J9N18j46l28N7K2q2M3o8P1j45
$$ -273 -19 251 45 -191 -43 181 105 4 -75 -174 -120 -54 -184 -165 353 207 -121 -64 -42 -124 -81 -149 -78 -223
3212b23M37k42J58N1l09J76m9oK51l79j31L74n6j34K65k26k01J73K44j10j47J93
$$ -223 214 -28 130 181 -128 48 -1 -7 244 -135 -266 108 52 -82 183 -43 -244 -71 173 63 -84 109
3234A09r9J5j38OJ05j49mL84l94L19o2K6l3l17L08r5K2J50j72n2J14L08m98M0
$$ 109 10 25 -113 -107 -2 -151 -155 229 -165 154 92 118 85 -232 76 -19 3 153 -19 -71 43 351 -147 -107
3258a07K42j16j61J70J75m05K69O3q9L7k54K85l48K86n3o5k44J54K14j41q6K91
$$ -107 135 19 -142 28 203 -202 67 130 41 78 -176 109 -239 47 -6 -71 -315 -161 53 -88 -174 117
3280A17j41n0L62m63L65j23j44J85R2l61J39J39J23k81J39J15k20K01q8Rj73L4
$$ 117 -24 -74 288 -175 190 67 -77 108 200 -161 -22 117 240 -41 98 213 -7 194 106 115 -58 -24
3302b4K11l97Q2K88m0p5k9R5O8k92O2j77J86k67K70r9L3L22q8k31O0l4K66j23
$$ -24 187 -210 -128 160 120 45 16 111 179 -113 -51 -228 -42 -309 -39 -138 -105 217 129 -102 -42 -76 190 67
3326F7k80J39n8O13l91P7o9k42M49l39l00L68Q6j96Q1Q5r0K79m25K18k28K52l32
$$ 67 -213 -74 -132 481 90 167 98 -144 305 -34 -334 34 120 -76 5 90 0 279 -146 72 -156 96 -236
3349b36J67r2J52M2N5n6j68K86N5q6j57j63K68j66M11n98L46l86M06j34J20l14
$$ -236 -69 -161 -9 33 88 32 -136 150 205 119 -38 -201 67 -99 312 -286 60 -326 80 -54 66 -248
3371b48K12K08m10k2j12o8P03l63j38N98l30N9j95M4J11M6k61K49j6p4j76K06
$$ -248 -36 172 -238 -260 -372 -440 263 -100 -238 360 30 89 -106 -62 49 95 -166 83 67 -7 -183 23
3393B3K1N5k96L94j2p4k75K97M5Q1k01k65P4J61o7j52K41J92o0m9k09K77r3j05
$$ 23 44 99 -197 197 185 111 -164 133 178 259 58 -207 -133 28 -39 -191 50 242 182 133 -76 201 108 3
3417CJ53j63R2Ko6m8L46l41o0oM47k54j7j53J2J93j17j6K22k90J28K18l02j52
$$ 3 156 -7 85 87 21 -27 319 -22 -82 -88 359 105 88 -65 -53 140 23 7 229 -61 67 285 -17 -169
3441a69M90n52K86k40J0n1L83k35k1K69j57k95K18K49l29Jj4J36N4M6k44N79k08
$$ -169 321 -231 55 -185 -175 -226 157 -78 -99 170 13 -282 -64 185 -144 -143 -157 -21 33 79 -165 414 206
3464B06L6j31l68K80l0q5J40l4j50J4K05r1L2j90N5j2J1K89n05K18K88j12j42
$$ 206 242 111 -257 23 -7 -92 48 14 -136 -122 83 -8 24 -166 -111 -123 -112 177 -328 -110 178 66 -76
3487g6J84Q6p3m27J55o6K8L46m30L13oO0j63K5P9K9L9r9K4j23J76J5O0r6k17j87
$$ -76 108 194 121 -306 -151 -217 -189 157 -273 40 34 94 -69 -44 35 64 103 4 28 -95 81 96 156 60 -157 -344
3513c44K57l1J84k35K12r1L64l01M07l80O4L5o3K7J70N5l47J20j49K73n55L26
$$ -344 -87 -118 66 -169 43 -48 316 15 422 42 106 141 78 105 275 330 -17 103 -46 227 -328 -2
3535bL40l29l1j88J7K12l9K05j40J03N3j79p1N8k54L35oj28K67l94J52k09L22
$$ -2 338 9 -22 -210 -193 19 -20 185 45 148 201 22 -49 9 -245 90 84 -44 223 -171 -19 -228 94
3558I4j0K7j6OL62n15r1KK43j22J2l04O5N75l90K2o2J00j51K20J59k18J8j14K8
$$ 94 84 111 95 101 463 -52 -143 -141 102 -20 -8 -312 -247 328 -62 -40 -102 -2 -153 67 226 8 26 -88 -60
3583f0j30K21n6j60L00l29J94R6m0K06O7k34j11j54N4J12L1k6M4M4j12M1j55L85
$$ -60 -190 31 -25 -185 115 -214 -20 76 36 242 309 75 -36 -190 -136 -24 7 -19 25 69 -43 -2 -157 228
3607B28j12o0j21J93j3n0j65J07j73j19N62r1k30K43r6j23R0J68l3m7m32K63j21
$$ 228 116 56 -65 128 115 65 -100 7 -166 -285 277 186 -44 199 103 -20 70 238 205 158 -274 -11 -132
3630a32L92j33N2j74J17k14J52k05K44j05K77n62K11J86P2j24m46L44J00l3K4
$$ -132 260 127 179 5 122 -92 60 -145 99 -6 271 -291 -80 106 178 54 -392 -48 52 19 43
3651D3m5k27L04l00M30m94L91o6j13l22L58O6l1l3p7n9J16J58k18J24j91J65N9
$$ 43 -2 -229 75 -225 205 -289 102 36 -77 -399 -41 25 -6 -39 -116 -175 -59 99 -119 5 -186 -21 38
3674C8k6J14j58K53L2o7j20K31k88L7l9K5Nj04K36j42P3j45J29j88j1m4O2J48
$$ 38 12 126 -32 221 253 186 66 297 9 46 7 32 37 -67 169 27 100 -45 84 -104 -115 -159 -97 51
3698E1Pj79j71L16L5l01L21k13Q6J04j19J33j31Q4j78K03j39L8m5l4J83O6J43
$$ 51 58 -121 -292 24 59 -242 79 -134 -48 56 -63 70 -61 23 -155 48 -91 -53 -98 -132 51 117 260
3721B60j73k23K1r4j82N56q8m8K76l29R5p6j54L3J41n0k0n7j25L92j67M2k25J48
$$ 260 87 -136 -115 -209 -391 165 77 29 305 -24 71 -5 -159 -126 15 -35 -55 -112 -237 155 -12 30 -195 -47
3745d7J5j94J00N7r3OL00l4l25M74j53J06Om05J70l05K69L8j29N3J8J37J89k02
$$ -47 -32 -226 -126 -69 -162 -156 144 110 -215 259 106 212 218 -187 -17 -322 -53 -15 -144 -91 -73 64 253 51
3769E1j09P0l89O39k25j91M68k30K7m68J12M51l99K69n1j11O5K89m69L19K2l67
$$ 51 -58 12 -377 262 37 -154 314 84 111 -357 -245 206 -193 76 25 -86 -21 268 -201 118 140 -227
3791b27J09K6Q0q4P5OJ41n15L06J57j95J27J27j75O8j05J71k83O6k4K17m02K70
$$ -227 -118 -92 -12 -96 -21 -15 126 -389 -83 74 -121 6 133 -42 26 -79 92 -191 -125 -149 68 -334 -64
3814f4K69j54k06j62N06j69O7j37P0K44o6k31q0K66O9n2l83L70j94l39J75L05
$$ -64 205 51 -155 -317 189 20 87 -50 20 264 198 -33 -113 153 222 170 -213 157 -37 -376 -201 104
3836A04k62L30k53R8j77qL90Rl24M8J43j03Q7j53M1j40N11j75n60J99J46j16K80
$$ 104 -158 172 -81 17 -160 -168 222 231 -93 -45 98 -5 82 -71 -30 -170 341 166 -394 -195 -49 -165 115
3859A15l75K59k8p0K21M0j96K04m46L95k92K11P7k47P0O2P8q8l9m2p5J64L53q0
$$ 115 -260 -1 -29 -99 122 162 -34 170 -276 119 -173 38 115 -132 -62 0 78 -10 -49 -91 -166 -2 351 271
3883B71q4l87L10k12j26L29k0P9m24K19o3N64l57j46N6K02l80K61J22l24K67P8
$$ 271 187 -200 110 -102 -228 101 81 160 -264 -45 -108 456 99 -47 9 211 -169 92 214 -110 157 235
3905B35k53k15K84k57n4l1J08L07K8l63J82n2l8O5mj71J91P3P6J20k54RJ10k58
$$ 235 -18 -233 51 -206 -260 -291 -183 124 152 -211 -29 -81 -119 -54 -58 -229 -38 35 111 231 -23 -14 96 -162
3929a62J31K95J05l85l5J55j7r2k25K07J67p1j1m1j12j23J01j13J89p0K79l54
$$ -162 -31 264 369 -16 -51 104 87 -5 -230 -23 144 73 62 21 -91 -214 -113 -226 -37 -107 172 -182
3951a82M13m31L60k76J49R9l40L04q7l4j67L24l36l7o0J32m3LL55j66L99r9k36
$$ -182 231 -200 160 -116 33 132 -208 96 9 -25 -192 132 -204 -241 -301 -169 -212 -209 146 -20 379 280 44
3974D4k60L42J1L0k01j8k02M29j44N0o3n3k15J83q6P6L15k53k46L42ml85J08M32
$$ 44 -216 126 137 167 -34 -52 -254 175 31 81 18 -35 -250 -67 -153 -77 238 -15 -261 81 77 -308 -200 232
3998B32k64K64l74J78P4k4k17K83r7L13l31J91k73m2K25l92L48J99k68j57L25
$$ 232 -32 232 -142 36 110 86 -131 152 55 368 37 228 -45 -87 138 -254 94 293 25 -132 193
4019A93j27O1r8j68J15n1k13K49l7j13K45L6rL8j69K28j01O1k36J52Pj26K16j6
$$ 193 66 127 29 -139 -24 -75 -288 -39 -76 -189 56 92 83 121 -48 180 79 140 -96 56 63 -63 153 137
4043A37J43k72j7q2Q1J23M1j01l03J57K73n5k57j71L34k1r3l1K17m5j65K12r6
$$ 137 280 8 -9 -91 -10 113 154 53 -250 -93 180 125 -132 -303 31 10 -83 -114 103 58 -107 105 9
4066Ik0J14J88l76K27k96m5m2K31J40j14j12J67K7m0j35j84J56K03j97K66J59
$$ 9 -11 103 291 -85 142 -154 -199 -241 -10 130 16 -96 71 98 58 -77 -261 -105 98 -99 167 326
4088C26n4L6k29j89J02J29k67K30l3k04K17k60K87p9k86K16R2o9r1L7K54o3m12
$$ 326 272 308 79 -110 -8 121 -146 84 51 -153 64 -196 91 12 -274 -58 34 -35 -126 -89 165 102 -310
4111c10O21l10P9j21J29J02o5k6j74o2L96L30n13K26l49k18K08n0J17QK44k75
$$ -310 311 1 80 -41 88 190 125 99 -75 -137 259 589 76 302 -47 -265 -57 -107 10 18 262 -13
4133a3j39m4K6J85j03p9j66K57R7l9j83N77j07j61j53L02j95j64L90l62R7K11
$$ -13 -152 -196 -170 15 -88 -167 -333 -76 21 -18 -201 376 269 108 -45 257 62 -102 288 -74 23 234
4155B34k66J03j43L58l22N7o6J36%k2J9j02K28k44j51q8j28N14j03J62k23R8m99
$$ 234 -32 71 -72 286 -36 21 -45 91 91 69 88 -14 214 -30 -181 -269 -397 117 14 176 -47 51 -448
4178d48M79M7j8j25M6N5R0O6M4m12J52K25j62Pk57L82k43J12J40K2k02N5j64O3
$$ -448 31 78 60 -65 -19 36 126 192 236 -176 -24 201 39 46 -211 171 -72 40 180 202 0 55 -109 -46
4202d6l8k7J78K0j82Ml8J70R8l90R7J52J32O2j46j47N9p8K58k96J80J39k57J47
$$ -46 -84 -111 67 87 -95 -91 -129 41 139 -251 -154 -2 130 192 46 -101 -42 -120 138 -158 22 161 -96 51
4226E1J90o7K13l01j25J55l76K62J5Q8k80P9n8P2j64M00o9k59K44R4n2j56mKJ83
$$ 51 241 174 387 86 -39 116 -260 2 17 105 -175 -96 -154 -82 -246 154 85 -174 70 164 112 -44 -48 -46 137
4251A37m11M06J1k50k6J67m0Q6m2P1J9k2j90L32m14Q3L16j84p6j29o6J73J23j33
$$ 137 -274 132 143 -107 -133 34 -6 80 38 109 128 106 -84 248 -166 -83 233 49 -27 -156 -222 -49 74 -59
4275e9j27P9J18j81K2J89j9J3L1j19J63o9jL29n73J98J03j58m23O92M9m6l49J53
$$ -59 -186 -107 11 -170 -148 41 22 35 66 -53 110 41 40 369 -204 -6 97 -61 -484 208 257 211 -138 15
4299A5L8j20L36k53O1j28L01l60K49l3n0N7k57J19K03k46k7K12M7j20j5J51j08
$$ 15 53 -67 269 16 77 -51 250 -110 139 106 56 113 -144 -25 178 -68 -95 117 164 44 29 180 72
4322G2l13J41J71M5j64Q9K8J76m80K06L50l13Q6R2k05N6J06j44j76L8J47L4J89
$$ 72 -241 -100 71 116 -48 41 69 245 -235 -29 321 8 94 186 -19 37 143 -1 -177 -139 8 42 231
4345B31k96P0j83J17O0k06R8K0K96j41N3p6l8N5m6O5j77q1L4n2J46k48L15l45
$$ 231 -65 5 -178 -61 -1 -207 -109 -89 207 66 119 43 5 60 14 79 -98 -179 -145 -197 -51 -299 16 -329
4369c29J02L86k34j1m2J16j13J36l40M29K1n66N55j96J92N4l57K2M9K46k15P9
$$ -329 -227 159 -75 -86 -128 -12 -125 11 -329 100 121 -445 110 -86 106 160 -197 -175 -126 120 -95 -16
4391a6J12j20J92j46K19m49J11j16J29L63n63L38l1L1j65PK05N2l40L38j77j86
$$ -16 96 -24 168 22 241 -208 -97 -213 -84 279 -284 54 23 54 -111 -104 101 153 -187 151 -26 -212
4413b12K92pj85J75o0J38j69l3l6K69J23k79P4k12j69J41K14J08j97O0q2J73j20
$$ -212 80 73 -112 63 3 141 -28 -61 -97 172 295 16 90 -122 -291 -150 64 172 -25 35 -47 126 6
4436Fn9r5L8p9m5K72L1j16Q2j51L66l46J27j92J53J08J17l03j15N01j08j36K12
$$ 6 -53 -148 -110 -189 -234 38 69 -47 35 -116 250 -96 31 -161 -8 100 217 -86 -201 300 192 56 268
4459B68k59n0L2ko3q1R9m48O36m20L35M6k17L63j57K1j18J55k67M40n03K82j86
$$ 268 9 -41 -9 -11 -74 -155 -56 -504 132 -288 47 93 -124 239 82 103 -15 140 -127 313 -190 92 -94
4482i4N6J32l86L87k59L94l83J08Qr5J00J32m9j61M0O5R3j56K3k29L12J82M6l22
$$ -94 -38 94 -292 95 -164 230 -153 -45 -37 -132 -32 100 51 -110 -70 -5 88 -68 -45 -274 38 220 266 -56
4506e6k9N6R9J54k85Ko1P8J28k99L60j66n3J91M6j59K22k32J85P6l9q5K55o64
$$ -56 -85 -29 70 224 -61 -59 -120 -42 86 -213 147 -19 -72 119 165 6 228 -4 181 257 218 133 388 -276
4530b76L11p5n2J65q7k54J94N1J9m4k27N25k35j14O7k2K20j09j06P1n1k18LR7
$$ -276 35 -40 -92 73 -14 -268 -74 -23 -4 -48 -275 250 15 -99 -32 -54 166 57 -49 22 -29 -247 -244 -147
4554a47O5K17l30Q2o8J10p1O4R4r9J38j37o6K99pk95K32M2j1o2J11N0l19j48o
$$ -147 -82 135 -195 -113 -181 -71 -142 -78 16 -83 55 -82 -148 151 144 -151 81 123 112 50 161 211 -108 -256 -262
4579b62L91k01o7M00l72L83n81L91l84L07J67LL0k63n7J86N2l29K62l34J17K01
$$ -262 129 -72 -139 261 -111 272 -309 82 -302 5 172 175 205 -58 -115 71 123 -206 56 -278 -161 40
4601D0j17K14j6L0Rk9Kk3j1J55j65K2k06J09j04Q9J47P4l20K97r8m2j49mO9q3
$$ 40 -77 137 121 151 160 131 133 110 99 254 89 111 -95 14 -90 -1 146 220 -100 197 99 57 -92 -96 -27 -110
4627a10J00L09j71l18K52Q7l7m1k91L53l04j70L41N0J01j91K24Jm1p5P6K9k16
$$ -110 -10 299 128 -190 62 149 112 71 -220 133 -171 -341 0 50 151 -40 184 185 144 69 145 174 -42
4650d2J71m14K82Q5l25L07k52J95P6p4j67M03n32L86j06M2O8j74J94j64k2K03
$$ -42 129 -285 -3 82 -243 64 -188 7 83 9 -158 245 -287 99 -7 35 103 -71 123 -41 -63 140
4672A40J12l75K25k13q9J28K1J6roq4R4K35k95J22p5J71j41j30J66m5J90J3m37
$$ 140 252 -123 102 -111 -200 -72 -51 -35 -44 -50 -134 -40 195 -100 22 -53 118 -23 -153 13 -32 158 171 -266
4696b66K50J89k41K01M9j70J27m3l43R5QJ69j28j28K40K18m57J6J04J23J00N1
$$ -266 -16 173 -68 133 182 12 139 96 -247 -152 -144 25 -103 -231 9 227 -230 -214 -110 13 113 164
4718A64j26Q2k07K19M1m66J53N7J99Pk75o8l4M12p8r1M3j44P2J82R8j11k16j44
$$ 164 38 120 -87 132 173 -293 -140 -83 116 123 -152 -220 -254 158 80 -11 32 -112 -40 142 240 129 -87 -231
4742b31L97j2j97K46q3j24R5j62M2n3K30k44J83J04j00m13N52k68j61N6O8k6K56
$$ -231 166 154 -43 203 120 -4 91 -71 -29 -82 148 -96 87 191 91 -322 230 -38 -199 -143 -75 -101 155
4765A55k80J73k31J04l9J05KN5J01p2J94k37K7j57L15l22K26qo4Q5J05l23j61
$$ 155 -125 48 -183 -79 -118 -13 -11 44 145 73 267 30 57 -100 215 -107 119 111 47 132 237 -86 -247
4788b47K24K87j97l05Q0P9o9Q2k07K28R7j67k8K67l64K46Q9M0R6k51j07R4J09
$$ -247 -23 264 67 -238 -158 -79 -148 -66 -273 -45 52 -115 -143 124 -240 6 95 135 231 -20 -127 -33 76
4811G6k44L76l7L4l79m2L09k09j1L62m13M51k50N6J52P5n65J76KR0L3j8n7q2N
$$ 76 -168 208 171 205 -174 -216 93 -116 -127 235 -178 273 23 79 231 306 -259 -83 -81 9 42 24 -33 -115 -110
4836a10M7K05j91L89l53j09R6p2j31L32j2N7j02o5Op1K56k06K29j55j53O2j75
$$ -110 -63 142 -49 340 -13 -122 -26 -98 -229 103 91 148 46 -19 -13 -84 172 -34 195 40 -113 -51 -226
4859b26K53J43J73o44L06K6o8M18o43JK1N10n35p0M1K21q8L18k36Q1K1L2m4J60
$$ -226 27 170 343 -301 5 31 -37 381 -262 -261 -240 270 -265 -335 -294 -73 -161 157 -79 2 23 55 11 171
4883A71M0k35k45L01Q9m68M82l33K16K4L5m17M56j20l7J28k43Lk2L59k13K30k35
$$ 171 211 -24 -269 32 121 -347 135 -198 18 42 77 -340 116 -4 -41 87 -156 -153 -175 184 -29 201 -34
4906c4J81l82L97j83Q2L5l9j34m0K07m47K77K92q6jj46K9k35J23q2j21J52K65
$$ -34 147 -235 162 -21 61 96 57 -77 -117 90 -357 -80 212 126 125 -21 8 -227 -104 -186 -307 -155 110
4929A10K1j32K4j79L8K27j93k39K22J03J21j40k5J69l2k81J85K63l12L19l56J00
$$ 110 131 -1 23 -156 -118 109 -84 -323 -101 2 123 -17 -42 127 95 -186 -1 262 -50 269 -87 13
4951A3k4l00J79mJ72j38j1P8O8P0j49M3L3o0n9N6m3K93m22N5Q9J78j42L56m30
$$ 13 -11 -311 -132 -136 36 -102 -113 -35 33 103 -46 -3 30 -30 -89 -33 -76 217 -205 -150 -61 117 -25 331 -99
4976i9j24M96j87J12l02K6J42k91j14J88L20j89KJ45j02n9O9k68J94j64K15k09
$$ -99 -223 273 86 198 -104 -78 64 -227 -341 -153 167 -22 -20 125 23 -36 33 -235 -41 -205 10 -199
4998a99R6M13j93j01K26p6j73J14j80l31J53M31l16j92K67J40k42J14p8J63L0
$$ -199 -103 310 117 16 242 166 -7 107 -73 -404 -251 180 -136 -328 -61 79 -163 -49 -127 36 66
5019F6j64P3J01L82l80N8k67L81j85l62M17k97K75j90R7o4j2j17Q1J34J59k86
$$ 66 -98 -25 76 458 78 136 -131 250 65 -297 120 -177 98 -92 5 -59 -71 -188 -107 27 186 -100
5041a00jN3L58k88L22l02L24l22o8O8k1j82Q8K55k59j7k8p6O6L02n2k71N3J66
$$ -100 -101 -48 310 22 344 42 366 44 -24 44 23 -159 -71 184 -75 -92 -120 -196 -130 172 120 -151 -98 68
5065F8Q0jl80O71m49o3J09J53j57o1J57Q6l69K47J58j87j79L42p3k74K43l89K08
$$ 68 148 147 -233 438 -11 -74 35 188 31 -30 127 213 -156 91 249 62 -117 225 152 -122 121 -268 -60
5088f0%k83K89o2J74J17m2l1j07j31L73k81j8K09k89m5j21L22k8L03l24M6j58
$$ -60 -60 -343 -54 -116 58 175 133 102 -5 -136 237 -44 -62 147 -142 -187 -308 14 -14 289 -35 11 -147
5111a47J50o2j80L57k05M6j2QM2k01L91l1l28L31J44j65j70k12J63k9R0m1m6P1
$$ -147 3 -59 -239 118 -87 -41 -53 -45 -3 -204 187 156 -172 159 303 138 -32 -244 -81 -110 -20 -61 -107 -36
5135c6l1k4k11O49j78p8N3q9j01J59N6J01l15O8L5N5K8j30N8j12j1r4K16J88k61
$$ -36 -67 -91 -302 347 169 91 144 55 -46 113 169 270 -45 23 58 113 141 11 69 -43 -54 -148 68 256 -5
5160eQ5j56J66l06J95j34J97J56l44L5k27M49M1L8q5l08K98k56J3K15Q9J1j45
$$ -5 80 -76 90 -216 -21 -155 42 198 -146 -111 -338 111 152 190 105 -203 95 -161 -148 67 156 167 22
5183B2r4K65o6k08J95M0j98K35k35O6L5J80N4o9j75J78j87J20po7Q4j83j27J67
$$ 22 -72 193 127 -81 114 154 -44 191 -44 22 57 237 291 222 47 225 38 158 151 84 168 -15 -142 25
5207B5q1J91pm6k64J83K6q9L31l54J46L0j21K53k38k53J30J9K19m4q2L62o9j72
$$ 25 -56 135 128 82 -182 1 27 -62 269 -85 61 91 -30 223 -15 -268 -138 -119 100 56 -26 336 267 95
5231I5k02J11J0L37n75K23l8J03j24Q5o6p9K29k34n5R8PJ85k65J90L36j47Kl10
$$ 95 -107 4 14 351 -224 -1 -39 64 -60 25 -41 -120 109 -125 -180 -82 -75 110 -155 35 371 224 226 -84
5255h4L4J15J20l64L5K12k25N8Q5k96K79J52q0J12n37M35k4l60M75j68q3O7J14
$$ -84 -50 65 185 -179 -144 68 -157 -99 -14 -310 -31 121 41 153 -384 51 27 -333 142 -26 -109 -42 72
5278G2k37L79l08j33q1M13j92q5L6Kp1O2n0J27K70k14k41J83K03N3q9o3l08K77
$$ 72 -165 214 -94 -227 -308 105 -87 -172 -136 -134 -205 -143 -193 -66 204 -10 -251 -68 135 188 99 36 -272 5
5302Ej54J74O4m0j58J57R3l68J72L0N3r7j46J31k8K02n1j64Q8M7l33M17k66J42
$$ 5 -149 25 89 49 -109 48 141 -227 -55 -25 28 -69 -215 -84 -112 90 39 -125 -37 10 -323 94 -172 -30
5326c0J24m58J82n0K85J41k48j0J03J67k00O3Q6k40J82J09j07k25j04R1P0Q3k36
$$ -30 94 -364 -182 -232 53 194 -54 -64 39 206 6 69 155 -85 97 206 99 -126 -230 -139 -69 14 -222
5349b22r1K56J16Q0Q2k43n2K47m00M56q5m84K41o2l1K64n9l2j43K19n0k5oO9K18
$$ -222 -313 -57 59 139 221 -22 -74 173 -227 229 144 -340 -99 -161 -192 72 13 -19 -162 57 7 -18 -24 45 263
5374B63l83K51m4J41Rj41j1k06nM4P2P6j6p0K73k07J56k45R7k71K8P7K3K96j20
$$ 263 -120 131 87 228 237 96 85 -121 -126 -82 -10 66 50 -20 253 46 202 -43 54 -217 -189 -112 -89 207 87
5399H7l58J18K6m7J56j25j63J27l0M68m99J47q0J36J06l34L44o5K46n28K74l8
$$ 87 -271 -153 -127 -174 -18 -143 -306 -179 -209 259 -240 -93 -173 -37 69 -265 79 14 260 -268 6 -32
5421c2%o5j36L79m6N6k19j11J52K39J14l65M8j98j0K85J61l79k64K63L10j85P8
$$ -32 -32 -97 -233 146 100 156 -63 -174 -22 217 331 -34 14 -184 -194 91 252 -127 -391 -128 182 -3 75
5444G5j75q7LK77j92M5J57j44K17m0j53j05L3J71k0m09J22O7k3J55r6J61j5K89
$$ 75 -100 -187 -184 93 -99 -54 103 -41 176 136 -17 -122 -89 82 62 -347 -225 -158 -181 -26 -122 39 24 313
5468C13m76L49k21k12N78l48Rk6j36m6K58j23J01k13K20j63P8l61N71l63O3L53
$$ 313 -163 186 -35 -247 331 -17 -8 -34 -170 -216 42 -81 20 -193 27 -136 -58 -419 152 -211 -148 205
5490B05l92L20p8j58j28K47k33R1P5J37j84J3J25Kj89Q6M48m37J51p4j21J28J0
$$ 205 -187 133 55 -103 -231 16 -217 -126 -51 86 -98 -85 40 42 -147 -61 387 -50 101 27 -94 34 44
5513D4K09k68j73J92J15j55kq4j1l4R2KO7j36J27J58R6k61m44M96j59k22L18O9
$$ 44 253 -15 -188 4 119 -36 -38 -122 -133 -167 -75 -73 -6 -142 -15 143 239 -22 -466 30 -129 -351 -33 36
5537C6K08k90qJ15k34J59j90K05m00L88L88k46j95L1R5J78l54j45J68K82l91K1
$$ 36 244 -46 -54 61 -173 -14 -204 1 -399 -11 377 131 -64 -33 62 240 -114 -259 -91 191 -200 -179
5559a79J91m5j29J14k14L32K68k43m63L42J07r6O2j08K0R0L4j15j09J98k15K59
$$ -179 12 -33 -162 -48 -262 70 338 95 -368 -26 81 -15 47 -61 -41 49 83 -32 -141 57 -158 101
5581A01j33k47L20oj24N6N1q0Q0l07M97k10Q3k35J91j8k52J40J43j06J54k12M36
$$ 101 -32 -279 41 35 -89 -33 18 -62 18 -289 208 -2 81 -154 37 19 -233 -93 50 -56 98 -114 322
5604C22o38L02m7P1M5j50r9R6L47J7j45j95J88R2k75J24J14j96q8J88p8j49K82
$$ 322 -316 -14 -61 10 55 -95 -194 -98 249 266 121 -74 114 206 -69 55 169 -27 -115 73 -5 -154 128
5627A28j84j56j36K15N1o7RJ62Lo1j48K08Rp2K1l1L54n13m5%K55j00O6p2Q9j5
$$ 128 -56 -212 -348 -133 -82 -149 -140 22 25 -36 -184 24 33 -39 -18 -49 305 -208 -253 -253 2 -98 -32 -104 -15 -30
5653c0L7j09O1j24J73J81j07J60k71q2J77j9R6j99J74m0Q7k96K00K39n82J78K7
$$ -30 7 -102 -41 -165 8 189 82 242 -29 -111 66 47 143 -56 118 78 165 -131 69 308 -274 -96 -69
5676f9J31j53L19r9m4Nj71K56k82K49j59J36r7o0J57k08q2K12o9R5k03J47J28
$$ -69 62 -91 228 129 85 90 -81 175 -107 142 -17 119 22 -38 119 -89 -171 41 -28 67 -136 11 139
5699A39n6n3l7n1K31l93K14K8k21kM00m14K22L63n19p1M46k46J76l12O7O2K4j51
$$ 139 83 30 -7 -58 173 -220 -6 22 -199 -201 199 -215 7 370 -149 -220 226 -20 156 -156 -89 -27 -3 -154
5723a54K21J12k38j75L92K75m48K78k88O6j37K51j3j07k07K82R2k84J6R2j04J13
$$ -154 67 179 -59 -234 158 433 -15 263 -25 41 -96 155 142 35 -172 110 202 -82 -66 26 -78 35
5745C5j95J90m7O4k48K63N2n7j05l02M94j65M4lj08J88j76L4J45m8L3k22J76j14
$$ 35 -160 30 -17 47 -201 62 114 57 -48 -350 144 -21 23 20 -88 100 -76 -42 103 55 88 -134 42 -72
5769g2j22k5M11q1o2j10J00j2k36K12j53K6J40j7j62Q1Q6j3N3J77k53k07K53q7
$$ -72 -194 -219 192 111 49 -61 39 27 -209 3 -150 -124 16 -1 -163 -82 4 -9 44 221 -32 -239 14 -73
$$ [...]
8191d6
##END NTUPLES=NMR FID
##END=
