##TITLE=1H_CG-1104-C1
 DMSO, 8 sc, 
 28.5.2019
##JCAMPDX= 6.0         $$ Bruker NMR JCAMP-DX V2.0
##DATA TYPE= NMR FID
##DATA CLASS= NTUPLES
##ORIGIN= UXNMR, Bruker Analytische Messtechnik GmbH
##OWNER= root
$$ XWIN-NMR		Version 3.5
$$ Wed May 29 13:29:37 2019 Russian Standard Time (UT+4h)  she@DPX200
##.OBSERVE FREQUENCY= 200.13155
##.OBSERVE NUCLEUS= ^1H
##.DELAY= (6, 6)
##.ACQUISITION MODE= SIMULTANEOUS
##.ACQUISITION SCHEME= undefined
##.AVERAGES= 8
##.DIGITISER RES= 18
##SPECTROMETER/DATA SYSTEM= spect
##.PULSE SEQUENCE= zg30
##.SOLVENT NAME= CDCl3
##.SHIFT REFERENCE= (INTERNAL, CDCl3, 0, 15.7039)
##AUDIT TRAIL= $$ (NUMBER, WHEN, WHO, WHERE, WHAT)
$$ ##TITLE= Audit trail, XWIN-NMR		Version 3.5
$$ ##JCAMPDX= 5.01
$$ ##ORIGIN= Bruker BioSpin GmbH
$$ ##OWNER= she
$$ F:/spectra/data/she/nmr/H-F/1/audita.txt
$$ ##AUDIT TRAIL=  $$ (NUMBER, WHEN, WHO, WHERE, WHAT)
(   1,<2019-05-29 13:28:23.48 +0400>,<she>,<DPX200>,
      <created by zg, POWCHK disabled, PULCHK disabled
       configuration hash MD5:
       00 E9 B6 7A A2 85 ED C7 34 08 36 98 17 FE 4E 26
       data hash MD5: 16K
       5F 71 B6 A5 7A 25 2B 80 E6 08 A1 21 C0 AE D7 25>)
$$ ##END=
$$ 
$$ hash MD5
$$ 74 56 AC 2D 6D CB FE 8C F2 12 63 B3 99 6A C3 4F
##$RELAX= 
##$RELAX= 
##$RELAX= 
##$RELAX= 
##$RELAX= 
##$RELAX= 
$$ Bruker specific parameters
$$ --------------------------
##$DU= <F:/spectra>
##$EXPNO= 1
##$NAME= <H-F>
##$PROCNO= 1
##$TYPE= <nmr>
##$USER= <she>
##$AMP= (0..31)
100 100 100 100 100 100 100 100 100 100 100 100 100 100 100 100 100 100 
100 100 100 100 100 100 100 100 100 100 100 100 100 100 
##$AQSEQ= 0
##$AQ_mod= 1
##$AUNM= <au_zg>
##$AUTOPOS= <>
##$BF1= 200.13
##$BF2= 200.13
##$BF3= 200.13
##$BF4= 200.13
##$BF5= 200.13
##$BF6= 200.13
##$BF7= 200.13
##$BF8= 200.13
##$BYTORDA= 1
##$CFDGTYP= 0
##$CFRGTYP= 5
##$CHEMSTR= <none>
##$CNST= (0..31)
1 1 145 1 1 1 1 1 1 1 1 1 1 1 1 1 1 1 1 1 1 1 1 1 1 1 1 1 1 1 1 1 
##$CPDPRG= <>
##$CPDPRG1= <>
##$CPDPRG2= <>
##$CPDPRG3= <>
##$CPDPRG4= <mlev>
##$CPDPRG5= <mlev>
##$CPDPRG6= <mlev>
##$CPDPRG7= <mlev>
##$CPDPRG8= <mlev>
##$CPDPRGB= <>
##$CPDPRGT= <>
##$D= (0..31)
0 1.2 0 0 0 0 0 0 0 0 0 0.03 0 0 0 0 0 0 0 0 0 0 0 0 0 0 0 0 0 0 0 0 
##$DATE= 1559122102
##$DBL= (0..7)
120 120 120 120 120 120 120 120 
##$DBP= (0..7)
150 150 150 150 150 150 150 150 
##$DBP07= 0
##$DBPNAM0= <>
##$DBPNAM1= <>
##$DBPNAM2= <>
##$DBPNAM3= <>
##$DBPNAM4= <>
##$DBPNAM5= <>
##$DBPNAM6= <>
##$DBPNAM7= <>
##$DBPOAL= (0..7)
0.5 0.5 0.5 0.5 0.5 0.5 0.5 0.5 
##$DBPOFFS= (0..7)
0 0 0 0 0 0 0 0 
##$DE= 6
##$DECBNUC= <off>
##$DECIM= 24
##$DECNUC= <off>
##$DECSTAT= 4
##$DIGMOD= 1
##$DIGTYP= 9
##$DL= (0..7)
0 120 120 120 120 120 120 120 
##$DP= (0..7)
150 150 150 150 150 150 150 150 
##$DP07= 0
##$DPNAME0= <>
##$DPNAME1= <>
##$DPNAME2= <>
##$DPNAME3= <>
##$DPNAME4= <>
##$DPNAME5= <>
##$DPNAME6= <>
##$DPNAME7= <>
##$DPOAL= (0..7)
0.5 0.5 0.5 0.5 0.5 0.5 0.5 0.5 
##$DPOFFS= (0..7)
0 0 0 0 0 0 0 0 
##$DQDMODE= 0
##$DR= 18
##$DS= 0
##$DSLIST= <SSSSSSSSSSSSSSS>
##$DSPFIRM= 0
$$ [...]
##$SUBNAM2= <"">
##$SUBNAM3= <"">
##$SUBNAM4= <"">
##$SUBNAM5= <"">
##$SUBNAM6= <"">
##$SUBNAM7= <"">
##$SUBNAM8= <"">
##$SUBNAM9= <"">
##$SW= 24.9336996594482
##$SWIBOX= (0..15)
0 0 2 0 0 0 0 0 0 0 0 0 0 0 0 0 
##$SW_h= 4990.01996007984
##$TD= 16384
##$TD0= 1
##$TE= 0
##$TE2= 300
##$TE3= 300
##$TEG= 300
##$TL= (0..7)
0 120 120 120 120 120 120 120 
##$TP= (0..7)
150 150 150 150 150 150 150 150 
##$TP07= 0
##$TPNAME0= <>
##$TPNAME1= <>
##$TPNAME2= <>
##$TPNAME3= <>
##$TPNAME4= <>
##$TPNAME5= <>
##$TPNAME6= <>
##$TPNAME7= <>
##$TPOAL= (0..7)
0.5 0.5 0.5 0.5 0.5 0.5 0.5 0.5 
##$TPOFFS= (0..7)
0 0 0 0 0 0 0 0 
##$TUNHIN= 0
##$TUNHOUT= 0
##$TUNXOUT= 0
##$USERA1= <user>
##$USERA2= <user>
##$USERA3= <user>
##$USERA4= <user>
##$USERA5= <user>
##$V9= 5
##$VALIST= <valist>
##$VCLIST= <CCCCCCCCCCCCCCC>
##$VD= 0
##$VDLIST= <DDDDDDDDDDDDDDD>
##$VPLIST= <PPPPPPPPPPPPPPP>
##$VTLIST= <TTTTTTTTTTTTTTT>
##$WBST= 1024
##$WBSW= 4
##$XGAIN= (0..3)
0 0 0 0 
##$XL= 0
##$YL= 0
##$YMAX_a= 87328
##$YMIN_a= -95034
##$ZGOPTNS= <>
##$ZL1= 120
##$ZL2= 120
##$ZL3= 120
##$ZL4= 120
##$ABSF1= 10
##$ABSF2= 0
##$ABSG= 5
##$ABSL= 3
##$ALPHA= 0
##$AQORDER= 0
##$ASSFAC= 0
##$ASSFACI= 0
##$ASSFACX= 0
##$ASSWID= 0
##$AUNMP= <proc_1d>
##$AZFE= 0.1
##$AZFW= 0.1
##$BCFW= 1
##$BC_mod= 2
##$BYTORDP= 1
##$COROFFS= 0
##$CY= 11.3945322036743
##$DATMOD= 1
##$DC= 2
##$DFILT= <>
##$DTYPP= 0
##$F1P= 18.9103706918063
##$F2P= -1.10871071338519
##$FCOR= 0.5
##$FTSIZE= 0
##$FT_mod= 4
##$GAMMA= 1
##$GB= 0.15
##$INTBC= 1
##$INTSCL= 1
##$ISEN= 128
##$LB= 0.24
##$LEV0= 0
##$LPBIN= 0
##$MAXI= 10000
##$MC2= 0
##$MEAN= 0
##$ME_mod= 0
##$MI= 1.114404
##$NCOEF= 0
##$NC_proc= 0
##$NLEV= 6
##$NOISF1= 3.799351
##$NOISF2= 2.8
##$NSP= 1
##$NTH_PI= 0
##$NZP= 0
##$OFFSET= 15.70392
##$PC= 1
##$PHC0= -8502.301
##$PHC1= 16.80025
##$PH_mod= 1
##$PKNL= yes
##$PPARMOD= 0
##$PSCAL= 0
##$PSIGN= 0
##$REVERSE= no
##$SF= 200.130013532006
##$SI= 16384
##$SIGF1= 3
##$SIGF2= 2
##$SINO= 400
##$SIOLD= 16384
##$SREGLST= <1H.CDCl3>
##$SSB= 0
##$STSI= 0
##$STSR= 0
##$SW_p= 3612.71676300578
##$SYMM= 0
##$S_DEV= 0
##$TDeff= 0
##$TDoff= 0
##$TI= <>
##$TILT= no
##$TM1= 0
##$TM2= 0
##$TOPLEV= 0
##$USERP1= <user>
##$USERP2= <user>
##$USERP3= <user>
##$USERP4= <user>
##$USERP5= <user>
##$WDW= 1
##$XDIM= 8192
##$YMAX_p= 0
##$YMIN_p= 0
$$ End of Bruker specific parameters
$$ ---------------------------------
##NTUPLES= NMR FID
##VAR_NAME=  TIME,          FID/REAL,        FID/IMAG
##SYMBOL=    X,             R,               I
##VAR_TYPE=  INDEPENDENT,   DEPENDENT,       DEPENDENT
##VAR_FORM=  AFFN,          ASDF,            ASDF
##VAR_DIM=   8192,          8192,            8192
##UNITS=     SECONDS,       ARBITRARY UNITS, ARBITRARY UNITS
##FACTOR=    0.0002004,     1,               1
##FIRST=     0,             0,               0
##LAST=      1.6414764,     0,               0
##MIN=       0,             -95034,          0
##MAX=       1.6414764,     87328,           0
$$ Real data points
##PAGE= N=1
##DATA TABLE= (X++(R..R)), XYDATA
$$ [...]
1892f78M53Q56p17j53n9K27L05j41k28j81L30J06m37L24k55L89K20n8q05k44J051
1913C05K0j68m89k89N09O35R6m67n14n4N59O16l33r44j43O95O74p4o18o88J11
1934e61J316n0n06m33o28Q19J212l69j204n62P66P38K05n50r74L6J133N03o62
1953B29p09l60O11O51j1n10n85M26O28N5j65p49J74K35M48m51j85j78N41J50j73
1974G2j63m6L45n8N7k81m9L80j51K22p29K75O30l69L54n02o21M03J111l16n31
1995C3o09l01J088N33k34r58k29M52R50j33n07j185N21R11M98o58o95k30M44J125
2015H16j62q97p95O63O35N10n15j081K14P07M57k44o69q6K26M14J93l22n37L03
2035a70K38L05k78K1m31K07Q2K21k03j25L76%l25l14J00O05J05o66%j43O30J80
$$ y = [-678, -225, 631, -86, -239, -298, -71, 234, 93, -135, -316, 14, 120, -317, 7, -248, 141, 361, 303, -502, -746, 305, 325, 157, -332, -621, -112, 523, 619, 152, -362, -416, 143, 759, 426, -518, -661, 34, 708, 634, 16, -672, -561, 755, 705, 199, -234, -862, -43, 1169, 800, -404, -966, -200, 538, 743, 193, -781, -745, 388, 891, 229, -480, -840, -229, 422, 411, -99, -684, -258, 370, 425, 260, -489, -315, -80, 368, -83, -268, -446, 95, 245, 72, -91, -137, 208, 150, 207, -74, -123, 257, 106, 328, -401, -126, 504, 135, 489, -13, -634, -231, 880, 564, 33, -576, -877, 211, 744, 510, -448, -677, -225, 725, 592, 85, -1100, -579, 332, 830, 172, -523, -753, -309, 816, 654, -243, -1038, -375, 260, 770, 255, -826, -612, 95, 552, 308, -361, -447, -221, 193, 386, 64, -473, -170, 68, 373, 95, 116, -315, -108, -26, 195, -8, -133, 243, 243, -82, -396, -296, 309, 414, -252, -252, -395, 235, 415]
2057D15p1o59l36Q49K69k92m86l88N45O22K54p95o22O2N12P36pr71l74M42Q92
2078E97J52r49p26L13P74O74m93m56k92L24P23J37p29n76K95N06J12j44o27k65
2098f50O32O64l74o00L6K52M80l31o9l61K79L43o0n28rK48P1K34o70J12M14R9
2120B12r9l22j63K03L09LJ04q15J08L78O34k32m91n04N89L02J95j88r58L86R70
2141F21J55m58p16j01M44R05m40m61n66N72M02N92m91q64p8O17Q28r84j63l88
2161e74O65j69K52l04j22l0K37J44L8l58l34L74L88Mn16Q0J93o6K77k91n5R4J08
2184C5K56l64Q5j6L02j28l45q4M48K53J31l97p86J48J020J97n13p15K83J45P92
2205G47n10n77m20Q41N25l70k48l82j62Q90L19p53o21K85M36K84L70r10l17N47
$$ y = [415, 344, -315, -651, 198, 467, 175, -311, -699, -154, 468, 722, -73, -695, -633, -121, 615, 608, -363, -737, -295, 597, 749, -200, -926, -613, 161, 835, 342, -114, -406, -82, 641, 778, 49, -527, -232, 274, 386, 242, -385, -650, -18, 646, 272, -328, -292, -40, 440, 109, 40, -321, -42, 301, 241, -287, -296, -48, 23, 257, -413, -301, 113, 212, 113, -209, -372, -169, 140, 143, 247, -568, -460, -82, 552, 320, -171, -675, -86, 216, 411, 223, -735, -349, 621, 776, 318, -398, -499, -55, 850, 410, -51, -617, -45, 357, 949, 458, -406, -484, 133, 961, -23, -186, -574, 91, -78, 174, -130, -252, -282, -45, 99, 137, -221, -555, -181, 207, 211, -305, -225, -32, -98, 179, -112, -167, -73, 35, 291, -73, 12, -4, 298, 170, -175, -259, 189, 442, 573, 176, -610, -462, 558, 755, 242, -473, -190, -45, 747, 237, -340, -760, 81, 606, 236, -12, -394, -556, 334, 653, -100, -721, -436, 0, 284, 654, -256, -573, -26]
2225b6M09J26n47l89J13J67O11o9o08l34J45M64J76q6m06J53M62m0K3k87l43M17
2247A31J45j6q12L99K95K67o49k45K81K98K58l27n13N37j4K21R1o87O5M28K85
2268D38m73j93n7J92M61J26p62KLL77rJ74l63k92K39L74K42k85m43j89P04M1J4
2291C21n31n41N27N65M01j172l09K91R99j05n25k72n4M47N68m75o35J24K67K28
2311A19J31k04k54K37K50k49Lj38P2J6J45J97l18L6R8j40J8R8o2lj7K83k17k58
2335a57J51K99J27o58k80K96L09L91n41m5k87M51O24l53q99K82L50O34k66r19
2355d91m6N42M61l62k62l59L64N17K72n47l07l3K67L34j98j14k13J32L74L5M1
2376D07p2m76k09Q26o8m71r3J21j38N38l8q46K09O95o0j02n27K11M59j09n23k31
$$ y = [-26, 383, 509, -38, -427, -314, -147, 464, 395, -213, -547, -402, 62, 238, 152, -254, -101, 361, 321, 344, 57, -286, 131, 276, 260, -552, -153, 142, 409, -240, -485, -204, 94, 352, 25, -488, 49, 35, 256, 347, -340, -275, 153, 438, -35, -228, -285, -93, 368, 494, -268, -266, -263, 114, 105, 279, -84, -376, -137, 237, 479, 194, -249, -438, 266, 307, 321, -210, -751, -224, 341, 742, -430, -739, -448, 551, 446, -79, -351, -405, 42, 610, 135, -500, -376, -109, 119, 250, 46, -208, 29, 279, 30, 33, -105, -33, -17, 128, 325, 7, 43, 141, 1, 19, 117, 55, 52, 35, 318, 101, -157, -6, 293, 420, -238, -518, -222, 87, 478, -63, -108, -395, 56, 680, 327, -572, -290, 60, 694, 428, -491, -537, 5, 466, 104, -158, -517, -153, 364, 636, 89, -218, -251, 16, 350, 152, 38, -175, -43, 331, 366, 407, 335, -141, -350, 476, 408, -63, -156, -35, -173, 365, 327, -519, -310, 385, 325, 223, -304, -93, 366, 257, -266, -497]
2398d97L50J98M52m33n93K76N19m0l16j96K0O09o9m34k46K33L36J82q0m37pM1
2420a32K09J08j64k57k33N05L71L42n40m89p5M18M61k78l36m27O85K44lm81l06
2441c78K99K77M34q43k63J48N64M09p36l38K22M28R5m15l33L34J71m4l22Q8p5
2462b78N65J36n94r3k82P77p1m98O6J77L02J65l92j28K26j94J64K64k41l98OK45
2484g6M38K53n57m00m6M32L48m59l23k2N85K34k26p19J87M57L29o5n14l21O17
2505A52L31n15k03P8j75M33N8k36j1P8n1MJ01K22m39R2l4j95K55J35k82M50k56
2528hK41k12J41m38M81Jk00j70k55N96Ml82j52K30J64J25k98k96k08R07J63p57
2550c23j7K32M65K3l38q90O37M72K80l56o92K85K85L45Ro15J70J84O8J20j81j93
$$ y = [-497, -147, 51, 503, 70, -523, -247, 272, 232, -84, -280, -260, 349, 280, -154, -400, -167, 169, 351, 271, -166, -173, -132, 77, 185, 21, -236, -469, 36, 407, 749, 209, -280, -355, 63, 524, 246, -90, -517, 168, 412, 409, -72, -378, -79, 198, 632, -211, -474, -326, 238, 647, -89, -427, -205, 223, 318, -97, -430, -96, 75, 31, -291, -203, -278, 287, 423, -171, -264, -546, 231, 160, -338, -272, -95, 207, 372, -20, -148, 78, -116, 48, 312, 71, -327, -321, -76, 362, 615, 58, -342, -388, 44, 392, -67, -390, -412, 173, 407, 181, -538, -351, 106, 435, 370, -144, -465, 152, 483, -32, -235, -157, -332, 101, 159, -77, -88, -10, -61, -57, 44, 266, -173, -81, -115, -310, -55, 80, -202, 248, -8, 233, 21, 162, -276, 205, 206, 6, -164, -419, 177, 181, -201, -353, -123, 41, 166, -132, -428, -636, 271, 434, -323, -340, -108, 357, 380, 42, -848, -211, 261, 541, 185, -507, -222, 63, 408, 417, -198, -28, 156, 224, 344, 163, -30]
2572c0J33J33l2p4J92j48m51J05L99l42K07j97r6L86K42q47K35l77P41J57l71
2593c5j63p2L96n3j70k28K8M14K50n03k32K70N11o77P2j16J62L54J3o03J94K46
2615E8K84l03k93j6J41L22j89o3j86K47M2m4R2K57l94j69P0L94L4j07n67L41L43
2638B94J80m20k63j51J37P27j4o81m06P19N46k02p84j10N85Q9j66k57k47M46N2
2659G4K0l1k20K56p9J61j90j41J98j07j1j3K80k57k3K0J44N2k61K83j04L6m55
2682c68K05lJ20J22Q9K9n09K88O39j07n58k85L77M81p7o19j56l1P67M1q2p34K52
2705a19K83K58k58l24l9J26M11j87l55J51L4J68j16R6j16k29K23j46K34n1q3m7
2727h6p9J58n0k47j4L20K46o9o13K55L4L38j28j71j93LM91J54q27K33L34M7q4
$$ y = [-30, 103, 236, 204, 130, 322, 174, -277, -172, 227, -115, 92, -105, -201, 185, 427, -420, -185, -562, 179, 336, -35, -198, -270, 126, 73, -97, -325, -297, 117, 367, -136, -368, -98, 413, -264, -192, -308, -146, 208, 221, -382, -188, 58, 342, 39, -254, -270, -129, 193, 4, -59, -245, 2, 44, 0, 92, 349, -45, -214, -144, 250, 284, 177, -390, -49, 294, 474, 54, -209, -360, -223, 504, 490, -191, -597, 122, 668, 466, -318, -428, 157, 246, 80, -177, -424, 22, 74, 94, 63, -157, 99, 20, 181, -9, -150, 48, -59, -70, -83, 197, -60, -83, -63, 81, 133, -128, 155, 51, 87, -368, -163, -166, -46, 76, 165, 194, -315, -27, 612, 505, -53, -338, 39, 520, 443, -176, -332, -363, 404, 445, 363, -371, -119, 164, 422, 164, -160, -199, -73, 338, 151, -204, -53, -19, 149, 33, 129, 13, -216, 7, -139, 95, 44, -39, -86, -165, -7, -57, -304, -318, 2, 248, 179, -434, -179, -145, 193, 65, -106, -299, -296, 195, 349, -478, -245, 89, 136, 52]
2750E2l88K77J75K19k27k76j20M36P7K75m88l13J32O06l42j1Nj23NM42p7n34K0
2773a78M4M55j50j06j87j69J93K68K41n8n53J9J95N14m56j33j59J23N93n79Ql95
2795d70N77kO8m39MR4K64O3l71j87N54K11k72J7k20J59R8k52k56L43L92m89K4
2818i0l1K64K55k08m4n8k40K18r0j19L91r5k16p7O0M39K00n65k49M66l30J16P5
2841G2n86L10J80J85j57k02k50M63J29J44o94J90L98K87m32jk15K0L09q2r9k04
2863b35J10K12m8J2k0J08m11M86n8j5j05n11K50J83l4p7J67J23j0l09K3J09k3
2886g3OJ10l28J70J6R1M4k53J08L02O0K49o35P6K25J09L09o95j14J79L16J50n36
2909a14N4J60J45l52k16L74j29J71K31k89m93M81N8j6J39k00m4m9L19j28j2n9
$$ y = [52, -336, -59, 116, 335, 108, -168, -288, 148, 225, 500, 12, -301, -169, 437, 95, 84, 89, -34, -29, 413, 336, -198, -178, -134, 321, 171, 65, -122, -291, -98, 170, 411, 353, -200, -181, 14, 528, 72, -61, -220, -97, 496, -83, -75, -470, 107, 105, 173, -266, -262, -168, 96, 159, -212, -399, 155, 366, 94, 111, -109, 50, 148, -104, -360, -17, 375, -114, -90, -121, 143, 398, 190, 146, 88, -152, 66, -24, -143, 248, 153, -63, -140, -80, 359, 559, -6, -255, 211, -119, -3, 72, -514, -204, -24, 161, 4, -198, -448, 15, 144, 288, -406, -216, 182, 469, 37, 36, -179, -159, 150, 68, -31, -235, -125, 87, 39, 51, 31, 139, -272, 214, 156, 141, 36, -475, -225, -42, -76, -153, 14, 137, 127, -182, -159, -50, -73, -67, 43, -285, -115, -99, -8, 36, -217, -109, 193, 253, 502, -133, -57, 168, 277, 586, -109, -223, -44, 272, 422, -114, -60, 100, 245, -107, -323, 51, -78, 93, 324, 35, -458, 23, 81, 65, 204, 4, -40, -89, 230, 102, 90, 31]
2931C1j1j71j02L25N4k98J9K23Q7j64K2k64K18l29L76k54L7J57R8j24j96j03K67
2954a02N8Kr1k87M81J99k72J40k29L85j26qk3mj7m0j81M95m20j8oR3R5L11m62
2979b7J56L9j52j3k16m1r0M23R0k26k76K93N9jJ10l43O3K23K8Jl27L69k80N29
3003C91No02J50J59j8n3jl27J38l2L0M2Pp7M50n39M16k22pK7j07K22k04Q1M5j60
3029a86J37r7k33P16m2j67j74J86j01n0Pl66Q7m7L71J40q5j91l85L03N20Q5k98
3052A30m86M97OL38o09l8J09K37Q3k46j67K02j34K5M74j13j4l17J58r9k1j28j32
3075b45J55K04j20j32k19K48j44J45N1k13o7L91j25J52k11KJ56L00l4o07J09M44
3097B40l02j53L8J45p3K07k07j3j6J39PJ35l07M2K21J15O3n21K54R0k96J59j17
$$ y = [31, 20, -151, -253, 72, 126, -172, -153, 70, 157, -7, 15, -249, -31, -360, 16, -238, -201, -44, 54, -70, -266, -369, -102, -44, -42, -133, -420, 61, 260, -12, 128, -101, 284, 158, 150, 127, 123, 106, 66, -115, 380, -40, -58, -64, 29, 124, 435, -27, 129, 168, 16, 3, -213, -254, -344, 79, 169, -57, -333, -40, 19, 18, 128, -215, -152, 71, 99, 100, -227, 142, -138, 391, 396, -206, -56, 103, 85, 32, 31, -296, -158, -190, -160, -118, -111, -188, 262, -277, 139, -83, -90, -63, -170, 52, -152, -71, -26, -186, -49, -146, -379, 337, 295, 128, -46, 140, 39, -11, -4, -370, -283, -330, 41, 181, 96, -95, -480, -177, 343, 428, 130, -356, 141, 147, 485, -124, -162, -53, 184, 267, 21, -146, 56, -78, -53, 421, 308, 294, -23, 135, 36, 15, -113, -245, -90, 114, -6, -138, -357, -109, -253, -108, -57, -270, -337, 54, -71, 81, -130, -128, 28, 328, 294, -313, -204, 240, -62, -215, -177, -32, -105, 102, -105, -118, -134, 5, 12, 147, -160, -118, 103, 218, 281, -240, 14, 104, -192, -33, -150]
3120a50R5K11j08L8k38M23n07L13j72M63k67l55K18j42J17p5K8Q3j41K74L16k53
3142A71l71m8L53J26j45k97N18r0m6k36K97j3k99K46k09k66L62j47R6j44K69K29
3164C56j67l32J08O1M5R9j23pm6j52M92p30O42m42R8M7j4J16p1o7l69M94J08Q7
3188B33j11j89K41N3j25p0l01k10P05k39L54l01m5o3L96k85l07L29k64J53J00
3209E4J93M3n74M26j92K43k83j77J39L58l04p3K16%K73m56m9mM5K51m04N04j46
3232H3j71j75J97J86k14R0M27o86J62l06L24J30K74k64p3j45k77L49R3n8k25R3
3254a86J34L7M1j3l88L05L34k6j99J13p5m3k1J07k81J77j57J25o3J28j66P2l04
3277c49M52P2k12n9j67L77k99k1K45l14M4L83l57j08L98j20L2j50M4Q3K93o2j81
$$ y = [-150, -55, 156, 48, 86, -152, 271, -236, 77, -95, 368, 101, -254, -36, -178, -61, -136, -108, -25, -166, 108, 424, 171, -200, -248, 105, 231, 86, -211, 307, 217, 171, -65, 232, 219, -80, 166, -43, -309, 53, -94, 2, -142, 127, 356, 189, -143, -35, 26, 71, 170, 47, 40, -6, -158, 334, -396, 246, -196, -98, -51, -65, 51, -20, -87, -456, 38, 146, 233, 122, -67, 174, 227, 102, 32, -269, -479, 226, -13, 341, 40, -5, -68, 328, 43, -264, 65, -199, -46, 54, 247, 290, -284, 142, -50, 193, -90, -267, -128, 230, -74, -147, 69, 69, 342, -114, -163, -167, -122, 129, -275, 229, 83, -88, -263, -66, 120, -94, -4, 423, -263, -101, -407, -83, 47, 321, 57, -16, -161, -438, -89, 4, -54, -279, -186, -52, -15, 26, 13, -375, -70, 264, 238, 39, 152, 77, 34, 13, 120, -161, 16, -141, -16, -79, 49, -117, -45, -349, 103, 175, -37, -96, -263, 114, -185, -206, 39, -275, -231, 152, -205, -313, 85, -35, -3, -153, -109, -26, 267, 205, 24]
3300B4L4k12K38Kq1J06k99J31K87J17m86rJ79m8R9k66j66M09L4K41j96k18P1k1
3324c0K49j73L0j26L40m8j35K1J5k40J97k82J06K74k12J88j66O1j69K01J70j86
3346H5P8r2k50J15q4L59n7k49j28J88K20r9j34J69j10J7l04L45r3j75J98Q2m4
3369C7J91K3n03N43k53r8k26J68K19Q5q8j20J71OJ7k39O6K28j57P9j18j46K43
3392A28J27k69K17j90R9j1P2J02m95j14N24P7j07j44j62K17K23j10m25J39P6M3
3414A7L5J40k16l1j09L28l5j49L00m01J89K20p2Q7l90R2j9p6L00k90l99M40J15
3437G6k97M41k45L49k56j23q3J99j7J72j82j41J85Koj21j0j63K58Q2m0l27M29
3460A82l26K86k08J59p1k8K38k37j52N0J69o5j62M0k0J79N6j58Q4k95J06N1J95
$$ y = [24, 58, -154, 84, 86, 5, 111, -188, -57, 230, 347, -139, -148, 31, -17, 82, -184, -350, 59, 93, 334, 138, -80, -9, -30, 219, 46, 76, -50, 290, 242, 107, 128, 143, -97, 100, -182, -76, 198, -14, 174, 8, 69, -100, 101, 271, 85, 163, 71, -179, -64, -148, 211, 154, -95, -223, -35, 185, 86, -48, 121, 11, 28, -276, 69, -24, -199, -1, 81, 37, 228, 251, -252, 291, 38, -60, -286, -118, 101, 186, 98, -22, 149, 155, 172, -67, -1, 227, 70, 149, 31, -115, 128, 255, -14, 203, 13, 112, 101, 173, 275, -220, -334, 190, 267, 160, 16, -146, 71, 294, 184, -241, -102, -26, 17, 52, 192, -24, -55, -164, 164, 129, -20, 280, -121, 68, 288, 216, 303, -87, 5, -14, -90, 210, -80, -479, -39, 76, -221, 220, -25, 324, 68, -55, -138, 61, 44, 216, 34, -107, 78, 80, 74, -47, -57, -220, 38, 120, 80, -247, 182, -144, 142, -66, 93, 22, -6, 232, -5, -157, -107, 62, -3, -165, -125, -145, 34, 90, -68, 16, -279, -173, -122, 73]
3483G3j78J46Oj26K1P5J41m12L14r4R8R6Q7o1k00J11k49M2K50j99J59l04L14L1
3507A41n43M69k25L1K00r1J82J07l67L45m03Q5L07l78P8J2K0nQ6nn1L4m3l11K80
3532d5K2N1J97k95KK68j89l2n9K76k40j4j4O4J89k26r2K44k69n3l0L85l16M38
3556B62m26K98j76R5k71J93J58j13j07P2mJ07J60l76K62j48R7j41J68J51j17j11
3578C3J36j93J79l21j45J44k1K63j37L6L91l48j6M9J28L0j65l76K00K02n2K68
3600B85m26j8J10J09j92K88j59j19m6J04J72k14r5L89k79R8JO5l6k35M60M4l53
3623d7M5k27K81J9l56L75k51j35M75l20R1K59j00Lk78K65l70J46K99l17j67M85
3645A75m24K9K64J59lk59J62j88K20p6j38L2N7J22k92K59k9J6j27r7r1L54k10
$$ y = [73, -105, 41, 47, -79, -58, 17, 158, -254, 60, -34, 64, 160, 247, 186, -14, 97, -152, -110, 140, -59, 100, -204, 110, 141, -402, 67, -158, -127, 73, -18, 164, 271, -96, 249, -154, -69, 238, -140, -62, -50, -30, -35, 51, 46, -5, 29, -14, -325, -45, -23, 28, 225, -70, -68, 200, 11, -21, -80, 196, -44, -58, -72, -8, 181, -45, -137, 107, -162, -215, -245, 140, -176, 262, -164, 134, -42, 53, -218, -25, 133, 20, -87, -15, -19, 88, 248, -128, 134, -14, 83, -58, 110, 261, 144, 33, 169, -24, 155, -166, -311, -167, -188, 75, -62, -26, 365, 17, 1, 50, 178, 208, 43, -333, -133, 69, 17, 285, -141, -159, -49, 60, -132, 156, -3, -122, -168, -64, 108, -106, -201, 188, -91, 7, 8, 73, 37, -198, 262, 306, -47, -2, -229, 52, 71, -285, 90, -161, -296, 179, -141, -50, 209, 109, 112, -166, 99, -271, -125, 174, -143, -310, 175, -249, -220, 44, 203, 200, -59, 103, -85, 135, 59, -79, -47, 10, 132, -160, 99, 70, 86, -41, -138, -229, 125, -85]
3668h5m0m5l8o8j34L60LL07l62L94k43m7k43O3L64J59r2k61j42k09N75o4J30q8
3692A94l75k0K69n3J54j90jK19k24p2j97L07k09K80j49l62O09j41j47j5L66m29
3714a86L54Q0k87P1j3p5j26K17q5j66L25PQ8l69p7L86k70K85k42k5M58j68j65
3737A7o7J67O9k79R8K53l81K40j74l9M44o61K23M9J0J78K6k75J76m44O46j28m74
3760c26K31j02L37k8o2O3k54L40p7l08J69k51J92L67k56K71k59k05K19k0r9Q0
3782B2J7j97N23m27k07K78j14M60m55M8R0l15K50l16N35l12J25j43L88m11j8R3
3804h6J02N2k31J49J41k75K40N6k95J16r5J2N0l16N18k86Q5J79j14J13l04L69
3826A80q7q6j10R5k82J72M2K10k42m1K30J10j46j54q1K21RoJ67l33j7L63k85j78
$$ y = [-85, -125, -170, -208, -276, -410, -50, -47, 260, -102, 292, 49, 2, -241, -178, 186, 345, 253, -8, -150, -359, 216, 152, 282, 194, -181, -201, 68, 15, 169, -21, -22, 197, -27, -99, -296, 11, -198, 82, -67, -429, 180, 39, -108, -123, 243, -186, 168, 248, -39, 32, 19, -56, -182, 35, -50, -216, 109, 116, 204, -165, -242, 144, -126, 159, -83, -108, 350, 182, 17, -50, 117, 186, -93, 5, 258, -123, 117, -57, -96, 348, -313, -90, -41, -31, 147, 173, -102, 74, -370, 276, 148, -326, -95, -197, 140, 112, 50, 113, -141, 199, 122, -186, -17, -268, -76, 291, 35, 306, 47, -158, 61, 41, -58, 22, 39, -158, 365, -62, -269, 9, -105, 355, -100, -52, 38, -277, -27, -343, 192, -120, 5, -138, 250, -161, -179, -86, 16, 68, -163, -14, 127, -148, 92, 148, -147, -31, -126, -114, -64, -380, 138, -148, -63, 116, 2, 115, -189, 180, 93, 7, -103, -8, -290, -118, -76, 134, -108, -149, 81, 191, 45, -109, -190, 31, 40, 34, 201, -132, -149, 214, -71, -249]
3850b49k4L75P8k2n0j15n9J72o6k59J61r3M47j47M9j67J47k35M5K7j76L16j13
3873D2Q0j44J56J49k34L3M23m83K8j86N9J12q5K94l57O8L13n1k79k23L25l80O38
3896B98j8k97q6J66L9l25J42K9J7K0J4m87K95J19j81N14k63Q0o9o9M42m40L10
3919B50j54m29L05P8j05NL5N0K02j66K23o54N64k80j37L55j78J1K90k98KK46j90
3942B5j21O9N9j91M0K29k17K05k32jJ54L1m5J26j39L6O3K7m38K08J35mJ4j87k
3967a56l8J55M22k55J2j94J0J96L3j61r7o8L59j5k72M2J62J74j91M1m27J41K76
3990A49K9j5k97K52k98J23J02K68k58m83P11l73K95l14rp3L24j54j27J17K27j76
4012B0k36N0n1K19j85N66r4k94j13J83j14j3K15k35K34j47j14n8L54l10K34j56
$$ y = [-249, -273, 102, 180, 158, 108, -7, -66, 106, 40, -219, -58, -151, 296, 149, 198, 31, 178, -57, -12, 15, -161, 155, 42, 122, -22, 134, 283, 49, 82, 505, 22, 50, -136, -77, 35, -50, 244, -113, -45, 268, 217, -62, -285, 40, -340, 298, 280, -17, -103, 63, 102, -223, -81, -52, -35, -15, -1, -488, -193, -74, -255, 259, -4, 76, 7, -62, 380, -60, 250, 96, -333, -28, 50, -55, -50, -15, 35, 237, 71, 294, -360, 204, -76, -213, 142, -36, -25, 265, -33, -31, 215, 25, -96, -27, 32, -159, -119, 110, -107, 98, -134, -135, 19, 50, 5, 131, -8, 28, 91, 118, -320, -112, 23, 19, 33, -154, -156, -194, -39, 383, 128, 140, -54, -44, 152, 185, 24, -73, -141, 218, 203, -69, -27, 135, 309, 118, 159, -268, -127, 149, 178, 163, -134, 118, -180, -57, 45, 313, 55, -428, 283, -90, 205, -109, -118, -191, 133, -21, -148, -31, 196, 20, -216, -166, -217, 2, -183, 383, 289, -5, -118, 65, -49, -62, 153, -82, 152, 5, -109, -167, 187, -123, 111, -45]
4034d5J16nL9o4J5O3oj14J3N5q0R2O9k80l7J24l37M33K75j79Q5n3k01J14p1J92
4060B13o8k42j30K30k3K32mk01r6J82r3J70k16oL04l65k1M6Q8j41K38k22M82k28
4084A29m7q7M0j0k02K89o5j24O7J65k93P1J80q0J89k28J44J0m8L8m7k08J14K55
4108B52k98m9k76M80k5r7J69o6q7r6j1Q7O5j6R1k33K40l48j14M15O8k79J63N0
4132H5p9R1j50l3M4L16o6n22R9K3K01R4k89J00n7J12Pj65K06L6j56L34m44J29
4156h4L7K46j69K74M7l78M4k49J18K3N0K60k68K67k74J05Pk47LL18j59J81O7m17
4180a98L99n58N03l9k86J12k4J3j86N60k53j2K12l03q9P0j62J4nK05J10j21K46
4203B08n7J3m65M65j41j20K41k46Q3L13J8j96Q6j22J45j59j30J85qj77K85l75
$$ y = [-45, 71, 66, 105, 41, 56, 119, 113, -1, 12, 67, -13, 79, 148, -132, -169, -45, -382, 51, 326, 147, 232, 179, -22, 92, 21, 213, 145, -97, -227, 3, -20, 212, 208, 7, -89, 93, 0, 170, -46, -52, 252, -113, -134, -88, 0, -141, 97, -125, 357, 129, 82, -5, 35, 25, -177, 112, 47, -77, -10, 155, -138, -67, 113, 33, 222, -6, 138, 148, 100, 138, 91, -117, -3, 252, -46, -95, -371, 109, 84, -13, 156, 90, 3, -93, -104, -17, 48, 32, 123, -110, 130, -218, -332, 83, 151, -128, 35, 85, 6, 97, -53, -86, -42, 274, 208, -314, -215, -192, 9, 103, -186, -86, -143, -31, -24, -189, 17, 53, -103, 231, -213, -84, -47, 199, 30, 304, 351, -27, 17, -232, -114, -91, -41, 219, -49, 218, -56, 49, 56, -191, -188, 130, -29, 152, 219, -198, 201, -357, 146, 107, -179, -67, -91, -78, -264, 296, 43, 31, 243, -60, -149, -79, -241, -227, -232, -27, 83, -38, 208, 151, 164, -301, 164, 23, -97, 144, -102, -19, 294, 312, 116, 202, 80, 225, 66, -64, 121, 113, -64, 221, -154]
4225a54K13j59L57m44K35q1J28n9j53j20J30J52J2Q6j75p5K5J78K54j48l05nr1
4248a99L11K67j01j51p4J1m5Q6L9q7j99L23k16K51m84M31K18l36N4M5P1k66K39
4271A88j84l74J6O17j80o6N2o5j16J2rK44o00O31l95K78j76O1L17l32L54l33J11
4294E1m7l9K65O8n79M33m6N1m40M14j92Nj44J28J33p3j6j15J78j39K05J48k73
4317b4J82l19K90l78J83J31J67l18j61K97J03j75n9j93L97j00k25j88M93K94l93
4338Dr2j14K82k8j6O7O8n2j10j37K5j32K34l8M3k26K68p7R5j63k94N90j35j24
4362f2J2J31j57M8m4J25j10M17l07j69N8r3L34N8j12k4N3j44l7K5j19J9J65j93
4386a26K40l38K95J67k86j8J08l3K07k7k85j08O42l10q1j16J43r1J27k22k02M28
$$ y = [-154, 59, -100, 257, -187, 48, -33, 95, 36, -117, -237, -107, 45, 57, 143, -32, -107, -82, 96, 350, 202, -103, -108, -199, 112, 379, 278, 127, 53, 64, 19, 105, 144, 57, -142, 181, -35, 216, -268, 163, 381, 45, 99, 144, 215, -51, 188, 4, -370, -354, 263, 83, 17, 69, 4, -112, -100, -109, 135, -465, 166, -229, 49, -127, -66, 251, -81, 273, -60, 51, 4, -35, 230, 298, -281, 152, 106, 157, -283, 131, -61, -56, -200, -72, 61, -12, -28, -143, 35, -104, 101, 249, -24, 158, -161, 129, -249, -66, 65, 232, -86, -247, 50, 153, -22, -81, -274, 123, 23, -202, -390, 103, 397, 4, -88, -202, 80, 52, 36, 103, 171, 119, 9, -128, -103, -235, -1, -39, 4, -222, 46, -31, 64, -99, -393, 197, 62, -62, -50, 81, -76, -28, -72, 53, -57, 360, 53, -116, -58, -151, 183, 241, 129, 105, 158, 14, -23, 2, -117, -98, 67, -126, 114, -224, 71, 238, -48, -66, 42, 9, 216, 189, -96, -204, 438, 128, 47, -69, 74, -17, 110, -112, -314, 114]
4408A14P6k19N9J87k13L03n08k36L53l05M31K16j74NO0k1l93K25k9L14l47J36
4430C4J49k91J98l19R3L40k73L0M18l17K4j84J88q9k74K44M5Mj05Qj2P6n6Q9L
4455B3j05J9J71n1p2K47k33j52L22m10N27l09K81k15q8k57K28M1k1K34n1K4j04
4478D9K55k39N3j11pM0J03k23K67m0j29k34K19R9j56J57r1Rr8J91j16J87m6p0
4502F9J86j64j06r8N3J17l57q9M9L08K04j56l72M96N7l78j3J91K1J68l24j99M14
4525G7J48l79M05j70j34N9N8l84K38j17K15J2J17Q0R5k76J26j37J73k52k3K40
4547A71k69L72n76P2K5K6J66l2p6N4OL62l94j19N4k04O09n09K83k48J62k8J09
4570A6Qp9m39M30O7k07K11J35R9j65j7O1O9j36k06J04R2j45m4j5r1K25K06j67
$$ y = [114, 190, -29, 30, 217, 4, 307, -201, -437, -84, -389, 42, 258, 84, 89, 149, 128, -265, -40, -69, 245, -102, 34, 183, -108, 90, -229, -136, 204, -69, -39, 379, 62, 86, -98, 90, 1, -273, -29, 16, 20, -85, -77, -89, -13, -69, 20, 23, -82, -63, 108, 57, -15, 232, -1, -153, 169, -241, 286, -23, 258, 43, -45, -302, -74, -33, -54, 180, 129, 153, 49, 304, 65, 118, 7, 0, 40, 143, -80, 187, 147, 18, -216, 3, 102, -54, 103, 12, 21, -77, 114, -2, 185, 139, 69, 255, 91, -15, -113, -60, 57, -300, -389, -340, -32, 172, 16, -356, 140, 197, -181, -194, -3, 18, 186, -138, -337, 77, 225, -154, 251, 81, -53, 6, 64, -320, -82, -199, 16, 28, 145, 225, 320, 44, 170, 33, 206, -46, -69, 171, -98, 274, -302, -230, -205, -179, -13, -45, -121, -67, -61, 301, -93, -212, -158, -362, 247, -262, 21, -227, -65, -93, 16, 24, -55, -494, -64, 3, -204, 7, 142, 241, 76, 59, 120, 189, 53, -153, -49, 43, -102, -146, -161, -252, -27, 179, 12]
4594A2j7j51L28l43Oj15J85J34J36l21Q4nK1J02P5lj87M6k54J51N1k4j40J78P9
4619B8k1P2m1m07L46m9j1J60r7l8J34k4k46O4k15M36L3j37k25J33J89n9j14j2
4643a01J47j58k3L17k26L99n91K21K47n48L20L6j11M4J19k4j32Q1k10K06p8K45
4665A80Nj71Q1J36j64j48J94j76J42J42l65P2K2N3p2M1J10j51K40j45J23kj49
4688bK93P2n11J29K19n4O9j43N2o7j14k1K9j24J99l10L99j49p0q8N14n02L42r
4712A53j25r7J38l26K95J66j12o0j76m2O6Q3J76j39k60L62L1r9L8N9l02P3Q5J10
4736I7l29L46l79J43M23k32k4J2k46N9r5oL98n51N62j15N5p8J26J73k83K75n41
4759b10J62L0n5J14q8J17j64m6K79n2k86N03n79O09o06R7L57j25K19j92j20k00
$$ y = [12, -5, -156, 172, -171, -165, -280, -95, 39, 175, -146, -62, -67, -46, 56, 131, 128, -59, -13, -267, -116, -65, -89, -229, -51, 28, 7, 79, 38, -369, -23, -72, -83, 77, -20, -58, 76, 52, -194, -130, -345, 91, 124, -13, -238, -105, 84, 25, -89, -101, 46, -112, -135, 182, -44, 355, -236, -15, 232, -316, 4, 40, -71, -27, 92, 68, -64, 17, -193, 13, -65, 180, 185, 14, 95, 231, 67, -81, 113, -63, 79, 221, -144, -72, -50, 3, -69, -28, 82, -69, 171, 26, 149, 147, -2, 291, 363, -148, -19, 200, 146, 215, 72, 124, 57, -57, -78, -49, -173, 26, -284, 115, -34, -104, -192, 322, -180, 162, 153, 28, -69, 69, -257, 38, 204, 92, 32, -144, -186, -120, -37, 139, 0, -260, 102, 133, 34, 72, 131, -171, -98, -13, 97, -232, 114, -265, -122, 301, 69, 45, 57, -189, -130, -225, -231, 167, -384, 178, 63, 118, 40, 166, 339, 56, 331, -210, -48, -18, -73, 41, -47, 70, -94, -140, 139, 87, -199, 304, -275, 334, -272, -175, 182, 57, 276, 84, -36, -236]
4781b36K79j64L5j90K15K5K5J40l26K14k8J03j68PJ84k10L30l17P9L14k05j93
4803h7j19L26R8j81j51K87j15J47l30l8K10j31M1k47J10M31k06Q5k39K45mj78
4825d6JN2k98M9K50J57j46J48l55j6M51j28K9r8j45%n6K92Q2k68J45k07k8L7K00
4850A02l17R4J9L13l74J89j37l2O0J28Qj27L06m29J61M9K4J61j49J61k87K47l73
4873b03K25r1K57k65J12J54q2l03M17j60R8O7k18j69L74j05k76L82J0K9l83K11
4895H1k9j39j58K10O8q3o1J38j41J12p9M8Q1Qj08O3R1m0J16k72J99Kk05J08JO5
4921G6J11j03NlO2K4m00J23j45K32L08k44L35o53J71n8J92j52J24l9J01KRk50
4945a72K33J55J64o41K25K05r4k66J76R5Qj42L08l50Q1j1K2J74l72L35j90L74
$$ y = [-236, 43, -121, -86, -276, -61, -36, -11, 129, -197, 17, -11, 92, -76, -69, 115, -95, 235, -82, -3, 311, 106, -87, -206, 120, 218, 37, -114, 173, 58, 205, -125, -163, 47, -84, -43, -290, -180, 251, 45, 130, -109, 136, 132, -46, -45, 7, -291, -242, 8, 165, 19, 167, -188, -204, 247, 119, 148, 50, -95, -95, -151, 141, 223, -45, 100, -107, -135, -98, 102, -215, -121, -102, 211, -163, 26, -111, -143, -83, 45, 53, -74, 232, -197, -36, 13, 37, 198, 49, 210, -77, 170, -203, 22, -69, 188, -77, 35, 189, 107, -196, 221, 61, 159, 226, 8, -161, 213, 108, -168, 214, 224, 253, -130, 81, 52, -87, -245, -35, 33, -50, -111, 27, -114, -2, -81, -33, 48, 56, -52, 11, 102, 62, 178, -94, 105, 107, -98, 10, 11, 76, 187, 84, 89, 86, 148, 172, -228, -105, -250, -18, 290, 46, 381, -272, -101, -159, 33, -119, 5, -34, 67, 69, 78, -172, 61, 216, 380, -261, -36, 169, 75, -191, -15, 80, 88, -54, 254, -96, -15, -26, -4, 170, -202, 133, -57, 317]
4967C17p4k60n3J14p4j4j27O2M12m58M15j19k32K19k81J58K16l53J70k63K24j64
4989a65l5M37m77N6K30M2j85J94l02M15k05k91N53n42M93l97K21J66j3l80J91
5010Fm13Q13l05r8j7P3K29k51j8l55K04J55q6j01J53K12l03K22k77L96o0j63J40
5033A56j95Q2j54J04M3P1j11n3r6L93j37l30o3L98j06L5J17k50K26k37P1j13J56
5056Gj5K04Rk58L40l42j40j8J44r5J73Q7jO9k29L27l90L38Q6m42J58j16m0Q7J56
5081I9k81K29J2k1J10r8k9j04j68L13J5j35J96o7k25J03q2K52J86n13J72RJ88
5104A61j14o2K16j73j5R8J33r1k22rK9j51K80J36k11J93o9j87m7n5N58n43J47
5127BJ61j03J95m41J10N3Nk75K02j84L61J15k1k15J4M7j37M4mn7K92k77J10J56
$$ y = [317, 243, -17, -70, 44, -30, -44, -171, -109, 303, -155, 260, 141, -91, 128, -153, 5, 221, -132, 38, -225, -1, -165, -200, 237, -240, -184, 46, 88, -97, 97, -205, 210, 5, -286, 267, -275, 218, -179, 42, 208, 195, -185, 6, -407, 406, 101, 3, -14, 59, 288, 37, 19, -336, -132, 23, -63, -164, -11, 201, -102, 120, -157, 239, 179, 16, 156, -39, 43, -111, -7, 36, 107, -4, -57, -153, 240, 103, -227, -290, 108, 2, 37, 154, -96, 130, -107, -36, -149, 7, -8, 196, 205, -53, 287, -55, -195, -213, -69, -164, 9, 96, 95, 164, -65, 262, -128, 210, 296, -146, 12, -104, -144, -57, 99, -182, 47, 59, 38, 148, 50, 21, -83, -251, 62, 77, -58, 138, 71, -154, -51, -133, 119, 305, -208, -36, -27, 161, 47, -15, 201, 28, 13, 111, 244, 153, -69, -78, -49, -200, 80, 216, 5, 198, 129, -58, -105, -160, 398, -145, 2, 163, 60, 255, -186, -76, -23, -18, -293, -91, -275, 86, 201, 180, -35, -21, 26, -111, -67, -71, -128, 164, -113, -3, 153]
5151A53p1K11k20j11N9j88M4R5p1lJ18K6j06%j44J11j6J48j89L19l13M17j83j94
5175a08J03l4J65J6p6J99l55k73M34j97J98P7P4q5j96Q4Q3K7n1Q5n4P7j72K5l1
5200A5N1k78K75M9k87K27K1P2m03J48K2K91l0k23K17k54k42J75J47R5l88N24n25
5223c01K21Q3k12K87q5K08j40m6J3J6j03K97k68l6R3l9n2J91k56J86K7j92J12
5246Dl6j52O8K13n6M0K2O8j82j65j51J61J6K46j85K32R9n98O42m63J25m1p2J77
5270A2Q6K46k70j95p1J29j84J13j84K61L31k35j66J49j18K63J12k93q8K67K40
5291D05k24k15k68M01J80m20o2J24P3J68K2j9k61L13Q5n71J12K39nJ49k12R2k84
5314a78K25m6R7j31K37l31J79k52Q6L59j46p0P8k46J12J06J67m49L47J16k04k15
$$ y = [153, 82, 293, 73, -38, 21, -167, -123, -28, -99, -102, 16, 42, -64, -64, -208, -97, -113, 35, -154, 165, -148, 269, 86, -108, -5, -39, 126, 142, 66, 265, -90, -363, 71, -126, 72, 149, 223, 138, -58, 26, 109, 136, 85, 170, 116, 193, 21, 46, 15, 66, -212, 63, 112, -175, 52, 73, 145, -258, -110, -88, 203, 173, -50, 167, -87, -329, -154, -7, 88, -300, 224, -301, -80, 3, -209, 78, -7, 201, 61, 15, 28, 44, -59, 238, -30, -66, 27, -12, -64, 127, -129, 57, 84, -108, 4, -32, -184, -116, 97, 41, 81, 103, 171, -11, -176, -327, -166, -150, 96, -89, 143, 242, -356, 286, -177, -52, -93, -165, 12, 98, 344, 74, -121, -192, -63, -247, -134, -318, -57, 274, 39, -127, 22, -96, 167, 279, -14, -102, 165, 405, 181, -34, -302, 99, 279, -141, -203, -79, -6, 162, 184, 165, -96, 217, 302, -269, -157, 82, 77, 226, 14, 106, -178, 47, 1, 98, -33, 204, -127, 52, -200, -114, 245, 99, 29, 107, -139, -27, 79, 246, -203, 144, 260, 56, -159]
5336a59N14l58j08K4J43k98M16j15j18P5J18j79o5m5K83k65K44m02n0M50j82O9
5358hK0K34Mk34k53L64k50L26m42J37K65o2jP2m62N80k68j64L36k90J56j8q2j18
5382a58J66j6Mj46J31k00j25L17J10J9K6o9j1Oj01K60j80K04l96L22l02J05m5
5405g9K09r3l3M8K51n40L41k12J5k28K64M7J77J07l21n7L75k04J40j57n5l00K41
5428f4J63Kj22r2J65J65j17q6r4L78j53j09K4m7R5j61Q5Q4o0j91K08m2J2Rj62
5453a10J83M3j08J38O0j79l4J66l43L82m35O55m75O1j85J96J32k62q6M70k96j32
5475a59O2j55L52p7L22l71P6N1m6p1K8K82m77k49O72k56J27l67L36K15m04J63
5497E4r5L27m28k05L1J64J83j35l6J65k54K02P2P8q5L3M2J6L3l2l14J10J33J5
$$ y = [-159, 355, -3, -111, -87, 56, -242, 174, 59, -59, 16, 134, -45, -110, -155, 128, -137, 107, -295, -345, 105, -77, -8, 12, 246, 250, 16, -237, 127, -123, 203, -239, -102, 163, 101, 100, 172, -290, 290, 22, -142, 194, -96, 60, 42, -40, -158, 8, -8, -4, -150, -19, -219, -344, -27, 83, 102, 128, 59, 48, 54, -47, 213, 33, 237, -159, 163, -139, -34, -79, 130, 37, 4, 52, 303, -237, 104, -108, -93, -321, -57, -10, 167, 274, -47, -104, 271, 67, 207, 50, -5, -305, -64, 99, 101, -21, -113, 52, 217, 100, 14, -80, 298, 145, 36, 60, 13, 108, -53, 32, 116, 56, -135, 73, 31, 43, 52, -110, 73, 116, 8, 146, 206, 27, -7, 159, -184, 198, -237, 418, -57, 4, -181, 15, 147, -115, -201, 269, -27, -159, -97, -252, 100, 23, 345, -26, 50, 101, 55, -16, 12, 294, -183, -432, 240, -16, 111, -256, 80, 295, -109, 54, -41, 286, -142, -347, -316, -152, 31, -104, -140, 25, -229, -27, 45, 123, 38, 71, 113, 129, 162, 130, -184, -74, 59, 74]
5521G4j49J72k65J07M28m42O1M9K04r4k0j95k04M05j95M48m08K5O5k75L78m26
5543b57L35j8p9l6k36M2J72J50q4J90k88J28N2m19M65l29K4K5L58k90j62J69J77
5566H9q8J57j10J30Q0l67M22l50K11j33N6k61R4m0K14J02m22K32L08m45L18o1
5588A36l80J41J19l51L92Q8l21q0k6N95m35J34J97m73L21O7L01n56K83j18k34
5609b00J59j89J63MJ45P1lm16J77J4J42p2j82M74k11l2R7l05K49k50K02M0j06
5632b9R1o2oMN2J45K9j1l97j0J45J49n8J21m09j06L59k74N0K89j75J84j09J64
5656A36j15M6qp9p0l3L13k18K36j13k23J9K76k81J83j69L71k92P2j45N0J8j46
5679a72J80J81j43j99K88k35r2L83j80l27J44K94l07K50N6J5q3p5J41j72J41p1
$$ y = [74, -75, 97, -168, -61, 367, -75, -14, 35, 239, 145, 125, -70, -274, 131, -64, 384, -24, 1, 66, -209, 169, -257, 78, 60, -19, -55, -291, -249, -77, 73, -11, 179, -109, 19, 71, -348, 117, -212, -188, -163, 195, -95, -257, -88, 89, 1, 158, 48, 178, 258, -109, 313, -37, 174, 41, 97, -164, -70, -110, 104, 206, -216, 16, 324, -121, 197, 136, -244, -103, 16, -335, 57, 145, -176, -256, -282, 313, -122, 12, 209, -264, 57, 124, 425, -131, 152, 34, -200, -41, -230, -67, -63, 82, 153, 150, -266, -89, -75, 67, -5, -187, 287, 76, 44, 141, -164, 85, -165, 37, 77, -29, 62, 0, -6, -2, 50, 195, 224, 213, -184, -194, -49, 100, 42, 163, -246, -352, 7, -267, -217, 72, -103, 81, -28, 136, 21, 67, 59, -20, -90, -123, 190, -28, 208, 95, -128, -109, 167, -114, 69, -100, 271, -21, 51, -94, -44, -26, -172, 8, 189, 46, -153, 135, -100, -192, 191, 11, -316, -172, 122, -185, 65, 121, 136, 53, -22, 119, -53, 88, 17]
5701A7j83M07j48l3k53N07k69j85J80k06P1P7J20j16j98J36k9J9L86n97M07j3
5723I7j03o5j64J88J04J7J53n00L17K55k25m2J37p7j34j41L42n5j53n6K02n2J02
5746A47j5p8J71l24K29k07n4M9j6K1K28j31m05M55K52p9l21j26J7J34J54J88m29
5769a40n1M16q4l64L05p9P1M9k66J59N0J18k63Q7P4RJ29j69R2j67J47Pl25K43
5793D8m2M70n70J02J06k83L88n6k45n1K85k11P3J46j52J43l39K36o4J17r8M8j88
5816a37J94j97L03o7k79L52J21l40J24j15l58K44j21K74J78l69O9j92Q0K03k6
5837e9j75J55R2N1k07J44n8K07j57J28j92R4j33Q6K0K19j25M5k43J25r6N1K08
5860A80n7j27l0J06j02K44k00R6J13k45K7Q2k44J52J10j34J97j53J8j0kr4K87
$$ y = [17, -166, 241, 93, 60, -193, 314, 45, -140, 40, -166, -95, -18, 102, -14, -212, -76, -105, -86, 300, -297, 110, 97, -6, -71, -235, -47, 57, 74, 227, -273, 44, 299, 74, 32, 169, 92, -42, -183, 159, 104, -49, -105, 97, 45, 147, 132, 54, 225, -99, 130, -77, -131, -82, -98, -77, 151, 20, -385, 70, 322, 243, -78, -204, -187, -53, 101, 289, -140, -191, 225, 141, -223, 82, 3, 74, 123, -143, 16, 66, 184, -79, 8, 82, 91, 220, 51, 143, -24, 123, 130, -195, 48, 6, 476, -94, 8, 114, -169, 219, 163, -82, -133, 152, -59, 14, 160, 8, 151, -188, 48, -16, 101, 3, 51, -137, 57, -140, 163, 96, -183, 169, 290, -50, 74, -41, -399, -155, -276, -2, 176, -193, -124, -316, -236, -33, -59, -234, -79, 13, 64, -143, 1, -57, 150, -7, 121, -71, 23, -110, -24, -4, 215, 90, 135, -108, 17, -79, -28, 180, 123, -4, -34, 72, -30, 214, 14, 110, 223, -22, 5, 87, -157, -5, 105, -29, 168, 15, 33, 23, 21, -73, 214]
5883B14j82q3J99k66j64L69K2k56N8Q0J07p4m6o6K99k9m87K53n6M67k12j91J54
5906A10n11P17k11rl44L82l45L27J9j88N3M7M7Kj15N0P9Q3J03o42M49rj98P9L7
5931A2o4K86k15O7o30N81J8K02l72K58J5k54j76N96j97l05K68j55N1j17o4K98
5953A03k89K99j46m8RJ55NQ1k36k66M32j14pJ50L0J11l18J39p1j17M20l28n5J76
5977A15j52K6J42l8K62l48O8l65M69k82n1R2M0L6J1j50L87k70K12k20j68J24L13
6000B53j3k76j55L04j72K04j85K57r0q9p4J54o9K37j5k81K3J69l4j91O6p3R4P3
6024A17j71j6L72k27M8k16ml1J88K68m98n7J24R3J78q2k26J82n5j98L22lk41j51
6048b84j79M32j54m8J97Q5k2Jk14J4L82j56j43J22M1k26j2N6K14k38K07%j72J75
$$ y = [214, 32, -51, 148, -118, -282, 87, 109, -147, -89, -9, 98, 24, -22, -88, 211, 182, -305, -52, -108, 359, 147, -44, 110, -401, 316, 105, 96, -248, 134, -211, 116, 135, -53, 0, 47, 94, 96, -19, 31, 110, 193, 296, -346, 103, 94, -104, -25, 12, -52, 234, 19, 86, -544, 37, 55, 257, -115, 143, 158, -96, -272, 324, 127, -178, 90, -65, -14, -131, -195, 103, -186, 113, -33, -81, -72, 83, 88, 169, -67, -333, 99, -15, -22, 128, 158, 269, -49, 90, 19, -98, 322, -6, -61, 115, -37, -11, 131, 93, 355, 7, 75, -290, 179, -103, -154, -62, -22, 14, 25, -125, 262, -8, 204, -16, -184, -60, 253, 240, -36, -191, 113, -59, 145, -40, 217, 127, 38, -36, 118, 49, 286, 271, -10, 13, 182, 148, -43, 23, -50, 44, 117, -54, -70, 302, 75, 123, -93, -97, -128, 60, 328, -170, -227, -103, -10, 168, 86, -140, 42, -13, -211, 111, 108, -133, -284, -463, -31, -185, -233, -36, 49, 27, 28, -186, -172, 210, 54, -89, 33, 74, -152, -164, -108, 106, -132, 75, 75, -97, 78]
6072G8l17R0J80m66K85J17lJ37j15j78N4L90l33P0M32n24K98l17P6N4k46K18L53
6095C33l70m4M27o20M49k14J85j00j8j6mj0j78K52j91J36k54L07P2K5k49M4P8
6118D0j30o2j09P7K26P0l14L65k06j84N36l21l9J54j36O2J25o0j34J7m20K8J89
6141b26N32l32k31L38k16K95N6j11k22J8J31q9J51k39J18NK45j98j88M05j60O0
6163A42k14R4J96k56K05k65P1J07L1j01rj74J02O6M2k69K59K10q1j74K09l59J63
6186eo2n4%J95J1p2k05K51N5l24J94J56J3n71K74L51r6l8j41QK8J51n29M16O4
6211G0r7J47qk05L78j27l1k59j09m5J66L33l55K06j55K17o9j26n1M48l76L52k30
6234G4l24K26PJ35P6O1j28P0l23K4n4J25K1J63j45p7L53l58J93k01N7L13k28J02
$$ y = [78, -239, -149, 31, -435, -150, -33, -36, 101, -14, -192, -138, 252, -81, -11, 421, -103, 195, -122, -46, 8, -238, -20, 333, -37, -81, 346, -274, 175, -39, 146, 46, 28, 12, 8, -2, -180, 72, -119, 17, -237, 70, 142, 167, -82, -38, 40, -90, -152, -261, -184, 42, 112, -202, 163, -43, -227, 309, -12, -51, 103, -33, 29, 154, 94, -40, -23, -443, -415, -226, 306, -26, -257, 81, -135, 160, 216, 105, -117, -99, 32, -57, 94, -145, -27, -22, 223, 25, -163, 242, 82, 142, -72, 22, 218, -38, 167, -98, -27, 80, 111, 10, 1, -173, -71, -5, 37, -232, 27, 237, 156, -18, 191, -168, -5, -67, -121, -121, 74, 85, 13, -192, 59, 114, -210, -16, 140, 153, -418, -144, 207, 111, 73, -68, -60, -32, 119, -410, 6, 70, -27, 120, 112, -93, 285, 158, 127, -132, -241, -286, -120, 213, -142, 64, -91, 126, 57, -69, -120, 328, -48, 304, 74, -250, -24, -17, 118, 194, 255, 127, 197, -126, -102, -156, -31, -10, 153, 8, -69, 284, -74, 119, -82, -25, 288, 60, 162]
6258A62k64p2K55M3k65j22R4j32K85L6j04J78k2M7j58l20L68J69l49K69j07kn7
6281f8j9l6j62L99J2J4k9K04l95q6K58k6p3q0L9j23K71J18m3L1p5p4K5k08J62
6306C6NL6n1j49J37j66L3K1Q1K60o15J85L67k25j4K10k12K18r7m9m2J07J06k33
6330e1L44j79j04N2l2l28L04L8l78K44J60k08L44j85k3L82o02K15j5M0l67M91
6352A42k9L9l9Pj21N5J04r5M1m23N16m34K62j00k04J07L26j49Q8J9k92K26L6O7
6376A49k61r7O4J10k14L12l40K21l45N27k17J2K77p2q2j03L7j52J76j4L3j67J69
6399B3m16P60l94J0J2l29L75j9l03L08L18n15K43l09M06k43k7l34L38K40j57k16
6421b29L59r6m4M3K08r8l40K11j20o0L02Rk27J89qJ74n18O5n5M00k56J97p1J91
$$ y = [162, -102, -174, 81, 124, -141, -263, -169, -301, -16, 20, -84, 94, 72, 119, -39, -359, 9, 178, -171, 98, -9, -11, -68, -87, -123, -285, 114, 126, 140, 111, 315, -80, -166, 92, 66, -7, -87, -48, -171, 100, 218, 175, 206, 131, 57, 82, -126, 36, 41, 77, 26, -123, 14, -152, -119, -98, -17, 243, -372, -187, 180, -45, -59, 151, -61, 157, 60, 11, -31, 76, 182, -51, 293, 114, 10, 62, 30, -298, 6, 44, -334, -90, 70, -138, 206, 21, -2, 380, -222, -7, -22, 18, -349, 142, 113, 152, 113, 120, -1, 54, 158, 63, 104, -319, 197, -237, 25, -75, -279, -172, 154, 5, 93, 112, -180, 46, 82, 149, -112, -209, -145, -35, -249, 63, -277, -56, -401, 126, -91, -79, 198, 126, 44, -59, -22, -174, 2, -12, 21, -146, 23, -393, 367, -27, -17, -5, -334, 41, 22, -281, 27, 345, -170, 73, -236, 170, -73, -100, -434, -96, 144, -13, -229, 130, 34, -10, 33, 241, 143, -197, 14, -106, -166, 136, 145, -82, 107, 99, 273, -245, -180, -235, 165, -91, 106, 35, 226]
6445B26k66J38p1J20JM4N9l11J61j09kL0m1l50L30ok01J59J17k12J7K32R9l93
6469b29P8J25j03j1J36J71l7k45J30J49m7N8M6k77K86N5k14r8j63OL58k34K19
6492A59l73J19K09Q4l25J46J30j44N2J12j49J34k7j33m5P0%j62N2J12q3J32p4
6515dK36J82m34O2J35j59j24K02n3K5J70l15RJ35k44Q3J86m5j33M36l14m0j01
6538a05K83l48M92l34j34J58J28K38l93J00j13J03K52m37M71p10M45j73p2l3L61
6559A79k38l8J53k2J39j99K26j74MM0J47n79L00L6p3M0j85K37j14J15J0k43q0
6582c19K68o9M5j61K57m06K03m0L10L4oj29j59L18n6j03rQ0J35j03j67K9k75K08
6606a15K87j15k0p7r8L06qk70JL16j84J0k72M29l5q5k8m5q1J87J17k56K33l05
$$ y = [226, -40, 98, 27, 147, 148, 192, 251, -60, 101, -8, -10, 20, -21, -371, -41, -47, -248, -89, 28, -184, -167, 65, 164, -229, -151, -26, -129, -140, -4, 167, 130, -115, 15, 164, 117, 175, 221, -56, 230, 285, 71, -27, -190, -184, 174, -60, 159, -214, -95, 114, 198, -127, 19, 149, 5, 57, 169, 20, 154, 127, -6, -51, 19, 19, -143, -91, 21, -62, 70, -4, 232, 414, -20, 42, 177, 18, -106, 96, 43, 68, 238, -77, -68, 67, -177, -94, 92, 47, -86, 350, 36, -4, -105, 178, -170, 322, -12, -146, 12, 140, 378, -15, 85, -28, 75, 327, -110, 361, -349, 96, -77, -149, -182, 179, -59, -97, 56, 34, 173, -26, 200, 26, 30, 70, 217, -362, -62, -26, -99, -59, -244, -7, -121, -6, 4, -239, -319, -51, -120, -75, -236, 21, -385, -182, -222, 88, 122, 116, -13, -172, 146, 90, -13, -22, 58, 193, 90, -77, -48, -323, -115, 172, 57, 37, -40, -138, 168, 160, -110, -109, 207, 23, 33, -239, 190, 155, 70, 42, -3, -84, 103, 220, -36, 197, -108]
6630a08n7K61%j85M5J75j75n7P7M5k45J7L87j00Jn0J30p31N40L6n9J17j14k1N8
6655a3L8o5J40j37K18P3l18q3N19k25j10R7l29L30J74k18lN9Rj49j00K87K1l85
6679a70K87k32ok27j52M68l7k44L87K4k66R0m0K43l09o4J19J40Pl09L59j87O7
6702e2m0Q8j72L24Pk64R4o4o5L12l75J34P5m9J32O2j60L36l21k51P6J29J26k15
6726a33K37n1j95K86k56J85mm91N59l43J15K90n07M18K1J13m67K57m12N07P1j18
6748H2J49l8j24j37k14K35o6K45l18K07J1k40K86j28jq9O4J45J49k86N14k75p3
6771I8j75K92m78L03rNk56N9L1J05j56J85k3K66M6l41o4j22O9O3N3L9J31r9k2
6796@K0L1L9R8j8R7m60K90k24K77m86M32j0k14J4j10J30J14j41N19n25p1L48J8
$$ y = [-108, -165, 96, 96, -89, -44, 131, -44, -101, -24, 21, -224, -207, 180, 80, 81, 31, 161, -570, -30, 6, -53, 64, -50, -71, -13, 25, -40, 100, -37, 181, 254, -64, -147, 372, 147, 37, 134, -195, 135, 309, 91, 88, 147, 156, 7, -93, 194, 215, -170, 117, -115, -121, -348, -500, -32, -69, -313, 74, 98, -168, -78, -118, 125, -184, -248, -129, 11, 18, -291, 68, -119, -52, -92, -4, -176, 148, 155, -109, -15, -79, -144, 168, -207, -73, 2, -47, 85, 147, -13, 323, 2, -249, -173, -44, 82, -133, 104, 53, -142, 144, -112, 73, 69, -422, 137, -206, -91, 199, -308, 110, 131, 244, -223, 34, -378, 129, 200, 82, 231, 193, 69, -68, -282, -47, -113, 132, -186, 21, 32, -208, 78, -50, -51, -140, -76, 69, 218, -68, 446, 171, 98, -77, 215, -263, 40, 31, 36, -220, -161, -130, -25, -181, 4, -19, 247, 293, -48, -112, -234, -165, -102, -49, -10, 121, 22, 0, 20, 51, 90, 188, 170, 267, -193, 97, -127, 150, -336, 96, 86, -128, -114, -224, -94, 20, -121, 398, -127, -198, 150, 168]
6820A68j87k38K00R6nr7k06L55K27M5l19P5l64K4M2L96k46K83j77k52mJ0J61Q0
6844F7M10n19j78L55k69J89p8K5l5Q1m0l93K50J24K57k98q6K40n9jK05k43j30
6867a26J95N8k41K02RJ5k64L70m74Q9J05nL43j51m1j65N9K50k86j49J35j44M4
6890a72K08k24K66m5j70O7M85k35k58q5R4q1J04J82j03K03l71j4J8J86k6L9P5
6913A43j35j42j2P5J51j35J45j1j30K22j10m2p8J63J26p0o0j83K31k20K54m95
6935c13L54k56J13J03o7J7K28l15M83n26k6K95J01j65J27k11J39K84l86m6J78
6956A11j22J5M8o5O4j00KL27l77Q4R8J9j97q7J62J17l1l38K39O6N9j74J59m7n5
6981b3R1k49J59L0j53K48k33M4n9K4k1J68J33j19r6K17k08J63r0P0k47k96Q43
$$ y = [168, -19, -257, -57, 39, 34, -63, -269, 86, 313, 358, 39, 114, -250, -226, -184, 212, -34, 249, 72, -180, -184, -174, -13, 67, 477, -42, -220, 135, -134, 55, -23, 2, -33, 48, 8, -385, -135, -11, 246, -52, -138, 102, 43, 42, 247, 4, -126, 69, 127, -114, 88, 97, 112, -152, 218, -256, -167, -62, -67, 276, 125, 84, -81, -22, 228, -58, -207, -72, -216, -172, 36, -188, 78, 33, -137, -70, 415, 180, -78, -163, -69, -150, -46, 136, 33, 236, -135, -149, -131, 55, 29, 68, 143, 8, -134, -146, -71, 80, -55, 90, 79, -51, 171, 61, 19, -59, 104, 230, 160, 100, -83, 148, -72, 182, -313, 41, -215, -102, 1, -66, -49, 179, -136, 347, -179, -205, 90, 191, 26, 153, -58, 81, 365, -21, -67, 111, -11, 4, 52, -13, 51, -49, -47, 280, -97, -13, 85, 104, -93, -180, -18, 99, 68, -270, -31, 35, 94, -80, 79, 32, -23, 68, -181, -22, 8, -145, 103, -130, -86, -145, -121, -142, 26, 159, 40, -56, 161, -47, 116, 26, 96, -151, -447, 396]
7004C96m11p2K58j05r8qp1L3R1M6j7j72R9J77k87k95K82J84j02M89l25k2l2J00
7028A38k65L27n06K82J95j45k02J82q9k3J87KR9k66K96k23J72k50J03Q7j07K16
7050B10l74K51J13m3o1j28J35r9K11j35l57L74k45J80l02L12j98K47k63kK76J12
7072B14j83m29M46m5J39l34J97k07J11L43l08n3K94k96N43k56k34R9j0J10k19
7093g8K92l20J04J94j59k7k00J63K22n02K03j15%J10M22q2j01j85j07m9J35L9
7115d1J56r0r5K22J9j38j75j23L16pK92j94nj72m7K12N6m82L25K08k75J68k76
7138a46Q3L12j12j54j17j28L05J4j72N6P7K32l85N1j9L5J22n1M7j35J78k0P7N7
7162B07m44J79j3J13k33M88j78l5P6p0j53R6r7J27J96l66K42joj37j2l5KN7R3
$$ y = [396, -15, -87, 171, 66, -32, -40, -111, -78, 13, 59, 42, -130, -31, 146, -141, -436, -154, 30, -72, 417, 92, 70, 38, 138, -127, 200, -306, -24, 171, 26, -176, 6, -83, -106, 81, 83, 182, -84, 212, -11, 161, -89, 14, 101, -6, 210, -164, 87, 200, 157, 96, -32, 103, 4, 215, 80, -277, 97, -148, 32, -270, 42, -156, 91, -172, -174, 102, 214, 31, -398, 48, 3, 142, -192, 5, -202, -91, 252, -56, -109, 185, -111, 432, 176, -58, 41, 31, 141, -78, 214, -106, -2, 192, 33, 6, -194, -31, 191, -311, -108, -223, -223, -113, 309, 227, 126, -59, -166, -215, -80, -41, 115, 25, -70, 152, 171, 33, -142, -265, 51, 44, 336, 142, 137, -35, -82, 130, 186, -296, 29, 237, -38, 130, -146, -63, 249, 137, -17, -134, -262, 43, 57, -115, -59, 18, 250, -135, -84, -103, -68, 54, 3, 50, -85, 93, 73, 150, 207, -237, -58, -71, 42, -191, 297, 119, 84, 160, 90, -63, 33, -64, 63, 259, -107, 135, 134, 128, -9, -21, -56, -54, 3, 96]
7187I6j36K67l46n3L13l40J02l0M8J63j59m8r2K68r6p8K93j83J56j41K2K9j28
7210g3n5l7R0N5J23r4j41J73j6N1j07l6J35J43j97l8N4k5K3N3j0pm4j62J19K38
7236B15k45j53L36l73m4L09L9j0J53k92J73k26k3K48n5J51j93J14m6R8j87j10
7258a21K72k76O63n65k12J98J06N3q2j23k6n9P1J49j9L36m41M05l36L02o20K51
7280g4m6L24K0k51k7K0J30J6O6j40r4j3kj01j22R5K81o6j39J71k17J85L38j28
7304B26k01j40J58R2J39k14n4R4Q1j86K11k03M9p3j47K83p2o5K3R5K47n06J19
7327d4l43L52K0j72J86K44k59j19J52q4J27K69k05l2j00j44J71m6J87j17k17K90
7349A16J03K82n31J84nj02J7j76J64O4q4j61L12m42K32k0j03L98k47m0J26j11
$$ y = [96, -40, 227, -119, -172, 141, -199, -97, -127, -79, 84, -75, -123, -215, 53, -43, -121, 172, -11, 145, 4, 26, 55, -73, -128, -165, -75, -20, 103, 9, -132, 41, 25, 76, -31, -67, 68, 211, 14, -24, 30, 5, 28, 81, 71, 64, 20, -142, -23, 215, -30, -183, 153, -220, -264, 45, 84, 74, 227, -65, 108, -118, -141, 107, 52, 203, 10, 124, 78, 176, -11, -121, 151, -125, 538, -27, -239, -41, 65, 118, 36, -87, -113, -172, -101, 48, 29, 365, -76, 329, -7, 295, -325, -74, -120, 204, 224, -27, -54, -34, 96, 112, 178, 38, -56, -69, -71, -172, -294, -199, 82, 16, -123, 48, -169, 16, 354, 226, 25, -115, 43, 135, 274, 60, 6, 100, 181, -5, 206, 3, 52, -21, -168, 115, 43, -22, 1, 96, 343, -163, -44, -387, -35, -15, -187, -1, 243, -16, -135, 17, -67, 60, 329, 124, 92, -8, -152, 19, -27, 160, 43, -174, 116, 219, 501, -30, 154, 149, 47, 64, -112, 52, 116, 32, -129, 183, -259, -27, -47, -150, 248, 1, -39, 87, -24]
7371b4N0J8j45K96r4j33j39k33M96Pml36K20j12J73k78N92l88J58k36l01O40j91
7394C6q6N3q4P8j39N69m93J03J35k58l5M3J09rQ3q6Pk67O08l94j5L30n16L9L35
7419A46l38o6J59Q9K90k53P5j53J03q5O1o3R3j92M3K83m85K52l06J12N7k4J11
7442i1K60N4l64q4K58o0J25k76J70J91k41J42K46j81j72k00K11j99J63J39J91
7463B82m74R4L21l43n5K19K2l55M05j67J83j99P3J68K8J23o61M46q1k73L01L0
7485H7N3m9j11J48j57j3j27L9L36m16K05N5p9m8j06j5K11q9K87l25J36p1l5J43
7509E9o9M5P4k32k80M07K8r8N1Q5j35J75n3n7k65L29j12K6Q0k75J9J62O9j52K7
7534i2K60N6R7j70k14P8lP9n1j39J94j37n5J61Q5K4J46l34J4j65K83l18K68Kk28
$$ y = [-24, 26, 44, -101, 195, 101, -32, -171, -404, 92, 99, 95, -241, -21, -133, 40, -238, 354, -34, 124, -112, -413, 227, 36, -50, 3, -81, -3, -142, 427, -66, 37, 172, -86, -121, -78, 31, 22, 105, 19, 26, -241, 367, -27, -42, 288, -228, -189, 146, -192, -258, -99, -10, 280, 27, 102, -51, 52, -33, 28, -35, 58, -134, -91, 192, -293, -41, -347, -235, -178, -202, -91, 169, 223, -141, -225, 33, -27, 98, -178, -8, 183, -58, 84, 330, 149, -23, -223, -12, -211, -48, 91, 282, -192, -98, 223, -120, -175, 44, 66, -289, 116, -51, 132, -67, 6, 174, 202, 325, -336, 110, 29, -244, 57, 87, 140, 91, -20, 128, -29, -42, -169, -130, 206, -210, -5, 50, -29, -77, -183, -198, 13, -76, 211, -114, 22, -49, -84, 59, -10, 35, 109, -123, -403, 4, 32, -66, -15, 70, -65, 110, 57, 0, -265, 64, -48, -22, 58, -217, -198, -36, 33, -119, -92, 168, 224, 321, 151, -63, 15, 12, 91, 40, -99, 95, -42, -97, 64, 149, 173, 319, -15, -1, -166, 117, -201, 67, 69, -159]
7559a59K68k08J20J85k66m7N9J7j27K44L56n41K6l7q5J91K45l3k24r6j99P04l34
7582E9k08L89k46l76M12J28k92J00K30k71O7J27j80R4M26p95K27j52K46k6L1o4
7604g4L70j80j02j56J27R6L49j85l62K09l27L72J18l92M0lQ7J4J38Q4J27j27l57
7627a34K52j87o6lJ44L7r5N9j18K12J43q4J9L8q6q4j29JL21j00p2M01m51J18L4
7652A70k71K23K27k49m63P5K12J72q8l7L9j02n3J01p9j40L16j4o1l7Q7K19k36
7675A1q4O27k45j52j3l85L39j58qp6J16q8K25P0j29nj47J09%K5L93n01r1j24Q1
7700b10Q9J92r0P9j86J40M7j58K02j13k8j64L05p5j85o7L90o09L62K81K2m38J64
7723e0j25J7nJ27j8kJ17p4k0j63O5J05M0j44J75J09P8m10J78J99l6J02k53m3R3
$$ y = [-159, 109, -99, 21, 206, -60, -107, -48, -31, -158, 86, 442, -99, -73, -110, -195, -4, 241, 208, -16, -112, -311, 393, 59, -149, 240, -6, -382, 30, 158, -134, -34, 196, -75, -8, 119, -61, 33, 459, -336, -109, -261, -15, -41, -10, -74, 296, 116, 14, -142, -15, 81, 430, 245, -117, 92, -235, 137, 255, -137, -97, -100, -13, 1, 139, 223, 350, 223, -134, 118, -69, -135, -138, 6, 43, -52, 7, -111, 101, 244, 160, 179, 217, 131, 47, -82, -81, 240, 140, 68, 469, 18, 136, 170, -101, 122, 349, 100, -363, -288, -76, 96, 8, -29, 10, -92, -145, -44, -123, -263, 53, 39, -22, -59, 28, 247, 11, -73, 554, 309, 157, 144, -241, 98, -60, -68, -144, -28, -116, 109, 179, 50, 45, -102, 7, 7, 32, 425, -76, -167, -291, -210, -121, 71, -19, 60, -126, 14, 61, -97, 105, -8, -36, -200, 105, 30, -155, -222, 168, -441, -79, 202, 224, -214, -50, -175, -158, -163, -36, -54, -56, 61, -13, -33, -196, -131, -26, 14, -130, 45, 154, 232, -178, 0, 199, 163, 265, 12, -31, 62]
7748F2n3L9n1m4K3O1l23L08K95m10J07r3M6J92q0qj67L02m9p6J18k82K25k13L20
7773B49P7l57J7J46n47K72P1l05P8L69P3k72k0PK87k89K73n92N39M7q5Q0k86L03
7797A35k07P0J69j50M6P4Q9J1k95k38N57k49p9J12j98R5k04M10m00L53k04q9N12
7820C20j76O1j85n2j6J74k8l31J65J76L13m77J83q7O7P1l11K58J64k64J74j89
7842A0L9N4j50K98l15J68o6j61K54l3K43k00k88J57j14o3p1j4L98l4j04k7M9j24
7866i4L7j07K65k07M14k57n5J4k31j07L67k73K91k09j41M66N0k21j73Q6O3J52
7888A30K1K36o78P8K93j2k36J85q3K65l88K05J15q3J97j45p7P8j84O9m5J47k7
7911F1J38k42o1K34o9j38o3L41k71p8NK23k62J67O6o5Q8p3k35M1K01M21n29P8
$$ y = [62, 9, 48, -3, -47, -24, 37, -286, 22, 317, -93, 14, -79, -33, 159, 79, 71, -96, 206, 157, 81, 199, -83, 142, -71, 249, 326, -31, -14, 132, -415, -143, -72, -377, -299, 70, 143, -129, -149, -142, 145, -144, 129, -463, 76, 123, 38, 118, -168, 135, -72, -2, 167, 17, 63, 137, 226, 237, -58, -296, 261, 12, -67, 45, -153, -58, -262, 148, -252, 101, -103, -192, 320, 144, 205, 20, -32, -48, 126, 98, -233, -68, 108, 421, -56, 127, 40, 107, 178, -133, 125, 289, 25, 199, 10, 49, 103, -47, 251, -64, 104, 38, -123, 131, 98, 341, 141, -147, 10, -104, -167, -238, -252, 146, 112, 8, -19, 30, -94, -57, -164, 101, -106, 308, 51, -4, 10, -221, -328, 39, -234, 57, -152, -293, 173, 223, 2, -171, -85, -22, 130, 151, 387, -291, -213, 80, 68, -168, 17, -66, 199, -189, 16, 131, 48, 245, 100, 23, 101, -83, -14, -59, 88, 61, 199, -43, -104, 130, 61, -77, -140, 201, -70, -148, -143, 80, -182, -15, 51, -14, 74, 1, -234, -193, 8, 429, -100, -22]
7935b2J68l02l7K68K74m85R2j08M65j76k25R2J45l16L7N7L51l04oL4j15r6J16
7958i3MJ55j94j6J90j77J16J30p2K55j65l36k0L37n5j49r4K38K13m12J89m17R9
7981b74L99j46j82L30J06n50K01q1P7L12j29Q6K2l37j20L3K59K11m65M54J6j1
8003B11k1q1j4m1L1J7l81L49k53K6L67k35m9N5P5P4j14J07j19M2r6p4n6L96k48
8028c2m9J24J96J06l58O0q4M69m64n6K47pk23j58K47K20j27j46K17l52Q0j9J19
8051A0K10l48m5J18J2P8j29L0L18l13M77o39K63k68J00J78j44J31k5l93L49J31
8073A01l65L78j61pj2k66L58m6Q8p6j06P2K33P9l96J8L30l77J51K8J90p0J66Q1
8097C91l31k06P2k8J40o7k1M47q1j31M5m78K27j93J65p7J28l51P45o44J88J49
$$ y = [-22, 146, -156, -193, 75, 349, -136, -44, -152, 313, 137, -88, 4, 149, -167, -130, -73, 278, -26, -32, 2, -113, -209, -93, -89, 66, -128, -144, 46, -131, -15, 115, 43, 298, 133, -203, -223, 114, 59, -90, -184, 54, 267, -145, 44, -373, -274, 125, -21, -203, 127, 233, -317, -116, -197, -120, 192, 63, 149, 171, -166, -286, -253, 6, 217, -248, 206, 222, 211, 190, 109, 95, 54, 85, 102, -279, 70, -183, -157, 210, -25, -74, -19, 56, 130, 16, 123, 4, 46, -50, -124, -180, 216, -32, -81, 43, 239, 345, -13, 47, -37, 432, -32, -88, 159, 152, -71, -229, 18, 238, 111, -35, 182, -170, -90, -109, 10, 220, -128, -173, -55, -43, 35, -94, -64, 254, -59, 418, -221, 42, -226, -126, 52, -92, 39, 14, -379, -30, 101, -264, 114, -47, -54, -66, -332, 26, -20, 68, -8, -114, -42, 191, 270, -126, -108, 222, -155, -4, 24, 214, 144, 310, 391, 60, -146, -74, -102, 38, -29, -50, 397, 316, 185, 230, -248, -21, -214, -49, -126, 2, -349, 396, -248, -60, 89]
8119H9P9j08j80oN8K92k12l5m71M98J03j39J24p6p7n1J41l21L20j66j45M32k36
8142h7l20M96j32k03L80Q5m27J37M7o1n8N7K24l41l1N51j02n78K59M65k15l27
8164a81j85M53q9P1k10K29k45M1L59k12J59j59j73J11K92k65%K8r9P9L04o23K91
8187b4N4p8K0K13
$$ y = [89, 168, 60, -120, -126, -68, 224, 12, -23, -494, 4, 107, -32, 92, 16, -61, -112, 29, -292, 28, -138, -283, 149, -87, -407, 89, -43, -246, 134, 219, -208, -71, -24, -85, -143, -86, 138, -203, -234, 317, 215, -363, -104, 361, 146, -181, -366, 87, -2, 69, -141, 88, -157, -116, 243, 31, 190, 31, -142, -31, 261, -4, -4, 24, -75, 4, 308, -315, -24, 30, -48, -28, 185]
8191A85
$$ Imaginary data points
##PAGE= N=2
##DATA TABLE= (X++(I..I)), XYDATA
0@%%%%%%%%%%%%qJ6j6J6j6J8k6L2l3M1m8N5o4P2q2R4j09J23j38J55j72J93k17
35a14K42k69K97l30L67m07M50m97N52o11O76p52Q37r35J049j181J341j538J782
54I59k099K533l160M151n969J0397m0488o1358O3989O5612M040o3033m5440J3432
68e6434N7008K4121k7578m0864o159K2730K6789M852j4410j6801m367O797K0694
81c622J9828q135l0779j1024K3728L3234N664k6362k8415R252L6751J7744j9852
94A8012k4301r24K0038J4967o414j2073K040M418q362l617J4231J4044q318k6608
108b867j5864K1653L8256N64m6381l4928K1715N1527J6790m2269n2576M055N4175
121A3850L2527k7030m8731j5681L1526M0804J182l6782k6733Q329K6440J9206
$$ y = [0, 0, 0, 0, 0, 0, 0, 0, 0, 0, 0, 0, 0, -8, 8, -8, 8, -8, 10, -16, 16, -17, 24, -24, 31, -33, 39, -43, 51, -58, 65, -73, 82, -90, 103, -114, 128, -141, 156, -174, 193, -214, 236, -261, 291, -320, 356, -396, 441, -494, 555, -626, 715, -823, 959, -1140, 1393, -1767, 2384, -3585, 6812, -33676, -95034, -31045, 34567, 38607, -24426, -69866, -56434, 574, 24695, -2883, -43747, -49906, -27176, -387, 4465, -9945, -26746, -31113, -24316, -3622, 16206, 8071, -22708, -33732, -10004, 23230, 28894, 2532, -25883, -16631, 20120, 37864, 18012, -6289, -7213, 12825, 27792, 21378, 9305, 11345, 15763, 7401, 3784, 18015, 32059, 23741, -2867, -18731, 2922, 41178, 41742, -4639, -39567, -17852, 33675, 50465, 8196, -44380, -40325, 13850, 46377, 19347, -29384, -45065, -13539, 27265, 28447, -8335, -35068, -26739, -299, 18907]
133A8907l099k4173k0862M931K6119K3423m123l3185k5830J8456M3531J5278l0283
146I090l9081k565M0581L5411j6282m4026j2922K9861L0157k528k7466j5714J4050
159a434J8287k937j0707O12N764k921q587j194J4655J3492j2846k8290j775K9502
173A1621K2142j3544l4139j3215K6077L3554k725l3469k0639J2183K7564J3018
185B8428j3801k4793o496J3791J6010Q737o506k1827j5840J2766L0363J2684k1229
198A2287l6867p579L7187L8007j2239m7768k3768K8155M7370P457m3769l7900
210c9427J6462M4345J4899k6618l2025o82K7677J9197j1331j9495l363Q402O312
223D353K090k33j366m126p640m99J4882J2283j0506k0127l357J6314J8132k116
$$ y = [18907, 15808, -8365, -29227, -24296, 1823, 25246, 21123, -12062, -37892, -19436, 24095, 39373, 9090, -29991, -32556, 8025, 43436, 27154, -16872, -29794, 67, 30224, 27696, 230, -15484, -1434, 16853, 13916, 3209, 3821, 9585, 6664, -1923, -3117, 11538, 25030, 12184, -16106, -17881, 11621, 33763, 20219, -13920, -27135, -1058, 32496, 29771, -3698, -24337, -12154, 15410, 28428, 14627, -10166, -16662, -2871, 13139, 21876, 15370, -6457, -22297, -9531, 20832, 33516, 12287, -24580, -32159, 5028, 43035, 30796, -16972, -40740, -12585, 34785, 42242, -1527, -39427, -22965, 21380, 36279, 9661, -22364, -23046, 4631, 23828, 12497, -6998, -10361, -1959, 4353, 6443, 6210, 4844, 718, -6922, -7421, 7461, 19744, 9238, -10889, -14246, 2068, 20200, 18084]
237A8084k0429j3377J1157J7829K329r425q631j723M037N151L071K868l620j4308
251f987q212J6026K2589k208k6513k2310J2869L6833J3870l1624l7932N490M0730
264A2621K5446k0293m2209j1443L4676L2664q315l3124j7470J3896K6545Q642
276B1636j6692j7690p83J0613J0271N306n408j3711p574P842J6049Q979j1998
289F840k1843l082K1913J8214q220k2293r895J4411K0601n29j9761r065J0534
302b175J0429j528q025k148O308J850r061m465J2055J1125q960j9090l476J8544
316A383J9673p165k8936j2005K2350K6430k234k6067j9603J0979K7852R209j8388
329C478k0557o02J5581J4624O73j3920j2757P2J2008J3435L281j4839j9410J628
$$ y = [18084, -2345, -15722, -4565, 13264, 15593, 6168, -2463, -4186, -149, 5002, 8073, 10941, 7321, -6987, -15199, 827, 23416, 21208, -5305, -27615, -14746, 22087, 35957, 4333, -33599, -28109, 12621, 38067, 17774, -24435, -35878, -1202, 31462, 23147, -9977, -27447, -13551, 12994, 21636, 4944, -12746, -13529, -2916, 7355, 12661, 7253, -6458, -14032, -6190, 9859, 18838, 6840, -15003, -18085, 3828, 22042, 13822, -8471, -18366, -3955, 16646, 16117, -3644, -12709, -2175, 8254, 6726, -1299, -3447, 2861, 4711, -4350, -8815, 3240, 14365, 5405, -13685, -17161, 1383, 21056, 13891, -15045, -27050, -4700, 21730, 19496, -6571, -26174, -15195, 12657, 21866, 3478, -17079, -17681, -2100, 12524, 13197, -723, -13480, -13408, -1400, 12035, 15316, 477, -18933, -17305]
343a7305K3287J7155r571k6639j2982K0054K9719K96k9207k0444J2452K7720J0052
356B4587j9926k2972L403K1699R572j0505j2402j211P767N420l277l018L253N13
370B903o710l025P118Q849j017j1898r191P085J5973K837j3715j1645L069J2034
384B667Q448n347j1611l716N822O499L436q92p842p781K208J0979R491l452j7033
399h124j1298J2651K2994L337k1453k0371N431K7066J5866j6969k8775k484K4610
412B481K0657p129k4799j1965J4252K1436J748j5467j1499J910J0654P945k551
425G673q382l998O44L852P273J989o936r299N60Q945Q195k305j1801o409P584
440b415J0796j32q233n361J453N668K148k744j365J570k148m506J982Q005L482
$$ y = [-17305, 5982, 23137, 13566, -13073, -26055, -6001, 23718, 24014, -5193, -25637, -13185, 14535, 24587, 4661, -18311, -14908, 6791, 16363, 5858, -6544, -7755, 12, 5432, 2155, -863, 2390, 2903, -3807, -6832, 286, 9135, 8118, -3780, -12971, -5886, 10087, 12924, -791, -12436, -9367, 2667, 11115, 5768, -5843, -9559, -3737, 2762, 6198, 5306, -2536, -10317, -8109, 2870, 12361, 8909, -8124, -19422, -6771, 16223, 19560, -1893, -22264, -16833, 10233, 26099, 9130, -19645, -22129, 2481, 23138, 16009, -8790, -20755, -6503, 14933, 16681, 1214, -10285, -8375, 2279, 10224, 7673, -709, -4707, -4063, -211, 7062, 9051, 2115, -7184, -6624, 2321, 10516, 8211, -3590, -9999, -2415, 8381, 8249, 16, -5345, -3892, 1776, 3924, 1180, -185, 1385, -763, -5269, -3287, 4718, 8200]
455H200p151j1479j688J4665J3280p918j9450o260J4335J8279L14k0209j4960
468b0042R765K0982O318j3623j6226k001J5161J3499l696j3882p432M111J1402
481D336P727m303j2402o373O396J2271O216q294j5086l007J3822J3423l106j4694
495c074r795O596J6289M487j2760j1577K526J1120N685m912q699j323O214K484
509C261k542j583J417k31k608k517K187O396J107q122p120M463R416L854p025
524C53j0358j481J0705R283l937j0901n350M452J0179N241o125j0338k729P064
538c942R420L775q034j2033j344J2318J1566j571j3955j1231O487J8013O807j3127
552C149j5715k85J5022J2883m631j7086p285J0804J3011J102j0905j0080K553
$$ y = [8200, 1049, -10430, -12118, 2547, 15827, 7909, -11541, -17801, -3466, 14813, 15127, -5082, -20042, -10277, 10705, 17023, 3400, -12826, -14827, 334, 13833, 10137, -3745, -11177, -7066, 4336, 12063, 7760, -4642, -11015, -4619, 7652, 13868, 5574, -9512, -12519, 1303, 14726, 11620, -3074, -12869, -6273, 10016, 14503, 1743, -9834, -7308, 3812, 9497, 4585, -4114, -5437, 777, 3261, 719, -864, 553, 322, -2286, -4803, -2616, 3780, 4887, -3235, -10355, -5892, 3524, 7378, 353, -10005, -11486, -781, 8502, 4565, -6336, -11686, -7234, 2945, 8186, 2061, -8277, -11006, -3942, 5478, 9253, 1219, -10814, -12158, 160, 11726, 10155, -3800, -15031, -8544, 9469, 16276, 3149, -12566, -12851, 2171, 15054, 10423, -6663, -13948, -3144, 9867, 10969, 64, -10016, -7463]
565g463J0360M285n016o174j551K179L740J755k124l194j268l10K413M004p47
580H89m453k619R37L556L117j319m465j913K058K541J872O41k736m075L43M494
596a132M740Q45o610p234K901J0296N693o440j1244k701R769J2378j982j4001
610d722q401P435J3582M423r908j4010L29J3124Q762m467j1738o402N604J1262
624D873L172p779r285j130O659Q235p9p999o891J997P392M786k008p946m065M648
640e420P624J374n324m771M0N414M025j943m086J14J695R76Q05O09r9L06j751
657d12j958K762N057j53n536m058K005P247M355n713q604j146P941P411j908q925
673a635p558M781J0195L525p619q770j851O948Q742k33r789p453K738R104N647
$$ y = [-7463, 2897, 7182, 2166, -4008, -5559, -3380, 360, 2115, -9, -3203, -4471, -4781, -2368, 1636, 889, -3564, -6183, -5246, -1690, 1427, 108, -4357, -6270, -4212, -1671, 201, 842, -1894, -5969, -5626, -1132, 3608, 4453, -2157, -9391, -6490, 3806, 9499, 3059, -8185, -10886, -1117, 11261, 9279, -4722, -13123, -5688, 7894, 12317, 2409, -11601, -11272, 1852, 10614, 6147, -5591, -11993, -6389, 4873, 8045, 266, -9019, -10149, -3490, 4745, 4666, -3333, -10224, -8227, -835, 3951, 1943, -6003, -10068, -5420, 2204, 3578, -1746, -6517, -6477, -1063, 2962, 1019, -3067, -2953, -1258, -282, 523, 1132, 1033, 1339, -412, -2370, 392, 5449, 5296, -240, -4298, -2293, 4954, 9309, 3596, -5008, -6154, 1787, 9198, 7290, -1635, -9193, -4412, 5783, 9308, 1689, -7081, -8932, -1984, 6758, 6525, -3264, -10717, -7979, 1125, 6772]
688F772l901j1018m164P895R175R52p890q939J430J0519O594n254r626k417O960
703b912Q529J56p361n932L264P013K735k915m539j008L517L140m37j373k39q68
719G70l06J976R49Q80r59k223j859K086L830J29k555l230j519L662M780j014n385
736A2l475J365M853M037k165p636l485N095P052J441o084p920j72R227O453l655
752D943r288m726N765R736K122q825q578K125Q807N480k618r608m148O389P927
767E503O64n642o056L53O554M785k925n342j922K306L906K255k789m082K81L329
783A178J680j31j333k111K20K213O28n6l21m93q69N08Q57R24R97j579l112j3L828
802C015L203j544m285l202K332O780J730n295o091j53O210N994j776q474m669
$$ y = [6772, 2871, -8147, -12311, -4416, 4759, 5711, -2179, -11118, -9688, 831, 7425, 2171, -7455, -9872, -2912, 5617, 5773, -1588, -7520, -4256, 2757, 5492, 2577, -1962, -2970, 547, 3687, 3250, 1877, 1638, 770, 464, 2440, 3389, 4269, 3310, 1087, -772, 1314, 5144, 5273, 2718, -512, -2031, 1631, 6411, 5397, 12, -3463, -2098, 2755, 6792, 4627, -3009, -6494, -1399, 5653, 7094, 1010, -6910, -7082, 2145, 8598, 4943, -4345, -9071, -3306, 6430, 8552, -273, -8851, -6726, 2081, 7561, 4943, -4665, -8813, -2424, 5503, 6167, 525, -5531, -5178, 1376, 6161, 3236, -2106, -4028, -1722, 2184, 4439, 1650, -2432, -2151, 1178, 2858, 2727, 1394, -717, -497, 1716, 2344, 2288, 1967, 1474, 605, 1113, 1970, 2894, 3891, 2312, -800, -813, 3015, 6218, 4674, 389, -2813, -481, 6299, 8029, 2734, -3357, -3510, 2700, 8694, 6918, -1556, -6225]
817f225M787P700J724n843p835n37P767O105l025p244m600L046P522L195n874
832F63p159k65O110N812r78p062m684L721O587K068m040n242j002M878M894j380
848B921m516j848J917K926J580j486k172r4J747Q03R4J03k02m11k66j01O93J966
866C654R7k959j698J499K611J901k199m325j218M335L320r56m513l640J461N820
882C190K665m263n713j102M440N885l63o914n287K972O983K821l730p130j844
897g390N807O422j039o185m448J901O804L854m379o312r36N292M430j39m626l614
913d558K042M497J862k637k878p16K457K727k68k490q81L63R59J065Qq65J1o23
931G5l28K59J567L11j182j888n46J502K616L38l199k705P42L307L155j524n307
$$ y = [-6225, -1438, 6262, 7986, 2143, -5692, -6229, 1538, 7643, 4618, -2626, -7226, -4180, 3342, 6537, 663, -6496, -6761, -651, 5161, 4183, -2879, -7563, -3842, 2745, 4813, 773, -4469, -5471, -593, 4301, 2921, -1595, -3443, -1526, 1400, 2980, 1494, -678, -772, 975, 1778, 1872, 1975, 1773, 1362, 1096, 995, 1688, 3654, 3751, 792, -906, 593, 3204, 5105, 2906, -1419, -2637, 1698, 5018, 4062, -451, -4091, -2630, 3190, 5855, 1592, -4121, -5223, -783, 5102, 4739, -2175, -7462, -4490, 2493, 5314, 1584, -5546, -7390, -1583, 4839, 3800, -2385, -6833, -4932, 1872, 5726, 1347, -4965, -5901, -609, 3821, 3682, -944, -4558, -2516, 1981, 3843, 1206, -1672, -2388, 69, 2796, 2528, 38, -843, -480, 479, 1544, 1552, 687, 698, 75, -253, 6, 1573, 1884, 702, -1186, -1732, -230, 2386, 2724, -475, -3180, -2438, 869, 4024, 2500, -2807]
948b807k255L572M967N10m413m569M91N506M214l222n942j842L710N628J333n706
964h25n223J704N994L387k467n988k389M195N647K22n001l930J084M959L051j994
980B426n400j194L754L361M98k969l229P03L467J198j641j450r92R52J867L3j122
997B62l59K10k28j38N59N80j60o77j606L3K373J294q75k717q67R62L463P10k917
1016i8l195R8L865K717p26n016k545L189M825J015m242m133R9M590M544k246n795
1033c054k280L211N386J559m047m932K6M940L376j681m416k202K410M682Q25l666
1049A37k822K31L213K695j124l956o18J884K308J69j373j956kJ940M94p50k64
1066B06m21J05Q9K44k7L08P1r15q05P84Q99J097r29k211r03K163K780o62k959
$$ y = [-2807, -5062, -1490, 3477, 3987, -426, -4995, -4504, 1002, 5216, 1994, -3948, -5790, -2080, 3548, 4881, -825, -6048, -4344, 1650, 5037, 2570, -3418, -5807, -1612, 4035, 4257, -744, -4674, -3590, 1369, 4420, 2426, -2974, -4168, -414, 2947, 3445, 476, -2753, -2050, 1417, 2615, 974, -476, -1468, -516, 1351, 1384, 262, -97, 113, -115, -253, 306, 886, 726, 49, -1557, -1524, 849, 2143, 1268, -1449, -2316, -1354, 2109, 2819, -98, -3293, -3195, 670, 3387, 2661, -2355, -4900, -1711, 3114, 4129, -113, -4246, -4147, 443, 4987, 2741, -3054, -5334, -2123, 3263, 4822, 775, -4157, -4131, 809, 4185, 2504, -1912, -4114, -1704, 2978, 3803, 137, -2685, -2454, 759, 3454, 2330, -1626, -2244, -360, 1948, 2117, 744, -1212, -1214, 726, 1220, 470, 206, -215, -110, -21, 223, 196, 504, 575, -340, -1145, -361, 538, 1635, 706, -1505, -2408, -245, 2535, 1873, -1086]
1085a086j747Q33L393K021k722l833k54L624K942l22m298l103J942N067J536l207
1101G86l966r58L683M590r27m798k672J811M703J837k803m621j33M157K681r84
1117B386l107k591J270M292O18j965k894J03J977J902l24k086j250R04J330M59
1133A024q16p95j42N51J34m70M59N18k90j042J33O6R62Q13j560j697O69K023J346
1152A886j310k624j507K733K916J52k953k563L58L567K898k262l856r29K760L410
1168B676N0l474l314J517M060K132k618l827p64L012L786o7m117k223J308K824
1184I61K118j800l698p64K823K900o00k485k009P59K751J098j873j897O9J028
1200f19J103M7j272m02O87N96l19j53LJ25nm28r00J093J191m95j392p51J016J410
$$ y = [-1086, -2833, -2000, 1393, 3414, 692, -3141, -3395, 229, 3171, 2849, -1449, -4552, -2610, 2457, 3993, 786, -3180, -4138, -455, 4135, 3208, -1590, -4262, -2451, 2252, 4089, 1286, -3335, -3468, 689, 3370, 2386, -721, -3312, -2042, 2250, 2868, 903, -1991, -1888, 89, 1991, 1667, -419, -1669, -765, 565, 1024, 208, -587, -729, -178, -44, -514, -55, 463, 173, -869, -736, -670, 292, 1105, -455, -2152, -1483, 540, 1886, 576, -2048, -3555, -822, 2094, 2246, -707, -3270, -2912, 655, 3553, 1291, -2565, -3494, -734, 2676, 2726, -748, -4062, -2545, 1515, 3647, 1029, -2798, -3562, -550, 3236, 3169, -948, -3171, -1863, 961, 3079, 1279, -2419, -3183, -360, 2540, 1940, -545, -2554, -1795, 956, 2054, 181, -1716, -1647, -619, 484, 531, -741, -1143, -456, 140, -179, -332, -329, -204, -209, -637, -1537, -444, 747, 252, -1140, -1891, -875, 535]
1220E35Q86j594k149N3K894J319q10k707j526J963L182N95l144k345Q9L116K916
1237C273j494l714j504K496K964O66k635l087k3M224J892j644l143j237J667L101
1253A802R50k827k369N43K214K070j073k950p63K155J813m94j270r58j29J809
1269E23O73j427m57K64K5M62K53l57p9L47m54q6L96J95N38p04r76k96R99J195
1289A034J18j747r01Q26J375J250j355k717k52K108K285n69k166k263J297L080
1305A403J118k227k543l14K294K782o13l195j784K224K429P84k179k663L14L063
1321H93J439r78k198j122O94K657O58j702j828N63J254J240J25j757j196J164
1337i4J407o20l40p93J20J137N7p64n01R19k99L3k64j3J63P67m08j072j03J264
$$ y = [535, 1421, -173, -2322, -2269, 625, 1944, 1134, -1573, -3099, -1136, 2046, 2641, -503, -2848, -2759, 357, 3273, 1779, -1935, -3439, -943, 2021, 2687, 52, -3035, -3058, 1166, 3058, 1414, -1729, -2966, -1299, 1802, 2752, -75, -2444, -1901, 313, 2383, 1310, -1640, -2403, -248, 1565, 1071, -199, -1157, -1286, 523, 1196, -231, -688, -424, -399, 63, 316, -41, -120, 227, -227, -313, 83, 278, 816, 112, -864, -1160, -161, 1034, 1152, -595, -1496, -670, 705, 1955, 600, -2117, -2369, -261, 2024, 1455, -711, -2974, -1677, 1403, 2521, 294, -2249, -2563, -269, 2513, 1900, -1295, -3079, -855, 1574, 2358, 179, -2484, -2170, 893, 2332, 1354, -844, -1966, -1272, 1385, 2043, 341, -1487, -924, 330, 1570, 1695, -62, -1258, -94, 1313, 693, 353, -440, -320, 817, 874, 110, -391, 528, 229, 262, -2, -15, 148, 915, 507, -565, -668, 596]
1357E96Q32p65j162r65J520J532O5k047r85O63J722J022j063k583o66K714J592
1374B022j03k158j739L97K993J324j885k305l24J728K282L1k712j346P00K512
1390A417P42j093k365o52K552J355n69j823q95N08K003N44j124j693M05J297L90
1407I99l45j066l66J080N90m77l20J85k5k09M35n66L22Q59k61q51m17N12O55O18
1427A352q80j268j37J804Q78q31j196o17M13K276K83j779j604L30J617J456p41
1444A356k280j187J824K187j73k131j652M12K392J378j478k261p89J944K151L13
1460B006k435j754J159J688Q62j139j315o23J343J426k65j219o41L07Q76J191
1476A467j164j207N08Q28L90m16n22K14M1Q89p80j19L0M04j51l78j75L26N72K14
$$ y = [596, 1428, 663, -499, -1464, 56, 1588, 1653, -394, -1379, -716, 1006, 2028, 965, -1618, -2284, 430, 2022, 1919, -239, -1978, -1581, 1412, 2736, 851, -1454, -1778, -50, 2232, 2263, -449, -1795, -1095, 1417, 2159, 1066, -1299, -1951, 601, 1956, 1387, -436, -1331, -823, 1180, 1724, 600, -1093, -688, 609, 999, 654, -412, -778, 302, 892, 415, 95, 280, 255, 46, 481, -85, 237, 1096, 835, -16, -433, 79, 734, 1352, 472, -796, -933, 871, 1749, 918, -278, -895, -482, 1794, 2077, 298, -1306, -976, 641, 2097, 1356, -924, -2111, -287, 1900, 1727, -404, -2056, -1644, 748, 2126, 648, -1613, -2402, -458, 1693, 2006, -429, -2183, -1024, 664, 1526, 387, -928, -1551, -208, 1218, 953, -266, -907, -600, 276, 1467, 303, -904, -396, 432, 822, 406, -116, 98, 139, 1028, 248, 129, 159, 563, 412, 34, -141, 185, 757, 971]
1496I71r01n79L92Q93O02j102j429%J689J059o51j606j101J122J802M89j512j947
1514a809N62J166J553m04k214j173J498J912M17j403j914k2K043J624j290j748
1530a202k32Q12J435O79j523j407O45J151Q03m87j498k13P57J234j19j268j40
1547e73L75M29L81m59l96L32J85k13j42K52m1K72L4r19J66M13P08k14j183q2L68
1568c07J098Nj000j098Q29P28R47q39j436n28J462J491m87j421j126M64J903Q41
1586A526j348j515k73J673J347k80j771j219J070J635L57r51j603J19J447J243
1602A457m83j601p59Q91J010O00q23j288J06J090M76l99m89m35N00R32k84n74
1620g3n7J44j31L78k02k22n7O80m63j83M4L88L00k06q62l51Q43Q63l49p77n64
$$ y = [971, 70, -509, -117, 776, 1378, 276, -1153, -1153, 536, 1595, 944, -662, -1763, -641, 1161, 1650, 138, -1809, -1247, -81, 1472, 1068, -1146, -2319, -821, 1091, 1508, 105, -1809, -1831, 212, 1836, 546, -1202, -1434, -622, 813, 1492, -31, -1438, -793, 358, 1161, 674, -824, -1037, -280, 954, 835, -433, -573, -198, 231, 612, 153, -243, 89, 274, 61, -81, 171, 130, 402, 436, -483, -317, 96, 804, 590, -593, -675, -307, 791, 796, -204, -1302, -473, 255, 1202, 363, -1073, -1601, -139, 1352, 865, -556, -1682, -1218, 685, 1526, 178, -1337, -1610, 63, 1410, 1130, -641, -1860, -790, 845, 1202, 251, -1352, -1233, 214, 1457, 974, -627, -1386, -495, 515, 1115, 292, -996, -890, 200, 676, 277, -212, -647, -147, 785, 501, -73, -130, 14, -117, 261, 59, -163, -220, 460, -3, -186, -142, 246, 546, 340, -522, -873, -30, 833, 484, -293, -857]
1641h57K74R37L66p57j242N11J096Q54o08j486j047J478J451M2j351p94K51J305
1659D23R78j040j199l04R92R30M28j547j146P72J614M62j106j338M5Q06J578m80
1677H68j136l91M50O95M48n56p04n14J457m8j99n86k39M06L80l3m78o2M58J62
1697C78m64j40l14J180k58o34n33K79P24L31l26q18l61Q51J056n95r06j93L30
1716d13J116N92j352j502N90J346P52k82j792m06J218J087L9r67q03n64J379J368
1734A406o38j710l63R36J056P0o73r81K0J320R78j179o57n37P78R68j0j191M7
1753c60K10L66J74j78n25k0O12J8k27m36K05k78Q08k51j92P5L03k48l29L8J34
1774a01O26o1l44p69K62O73O78p59l65o18Q11P90o7j224n05M50J180M64j020j084
$$ y = [-857, -583, 354, 720, -37, -1279, -768, 328, 1182, 574, -912, -1959, -481, 970, 1012, -339, -1133, -882, 423, 1401, 361, -838, -1142, -150, 780, 1208, -339, -1485, -713, 901, 1363, 257, -1081, -1036, -230, 1348, 868, -268, -659, -209, 486, 934, 378, -326, -840, 617, 569, 370, -216, -455, -49, 331, 298, -180, -242, 216, 378, -86, -226, -540, 640, 382, -252, -785, -506, 218, 549, 223, -595, -956, -105, 951, 356, -550, -743, -413, 703, 1295, -57, -1559, -969, 377, 1129, 847, -945, -1351, -133, 954, 993, 26, -777, -1341, 38, 1406, 768, -942, -1305, -369, 687, 757, 84, -897, -877, 443, 1421, 242, -415, -952, -174, 794, 784, -407, -360, -150, 216, 390, 212, -313, -333, 279, 297, 70, -366, -161, -439, 369, 118, -74, 1, 304, 56, -273, -235, -101, 525, 464, 120, -649, -387, 286, 964, 205, -160, -778, 33, 823, 756, -468, -973, -523, 657, 1121, 101, -983]
1794i83k58J429O65j21j320m21N80J426L18j283j100J91R07Q68l06j114n77P05
1812c94R89R1o61r99J54J294N11p02r68L9L10N95J75q04J07K30L98m58k16j22
1832d31L59M75k99j52j01J58L83m62J8n11K73J002j11o71n39O13P80j73k80j102
1852g71K41J109k25J64j047l43Q52J160k53j116l87j57J177O65p87j215p2R87
1870a8J012m09r28q75O03R63Q26q92j033n0P96Q20l15q00n11N02P93Q8p32k43
1890d03l16J112K63m41p03J01K41M17O8o58J93J82M56n91j10K49j9M21m47j29
1910a14M9M43M2K5p06l53O27Q15J2j230k60M40Q95N3o20j237L41J239K25J57j125
1931b82p55P26J126k63o32p98JJ302M88p45j094L01P34P50l58q56n09J29R80K57
$$ y = [-983, -1241, 188, 853, 732, -588, -1009, -429, 997, 1315, 32, -1068, -877, 30, 898, 592, -522, -1099, -394, 595, 686, 25, -974, -820, 474, 985, 283, -685, -646, -336, 259, 434, -370, -263, -33, 365, -93, -309, -431, -72, 403, 104, -48, -149, 9, 392, -70, -52, -563, -290, 712, 601, -70, -609, 4, 784, 611, 331, -771, -530, 579, 354, 518, -529, -872, -20, 1140, 887, -229, -616, -773, 404, 1069, 282, -933, -1005, -18, 994, 585, -343, -1218, -615, 348, 1174, 282, -751, -801, -5, 815, 500, -300, -811, -309, 484, 572, -160, -403, -719, 393, 656, 215, -488, -387, -146, 271, 339, -319, -126, 56, 512, -79, -189, 60, 41, 462, 15, -114, -65, 378, 420, 445, -261, -614, 13, 828, 840, -390, -650, -210, 685, 738, 118, -1119, -778, 461, 686, 843, -282, -1037, -311, 815, 552, -80, -878, -877, 425, 913, 168, -926, -625, 109, 859, 501, -355, -864, -735, 245, 502]
1951E02l06q64L3R03N80j75r54l60L62M19M15m70j03q3N32j3o19j54K23L93j32
1972A29j63P6j11K40J04k82j15K29P1p1K3o45L86K45M99k72o98m30O79R13K9j202
1994c66k36L54L67N81o41p41j12R06O85p2j158n91J085O09L87j346o69K02Q22
2013F6L06k7p08m07R05O24m25l74n58K99L00M83m13j12j59M31jL68m96k82J55
2034b5N59m06k53k74J85N09l16q7J14k14M00L0l06jq7N00J46j059J65N40l4K51
2056C37n62l38K93L69N53n31m29j39N39O62j69m38p67L42O24K95l92p40k56J211
2076D64N17l39q18j94M8O90N12n25p17k38O82R31l60j382N1M69Q67k87j43m73
2096b45l51Q72J14j21o40J14L76J68r6l42j97J79J86L3p75R00P7k22J12k95J0
$$ y = [502, 196, -668, -635, 268, 848, 673, -281, -641, -279, 140, 555, 85, -18, -101, 431, 418, -201, -355, -132, 261, 129, -34, 42, -69, 171, 275, -7, -122, 107, 178, 107, 130, -515, -129, 116, 615, 343, -355, -785, -106, 807, 836, -366, -602, -248, 119, 700, 59, -682, -794, 112, 797, 725, -433, -1024, 61, 670, 1057, -289, -958, -756, 66, 372, 345, -363, -770, 135, 759, 334, -40, -598, -299, 1, 484, 71, -41, -200, 231, 230, 598, 102, -180, -25, 534, 128, -125, -399, -214, 295, -21, -108, 6, -208, 192, 222, -84, -85, -172, 328, 474, -585, -420, 120, 86, 337, -225, -563, -270, 99, 652, 121, -308, -447, 92, 754, 585, 147, -620, -278, 346, 641, 249, -491, -747, 464, 981, 642, -176, -370, -322, 368, 880, 355, -362, -600, 82, 1013, 653, -729, -678, -209, 658, 371, 228, -245, -596, 276, 390, 269, -371, -257, 119, 287, 191, -151, -348, -169, 17, 50, -725, 175, 252, 30, 142, -153, -143]
2117a43N10Q7j67p19J19J22O47Rq08L15q8N35j04m79k96L4M70N16r0o82l06M41
2139g7N11K15o67o30K48P84M43l66p52o54Q21J217o73p24k94M06P62j44l44m56
2159c74m2P08l05j09m62K2M95K75n1J22m01Q6p7K67J56j76k15M10j02j27k61M
2181a57L18M6q1n11L44K20j8K27m42j99L61O48m60n95Q7K22M26L9m23r67M63Q02
2203C50J68l46q91M9P95M55n62p52l7Q19M23o8m53o85M95M41K28l74m82j27P04
2224A50L34j51k55k25k81K91N90l49m40k4P59l27K78m43l65M33L64R1l83l79M77
2245A45j45K82j03l70l65P12L4j18k43J02J69J22k09n47N79J8L39n72j97j3P90
2266D10k10o2m81J67J32n6L02o04L13l39P03M9p7m41l09M67O31m02l75k25j46
$$ y = [-143, 367, 454, 287, -432, -313, -191, 456, 465, -343, -28, -116, 419, 315, -164, -460, -426, 44, 560, 470, -212, -518, -77, 434, 649, -18, -648, -400, 384, 827, 461, -291, -945, -124, 1093, 420, -304, -598, -192, 570, 426, 82, -374, -416, 292, -13, -122, -584, -562, -67, 208, 157, 279, -122, -36, -113, 154, 310, 134, -81, 329, 227, 100, -161, -157, 161, 207, 126, -385, -41, 179, 161, 388, -54, -253, 108, 756, 296, -299, -212, 10, 436, 475, 52, -915, -452, 350, 518, 172, -719, -670, 125, 580, 18, -734, -771, 48, 471, 403, -50, -735, -240, 201, 429, 55, -427, -554, 150, 484, 333, 78, -147, -428, -137, 453, 104, -336, -360, 399, 72, 350, -93, -458, -25, 339, 430, 47, -332, 145, 0, 282, 179, -191, -556, 156, 190, 72, -171, -69, 100, 222, 13, -534, 45, 63, 402, -170, -367, -380, 410, 200, 138, -343, -176, -44, -100, 202, -402, -89, -428, 275, 324, 247, -194, -503, -36, 595, 193, -182, -407, -553]
2287e53P68L77n69o00k45P40N21m81p8n27M33O65P4p11l34K48M48N85o85m22K58
2308h8J62K57q2j84j36M0N53p05R1K15L06n01J58M5k68J80J51l4j60p0j27L23
2330A26j27k82p8J78L74K2j35m32pL49K08L28r65o1N19K30J88p01m98K92Q20K67
2352F15m45o42nM43N07j88p36O5N71J19M6m01l48K14N40k8J14m40m97L80L98j72
2374A10k98L56o40K86O55n41j38Mj61M38k7J10m35O6L00L57j004K84m3M50r8l12
2396b81o1N9P04o9n90r3M67J73j26n13j34M15P23j53l89m70K15L48J91n98J81
2417aj96L26J70m06m6k0J66m4N59k81m96k06L05O16K09n11o56J62N08L95j82q70
2439d99j35O53M89l41n13j2L82K66K51q52k98L42P39k18n60n5K01L04Q4j66k71
$$ y = [-553, 215, 592, 23, -577, -822, -82, 439, -42, -120, -647, -214, 451, 525, -186, -520, -272, 176, 761, 76, -346, -88, 74, 331, 249, 65, -71, -31, 522, -183, -92, 123, 429, -72, 86, 131, -137, 43, 194, 160, 0, -70, -197, 126, -1, -283, -361, -183, 191, 213, 78, -354, -361, -12, 196, 524, -441, -502, 17, 247, 435, -266, -764, -472, 348, 615, 170, -472, -477, -34, 473, 285, -451, -386, 185, 304, 350, -51, -399, -185, 355, 327, 441, 1, -496, -116, 282, 110, -188, 168, -472, -186, 469, -72, -210, -206, -367, 71, 44, 154, -281, -215, 85, 442, -562, -278, -321, 129, 31, -281, -342, -283, 421, 352, -238, -331, 136, 309, 183, -330, -464, -49, 674, 521, 132, -338, -123, 225, 416, -182, -1, -197, 129, 299, -107, -153, -173, -7, -51, 508, 227, -269, -475, -170, 446, 655, 144, -512, -350, 158, 553, 371, -499, -634, 19, 508, 167, -346, -358, 24, 290, 541, -311, -609, -267, 472, 254, -306, -361, -160, 144, 228, 62, -209]
2460b09R0L76M06j083j22N15r2o6o8J11j42M20J3l68J30j3N23k36J1j23m65J58
2482b34L46K95l93k46L0k07R67q1o79k75L18Q1P83l61r84L24O48K51n44l99k9
2503c89M33M67k05q08n6N04O56l10m83m3K43n1j09q5J11J1m4k6L34n0k80P0K9
2526h1Q6K78m55K7P0K85j70k37J66k3J08K97n97r4M99m5J74k88m19QP56J79j025
2549e01P6N66J5K00n40j2n3N69J04m10m36K77L28K16l16m30p7P41k56J71l18R5
2571Ir0k84O57n4q7m19j5K85K73J3k88l62K43M38j26n67J58K22M44J4n28J4j75
2594b25O00l6p63J02L23N22k92k09l69N54O2n39r3o8P21j84r8R9J6Q3J99k7k39
2617A39o6k34M22j54k89J1L20M0j25k9k63k56L06J76n2K29m53J85k42L53M53m14
$$ y = [-209, -119, 257, 663, -420, -542, -27, -119, -185, -253, -142, -284, 136, 149, -219, -89, -102, 421, 185, 196, 73, -392, -234, 112, 407, 14, -232, -202, -409, 558, 477, -202, -477, -159, -78, 705, 344, -640, -316, 332, 583, 39, -360, -389, 44, 511, 306, -502, -558, -54, 602, 292, -191, -234, 9, -42, -151, -236, -125, -114, -158, -184, 150, 100, -180, -110, -81, 5, 283, -172, -145, -75, 210, 40, -197, -31, -54, 54, 351, -246, -340, 159, 114, 288, 0, -419, -411, 345, 524, -501, -425, 141, 156, 356, -184, -196, -249, 320, 424, 14, -422, -145, 183, 399, 83, -347, -424, 317, 61, 232, -86, 9, -81, -365, 292, 238, 151, -268, -283, 2, 275, 288, 0, -362, -119, 319, 193, -374, -216, 6, 450, 464, -64, -50, -225, 375, 339, -424, -322, 1, 523, 231, 22, -347, 207, 269, -270, -363, -431, 290, 106, 8, 107, 123, 206, 405, 378, 139, 73, -161, 261, 107, -182, -171, 149, 189, 64, 35, -228, -484, -178, -2, -54, 175, -278, -93, -335, 18, 471, 57]
2639E7n36p9P52M23m45o38m3M44L65k97k62Q9K12L92j94l90l54O22L02m47j80
2660b07O8j03N82o75J90p7J89J79j58mj82L65k86K19k26J21K50k79m16M95Q7k
2682A30L9k01J68M36r36J20L92M35k50n57p1J48O79l28k37m23M79M69j76o76j39
2703d99O46J64j46p5l81J55J28L64m95j35K48K0j10j00J47q6j81L81j04M6P5l24
2725b62o4K51J08Q1l39NM54k0j83m7j73r1N40m4n44J93J54L22l41l1N0J89K25
2748D33n58K4k54M66K24k87o01K14J78P45o93j63M29j77K8J71l70j11L30M77k54
2769B51m48j71L27l9P6N3p7j88q5J84J48Q4j34k83k1L96M13p77OL8J96M18k87
2792H0p43M42N18M55p23j49l3L82P9j58j62j56M65j5j66j53J51O6J68k00k21k46
$$ y = [57, -479, -558, 194, 617, 172, -466, -509, -65, 300, 3, -259, -170, 42, 434, 240, -150, -504, 118, 420, -27, -207, -139, -242, 340, -335, -145, -222, -33, 146, -12, -16, -198, 167, -119, 100, -126, -5, 245, -34, -450, 45, 132, 130, 169, -32, 136, 572, -364, -244, 148, 583, 333, -224, -295, -147, 532, 204, -33, -456, 23, 492, 316, -360, -499, 147, 311, 165, 90, -291, -136, -8, 356, -139, -274, -26, -6, -116, -216, -69, -155, -336, 45, -59, -13, 62, -262, -326, -75, 33, 114, -225, -220, 234, 214, 31, -16, -189, -280, 260, 216, -328, -135, 19, 341, 0, -31, 19, 208, 433, -125, -101, -355, 111, 335, 48, -553, -339, -161, 584, -109, -272, 157, -20, 8, 179, -191, -302, 28, 505, 251, -197, -368, -41, -80, -4, 49, -28, -216, -301, -117, 31, 115, -19, -302, -323, 73, 486, -291, -285, -247, -51, 367, 80, -663, -221, 297, 752, 29, -120, -153, 229, 308, 150, -12, -168, 297, 282, 116, -37, 114, 180, 348, 148, -73, -319]
2814c19P00l88k81lK62K6L4J22l05R2J95m8O0p1j08o4k68M51J73l78l69j21Q29
2837B21n3q8k07p7K76L87k26o00j83O06J89K69o99k13J92P48n7p58K6RK77L6J51
2860B26n85L21L22k67K66n12J35K12p3m4P2q1n0K61j68j69J08J31j36k18K20M05
2882C76n98J24pM20j46l61L32J17j47L9m29k30N78O6j30k37j6K26nK50m73j84
2904d35L06O20m04l96J23P1M91Nm68j65J12J76J1J0Q6k53P9l08K19L64j47l80
2926b83j18P85j13l28m93O0L24N19n27j56O0K97L03m81J91j17R6J57n7l18K10
2947A1J20M9L8j97o1J61J02j25j77O0K74O5l58j00J16P9o7K10j18J44J28l25o5
2970c6K88m51J88P7q4L43m04r0K18j36K46M7m42J02J41L72j79k93l34L12K63L05
$$ y = [-319, 381, -7, -288, -291, -29, -3, 31, 153, -152, -60, 135, 87, 147, 76, -32, -96, -364, 87, 260, -118, -487, -608, 221, 168, 80, -127, -204, 72, 459, 233, -367, -550, 56, 245, 514, -185, -398, -206, 542, 485, -273, -247, -238, 39, 75, 226, -359, -38, 284, 17, 283, -229, -94, 118, 45, 1, 73, -8, -58, 203, 35, -134, -26, 105, -31, -249, -29, 376, -222, -98, -105, 315, 169, -192, 140, 257, 110, 149, -280, -510, 68, 134, 4, -233, -249, -23, -28, 222, -251, -435, -129, 491, 87, -309, -186, -115, 376, 381, -87, -252, -140, 36, 47, 57, 143, -110, -31, -339, -120, 244, 97, -283, -401, 384, 271, -57, -550, -490, -166, 353, -174, -330, -270, 27, 330, -151, 40, -77, 19, 176, 119, -199, 11, 131, 180, 218, 21, -40, 121, 223, 98, -79, -19, 255, 320, -38, -138, -22, 57, -10, 200, 82, 226, 354, 29, -36, 252, -199, -11, 66, -18, 325, -79, -169, 49, -87, 159, 206, -236, -134, 7, 379, 200, -93, -427, -115, 148, 453]
2992D53o95j94L82J85K67l50k37q6K14K69k4o06O34j66L17l37J5j28k0M03m34
3013a38N4Nj42J13k8J78l27K38k8l7m2M6L18o7k99J64j75J78M2l25M64O7n51J74
3037a18J78Qj02J48m36N12J54m47K4J14Q7L31j51m28j6J33J3J48l19K41j18L27
3059B83k44k02M0j92L69m8K49j52k33j51J80l05M35k45p1k3O13j04Q7n00L49n5
3081H0j21J61p7j2L50m34J68k58O3K71J52l81J17j33L83l48K20j04o44Q95j69
3102A79J04j85j31O0J84o5j08M4k10M94m62J15P1j07J44o0j28LR0J00n4o9p0j87
3126b48L90M7k68J09j84K23L4K33k51j79k55J03K78L06m66j17m6M06J43k26k17
3147a85r0K33L7m2m28P00m64K14j72K7M5L69J70k78k63q2K82k20OR3qL8M51j36
$$ y = [453, -242, -436, -54, 131, 398, 48, -189, -275, -61, 208, 184, -422, 212, 46, 363, 26, 41, -87, -107, 296, -138, -84, -79, -221, -108, -136, 42, -285, -47, -75, -112, -154, -108, 210, 143, -156, 8, -167, 11, 53, -272, 192, 259, -292, -118, 60, 68, -34, 114, -322, 190, 344, -103, -79, 35, 122, 453, 302, -126, -142, -9, 4, 152, -167, 74, -44, 283, 39, -163, -123, -315, 54, 6, 255, 103, -130, -281, -101, -406, 29, -216, -287, -310, 303, 199, 286, -214, 135, 80, -41, 120, 43, 31, 381, -53, 115, -143, -80, 191, 343, -38, 79, -54, 329, -19, 201, 97, -547, 348, 179, 283, 98, -33, 27, 211, 146, 38, 82, -128, 366, -96, 19, 90, -17, 127, 67, -61, -58, 32, 132, 78, 9, -61, -248, 142, 189, -79, 30, -154, 69, 103, 336, 85, -94, -349, -246, 32, 338, -128, -245, -291, 115, 258, 32, -185, -275, -42, -5, -47, -475, 225, -239, -25, -197, -170, -125, 244, 414, 136, -127, -209, 73, -147, -141, -48, -56, -18, 433, 297]
3171B97k97N4j23J70o4j98J81j56K4M5J90m11j39L04K00J79j40j51m8K58L13l67
3193A21n13L46L51q7j82k69o0K14L44j73N7l3k81J29n1k69J64K09o7J66k11p5
3215a70K03l50L68k25N8ORj33J7r4J69K40j12k38L50j96N8J45J07j93K19k16L30
3238C52p8j36k95J01R3K18M6o15K68RK89j34K16m08n1J63l5r0R5p2n3J47L56n42
3262a56l65L76J67K48k99J84j41K49m21J87k94j52L71qO1q8M7J17q3j27K91j27
3284C7j41L1K34k53J63j74O9J6m4R0Q3j05k74J73J68j51j48K56Q8j07J31k20q
3307h6j3l5n9K33J01K5l38J49l5L96k50j24K50l74K61k68M18j60J4k98o3L91k73
3330a38l2L26j21q9L23m23k15M65Q8l92J22J15j28J51R9j24j46o4K80P2Lk54j48
$$ y = [297, 0, 54, -69, 101, 37, -161, 20, -136, -112, -67, 123, -288, -427, -123, 77, 256, 116, -35, -83, 175, 488, 121, -392, -46, 305, 218, 36, -233, -293, -79, 265, 92, 149, 116, -165, -36, -87, -356, -192, 17, -50, 116, -95, -170, 33, -317, 51, -174, -116, -110, -101, -234, -217, -311, -142, 98, -14, -252, 98, -98, -40, 105, 212, 19, 238, 22, 352, 274, 138, -157, -56, 37, 255, 301, -314, -46, -37, 252, 118, 334, -74, -125, 38, 3, -87, 8, -64, -117, 30, 386, -156, -521, -145, 22, 270, -29, 155, 14, 263, -158, 29, -265, -417, -46, -54, 7, -81, -34, 83, 0, -127, 164, 37, -104, -73, 161, -92, 71, -103, -34, -18, -62, 28, 111, 6, -268, -95, 73, -78, -226, 30, 118, 11, 142, -78, -86, -99, -134, -193, 40, 141, 166, -172, -23, -58, 338, 88, -36, 214, -160, 101, -167, 251, 91, 105, -193, -256, 135, -138, -170, 156, 35, -54, 269, -154, -369, 96, 184, -208, -86, 29, -99, 52, 151, 27, -119, -183, 97, 169, 172, -82, -230]
3353b30J71Q4j54K18j32j09L57j57p2J51o6L53k90n1J63k05J79j08j02L09J47
3374D56p79N35J2k73j99K41r0K60k90L8N8k34O41l58k27J61j17J73R2K1r7j76
3396a52J54K92m51j09J71P39o81m8j48J86K08k92K53j46J36Q2j12j45M69m37J07
3417G6j04j6J70k64K28l60K93nL91o61L01p7j12J60q4K39K2l20p5J06K25m2q9
3440BL12m09J44p6oJ25lp5l81L94K98m30J45j84J11j17K23j10p6Q8j52L6K12j91
3464a20J48r7J98L1m44K55J61q8J08m33J75K6J84j68K14L4J92k83r6R9k97N41
3486C40l61K45ol12R7p9K08J33l69K21K7RK1j94m2l9K00k48K79J15n63J81J57
3509B0j83p6r1M45k29J44k70J31J82j30j84p6L68l38M35j14j85M28j23k53l1p6
$$ y = [-230, -59, 25, -129, 89, -43, -152, 205, 48, -24, 127, 61, 414, 124, 73, 236, 31, 210, 102, 0, 309, 456, -323, 212, 224, -49, -248, -7, -97, 163, -127, -89, -31, -265, 376, 18, -209, -48, -165, 8, 100, 121, 24, -152, 2, 294, -157, -266, -95, 644, -37, -85, -233, -47, 161, -131, 122, -24, 112, 194, 82, -63, 406, -31, 76, -28, -44, 126, -138, 90, -270, 23, 18, 409, -252, 49, -28, -140, 20, -64, 175, 197, -123, -198, -92, 133, 91, 2, 314, -95, 49, -27, -33, 92, 89, 14, -367, 27, 325, -105, 40, -144, -33, -150, 73, -37, -113, -25, -177, -141, 71, -120, 28, -69, 129, 160, -284, -29, 132, 44, 152, -281, -106, -80, 104, -64, 150, 184, 376, 93, -3, 96, -201, 340, -21, 224, 218, -94, 3, -76, 132, 265, -104, 117, 144, 153, 174, -20, -62, -101, 99, -149, 130, 245, -318, -137, 20, -163, -239, -330, 115, -114, 30, -240, -109, 73, -57, -241, -317, 51, -287, 148, 34, -151, 277, 154, -99, -130, -206]
3531b06K55k2m5P9L5k50J98q5KL43j77k31r5K3J86Q4j86q1Q1J28j04k42L39k33
3555b04K35L4j39k31J39j76N64k66j52J61j13J50J34j95R8K12l2Pm64J15K33q1
3577B9j31M6Q0J94j96k31j07Q0L17k79Q0N5K73j39j98J75k42j00L22J46j97P4
3599E1Qk12K9K34p4r9pP5K69j49r4J58k92P7J67p9j98L8K57l00K51k5l42J07R6
3624e4Q2N5l11K58N8P0l8k98nJ61mO3j72L01k60Q1J09J2l31J96O3oj21j37K81
3649E3lJ56J57m06J53l16M14r9n2J62k29K36k84K28l33M4P4J30J15J9m43J62L81
3672C19m13K59k87J62mK6K18l99j27O03m02NJ84n72L60j4K22k06k0o2K14J1K20
3695B97n24J38Q5L71m48k28L05J29j93n6K97j79J11j56K93n21K41k63L91K9p0
$$ y = [-206, 49, 27, -18, 61, 96, -154, 44, -41, -39, 304, 127, -104, -199, -176, 10, 94, -92, -173, -92, 36, -68, -310, 29, -204, 31, 65, -74, -305, -166, -342, 222, -44, -196, -35, -148, 2, 136, -59, 39, 251, 219, 226, -238, -123, 110, 29, -102, -56, 24, 218, 22, -209, -316, -236, 81, -198, -118, -63, 210, 71, -127, 48, -194, -294, 28, 174, -23, 51, 59, -153, -124, 110, 36, -63, -70, 5, 274, 125, 31, 189, -103, -26, 141, 62, -136, -98, 159, -141, 110, 85, -257, -150, -54, 28, 83, -228, 30, 88, 158, 120, -178, -183, -22, -26, 37, -135, 166, -94, -13, 96, 108, -223, -27, 36, 30, -91, -228, 53, 50, 206, 363, -43, 110, -206, 208, 109, 57, 219, -10, 226, -58, 170, -163, -119, -45, 85, 200, 219, -224, -62, 319, -94, 165, -122, 40, 36, 62, 280, -119, -246, 357, -45, -40, 144, -428, -68, -82, 140, -66, -86, -148, 66, 77, 297, -227, -89, -4, 367, -81, -309, -4, 125, -68, -124, 173, -6, 105, -51, 242, -279, -38, -301, 90, 119, 49]
3716D9j05j91J48K36L1J12l63q5N18m08k22L37j77K55J25k34J7J18m46j53O41
3737B03j54L1J8J17l62K57j7n9J24k82j47ML59l63L26j5P4k56K86l15K36j27P6
3760A4n1n2J08K96j12k80K33k06Q2n8M7p4K25j64j03N0J73r0l9j24L03J26j42
3783A62K7j07K5k52J79k34K74J06j75K4J32qj60j50j74N54L4k66k92N11l57J47
3805@P1l02M19k30M16m77kJ40k6m1J48n05K90K33K0K8k31k72K74L26r5j66j21
3828a03k24L90o5J85P1j78l8J22Rj32q4j42L75j35J58j87q1m2K01j16k2k21L61
3851A02j78K47q1RRj20J19k69K44k31J88M13l6p24J65k53L64k28K26J18l5K8Q4
3874A61j41J92k82N8K45k24j88N1K04j77Q8L7L03m71r8K11L47n82k4L55l74J97
$$ y = [49, -56, -247, -99, 137, 168, 280, -83, -168, 350, -58, -280, 57, -120, 135, 260, 26, 43, 161, -285, -438, 203, 49, 80, 98, 215, -147, 110, 93, 34, 158, -124, -271, -267, 92, -271, 55, 40, 114, -142, 144, -171, 65, -62, 14, -37, -89, 19, 315, 203, -77, 156, -50, 32, -26, 21, -53, 172, 8, -95, -45, 128, 38, -1, -125, 178, 304, 162, 189, 82, 107, -145, 34, -200, 74, 180, 5, 29, 161, 153, -7, -157, -331, 223, 257, -9, -301, 210, -147, 0, 71, -231, 188, -42, 374, -103, -105, 35, 9, -32, 116, -389, -99, 134, 154, 182, -49, -321, -47, 279, 184, 18, -103, -327, 63, -2, 183, 254, 76, 38, 160, 169, 37, -47, -189, 186, 51, 209, 22, -59, -101, 100, -16, -38, -259, 102, -76, 171, 90, 99, 108, -12, 107, -162, 82, -149, 39, 452, 416, -308, -143, -396, -32, -260, -34, 84, 49, 77, 161, 20, 212, -70, -12, 233, 9, -179, -128, 76, -101, -13, 24, 327, -144, -242, -31, 316, -266, -290, 65, -309, -112]
3896a12R3K51j55N5l89K08L3J34p6j99M7J21k3K40L4k98m5k02K37N66q80M62j81
3919g9Q2r4j13K5K98P6k85J59l03J05NN8K09o3j35J89q0J31j94j29K31LJ90m63
3943a77J47j49J51n7j73J56J92j40n4J56n0k15N91l21j33M6j20K09l5o6J57k63
3965a48j36K16L36j94M7p7J45j11k35l1P6K16P1j33J06k00P6j45K90j46K08k18
3987A3M9o5q3K25k9Mj76K08j43K16k63k2J37k20K11l27K72o2o8K32j76J03r8J78
4011A16M3r5L01k52m7P9j91J31K8Q5j14j21r1M20k56J01l40J00l04O86J85l74
4033I0m48M29K00m18K55j43J40j12k99K61K10l06L20j52n6K9J04k72Q1L01k80
4054f6k70l2M28P4l29m3L41k58J6l8L03J21j35j74K4p9m0K77j92K2K52k56k7N7
$$ y = [-112, -19, 232, 77, 132, -257, -49, -16, 118, 42, -157, -110, 11, -12, 228, 262, -36, -81, -283, -46, 520, -360, 102, -79, 3, -91, -204, -179, 119, 195, -90, 69, -234, -129, -124, -66, 143, 80, -55, 134, 54, 185, -9, -138, 93, 96, 286, -177, -30, -179, -28, -85, -258, -102, 90, -50, -104, 52, 2, -213, 378, 57, -76, -30, -150, 59, 24, -42, 115, -148, -284, -68, 268, 74, 121, 44, 189, 78, -157, -188, -112, 104, 175, 42, 148, -52, 24, -121, 169, 23, 231, 13, 62, -3, -86, 139, 110, 114, -62, 146, 3, 219, -44, -66, 71, -149, 62, -265, 7, -55, -123, 109, -67, 36, -62, 116, 159, 64, 365, 113, 66, 145, -46, 85, 113, 198, 84, -37, -128, 292, 36, 137, -203, -103, -407, 279, 464, 90, -358, 71, 271, -147, 108, -35, 105, -7, -306, -45, 165, -141, 179, 27, -29, 0, 104, -168, -87, 214, -66, -336, -368, 60, 134, -195, -238, 103, -155, -139, -177, 126, 247, 112, -62, -38, -117, -157, 120, -72, -50, 202, -54, -81, -24]
4078b4N2J8j19J36j30K61k13j78L05n6P1Qj86J74qj90J94l49J27J93j13J56j66
4101c7q8L57j32oJ02l29J49k09K17J71o9Q0m46K76k78J51n0k10M65j09j44j3J27
4124b5k04L87k44p3J66jl07L76l6m09p3M19o2K73m57P1J75K64k55K47k04j16J07
4147A9j75N8J34J6j44M6M9q2j3K3O9J48k37N0R1P8n1J2j45K30j91K28l9k42jk1
4173i0M5R5j22j70M29k6j59K9p6NnR2k10J00qL88m60Q8RK92l06j3l07K82k8p9
4199b05J82l9J36k08J26l1K7Q2m2K01k6k63J32Q3k72K30k66J87J6k03P8lJ44j37
4223g1J02J88j52J0k0r2O9j5o3NJ26k42J62k5K73P0l53j05J08J4j55K13K2k7k26
4248a84K13p8M8J08l52L04Qk87L16M60l31j24r3j46J15J89j40o8L06N2j50O9r4
$$ y = [-24, 28, 46, -73, 63, -67, 194, -19, -197, 108, 52, 123, 131, -55, 119, 111, -79, 115, -234, -107, 86, -27, 129, -37, -125, 232, 100, 94, 196, -133, 16, -193, 24, 195, 126, 206, -240, 36, -242, -91, -141, -351, 114, 5, -139, -152, -25, -229, 158, -86, -159, 7, 6, -301, 75, 39, -370, -443, -24, -86, 187, -270, -199, -24, 240, -15, 232, 28, -88, 19, -156, -98, 36, 52, -92, -46, 3, -79, -92, -69, 0, 148, -89, -39, 52, 130, 79, 91, -54, 176, -15, 213, 174, -68, -69, -90, -45, 50, -72, -242, 187, 161, 2, 31, -45, -40, -45, 47, -163, -63, -71, 317, -143, -55, -46, 246, -60, -73, -380, -98, -126, -205, -23, -62, 74, -134, -8, -39, -12, 70, 28, 229, 203, -60, 72, 155, -117, 113, -153, 34, 50, -153, -75, -78, 66, -71, 31, 219, 67, 77, 57, -35, 34, 19, -44, -39, 87, -155, 7, -18, 255, 325, -28, -133, -25, -11, -166, 47, 69, 42, -184, 29, -49, -1, 107, -245, 59, 67, -220, 96, 556, 225, 101, 8, -138, -23, 166, 26, -42, 264, 316, 166, 235, 141]
4271A41l8m78j6O38l77M15l13M3J41j11j80L69k56j76K58k80K59J05J75l74n7
4292a12k9J25j6K19P1l47l04L30n6J34M3J4Oj11o7kJ84l7K1k9N2%j88J86o0k51
4318b24N08n42L48l58N47k38n0J66J0j0j78j57K23O5k77o1J56J32j3j13r1J58
4340AJ86l42K93Ll37L27k89L40n08L64j12K04j17L6j7j79RR9k20L70l44k44O21
4363A44l09M95k69l33L15N4M8j95L1J13p1j77J45j04K8J58m7J37m38K74R7J68
4385B64k14RQj51P3K57k05k33K20K1Q1n8o7L03n23L46M2j26m39N10K9k02J60j13
4409hL00j83k31P8O5K37j92j95K52M1j26k1N12k10m43L7K77j2Q8n18K6L35r6J19
4433A32j31n7q9Q1Q4k63M36l65q9P5j0M95k39l02K08M5K03o4l00J67J18k35J81
$$ y = [141, 103, -375, -391, 247, -130, 285, -28, 15, 156, 45, -135, 234, -22, -198, 60, -220, 39, 144, 319, -55, -112, -141, -16, -32, 187, 258, -89, -393, -63, -119, 15, 58, 72, 78, -33, -100, -102, 82, 45, 66, 37, 89, 89, -99, 87, 27, -224, 284, -258, 90, -268, 279, 41, -9, 157, 167, 157, -21, -178, 45, 110, -167, -228, -72, 60, 47, -66, -157, 1, 187, -155, 138, 141, -196, 131, -158, 182, -326, 38, -74, 130, 13, 49, 32, -147, -138, -39, -259, 111, -233, -477, 144, -165, 330, 61, -272, 43, 97, 145, -50, -19, 94, 23, -154, -9, -113, -85, 73, 26, 163, -275, -1, 96, 264, 50, 59, 67, -84, -11, 246, 41, -192, 28, 49, 130, 72, 5, 308, -215, 131, 173, 47, -392, 118, 147, -55, 105, -8, 292, 109, -122, -44, 21, 258, 66, -129, 123, 164, 38, 17, 529, 319, -124, -87, 190, 178, 266, -252, -226, 109, 13, 132, 1, -56, -145, -64, 20, -243, 193, -172, -261, -186, -196, 299, 60, -242, -34, 11, 214, 150, -150, 17, 135, -100, 81]
4456H1M1J37M1l78K49k02K16m33K43N1K19l54L8J70J35l47J89k87J73n2L01j95
4478C6J12K21j59j72m2m8L26k02l7j25J96k04L09k72j16M05k88k15K74J33j28
4499DQ9j92r5M38n8k65K70j23l43K23K4J95k82J25j73m4J99j19K19M9r4R0j60
4522b3M4K72l51j02J04L08l76J03l3k46M09k23Q3k40m9M34j48J62j53L11m43N53
4544C96l54l13L94J24l66J24k03O2K82k40J35p7Kj63K0J53o3K6o6J27J92k27k9
4567f4J09m8P4j26J18j36Q4L1m11N36p8J03j87o7L6P6P9j06j19J86l52P5P9j8
4591a26m7K30j92K17k32K05j21J61K32j56m41R6J29P7O8j40L2j37L83l69K41m28
4613c18O27j67k39R6j05j7R0J39j19L7q4j93p8N30n74K81J72m7N62m52j5q2l27
$$ y = [81, 122, 259, 300, -78, 171, -31, 185, -248, -5, 46, 265, -89, -51, 119, 254, -93, 96, -191, -18, -70, 231, 36, 148, 369, 210, 38, -4, -52, 274, 72, 35, -90, 106, -98, 211, -61, -177, 228, -60, -275, -1, 132, 4, 93, -99, -194, 244, 186, -79, 191, 68, -275, -52, -28, 167, -115, 10, -163, -207, -8, -127, 92, 141, 47, 137, -23, 21, 293, -58, -160, -56, 252, -124, -21, -54, -300, 109, -114, -31, -271, -320, 114, -34, 128, -25, 286, -157, 396, 42, -271, 123, 247, -119, 5, -198, -136, 146, -94, 41, -36, -34, -197, -177, -24, -87, -61, -127, 0, 192, -35, -64, 45, -3, 71, -55, 63, -73, 11, 42, -369, 167, 89, 192, 5, -62, -26, 50, 129, 23, -96, 90, -262, -187, -108, -126, -173, 57, -135, 82, -150, 55, -66, 95, 327, 171, -270, -174, -45, 32, 100, -40, -8, -145, 238, -131, 110, -318, 309, 142, -97, -1, -106, -123, -33, 106, -13, 24, -60, -253, -331, 199, -375, -94, 78, 31, 593, 141, 126, 44, -283]
4636b83J33Q9J51j99J48k2q4L23m26J58k97K49K22k97L53k12J65L6k92K07o8K30
4658B84l65M4J39Kk32L9J26J08K5k06K0m1J52k36J06J61j7k8k0R0r7j6m7J52j08
4683C5j33L25j06k79QJ7J5L11j94l08M10j60j84K07k1P3O1J00j05l93L94j5k51
4706a93L22k92P0J94n0k14K80j37q8j07J42k98J44L76j78l05M81j91k12K61K66
4727B71k17R3k01J01J5K26j34p7J4j99K6J36q9k28J58LJ00L34j20n03J71n0r8
4750b68J47J24l7M9k76L87o9j05l5J3k40K32j36J99Q8l36J25l1J62p9P6j53J86
4773B3Q3l07L92J44o48J77J22j32J11O5n8L27l9l20kJ49m64L88J39q2K34j88J67
4796B81l4J47q80M13j02J93J25k42J12p2K31l10k0L83l06K55j94l2j73N04j15
$$ y = [-283, -150, -61, 90, -109, 39, 17, -67, 256, -170, -12, -309, -60, 162, -135, 218, 6, 171, 207, -85, 122, 54, 284, -81, -37, 102, 104, -128, -89, 37, 145, 170, -36, -16, -57, 95, -141, -35, 126, 109, 81, 61, 151, 54, 38, -9, 143, 35, -98, 227, 121, -158, -150, -133, -118, 193, -1, -309, 101, -59, -243, -36, -57, 16, 77, 177, 72, -321, 73, 58, -193, 129, -163, -93, 101, 51, -163, 117, -20, -108, -215, -73, -371, -227, 149, -29, -334, 147, -44, -256, 5, 271, 54, 147, -54, 47, 62, 288, 154, 77, 91, -108, -82, 54, -35, -263, -105, -102, -2, 332, 212, -291, -120, -170, -268, -121, 3, -34, 15, -261, 126, 57, -48, -83, -70, -310, -78, -214, -15, 73, -263, -138, -169, -7, -86, -10, -163, 23, 106, -201, 191, 335, -313, -136, -14, -146, -35, 30, -28, 299, 260, -60, -62, 87, -377, 11, 150, 68, 302, 114, 281, 247, 394, -486, -73, -175, 18, 143, -99, 13, -59, 172, -138, -158, 225, -81, 174, -20, -52, -225, 279, 164]
4817A64j89J31k22l8J86o2q5L68J12p51M96J35k96J0P3J64l06%Q0K64l29rJ83
4840G9j37r1J72Q2p7J1n5j45L53k25L08k98R3J5l1j66K0K07lk46L8J03O8j56K48
4865A67k39j18MJ65k49L48j50J79L79l96O5j76J20m9n7j37K82k54J19L2%l86J97
4888a54J83L4k29K28j59Q1j38J21k2p3J12l2K58l81J50J32l28J84K5K6p7j67K91
4911F5O7j49J69k70LK71k26m4j5L50l52K84m5M9k34J19L19j59m87K64J92j05n8
4934Hj85K16l44M13j64J06j24L84k96J25m00N08j24j45k07L68k8k28J55K26j63
4955A01N5j09k60K96k07K74o9j09K45k35k3J5Q5Q9k21rJ40l7j95j23J45j4J04
4978f2j30J10K45M0m28K74M9k43J39j07M4K05j21p4R2Q1J97k3q4m53J71m8O3Q7
$$ y = [164, -25, 106, -116, -154, 32, -30, -115, 253, 365, -386, 110, 245, -51, -41, 32, 196, -110, -110, -30, 234, -95, -104, 79, -58, -149, 23, 105, 28, 39, -16, -161, 192, -33, 275, -23, 70, 85, 54, -112, -92, 115, 112, -134, -96, 7, 75, -81, 167, -72, -190, -186, -21, -270, 78, -72, 107, 486, 90, 155, -21, 99, 50, -7, -144, 138, -116, 3, 35, 35, -351, -154, 29, 63, -166, 62, -97, -16, -154, -33, -55, -128, -16, -48, 210, -171, -21, 111, -217, -33, -8, 18, -59, -226, 65, 132, -17, 152, -118, -115, 156, -70, -114, -129, 221, -131, 153, 108, 157, -77, 42, 361, 202, -285, -21, 171, 66, 8, -177, 39, -305, 108, -56, 50, -74, 310, 14, 139, -261, 247, 123, -22, -229, 139, 111, -117, 38, 264, 101, 156, 47, -213, 83, -124, 150, 81, -28, 217, -18, -41, -26, 59, 148, -73, -82, 58, 21, -174, -297, -152, -166, -62, -192, -82, 163, 203, -225, 49, 98, -145, -6, -113, -69, 136, 15, -59, 33, 114, 311, 288, 204, -249, -78, -126, -63, 24]
5002B4k61K85n9J2j12K79Rk39J58l80J15J60j46J77j07o7k2M15k82p1J01nk0K38
5026B02pl30L4l6J80k7p1J63Q4k29j74P4J73l7J58r5J9nJ42l47O7Q1M4R1l72K53
5052C5r2K74l45K53j49N1J96q0q2r3Q0Q0k56J9J48j3P5K9j27j13J00J83k40P3
5076Fj89L66%j03k5K07o5l43R5J37j88L23k72K9J92p3o6J1j32N1J21m38L41J74
5100A59l55M14l37M09l35O0J9J05J20j6m03j04L64J10j92J3K8j6J96j61k82J62
5122d2m6K30k86J10J75j8O5p9j43j64K93P6k29K69Nl58J18J69j57j59J16J22K03
5145B70q6j19k3L03o14L34j2j25K46j21p6J3l3N5k1M20m79L38k36k28J47j25N7
5168a15j88K76ol24L55J28J31o56M29J57o2q4k13j73M28J08k45J64jM6k79K53
$$ y = [24, -237, 48, -11, 1, -111, 168, 177, -62, 96, -284, -169, -9, -155, 22, -85, -152, -174, 241, -41, -112, -11, -16, -36, 202, 195, -135, -101, -137, 43, 16, -55, 108, 192, -37, -211, -137, 36, -1, 157, 62, 81, 76, 218, -129, -62, 19, 63, 154, -218, 35, -57, 217, -128, 125, -24, 27, 223, 143, 61, -32, 48, 128, -128, -109, 39, 26, 101, 130, 3, -110, -10, 173, -67, 6, -183, 183, 183, 80, 55, 262, 197, -146, -51, 86, -102, 221, -51, -22, 170, 97, 31, 42, -90, -39, 82, -356, -15, 159, -196, 218, -119, 290, -45, 15, 34, 139, 259, 243, -160, -264, 100, 210, 18, 31, 59, 43, 239, 78, -204, -42, -88, 142, -144, -34, 141, 123, 188, 109, -34, -198, 95, 171, -58, 211, 216, -142, -24, 145, -12, -171, -55, 67, 270, 184, 65, 42, 345, -269, 65, 53, -72, 174, 53, -23, -10, -43, 12, -9, 411, -68, 270, 34, -194, -47, -172, -115, -303, -27, -33, -357, -2, 126, 257, -399, 30, 187, 125, 41, -172, -345, 83, 191, -54, 110, 109, 155, -124, 129]
5190A29j70n0o8J15J08Q1l17J90J10L10m33j94P4j06K9M2k3j66L38R1k29j42L30
5213D9J17L9m33K33k59N29j18k49J99R7m59K32J62k14k53K66M0O2p2j37Q3k4o4
5236a74m9L29k39Rm10N08J77J7j5l8O1k40K14q2k63M32Ql68p8J05K24j2k82M24
5260B58l08JJ29r9MM9o0J42k12J5J66r9K6j19J51N3q1J14M8l10L47k32o0J26K9
5285G8j94j29M32k45j04L52j27l10nJ27qJ72L38m71J43J14k47m6M8J23K6J5Q6
5308A68N4j15m6k8P0n6j9Pk15J1L57k99M57m94L28r3l7J6j50R1j61O9k01M74k37
5333d9J52j73J04k04K58k09j51M45l78P1K67j20j28p5N2K03k02J8J27K13j52K3
5355I2k78J67l6k48J74K29k72J97O1Oj06M8j48K80k27J55O4k07R7k76J4K74J23
$$ y = [129, -41, -91, -159, -44, 64, 145, -172, 18, 128, 438, 5, -189, -115, -221, -192, -150, -173, -339, -1, 90, -139, -281, 49, 166, 205, -228, 5, -254, 275, 157, -92, 107, 204, -255, -23, 139, -75, -328, -62, -22, 40, -32, -169, -86, -110, -174, -223, 106, -133, -124, -534, -26, 151, 168, 153, 115, 176, -64, 150, 68, -195, 237, 245, -123, -201, -96, 128, 116, -166, 258, -50, -49, 80, -19, -15, 34, -26, 116, -96, -81, 85, -14, 12, -107, 44, 97, 16, 130, 178, -132, 215, -17, -77, 49, 78, -116, -245, 187, -58, -162, 190, 63, -247, -252, -125, -133, 39, 377, -94, 49, 163, -84, -130, -82, 41, 67, 82, 168, 222, 107, 61, 33, 103, 47, 28, 35, -180, -169, 188, -111, 346, -148, 180, 87, 50, 66, -84, 7, -154, -85, -286, 188, -49, 103, -70, 34, -170, 88, -121, -272, 173, -205, -134, 133, 13, -115, -190, -138, 65, -137, -119, 8, 221, 69, 92, -186, -19, -55, -303, -129, 100, -172, 25, 86, 92, -14, 34, -114, 166, -61, 94, 158, -49, 48, -228, -214, 60, 183]
5378A83q4j53j00O7K8O9p6K14j66l10K98j12M43k30j27j59J91J29j50J35j35J64
5400A19M5k82L99n37M9L97k12j31Q8J52l54M26l71N05j90l09M88j52O2o0j30N1
5422E3j50o2K79r0J37k58l0K13r4K27j16j91J37J3R2J82l04K44qm90L77l28Q9
5445g8NJ2J15M7m0p1j5J50J09l28K77k2kj4k41K15o5n2pj5J96l34j22L66k79K36
5471D3l18M20j37J48k39L19j86j34J07j46J45l83L52p7k35M01j26k8j56K06K8
5492Dj84M38m69J38m0m5J60j21l8N1j29J37J73L39o00L8K71j88J7p6M49l81J05
5515D9L8j73j19J57J34j89K4J51j84j67N69n35J8o6L64n6k83M45j90K8p4m6N7
5538d8N7J25ok16p6K00k80L04N2J00j62k5Q8r9J68k42J64j04j35J19j76N57m44
$$ y = [183, 99, -54, -154, -87, -59, 10, -66, 148, -18, -328, -30, -142, 301, 71, -56, -215, -24, 105, -45, 90, -45, 119, 164, -118, 281, -256, -207, 190, -22, -153, -65, 87, -267, 159, -212, 293, 103, -206, 282, 130, 192, 132, 2, 53, -97, -159, 120, 30, 167, -91, -121, 92, -2, 225, 109, -82, 55, 68, 160, 342, 38, 282, 274, -216, 161, -167, -78, -73, -61, 54, 101, 61, -10, -25, 125, 234, -94, 183, 161, 159, 145, -96, 119, 54, 2, -5, -20, 176, -158, -280, 86, -193, 43, -275, 145, 8, 156, -83, 236, 50, -84, 23, -123, 22, -361, -9, -86, -321, 80, -46, -74, -230, -24, 4, -180, 258, -211, -73, -113, -158, 2, -119, -157, -106, -235, -98, 75, 414, -186, -148, 123, -65, -48, -124, 325, -56, 49, 87, -86, -205, -48, 86, -103, -79, 72, -112, -279, 290, -245, -227, -293, 71, 15, -268, 177, -13, 15, -59, -105, -48, 9, 134, 128, -88, -164, 36, -244, 60, 112, 212, 50, 25, 113, 14, 182, -60, 104, 0, -135, -16, -192, 365, -79]
5561g9J07j10R8j16l3J41r7R3K12o6p2k52K04J29k79K22l08O2N5j67K65L77m27
5584d1J14l3j67K13k37K76J08k36K41l57J66M41p90J50J15Q6j74K05l32M12k50
5605i0k47K35J49j44J14K08k41L21l42N6k23K23r2J52l95J67K61j56N97m58k48
5626a53o0L84j37L17l48N9m6k58J85J93m48M65j50J72l08J52p2k89J67l0J88k06
5648b23N33m12K10k22L26k23m5l7P4j9R3l98M25k91J76R8j58J02M7J89j62j74
5670i1K04j37q3J15J00J13p1l30J13R3J15j74n4J66j52J33j91K88k46Q2K8J72
5692A93j42P9o9j01K90l11O7k20L03qk14J82K29k48j09K23j98k32M96l46J97k53
$$ y = [-79, 28, -82, 16, -100, -133, 8, -89, 4, 216, 150, 78, -174, 30, 159, -120, 102, -206, -144, -89, -256, 9, 386, -41, 73, 40, -127, 86, -151, 125, 233, -3, 238, -119, 47, 488, -302, -152, -37, 49, -125, 80, -252, 160, -90, -337, -102, 47, -97, 17, 225, -16, 305, -37, 19, -204, 19, -73, 79, -316, -149, 112, -44, 553, 95, -153, -213, 171, 34, 351, 3, 62, 16, -242, -57, 136, -312, 153, 3, 175, -133, 19, -53, -342, -175, -205, -17, -223, 310, -102, 108, -114, 212, -11, -56, -93, -19, -38, 55, -343, 82, -209, -33, 65, -93, 9, 56, 245, 83, -91, 113, -24, -107, 8, 108, 221, 150, -180, -67, 26, 141, -33, -87, 79, -73, 60, -131, 157, -89, -7, 21, 193, 51, 130, 61, -40, 250, -61, 6, -214, 89, 81, -133, 49, 278, 30, -79, 144, -54, -286, 210, -136, 61, -192]
$$ [...]
8191A34
##END NTUPLES=NMR FID
##END=
