##TITLE=1H_CG-1104-C
 DMSO, 8 sc, 
 28.5.2019
##JCAMPDX= 6.0         $$ Bruker NMR JCAMP-DX V2.0
##DATA TYPE= NMR FID
##DATA CLASS= NTUPLES
##ORIGIN= UXNMR, Bruker Analytische Messtechnik GmbH
##OWNER= root
$$ XWIN-NMR		Version 3.5
$$ Tue May 28 15:51:44 2019 Russian Standard Time (UT+4h)  she@DPX200
##.OBSERVE FREQUENCY= 200.1315
##.OBSERVE NUCLEUS= ^1H
##.DELAY= (6, 6)
##.ACQUISITION MODE= SIMULTANEOUS
##.ACQUISITION SCHEME= undefined
##.AVERAGES= 8
##.DIGITISER RES= 18
##SPECTROMETER/DATA SYSTEM= spect
##.PULSE SEQUENCE= zg30
##.SOLVENT NAME= DMSO
##.SHIFT REFERENCE= (INTERNAL, DMSO, 0, 15.7039)
##AUDIT TRAIL= $$ (NUMBER, WHEN, WHO, WHERE, WHAT)
$$ ##TITLE= Audit trail, XWIN-NMR		Version 3.5
$$ ##JCAMPDX= 5.01
$$ ##ORIGIN= Bruker BioSpin GmbH
$$ ##OWNER= she
$$ F:/spectra/data/she/nmr/H-F/1/audita.txt
$$ ##AUDIT TRAIL=  $$ (NUMBER, WHEN, WHO, WHERE, WHAT)
(   1,<2019-05-28 15:50:34.40 +0400>,<she>,<DPX200>,
      <created by zg, POWCHK disabled, PULCHK disabled
       configuration hash MD5:
       00 E9 B6 7A A2 85 ED C7 34 08 36 98 17 FE 4E 26
       data hash MD5: 16K
       63 F8 E0 0E 92 A3 06 BC B3 C8 97 15 76 5E 10 F5>)
$$ ##END=
$$ 
$$ hash MD5
$$ 6C 96 59 30 C5 B8 84 D2 D4 38 5A 0B 51 7F 8D 71
##$RELAX= 
##$RELAX= 
##$RELAX= 
##$RELAX= 
##$RELAX= 
##$RELAX= 
$$ Bruker specific parameters
$$ --------------------------
##$DU= <F:/spectra>
##$EXPNO= 1
##$NAME= <H-F>
##$PROCNO= 1
##$TYPE= <nmr>
##$USER= <she>
##$AMP= (0..31)
100 100 100 100 100 100 100 100 100 100 100 100 100 100 100 100 100 100 
100 100 100 100 100 100 100 100 100 100 100 100 100 100 
##$AQSEQ= 0
##$AQ_mod= 1
##$AUNM= <au_zg>
##$AUTOPOS= <>
##$BF1= 200.13
##$BF2= 200.13
##$BF3= 200.13
##$BF4= 200.13
##$BF5= 200.13
##$BF6= 200.13
##$BF7= 200.13
##$BF8= 200.13
##$BYTORDA= 1
##$CFDGTYP= 0
##$CFRGTYP= 5
##$CHEMSTR= <none>
##$CNST= (0..31)
1 1 145 1 1 1 1 1 1 1 1 1 1 1 1 1 1 1 1 1 1 1 1 1 1 1 1 1 1 1 1 1 
##$CPDPRG= <>
##$CPDPRG1= <>
##$CPDPRG2= <>
##$CPDPRG3= <>
##$CPDPRG4= <mlev>
##$CPDPRG5= <mlev>
##$CPDPRG6= <mlev>
##$CPDPRG7= <mlev>
##$CPDPRG8= <mlev>
##$CPDPRGB= <>
##$CPDPRGT= <>
##$D= (0..31)
0 1.2 0 0 0 0 0 0 0 0 0 0.03 0 0 0 0 0 0 0 0 0 0 0 0 0 0 0 0 0 0 0 0 
##$DATE= 1559044233
##$DBL= (0..7)
120 120 120 120 120 120 120 120 
##$DBP= (0..7)
150 150 150 150 150 150 150 150 
##$DBP07= 0
##$DBPNAM0= <>
##$DBPNAM1= <>
##$DBPNAM2= <>
##$DBPNAM3= <>
##$DBPNAM4= <>
##$DBPNAM5= <>
##$DBPNAM6= <>
##$DBPNAM7= <>
##$DBPOAL= (0..7)
0.5 0.5 0.5 0.5 0.5 0.5 0.5 0.5 
##$DBPOFFS= (0..7)
0 0 0 0 0 0 0 0 
##$DE= 6
##$DECBNUC= <off>
##$DECIM= 24
##$DECNUC= <off>
##$DECSTAT= 4
##$DIGMOD= 1
##$DIGTYP= 9
##$DL= (0..7)
0 120 120 120 120 120 120 120 
##$DP= (0..7)
150 150 150 150 150 150 150 150 
##$DP07= 0
##$DPNAME0= <>
##$DPNAME1= <>
##$DPNAME2= <>
##$DPNAME3= <>
##$DPNAME4= <>
##$DPNAME5= <>
##$DPNAME6= <>
##$DPNAME7= <>
##$DPOAL= (0..7)
0.5 0.5 0.5 0.5 0.5 0.5 0.5 0.5 
##$DPOFFS= (0..7)
0 0 0 0 0 0 0 0 
##$DQDMODE= 0
##$DR= 18
##$DS= 0
##$DSLIST= <SSSSSSSSSSSSSSS>
##$DSPFIRM= 0
$$ [...]
##$SUBNAM2= <"">
##$SUBNAM3= <"">
##$SUBNAM4= <"">
##$SUBNAM5= <"">
##$SUBNAM6= <"">
##$SUBNAM7= <"">
##$SUBNAM8= <"">
##$SUBNAM9= <"">
##$SW= 24.9337058887773
##$SWIBOX= (0..15)
0 0 2 0 0 0 0 0 0 0 0 0 0 0 0 0 
##$SW_h= 4990.01996007984
##$TD= 16384
##$TD0= 1
##$TE= 0
##$TE2= 300
##$TE3= 300
##$TEG= 300
##$TL= (0..7)
0 120 120 120 120 120 120 120 
##$TP= (0..7)
150 150 150 150 150 150 150 150 
##$TP07= 0
##$TPNAME0= <>
##$TPNAME1= <>
##$TPNAME2= <>
##$TPNAME3= <>
##$TPNAME4= <>
##$TPNAME5= <>
##$TPNAME6= <>
##$TPNAME7= <>
##$TPOAL= (0..7)
0.5 0.5 0.5 0.5 0.5 0.5 0.5 0.5 
##$TPOFFS= (0..7)
0 0 0 0 0 0 0 0 
##$TUNHIN= 0
##$TUNHOUT= 0
##$TUNXOUT= 0
##$USERA1= <user>
##$USERA2= <user>
##$USERA3= <user>
##$USERA4= <user>
##$USERA5= <user>
##$V9= 5
##$VALIST= <valist>
##$VCLIST= <CCCCCCCCCCCCCCC>
##$VD= 0
##$VDLIST= <DDDDDDDDDDDDDDD>
##$VPLIST= <PPPPPPPPPPPPPPP>
##$VTLIST= <TTTTTTTTTTTTTTT>
##$WBST= 1024
##$WBSW= 4
##$XGAIN= (0..3)
0 0 0 0 
##$XL= 0
##$YL= 0
##$YMAX_a= 297900
##$YMIN_a= -425178
##$ZGOPTNS= <>
##$ZL1= 120
##$ZL2= 120
##$ZL3= 120
##$ZL4= 120
##$ABSF1= 10
##$ABSF2= 0
##$ABSG= 5
##$ABSL= 3
##$ALPHA= 0
##$AQORDER= 0
##$ASSFAC= 0
##$ASSFACI= 0
##$ASSFACX= 0
##$ASSWID= 0
##$AUNMP= <proc_1d>
##$AZFE= 0.1
##$AZFW= 0.1
##$BCFW= 1
##$BC_mod= 2
##$BYTORDP= 1
##$COROFFS= 0
##$CY= 11.3945322036743
##$DATMOD= 1
##$DC= 2
##$DFILT= <>
##$DTYPP= 0
##$F1P= 18.9103706918063
##$F2P= -1.10871071338519
##$FCOR= 0.5
##$FTSIZE= 0
##$FT_mod= 4
##$GAMMA= 1
##$GB= 0.15
##$INTBC= 1
##$INTSCL= 1
##$ISEN= 128
##$LB= 0.24
##$LEV0= 0
##$LPBIN= 0
##$MAXI= 10000
##$MC2= 0
##$MEAN= 0
##$ME_mod= 0
##$MI= 1.114404
##$NCOEF= 0
##$NC_proc= 0
##$NLEV= 6
##$NOISF1= 3.799351
##$NOISF2= 2.8
##$NSP= 1
##$NTH_PI= 0
##$NZP= 0
##$OFFSET= 15.70392
##$PC= 1
##$PHC0= -8861.913
##$PHC1= 16.80025
##$PH_mod= 1
##$PKNL= yes
##$PPARMOD= 0
##$PSCAL= 0
##$PSIGN= 0
##$REVERSE= no
##$SF= 200.130013532006
##$SI= 16384
##$SIGF1= 3
##$SIGF2= 2
##$SINO= 400
##$SIOLD= 16384
##$SREGLST= <1H.CDCl3>
##$SSB= 0
##$STSI= 0
##$STSR= 0
##$SW_p= 3612.71676300578
##$SYMM= 0
##$S_DEV= 0
##$TDeff= 0
##$TDoff= 0
##$TI= <>
##$TILT= no
##$TM1= 0
##$TM2= 0
##$TOPLEV= 0
##$USERP1= <user>
##$USERP2= <user>
##$USERP3= <user>
##$USERP4= <user>
##$USERP5= <user>
##$WDW= 1
##$XDIM= 8192
##$YMAX_p= 0
##$YMIN_p= 0
$$ End of Bruker specific parameters
$$ ---------------------------------
##NTUPLES= NMR FID
##VAR_NAME=  TIME,          FID/REAL,        FID/IMAG
##SYMBOL=    X,             R,               I
##VAR_TYPE=  INDEPENDENT,   DEPENDENT,       DEPENDENT
##VAR_FORM=  AFFN,          ASDF,            ASDF
##VAR_DIM=   8192,          8192,            8192
##UNITS=     SECONDS,       ARBITRARY UNITS, ARBITRARY UNITS
##FACTOR=    0.0002004,     1,               1
##FIRST=     0,             0,               0
##LAST=      1.6414764,     0,               0
##MIN=       0,             -425178,         0
##MAX=       1.6414764,     297900,          0
$$ Real data points
##PAGE= N=1
##DATA TABLE= (X++(R..R)), XYDATA
$$ plain form
0 0 0 0 0 0 8 -8 8 -8 16 -16 24 -24 32 -40 48 -56 72 -87 97 -119 140 -160 187 -215 247 -286 326 -369
28 -369 420 -475 533 -600 674 -754 841 -937 1046 -1161 1286 -1426 1580 -1751 1935 -2143
44 -2143 2376 -2635 2925 -3259 3640 -4080 4599 -5221 5983 -6938 8179 -9861 12294 -16130
58 -16130 23117 -39956 165312 24557 -364874 -58566 215226 148913 -28292 26115 -5616
69 -5616 -119518 -17914 276196 204784 -181713 -271554 83431 248789 27351 -104371 50588
80 50588 65711 -111027 -65079 185848 126433 -186818 -182232 155599 221981 -65397 -179897
91 -179897 9679 77388 -49974 -25345 119476 15034 -203258 -78178 224904 132715 -234551
102 -234551 -236489 118851 217802 -30078 -144850 -29621 -13786 -78186 38960 165455 -24233
$$ packed form
0@%%%%Qj6J6j6K4l2M0m8N6p2Q8j04J28j59J84k16K59l00L47m02M62n33O12o95
28c69P89q95J008j133J274j428J595j778J983k207K447k712L006l331L686m078
44b143M519n011N560o184O899p720Q679r820J1204j2921J5117j8040K2155k8424
58a6130L9247o3073K05268j40755l89431L06308K73792o6313j77205N4407l1731
69e616j13902J01604K94110p1412l86497q9841L54985J65358k21438j31722J54959
80E0588J5123j76738M5948K50927n9415l13251M586L37831O6382k87378j14500
91a79897J89576O7709j27362K4629J44821j04442k18292J25080L03082r2189l67266
102b34551j938L55340R8951k47880j14772J15229J5835o4400J17146J26495j89688
$$ plain form
113 -24233 -268185 -106483 228320 172955 -157998 -207985 18000 79150 -23078 22795 96722
124 96722 -74292 -232797 -23723 244380 105827 -196665 -160688 83358 100656 -36323
134 -36323 -11815 55422 -72176 -163849 46099 236506 41039 -227218 -119235 139936 110535
145 110535 -67186 -47066 44141 -29781 -80877 70854 145137 -58645 -199793 -3811 196330
156 196330 58450 -150507 -76439 90211 42940 -62555 -1731 51094 -58441 -90785 77989
167 77989 132789 -73127 -183951 6345 157562 21269 -126376 -40647 62037 -14485 -69716
178 -69716 38293 75520 -78800 -142051 28313 133268 -5027 -120959 -35956 34869 -31657
189 -31657 -35601 70752 43838 -129142 -134300 77053 152155 -35437 -164392 -46277 79283
$$ packed form
113b4233k43952J61702L34803n5365l30953m9987K25985O1150j02228M5873P3927
124I6722j71014j58505K09074K68103j38553l02492L5977K44046J7298j36979
134c6323K4508O7237j27598r1673K09948J90407j95467k68257J07983K59171k9401
145A10535j77721K0120R1207p3922n1096J51731P4283k03782j41148J95982K00141
156A96330j37880k08957P4068J66650m7271j05495O0824N2825j09535l2344J68774
167G7989N4800k05916j10824J90296J51217j36293j47645Q5729J02684p6522n5231
178f9716J08009L7227j54320o3251J70364J04955j38295j15932Q5003P0825o6526
189c1657l944J06353k6914j72980n158K11353P5102j87592j28955J18115J25560
$$ plain form
200 79283 29477 -33610 -303 -10899 -83861 -36135 98109 64948 -103964 -107435 60483 94615
212 94615 -47802 -89781 27612 64811 -36670 -62409 35104 54643 -39527 -52328 38168
223 38168 42545 -44882 -35017 56542 37403 -58585 -34482 65619 40182 -62726 -37244 72404
235 72404 56157 -57207 -58578 48588 68170 -16094 -40500 14380 21156 -13118 16377 55116
247 55116 -7653 -74812 -4689 94833 45542 -64462 -48094 46312 50124 -16275 -17905 27380
259 27380 13283 -28795 -439 48855 16560 -38654 -8300 44445 13120 -35327 3086 51850
271 51850 9192 -45554 -8403 48939 24529 -25281 -9714 26688 8522 -17801 10850 38885
283 38885 1198 -35304 2198 44287 14490 -23579 2702 30866 187 -22736 13740 40951
$$ packed form
200G9283m9806o3087L3307j0596p2962M7726J34244l3161j68912l471J67918L4132
212I4615j42417m1979J17393L7199j01481k5739R7513J9539r4170j2801R0496
223C8168M377q7427R865R1559j9139r5988K4103J00101k5437j02908K5482J09648
235G2404j6247j13364j371J07166J9582q4264k4406N4880O776l4274K9495L8739
247E5116o2769o7159P0123R9522m9291j10004J6368R4406L812o6399j630M5285
259B7380j4097m2078K8356M9294l2295n5214L0354N2745l1325m8447L8413M8764
271E1850m2658n4746L7151N7342k4410m9810J5567L6402j8166k6323K8651K8035
283C8885l7687l6502L7502M2089k9797l8069K6281K8164l0679k2923L6476K7211
$$ plain form
295 40951 6428 -26276 -3127 27104 14890 -2511 10628 14173 -12516 -15844 27700 44706
307 44706 -4734 -39346 -1706 39782 23002 -9789 -8208 4048 4425 9130 17861 5845 -16205
320 -16205 -7495 24273 24055 -12865 -24182 11992 33251 2982 -25085 -7154 19119 14695 -842
333 -842 -5370 -6161 -4079 8382 15678 645 -16416 -8295 11892 10600 -8225 -10243 8333 10035
347 10035 -13116 -18494 8903 23381 1069 -24378 -19397 5609 22049 13408 -15060 -32245 -12354
360 -12354 23513 28125 -6851 -37879 -22898 18916 30092 -3151 -31900 -18406 10020 15472
372 15472 -317 -15583 -14956 -346 9649 741 -13240 -11044 1843 4697 -4971 -12634 -6898 4406
386 4406 2865 -9604 -13635 -518 5858 -3589 -12549 -7827 1787 4419 -4548 -15666 -11245 6033
$$ packed form
295D0951l4523l2704K3149L0231j2214j7401J3139L545k6689l328M3544J7006
307D4706m9440l4612L7640M1488j6780l2791J581J2256L77M705Q731j2016k2050
320a6205Q710L1768k18l6920j1317L6174K1259l0269k8067J7931K6273m424j5537
333h42m528p91K082J2461P296j5033j7061Q121K0187j292j8825k018J8576J702
347A0035k3151n378K7397J4478k2312k5447M981K5006J6440q641k8468j7185J9891
360a2354L5867M612l4976l1028J4981M1814J1176l3243k8749J3494K8426N452
372A5472j5789j5266O27J4610R995q908j3981K196J2887K854r668p663N736J1304
386D406j541j2469m031J3117O376r447q960M722R614K632q967j1118M421J7278
$$ plain form
400 6033 11840 -5237 -22019 -15881 6179 17734 2725 -22579 -24491 1191 19942 9326 -14082
413 -14082 -23719 -10329 10526 16262 -897 -18997 -15755 1199 11075 5367 -6166 -12548 -7415
426 -7415 1995 4712 2646 -2446 -8962 -8783 1893 8531 727 -7849 -5792 -768 1403 2109 187
441 187 -4663 -5879 -526 4206 2291 -5192 -7524 -386 6374 731 -5824 -2958 -659 -3578 436
456 436 7556 186 -14573 -9728 9734 14185 -2713 -16690 -10075 5724 11646 4272 -6486 -13751
470 -13751 -10265 8250 21326 3168 -25528 -18173 15754 22378 -4464 -18089 -4479 7860 4612
483 4612 893 1926 -1325 -6699 123 11021 5182 -8724 -3205 12554 5472 -11583 -361 21366
497 21366 7999 -19355 -8622 22508 19792 -9275 -13548 7790 16269 4563 -106 3818 -806
$$ packed form
400F033N807j7077j6782O138K2060J1555j5009k5304j912K5682J8751j0616k3408
413a4082r637J3390K0855N736j7159j8100L242J6954R876n708j1533o382N133
426g415R410K717k066n092o516J79J0676O638p804q576K057N024K171P06j922
441A87m850j216N353M732j915p483k332P138O760n643o555K866K299k919M014
456D36P120p370j4759M845J9462M451j6898j3977O615J5799N922p374j0758p265
470a3751L486J8515J3076j8158k8696P355L3927O624k6842j3625J3610J2339l248
483D612l719J033l251n374O822J0898n839j3906N519J5759p082j7055J1222K1727
497B1366j3367k7354J0733L1130k716k9067m273K1338Q479j1706m669L924m624
$$ plain form
510 -806 -3760 13966 23495 -4313 -26651 4238 40329 14599 -28531 -15657 25619 24022 -6310
523 -6310 -9262 7650 5374 -3209 9388 18116 -4811 -21663 5877 30146 3284 -25395 -462
536 -462 27049 1421 -25219 3494 30334 -162 -31104 -3846 29077 8152 -21658 -7089
548 -7089 15020 -38 -14255 8189 18626 -15544 -28178 14919 35895 -11826 -41017 4481
560 4481 38099 -96 -32822 -2206 24249 -2628 -20083 8967 20439 -15367 -26139 17986
572 17986 33944 -14383 -36298 10837 34958 -7637 -28104 12893 25884 -18524 -25315 26491
584 26491 33879 -23707 -37501 19856 39675 -10317 -31381 11312 25853 -14601 -20438 26270
596 26270 25036 -32020 -30419 33900 37197 -27997 -36223 22755 31080 -22885 -25079 26150 20903
$$ packed form
510h06k954J7726R529k7808k2338L0889L6091k5730m3130J2874M1276j597l0332
523f310k952J6912k276q583J2597Q728k2927j6852K7540K4269k6862k8679K4933
536d62K7511k5628k6640K8713K6840l0496l0942K7258L2923k0925k9810J4569
548g089K2109j5058j4217K2444J0437l4170j2634M3097K0976m7721k9191M5498
560D481L3618l8195l2726L0616K6455k6877j7455K9050J1472l5806j0772M4125
572A7986J5958m8327k1915M7135K4121m2595k0467M0997J2991m4408o791N1806
584B6491P388n7586j3794N7357J9819m9992k1064M2693J4541m0454n837M6708
596B6270j234n7056J601O4319L297o5194q226N8978Q325n3965k194N1229n247
$$ plain form
609 20903 -35189 -27092 36082 30826 -36936 -39280 25778 31749 -26372 -28805 21038 12827 -36190
622 -36190 -15143 39444 11106 -55199 -28248 46266 28316 -47153 -39968 28577 25800 -31778
634 -31778 -24891 25957 8249 -42760 -15006 43154 10859 -53428 -22592 42980 16238 -44504
646 -44504 -16680 38487 4940 -48425 -8168 52143 10408 -58430 -22095 51255 25342 -41254
658 -41254 -20842 32593 7231 -33211 7773 45668 -11030 -56742 8586 67344 6145 -60977
670 -60977 -10941 55582 15489 -41913 -3957 43766 -477 -43413 9941 54939 -4472 -53561
682 -53561 5668 55551 -645 -45897 8788 46755 -12830 -45687 21330 56151 -17226 -60206
694 -60206 12192 62970 -2024 -54171 858 44595 -6029 -36485 18801 37622 -29451 -46184
$$ packed form
609B0903n6092Q097O3174n256o7762k344O5058N971n8121k433M9843q211m9017
622c6190K1047N4587k8338o6305K6951P4514j7950p5469P185O8545k777n7578
634c1778O887N0848j7708n1009K7754N8160l2295o4287L0836O5572k6742o0742
646d4504K7824N5167l3547n3365M0257O0311m1735o8838L6335P3350k5913o6596
658d1254K0412N3435k5362m0442M0984L7895n6698m5712O5328N8758o1199o7122
670f0977N0036O6523m0093n7402L7956M7723m4243m2936N3354M4998n9411m9089
682e3561N9229M9883n6196m5252N4685L7967n9585l2857O7017L4821p3377m2980
694f0206P2398N0778o4994n2147N5029M3737n0624l0456N5286J8821o7073j6733
$$ plain form
706 -46184 31661 54264 -27721 -58263 18236 52125 -15214 -45580 16270 39115 -25320 -42135
718 -42135 29317 46115 -30543 -51382 24577 48341 -21504 -41427 22431 32879 -30382 -30380 39663
731 39663 35623 -43046 -42606 41387 50055 -31374 -45754 27982 41408 -25037 -29809 35362 31273
744 31273 -37981 -28754 47117 37979 -38845 -32969 40486 35202 -31768 -22041 41987 25071 -41903
757 -41903 -20002 53574 33286 -46637 -31560 47786 38125 -34098 -25055 38089 22087 -35240
769 -35240 -9843 47273 14291 -47490 -13052 53141 22383 -45703 -19878 45000 19294 -40668
781 -40668 -12611 45259 11729 -48405 -12217 50076 15975 -45941 -16460 39015 10727 -35924
793 -35924 -3172 36825 -4250 -45792 3140 51214 1117 -55769 -10666 48859 11679 -43579
$$ packed form
706d6184P7845K2603q1985l0542P6499L3889o7339l0366O1850K2845o4435j6815
718d2135P1452J6798p6658k0839P5959K3764o9845j9923O3858J0448o3261KP0043
731C9663m040p8669M40Q3993Q668q1429j4380P3736J3426o6445m772O5171m089
744C1273o9254R227P5871r138p6824N876P3455n284o6970R727O4028j6916o6974
757d1903K1901P3576k0288p9923J5077P9346r661p2223R043O3144j6002n7327
769c5240K5397N7116l2982o1781L4438O6193l0758o8086K5825O4878k5706n9962
781d0668K8057N7870l3530o0134L6188O2293l4101o1916K9481N5475k8288m6651
793c5924L2752L9997m1075m1542M8932M8074n0097n6886M5103N9525l7180n5258
$$ plain form
805 -43579 -10458 35569 62 -38016 3835 39579 -7604 -45343 3154 42676 -2503 -41016
817 -41016 1196 35730 -8017 -37890 11045 40685 -14240 -48061 8994 48576 -3975 -45453
829 -45453 -859 34919 -3417 -28197 9980 24808 -19590 -31149 22446 37161 -20936 -43066
841 -43066 13110 39768 -10225 -35996 9492 28645 -16761 -30097 19321 30702 -22674 -36590
853 -36590 14876 32220 -13723 -29380 8828 17831 -18347 -18963 22402 18220 -32472 -30737 26172
866 26172 32228 -24463 -37231 11545 25187 -13543 -20850 12133 9777 -24323 -15133 24439 15802
879 15802 -29016 -25848 19086 20667 -18744 -19549 14807 9821 -24097 -11896 27020 12769 -32022
892 -32022 -21968 24213 22039 -18026 -20189 10077 9256 -11882 -2588 18216 -443 -27355 -4976
$$ packed form
805d3579L3121M6027l5507l8078M1851L5744m7183l7739M8497L9522m5179l8513
817d1016M2212L4534m3747k9873M8935K9640n4925l3821N7055L9582n2551m1478
829d5453M4594L5778l8336k4780L8177J4828m4398j1559N3595J4715n8097k2130
841d3066N6176K6658m9993k5771M5488J9153m5406j3336M9418J1381n3376j3916
853c6590N1466J7344m5943j5657L8208R003l6178o16M1365m182n0692J735N6909
866B6172O056n6691j2768M8776J3642l8730p307L2983k356l4100R190L9572q637
879A5802m4818L168M4934J581l9411q05L4356m986l3918J2201L8916j4251m4791
892c2022J0054M6181k174m0065k163L0266q21k1138R294K0804j8659k6912K2379
$$ plain form
905 -4976 31677 12676 -28742 -16971 22470 15758 -15694 -8508 15533 3487 -18262 -298 23608
918 23608 5031 -23133 -8085 20555 11479 -13082 -5747 11650 117 -13154 6990 22945
930 22945 -4302 -27584 -491 29635 9950 -20623 -11218 13327 8653 -5360 975 7211 -5695
943 -5695 -12048 8686 19786 -3329 -20628 -422 19333 4337 -11944 -142 10781 -3620
955 -3620 -10568 8053 16371 -4652 -17455 772 17333 5960 -9748 -4325 5036 1089 -402
968 -402 8702 6169 -11682 -11092 13439 19299 -4901 -17247 728 14891 4944 -5398 -395 3006
982 3006 -1719 -1323 8267 7681 -5849 -8540 5556 11376 -254 -6066 2623 4497 -3234 -579 10098
997 10098 5388 -9199 -7405 9174 13230 -343 -9896 -2729 6846 6289 1538 -320 -3116 -4278
$$ packed form
905d976L6653j9001m1418J1771L9441o712l1452P186K4041j2046k1749J7964K3906
918B3608j8577k8164J5048K8640r076k4561P335J7397j1533j3271K0144J5955
930B2945k7247k3282K7093L0126j9685l0573R405K4545m674j4013O335O236j2906
943e695o353K0734J1100k3115j7299K0206J9755j4996j6281J1802J0923j4401
955c620o948J8621Q318k1023j2803J8227J6561j1373j5708N423R361l947j491
968d02R104k533j7851N90K4531N860k4200j2346J7975J4163r947j0342N003L401
982C006m725L96R590n86j3530k691J4096N820j1630n812Q689J874p731K655J0677
997A0098m710j4587J794J6579M056j3573r553P167R575n57m751j858k796j162
$$ plain form
1011 -4278 3446 11731 3644 -10551 -6584 8409 9702 -1593 -6015 -175 2968 902 823 3054 890
1026 890 -4049 -3175 3796 5527 -773 -4488 -902 854 619 3204 2595 -4635 -7153 2367 8891 2452
1042 2452 -8173 -7386 2874 8290 2229 -6153 -5958 -148 3762 3224 -241 -5372 -5471 1233 5966 541
1058 541 -5582 -3788 881 1060 -416 -616 -1135 -2513 -3119 -929 2898 1284 -4571 -6254 -1162 3433
1074 3433 1509 -2315 -5306 -4791 1068 5601 1181 -7723 -7512 884 6093 2011 -5999 -7878 -706
1089 -706 4952 2162 -3530 -4963 -2977 420 2731 769 -3910 -4375 -97 1532 -266 -1325 -722 -1625
1105 -1625 -2859 -649 2458 2367 -2423 -5829 -1567 5295 3954 -3560 -5477 -1530 2655 4514 1358
1120 1358 -5146 -6435 1272 7879 2769 -6314 -6633 1176 6427 2336 -4245 -3814 250 1750 599
$$ packed form
1011d278P724Q285q087j4195L967J4993J293j1295m422N840L143k066p9K231k164
1026H90m939Q74O971J731o300l715L586J756k35K585o09p230k518R520O524o439
1042B452j0625P87J0260N416o061q382J95N810L910n38l465n131r9O704M733n425
1058E41o123J794M669J79j476k00n19j378o06K190L827j614n855j683N092M595
1074C433j924l824k991N15N859M533m420q904K11Q396N209m082q010j879P172
1089g06N658k790n692j433J986L397K311j962m679m65M278J629j798j059O03r03
1105a625j234K210L107r1m790l406M262O862j341p514j917L947M185J859l156
1120A358o504j289P707O607n110r083l19P809N251m091o581M31M064J500j151
$$ plain form
1135 599 868 -634 -3914 -2093 2770 2413 -2252 -2391 -169 -836 -1479 1575 2722 -2180 -6973 -2076
1151 -2076 6126 5087 -5404 -8392 713 6316 1783 -3205 -2828 -2782 -814 4819 4636 -4471 -9144 421
1167 421 9455 3868 -6818 -5744 3296 5075 -986 -1938 2309 80 -4182 1106 8114 2049 -6680
1182 -6680 -2456 5683 3471 -1265 1143 2638 -2184 -2907 6395 10490 -1962 -11384 -267 14265
1196 14265 7381 -7509 -6150 5581 6134 829 2719 2708 -5000 -3978 9322 12123 -3570 -11804
1210 -11804 1478 12593 3759 -6719 -572 6197 -1537 -5637 6651 10972 -5125 -13312 3001
1223 3001 14140 1700 -9780 -2350 4041 -690 -828 6855 2825 -12569 -9959 12173 15732 -8391
1237 -8391 -19873 716 15352 1445 -9955 -1481 2941 -6332 -3559 10694 5697 -14435 -12829
$$ packed form
1135E99K69j502l280J821M863l57m665j39K222o67o43L054J147m902m793M897
1151b076Q202j039j0491k988R105N603m533m988L77M6J968N633j83r107m673R565
1167D21R034n587j0686J074R040J779o061r52M247k229m262N288P008o065q729
1182f680M224Q139k212m736K408J495m822p23R302M095j2452r422J1117J4532
1196A4265o884j4890J359J1731N53n305J890j1p708J022J3300K801j5693q234
1210a1804J3282J1115q834j0478O147O769p734m100J2288M321j6097q187J6313
1223C001J1139j2440j1480P430O391m731j38P683m030j5394K610K2132L559k4123
1237h391j1482K0589J4636j3907j1400Q474M422r273K773J4253m997k0132J606
$$ plain form
1250 -12829 9636 13967 -5937 -12990 1810 6404 -6077 -4266 10854 5300 -16750 -11899 15880
1263 15880 17009 -10850 -17961 3578 11913 -982 -3491 4470 -1696 -12934 550 20601 6846
1276 6846 -21412 -14590 17239 18606 -9704 -14477 5791 7408 -7285 -638 14041 982 -19052
1289 -19052 -5453 20909 11375 -15787 -12355 9486 7745 -7457 -741 12092 -3758 -21023 695
1302 695 27068 6759 -26869 -14752 18630 14298 -10669 -9032 5526 -1974 -10537 6915 17751
1315 17751 -7357 -26727 -1269 26134 6695 -23070 -10407 14218 3556 -13070 1800 14427
1327 14427 -8637 -23079 4753 26023 235 -25800 -7465 17429 5729 -11143 -68 9038
1339 9038 -9593 -15180 13698 24001 -11128 -30732 3181 29285 3433 -21525 -4065 13528
$$ packed form
1250a2829K2465M331j9904p053J4800M594j2481J811J5120n554k2050M851K7779
1263A5880J129k7859p111K1539Q335j2895k509P961o166j1238J3484K0051j3755
1276F846k8258O822L1829J367k8310m773K0268J617j4693O647J4679j3059k0034
1289a9052J3599K6362r534k7162L432K1841j741j5202O716J2833j5850j7265K1718
1302F95K6373k0309l3628J2117L3382m332k4967J637J4558p500q563J7452J0836
1315A7751k5108j9370K5458K7403j9439k9765J2663K4625j0662j6626J4870J2627
1327A4427k3064j4442K7832K1270k5788k6035J8335K4894j1700j6872J1075R106
1339I038j8631n587K8878J0303l5129j9604L3913K6104k5852k4958J7460J7593
$$ plain form
1351 13528 -1371 -9694 10649 13801 -13899 -19919 13406 26293 -5880 -24369 2870 19997
1363 19997 -2361 -12312 9819 13166 -15438 -15846 19754 24549 -14590 -26314 8990 24813 -1590
1376 -1590 -15115 4137 9518 -10044 -6588 19599 12894 -22798 -19566 21433 24978 -14160 -22531
1389 -22531 9834 17208 -9032 -10337 14255 8956 -19395 -12242 21016 17105 -17953 -18883 13011
1402 13011 15856 -10873 -10176 13689 5853 -20000 -5806 25718 10868 -26433 -16406 22640 19132
1415 19132 -15258 -15474 11427 9571 -11508 -3734 17449 2912 -22052 -4993 25541 10236 -22898
1428 -22898 -10334 20623 10195 -16686 -4445 19161 3470 -20644 -2215 24622 6994 -22240
1440 -22240 -7841 20717 9245 -15406 -3760 16050 690 -17078 4262 23425 -2249 -25402
$$ packed form
1351A3528j4899q323K0343L152k7700o020L3325J2887l2173j8489K7239J7127
1363A9997k2358r951K2131L347k8604m08L5600M795l9139j1724L5304J5823k6403
1376a590j3525J9252N381j9562L456K6187o705l5692L232M0999L545l9138q371
1389b2531L2365P374k6240j305K4592n299k8351P153L3258l911l5058r30L1894
1402A3011K845k6729O97K3865p836k5853J4194L1524j4850l7301J0027L9046l508
1415A9132l4390k16K6901j856k1079P774K1183j4537k4964J7059L0534j5305l3134
1428b2898J2564L0957j0428k6881J2241K3606j5691k4114J8429K6837j7628k9234
1440b2240J4399K8558j1472k4651J1646J9810j5360j7768K1340J9163k5674k3153
$$ plain form
1452 -25402 596 27182 4320 -22870 -3930 20004 3742 -16176 614 17112 -2793 -18790
1464 -18790 4091 21218 -2895 -21353 2039 20273 -2729 -18910 4376 18311 -7094 -20059
1476 -20059 6325 20703 -5858 -21848 2617 19322 -2847 -18338 1968 14505 -5987 -15694
1488 -15694 7235 14547 -10434 -17765 9385 16562 -10235 -18649 7739 16076 -8938 -17471 7141
1501 7141 14935 -8832 -16387 6952 14285 -8759 -14832 7468 12086 -10392 -12609 10651 11074 -13113
1515 -13113 -12675 12311 12195 -13300 -13870 11193 12643 -11239 -12768 10071 11365 -11284 -11872 10231
1529 10231 10140 -10938 -9923 10855 7628 -12487 -6787 13315 6124 -15287 -7760 14712 8597 -14343
1543 -14343 -10527 11833 9552 -10788 -8819 9619 6157 -10893 -4835 11996 3475 -13877 -4635
$$ packed form
1452b5402K5998K6586k2862k7190J8940K3934j6262j9918J6790J6498j9905j5997
1464a8790K2881J7127k4113j8458K3392J8234k3002j6181K3286J3935k5405j2965
1476b0059K6384J4378k6561j5990K4465J6705k2169j5491K0306J2537k0492r707
1488a5694K2929P312k4981p331K7150P177k6797q414K6388Q337k5014q533K4612
1501G141P794k3767p555K3339P333k3044o073K2300M618k2478k217K3260M23k4187
1515a3113M38K4986j16k5495n70K5063J450k3882j529K2839J294k2649n88K2103
1529A0231r1k1078J015K0778l227k0115N700K0102p191k1411P527K2472o115k2940
1543a4343L816K2360k281k0340J969J8438l462j7050O058J6831q521j7352R242
$$ plain form
1556 -4635 13000 3944 -13453 -4257 11945 3033 -12822 -3634 12864 3112 -14318 -5222 12997
1569 12997 5626 -11739 -5988 8932 3306 -8387 -520 8538 -2584 -11616 2454 12723 -1145
1582 -1145 -14703 -1732 13095 3366 -11021 -3501 8891 1807 -8651 -62 9279 -1301 -10472
1595 -10472 1042 9876 -637 -9049 852 7877 -1924 -7173 3879 8444 -4161 -9953 3725
1608 3725 12243 -1097 -11794 -969 10053 1988 -5888 -40 4645 -2556 -3420 5789 6134 -6007
1622 -6007 -7675 5505 9686 -2610 -8181 2066 7286 -969 -5154 3242 6260 -3703 -5760 4460
1636 4460 7852 -2033 -5783 2348 5377 -857 -2055 3399 1639 -4290 -1232 7512 5257 -5902 -6594
1651 -6594 5132 9182 -1400 -6130 913 4761 -30 -755 3045 705 -3898 -534 5661 3143 -3817
$$ packed form
1556d635J7635r056j7397R196J6202q912j5855R188J6498r752j7430R096J8219
1569A2997p371j7365N751J4920n626j1693P867R058j1122r032J4070J0269j3868
1582a145j3558J2971J4827r729j4387P520J2392p084j0458Q589R341j0580r171
1595a0472J1514Q834j0513q412R901P025r801n249J1052M565j2605n792J3678
1608C725Q518j3340j0697J0825J1022q065p876N848M685p201q64R209L45j2141
1622f007j668J3180M181j2296n571J0247N220q255m185Q396L018r963k057J0220
1636D460L392r885l750Q131L029o234j198N454j760n929L058Q744k255j1159o92
1651f594J1726M050j0582m730P043L848m791p25L800k340m603L364O195k518o960
$$ plain form
1666 -3817 -2927 3915 4078 -2125 -2011 3359 2348 -3515 -1464 5931 3767 -4046 -4089 3491 4492 -398
1682 -398 -1831 -141 603 83 2773 2949 -1714 -4480 764 6352 2749 -4896 -4088 3839 4780 -1027
1698 -1027 -2048 709 551 -575 837 2169 -461 -2291 -250 2146 1235 -1077 -450 654 -376 -1437
1714 -1437 1607 3539 -770 -4451 -216 5037 2478 -3265 -3360 422 2414 1893 -472 -2370 -2256 524
1730 524 2848 1810 -2669 -4081 96 4073 1055 -3566 -2418 871 479 -951 -71 -159 -1604 -2044
1746 -2044 -317 765 63 -1717 -2389 -1126 28 357 -301 -1752 -3401 -2399 1984 2361 -3062 -5574
1762 -5574 -1413 2592 1615 -2467 -4267 -2513 701 1883 -682 -3181 -3197 -1044 1833 606 -2705 -3783
1778 -3783 -729 1474 -398 -2044 -457 -641 -1774 -1278 484 951 -1306 -2734 -1555 1069 1359 -583
$$ packed form
1666c817Q90O842J63o203J14N370j011n863K051P395k164p813m3P580J001m890
1682c98j433J690P44n20K690J76m663k766N244N588l603p645Q08P927R41n807
1698a027j021K757j58j126J412J332k630j830K041K396r11k312O27J104j030j061
1714a437L044J932m309l681M235N253k559n743r5L782J992n21k365j898J14K780
1730E24K324j038m479j412M177L977l018m621J148L289l92j430Q80q8j445m40
1746b044J727J082p02j780o72J263J154L29o58j451j649J002M383L77n423k512
1762e574M161M005r77m082j800J754L214J182k565k499j6K153K877j227l311j078
1778c783L054K203j872j646J587j84j133M96J762M67k257j428J179K624K90j942
$$ plain form
1794 -583 -2366 -1788 -198 1709 2633 -1178 -4538 -1266 4365 3421 -2201 -3982 -47 2980 2120 -286
1810 -286 -1519 -1289 414 1718 1818 13 -2212 -730 2454 1554 -749 -772 1243 -120 -1411 1031
1826 1031 3238 154 -3236 -1347 2857 3116 -611 -2863 -715 1454 1689 1298 44 -2389 -2402 2743
1842 2743 4922 -858 -5250 -987 4341 2146 -2175 -2205 426 540 -429 575 932 -1192 -2682 -40
1858 -40 2765 313 -2855 -306 1397 -1142 -1625 2408 2520 -3543 -4628 2443 5252 -40 -5201 -1812
1874 -1812 3309 2293 -1414 -1048 223 -735 -415 3864 2619 -3749 -3769 3893 5929 -1623 -4395 1761
1890 1761 4053 -356 -2088 2353 3423 -1935 -2652 3263 5007 -589 -3396 1992 3872 -756 -786 3913
1906 3913 1960 -4373 -1054 7348 4844 -4971 -4638 4816 6602 -1482 -4034 2004 4034 -928 -1162
$$ packed form
1794e83j783N78J590J907R24l811l360L272N631r44n622j781L935L027q60k406
1810b86j233K30J703J304J00j805k225J482L184r00k303k3K015j363j291K442
1826A031K207l084l390J889M204K59l727k252K148K169K35l91j254k433j3N145
1842B743K179n780m392M263N328k195m321l0K631J14r69J004L57k124j490K642
1858d0K805k452l168K549J703k539m83M033J12o063j085P071K809n292n161L389
1874a812N121j016l707L66J271r58L20M279j245o368k0P662K036p552k772O156
1890A761K292m409j732M441J070n358p17N915J744n596k807N388J880m628l0M699
1906C913j953o333L319Q402k504r815L33R454J786q084k552O038K030m962k34
$$ plain form
1921 -1162 4191 2445 -4264 -1588 6515 3692 -5109 -2700 5936 3447 -4694 -1717 6152 3003 -5963
1936 -5963 -2663 6285 4269 -5146 -3976 4578 4073 -3394 -1953 4672 611 -5911 133 7765 204
1951 204 -8466 -1516 8157 2271 -7358 -3047 5950 2440 -6213 -2543 6096 1145 -6517 -1405 6370
1966 6370 544 -6863 -517 6174 -906 -7650 1071 7546 -1855 -9579 -80 8537 76 -9522 -1767
1981 -1767 7191 825 -7670 -869 6511 -1725 -7732 1480 6818 -2880 -8230 2001 7324 -3660
1995 -3660 -8239 2944 7483 -3864 -9790 2694 9713 -2322 -10040 867 8185 -1461 -7617 1894
2009 1894 5896 -4556 -6360 5481 6985 -6817 -8936 5417 8787 -5079 -8937 3657 7986
2022 7986 -4240 -7648 4766 7595 -6261 -8720 5332 8177 -4679 -7719 4170 5633 -5426
$$ packed form
1921a162N353j746o709K676Q103k823q801K409Q636k489q141K977P869l149q966
1936e963L300Q948k016r415J170Q554n05p467J441O625m061o522O044P632p561
1951B04q670O950R673n886r629M311Q997l510q653L670Q639m951p662N112P775
1966F370n826p407O346O691p080o744Q721O475r401p724R499Q617q461r598P755
1981a767Q958o366q495O801P380q236o007R212N338r698n350J0231N323j0984
1995c660m579J1183M539j1347n926J2484P019j2035p718J0907P318r646o156R511
2009A894M002j0452j804J1841J504j3802k119J4353L370j3866l858J2594M329
2022G986j2226l408J2414K829j3856k459J4052K845j2856l040J1889J463j1059
$$ plain form
2035 -5426 -4415 6965 4113 -9138 -5903 9595 8283 -8840 -9802 6468 9405 -4696 -7435 4397
2049 4397 4619 -6344 -3381 8672 3860 -9856 -5152 9759 6225 -8079 -6212 7062 4615 -7466
2063 -7466 -3545 9442 3109 -11295 -5163 11277 6594 -9537 -7274 7040 5070 -5921 -1565
2076 -1565 6501 -697 -9820 766 12268 1389 -13617 -4555 12180 6074 -8836 -4873 7225
2089 7225 2015 -7516 613 10067 -1015 -11904 -570 12584 2337 -10250 -2701 7655 1217
2102 1217 -6375 2141 8268 -3685 -11636 3214 14627 293 -13834 -2738 11674 4025 -7247
2115 -7247 -742 5902 -2533 -5816 5922 9795 -5320 -11783 3092 13120 208 -10097 -225
2128 -225 7877 -1054 -6097 4759 8360 -6069 -10681 5778 13110 -1980 -11223 399 8497 437
$$ packed form
2035e426J011J1380k852j3251L235J5498j312j7123r62J6270K937j4101k739J1832
2049D397K22j0963K963J2053m812j3716M704J4911l534j4304J867J3274k447j2081
2063g466L921J2987o333j4404O132J6440m683j6131K263J4314j970j0991M356
2076a565Q066p198r123J0586J1502j0879j5006R062J6735o106j4910L963J2098
2089G225n210r531Q129R454j1082j0889J1334J3154j0247j2587P549J0356o438
2102A217p592Q516O127j1953p951J4850J1413j4334j4127J1096J4412p649j1272
2115g247O505O644q435l283J1738L873j5115o463J4875J0028j2912j0305R872
2128b25Q102q931n043J0856L601j4429m612J6459P332j5090r243J1622Q098q060
$$ plain form
2142 437 -4281 3592 3698 -6910 -5385 9593 10327 -8071 -12832 5461 12660 -1427 -8917 1459
2156 1459 6213 -3164 -3199 6632 4811 -8718 -7088 8172 9527 -5308 -8699 3549 6444 -3752
2170 -3752 -3792 6596 3428 -9679 -5409 11099 8891 -8369 -10263 4337 8050 -1927 -4564 2239
2184 2239 366 -5263 303 9459 1669 -11643 -5611 10581 8402 -7477 -8131 4425 4823 -4253
2198 -4253 -1865 5941 220 -8543 -1864 9330 4373 -7951 -5945 5242 4133 -3856 -1274 4485
2212 4485 -1545 -8047 1014 10939 1184 -11263 -4531 8902 5563 -5452 -4295 2435 730 -2960
2226 -2960 2177 5468 -3364 -8823 1265 9789 1312 -9231 -3141 6216 2191 -4663 69 4538
2240 4538 -2863 -6317 2537 7974 -886 -8588 -1770 6232 2113 -4508 -1204 2368 -2142 -3579 4109
$$ packed form
2142D37m718P873J06j0608J525J4978P34j8398m761J8293P199j4087p490J0376
2156A459M754r377l5R831j821j3529J630J5260J355j4835l391J2248K895j0196
2170c752m0J0388l168j3107M270J6508k208j7260j894J4600L713r977k637O803
2184B239j873n629N566R156p790j3312O032J6192k179j5879o54J2556L98r076
2198d253K388P806n721q763O679J1194m957j2324K006J1187j109p989K582N759
2212D485o030o502R061R925r755j2447O732J3433l339j1015J157O730j705l690
2226b960N137L291q832n459J0088Q524q477j0543O090R357m025o854M732M469
2240D538p401l454Q854N437q860p702O818Q002m119o621L304L572m510j437P688
$$ plain form
2255 4109 5482 -4891 -8710 2700 8692 -344 -7681 -1390 4689 314 -2645 1550 2566 -3466
2269 -3466 -4434 3062 5481 -2419 -6749 634 5308 -485 -3686 999 1983 -3781 -2758 4930 4247 -4490
2285 -4490 -6240 2657 6348 -602 -5305 -857 2609 234 -903 1926 504 -4181 -2186 5235 3630
2300 3630 -4565 -4770 3110 4305 -1651 -2942 1392 1977 -2080 -1505 3067 2620 -2925 -3509 2294 3285
2316 3285 -1142 -1944 1377 586 -2135 699 4003 -195 -5123 -1566 5174 3589 -3555 -4464 1365 3918
2332 3918 358 -1914 -218 -336 -1006 1103 2805 -860 -4261 -389 4203 1474 -3411 -1861 2561
2347 2561 1544 -1637 -807 1872 966 -2182 -1020 1824 1374 -1763 -1133 1156 708 -679 655 1251
2363 1251 -1755 -2200 1929 3620 -816 -3515 -1031 3406 2313 -1634 -2487 198 1310 451 311 138
$$ packed form
2255D109J373j0373l819J1410N992r036p337O291O079m375k959M195J016o032
2269c466r68P496K419p900m330P383M674n793l201M685R84n764J023P688o83q737
2285d490j750Q897L691o950m703M448L466k375j137K829j422m685J995P421j605
2300C630q195k05P880J195n956j291M334N85m057N75M572m47n545n84N803R91
2316C285m427q02L321p91k721K834L304m198m928L557O740j585p144r09N829K553
2332C918l560k272J696j18o70K109J702l665l401L872M592k729m885J550M422
2347B561j017l181Q30K679r06l148J162K844m50l137O30K289m48j387J334N96
2363A251l006m45M129J691m436k699K484M437j093l947q53K685J112q59j40j73
$$ plain form
2379 138 -1285 -1489 1834 2591 -1097 -2595 -88 2275 400 -1061 -294 830 -74 -744 574 1477 -291
2396 -291 -1753 140 1947 1112 -994 -817 257 307 298 823 310 -1597 -807 1762 1854 -518 -1990 -462
2414 -462 1829 1165 -382 -613 343 27 -33 974 1073 -910 -1348 451 1267 267 -604 -380 -136 206 916
2433 916 1251 -37 -1391 -833 1957 2376 -699 -2537 -263 2006 1692 -706 -1467 -667 162 1695 728
2450 728 -1272 -1752 134 2082 987 -1299 -1491 429 1513 7 -1043 378 956 -887 -1005 416
2466 416 764 264 -296 -522 -160 866 1064 -20 -1681 -1445 958 2457 334 -2970 -2244 1763 2984
2483 2984 -612 -2919 -1020 1115 1918 722 -1359 -2259 -575 1801 1900 -717 -2378 -678 1493 1271
2499 1271 -1269 -1282 715 873 -951 -355 919 300 -968 -480 343 100 37 -48 -414 -1240 -120 1712
$$ packed form
2379A38j423k04L323P57l688j498K507K363j875j461P67J124r04o70J318R03j768
2396b91j462J893J807q35k106J77J074N0rN25n13j907P90K569R2k372j472J528
2414d62K291o64j547k31R56l16o0J007R9j983m38J799Q16j000q71K24K44L42P10
2433I16L35j288j354N58K790M19l075j838K274K269l14k398p61Q00Q29J533r67
2450G28k000m80J886J948j095k286j92J920J084j506j050J421N78j843j18J421
2466D16L48n00n60k26L62J026J98j084j661K36K403J499k123l304P26M007J221
2483B984l596k307J899K135Q03j196k081r00J684K376R9k617j661J700K171k22
2499A271k540j3J997J58j824N96J274o19j268M88Q23k43o3q5l66q26J120J832
$$ plain form
2517 1712 1365 -1696 -2355 557 2939 412 -2836 -2025 1164 1397 180 -401 -684 -930 465 2209 669
2534 669 -2064 -1843 963 2195 -180 -1936 -353 1081 34 -961 635 1211 -1686 -1522 1447 2093
2550 2093 -897 -1483 355 1027 -11 -268 623 223 -1470 -428 2217 1707 -1967 -2023 1510 2507 -862
2567 -862 -1770 692 1108 -1300 -626 1896 495 -2446 -1515 1739 1953 -1214 -1693 271 691 -841 -200
2584 -200 1506 -367 -3408 -181 3767 1312 -3683 -2489 2751 2453 -1532 -2059 682 688 -733 188 1662
2601 1662 -605 -2627 -94 3645 636 -3814 -966 3415 848 -3200 -880 3082 110 -3311 -689
2616 -689 3255 679 -2303 -1223 1815 391 -1555 712 1790 -1585 -3016 1986 4482 -1696 -5793
2631 -5793 103 5547 1332 -4171 -1456 2709 1270 -1258 313 820 -1632 -1772 2410 2949 -2490 -4240
$$ packed form
2517A712l47l061o59K912K382k527l248Q11L189K33j217n81k83k46J395J744j540
2534F69k733K21K806J232k375j756J583J434j047r95J596N76k897J64K969O46
2550B093k990n86J838O72j038k57Q91m00j693J042K645n10l674n6L533R97l369
2567h62r08K462M16k408O74K522j401k941R31L254K14l167m79J964M20j532O41
2584b00J706j873l041L227L948k455m995J194N240k98l985n27K741Oj421R21J474
2601A662k267k022K533L739l009m450K848M381k567m048K320L962k972l421K622
2616f89L944k576k982J080L038j424j946K267J078l375j431N002K496o178m097
2631e793N896N444m215n503K715M165j439k528J571N07k452j40M182N39n439j750
$$ plain form
2647 -4240 1800 4588 -1499 -4613 1025 4156 -1152 -3993 1480 3465 -1048 -2996 1224 3104 -841
2662 -841 -2408 1373 2135 -1948 -1938 3085 2891 -3785 -3779 3718 4536 -2693 -4600 2284 4310 -795 -2777
2679 -2777 1245 1917 -1518 -1230 2905 1914 -4126 -2824 4173 3918 -3660 -4028 3355 3445 -2517 -2507 2912
2696 2912 2159 -3832 -2057 4340 2490 -4007 -2822 3612 3110 -3143 -1942 2823 1480 -3947 -1276
2711 -1276 4442 1591 -5176 -2287 4950 2538 -4629 -2242 3681 1907 -3656 -1137 3840 843 -4470
2726 -4470 -1273 5360 1900 -4840 -2256 4123 1642 -3589 -813 3726 -531 -4700 786 5540 -359
2741 -359 -6446 -872 6099 1876 -5120 -2139 3706 1382 -3050 -123 3583 -1101 -4138 1681 5272
2756 5272 -1217 -5713 905 5797 -476 -5009 708 4613 -714 -4879 949 5094 -191 -5187 156
$$ packed form
2647d240O040K788o087l114N638L131n308k841N473J985m513j948M220J880l945
2662h41j567L781P62m083J0N023j94o676OP497Q18p229j907O884K026n105j982
2679b777M022O72l435K88M135r91o040J302O997k55p578l68P383R0n962J0N419
2696B912p53n991J775O397j850o497J185O434n02o253J201M765j343n427K671
2711a276N718k851o767K889P237k412p167K387N923j774n563K519M977k997n313
2726d470L197O633l460o740K584O379k481n231K776M539m257m169N486M754n899
2741c59o087N574O971m223o996K981N845k324m432K927L706m684l037N819L591
2756E272o489m496O618M892o273m533N717L905n327m165N828M145n285m996N343
$$ plain form
2771 156 4651 223 -3835 730 2933 -2240 -2862 3778 4289 -4258 -5887 3458 6584 -1691 -6036 295
2787 295 4852 160 -3548 433 2752 -1995 -2440 3561 3497 -4175 -4092 3595 4769 -3293 -4308 2792
2803 2792 4384 -2789 -3547 3206 3965 -3015 -4846 2630 4111 -1987 -3328 1671 2633 -2617 -1746 4100
2819 4100 1883 -5345 -2752 5523 3613 -5038 -4722 3585 4242 -2205 -3582 1887 1996 -2684 -1341 3597
2835 3597 1535 -4676 -2004 4772 2390 -4568 -2634 3802 1829 -3579 -1538 3466 1072 -4319 -1672
2850 -1672 4729 2409 -4278 -2390 3419 2271 -3489 -1312 3473 118 -3968 -35 4567 100 -5011
2865 -5011 -714 4377 1226 -3938 -1034 3428 697 -3497 25 4018 -79 -4300 -238 4717 578
2880 578 -4088 -792 3513 253 -2918 482 2518 -1146 -3381 1476 4227 -1213 -4843 175 4680
$$ packed form
2771A56M495m428m058M565K203n173o22O640N11q547j629R345L126q275m345O331
2787B95M557m692l708L981K319m747m45O001o4p672Q3P687J174q062j015P100
2803B792J592p173p58O753P59o980j831P476J481o098j341M999R62n250Q71N846
2819D100k217p228K593Q275j910q651L16Q307O57o447j377N469J09m680J343M938
2835C597k062o211K672O776k382o958J934O436j973n408K041N004k394n391K647
2850a672O401k320o687J888N809j148n760K177M785l355m086L933M602m467n111
2865e011M297N091l151n164K904M462k731m194L522L993m097m221M062M955m139
2880E78m666L296M305l260l171L400K036l664k235M857K751n440l630N018M505
$$ plain form
2895 4680 42 -3938 -310 3301 -74 -3053 580 2648 -1196 -2772 1192 2837 -1535 -2973 1490
2910 1490 2762 -1513 -3226 1463 3493 -1602 -3922 934 3673 -977 -3640 612 2672 -689 -1576
2925 -1576 972 1461 -1975 -1395 2632 1803 -3072 -2546 3056 3191 -2129 -3859 1906 3482 -1196 -2986
2941 -2986 491 2045 -810 -1109 1511 562 -1925 -806 2258 1127 -2364 -1538 2771 2244 -2180 -2346
2957 -2346 2299 2435 -1895 -2182 1479 1877 -1693 -1386 1162 598 -1158 -193 1662 56 -2426 -249
2973 -249 2637 888 -3051 -1681 2598 1918 -2125 -1863 1566 1699 -905 -798 1101 529 -1089 125
2989 125 1822 -142 -2158 -110 2054 683 -1920 -717 1612 584 -1559 -637 1612 413 -2181
3004 -2181 -245 1914 541 -1578 -246 1244 187 -551 -126 860 -248 -939 320 1714 -493 -2390
$$ packed form
2895D680m638l980L628L611l375k979L633K068l844j576L964J645m372j438M463
2910A490J272m275j713M689K030n095k320M856K739m650k663M252K060l361q87
2925a576K548M89l436N80M027q29m875N26N602J35n320j730N765J576m678j790
2941b986L477J554k855k99K620r49k487J119L064j131l491Q26M309n27m424j66
2957b346M645J36m330k87L661L98l570L07K548n64j756R65J855j606k482K177
2973b49K886j749l939J370M279o80m043K62L429J33k604J07J899n72j618J214
2989A25J697j964k016K048K164j371k603J203K329j028k143R22K249j199k594
3004b181J936K159j373k119J332J490j057p38M25R86j108o91J259J394k207j897
$$ plain form
3020 -2390 -198 1957 163 -1672 -559 1073 199 -1009 155 1156 -146 -1023 415 1453 97
3035 97 -1034 -150 519 -163 -672 404 738 -916 -791 1284 1534 -1006 -1985 227 1875 802 -1371
3052 -1371 -666 219 815 306 124 -543 -1078 -525 958 874 -936 -1304 687 1469 -376 -1017 581 895
3070 895 -326 -670 484 690 -52 -668 -461 658 434 215 -197 -128 -601 556 1457 43 -1630 -1249
3088 -1249 1624 1476 -398 -1597 -316 1073 1005 -484 -901 -533 -191 502 940 100 -991 -313 1546
3105 1546 698 -951 -781 796 463 -523 -393 655 673 -196 -560 -171 727 316 -584 -516 -103 443 290
3124 290 380 -747 -1043 640 1683 309 -1650 -808 910 1292 20 -978 -250 498 318 235 39 -414
3142 -414 -586 -6 724 473 -1004 -486 492 -59 -147 236 427 -227 -633 76 763 243 -832 -624 387
$$ packed form
3020b390K192K155j794j835J113J632q74j208J164J001j302q77J438J038j356
3035I7j131Q84O69o82n09J076L34j654J25K075K50k540r79K212J648j073k173
3052a371P05Q85N96n09j82o67n35N53J483q4j810l68J991P82j845o41J598L14
3070H95j221l44J154K06p42o16K07J119k24k19m12O9m73J157R01j414j673L81
3088a249K873j48j874j199J281J389o8j489m17L68L42O93M38q40j091O78J859
3105A546q48j649J70J577l33r86J30J048J8q69l64L89Q98m11r00O8M13N46j53
3124B90R0j127k96J683J043j374j959Q42J718L82j272r98P28P48j80q3j96m53
3142d14j72N80P30k51j477N18R78n51q8L83J91o54m06P09O87n20j075K08J011
$$ plain form
3161 387 838 -258 -703 -289 -59 187 586 529 -662 -1009 534 1263 -34 -771 -337 561 258 -347 24
3180 24 203 -94 -436 -202 764 -83 -739 -68 671 -8 219 253 -29 -613 -72 1284 421 -955 -896 483
3200 483 1226 192 -1257 -390 638 626 -16 93 -105 -574 74 1156 354 -1234 -460 1136 793 -839
3218 -839 -695 517 749 -557 -605 354 880 -230 -1025 224 871 -2 -835 345 23 -351 768 906
3236 906 -488 -1819 -234 1663 444 -1453 -1232 525 1382 -249 -1123 -172 167 -458 232 504 -750
3253 -750 -1315 446 1355 -243 -1448 -394 1276 -79 -1113 -403 936 334 -1283 -607 1009 393 -1227
3270 -1227 -786 919 164 -847 53 470 -809 -629 808 970 -1053 -1801 401 1585 108 -2246 -808
3287 -808 1478 370 -897 -246 880 -193 -946 856 1213 -942 -1645 833 1511 -586 -1272 608 943
$$ packed form
3161C87M51j096m45M14K30K46L99n7j191l47J543P29j297p37M34Q98l03o05L71
3180B4J79k97l42K34R66q47o56O71P39o79K27L4k82n84N41J356q63j376N9J379
3200D83P43j034j449Q67J028j2o42J09j98m69O48J082q02j588P74J596l43j632
3218h39J44J212K32j306m8R59N26j110p95J249O47q73q33J180l22l74J119J38
3236I06j394j331J585J897j219j897K21J757Q57j631q74R51L39o25O90K72j254
3253g50n65J761R09j598j205J054J670j355j034P10J339o02j617O76J616o16j620
3270a227M41J705p55j011R00M17j279J80J437J62k023p48K202J184j477k354J438
3287h08K286j108j267O51J126j073p53J802L57k155p03K478O78k097o86J880L35
$$ plain form
3304 943 -596 -1147 691 1545 -894 -1741 797 1869 -439 -1656 415 933 -524 -94 658 455 -1301
3321 -1301 -415 2050 1422 -1925 -1838 1267 1751 -842 -1908 362 1107 -699 -898 1353 1053 -1373 -1091
3338 -1091 1726 1272 -1668 -1307 1193 910 -875 -406 1633 501 -2287 -813 2254 1534 -2246 -2159 1523
3355 1523 1818 -929 -1059 729 539 -1102 460 1553 -496 -2271 -206 2715 823 -2241 -1210 1912
3371 1912 1144 -1455 -760 1939 508 -2074 -256 2350 687 -2395 -752 1668 499 -1151 14
3386 14 1260 -629 -1369 1027 2906 -71 -3328 -390 3333 1253 -2409 -1246 1976 465 -1028 769
3402 769 1230 -1070 -2112 1339 2600 -618 -2691 316 2482 63 -1546 373 1880 -651 -2072
3417 -2072 1322 2915 -1000 -2874 445 2560 251 -1827 440 1127 -435 -476 1879 1719 -2252 -2384
$$ packed form
3304I43j539n51J838Q54k439q47K538J072k308j217K071N18j457M30P52k03j756
3321a301Q86K465o28l347Q7L105M84k593j066K270P45j806j99K251l00k426K82
3338a091K817m54k940L61K500k83j785M69K039j132k788J474L067p20l780Q7L682
3355A523K95k747j30J788j90j641J562J093k049j775K065K921j892l064J031L122
3371A912p68k599O95K699j431k582J818K606j663l082J643K420j169j650J165
3386A4J246j889p40K396J879k977l257K938L723k080l662J163L222j511j493J797
3402G69M61k300j042L451J261l218k073L007K166k419j609J919J507k531j421
3417b072L394J593l915j874L319K115k309k078K267O87j562m1K355j60l971j32
$$ plain form
3433 -2384 2061 3175 -788 -3172 494 2677 -33 -1541 872 1026 -1824 -1042 1806 1684 -1866 -1997
3449 -1997 1394 2165 -761 -1532 1045 1210 -1616 -1284 2363 1463 -2659 -2276 2139 2692 -1457 -2070 757
3466 757 1066 -1023 -756 1119 96 -1965 -640 2637 1339 -2543 -2106 2375 1978 -1745 -1469 1596
3482 1596 805 -2276 -620 2117 589 -2353 -1144 1943 1130 -1982 -928 923 221 -1639 174 2170
3498 2170 -255 -3048 -256 3013 689 -2761 -1225 2126 1269 -1477 -687 1167 -347 -1447 154
3513 154 1648 -400 -2708 -12 2505 574 -2620 -212 2035 208 -2099 78 2150 -478 -2692
3528 -2692 210 2176 247 -2067 -702 1682 3 -1099 312 1200 -1011 -1830 1285 2357 -1264
3543 -1264 -2897 627 2543 -217 -2331 80 1570 -20 -1249 463 1126 -1237 -1509 655 1811
$$ packed form
3433b384M445J114l963k384L666K183k710j508K413J54k850P82K848j22l550j31
3449a997L391P71k926p71K577J65k826L32L647r00m122L83M415N53m149o13K827
3466G57L09k089K67J875j023k061J325L277j298l882M37M481l97l723K76L065
3482A596p91l081J656K737j528k942J209L087q13l112J054J851p02j860J813J996
3498B170k425k793K792L269k324l450J536L351q57k746P90J854j514j100J601
3513A54J494k048k308K696K517j931l194K408K247j827k307K177K072k628k214
3528b692K902J966j929k314J365K384j679j102J411Q88k211q19L115J072l621
3543a264j633L524J916k760k114K411J490j590j229J712O63k363k72K164J156
$$ plain form
3558 1811 -921 -1987 524 1632 -773 -1565 1184 1588 -1668 -1496 1138 2034 -1109 -1978 672 1600
3574 1600 79 -1417 482 896 -654 -638 1352 1088 -1957 -1242 1808 1622 -1594 -1668 1253 1846 -793
3591 -793 -1308 680 980 -728 -670 1280 1026 -1087 -816 1242 913 -990 -965 1187 508 -1658 -500 1602
3609 1602 431 -1999 -784 1854 1335 -1165 -1253 816 1140 -614 -450 576 168 -1166 161 1453
3625 1453 133 -1715 -257 2018 630 -1291 -220 1340 441 -1050 -286 822 423 -1076 -371 1402
3641 1402 411 -869 -400 1096 196 -739 443 1025 -372 -1227 620 1611 -210 -1741 -431 1593 756
3658 756 -971 -660 826 598 -596 53 451 -425 -692 810 1271 -462 -1074 431 1517 -37 -877
3675 -877 44 852 77 -905 307 1022 212 -1600 -143 1398 457 -440 -53 622 -207 120 577 492 -820
$$ packed form
3558A811k732j066K511J108k405p92K749M04l256J72K634Q96l143q69K650R28
3574A600j521j496J899M14j550J6J990k64l045P15L050j86l216p4K921N93k639
3591g93n15J988L00j708N8J950k54k113K71K058l29j903K5K152o79k166J158K102
3609A602j171k430J215K638n19k500q8K069L24j754J64J026m08j334J327J292
3625A453j320j848J458K275j388j921J071J560q99j491P64J108l99j499P05J773
3641A402r91j280M69J496r00r35J182N82j397q55J847R91j821j531J310K024q37
3658G56j727L11J486k28j194O49L98q76k67J502M61j733o12J505J086j554q40
3675h77R21Q08p75r82J212P15q10j812J457J541r41q97L87O75q29L27M57q5j312
$$ plain form
3694 -820 -536 927 1291 -489 -1229 54 901 518 -775 -156 757 -137 -521 525 402 -462 -339 630
3712 630 507 -707 -604 343 396 -419 -719 641 392 -541 -1111 279 991 -457 -965 -204 578 293 -409
3731 -409 18 -149 -645 200 702 -85 -991 -656 407 871 -192 -754 60 689 250 -676 -87 70 -360
3750 -360 -453 211 348 -457 -261 -86 -22 -398 -293 236 -21 -724 -2 776 362 -581 -917 439 955 -44
3770 -44 -721 -116 -88 119 265 199 -565 -261 454 711 105 -739 -280 571 602 -212 -534 298 199 -238 8 445
3792 445 362 -381 -42 130 285 175 -46 -162 -90 256 570 92 -418 -550 96 1185 291 -922 -647 430
3812 430 343 -116 -359 -17 -124 -45 432 49 -593 -710 383 478 -177 -358 -82 434 -222 -510 -23 392 -229
3833 -229 -869 -178 515 91 -352 -485 -25 -124 217 248 -437 -418 -30 500 602 -735 -772 197 770 -79 -651
$$ packed form
3694h20K84J463L64j780p40J283Q47l83j293O19R13q94l84J046j23q64J23R69
3712F30j23j214J03R47N3q15l00J360k49r33n70J390P12j448n08P61P82k85p02
3731d09M27j67m96Q45N02p87r06L35J063M64j063n62Q14O29m39r26N89J57m30
3750c60r3O64J37q05J96J75O4l76J05N29k57p03P22P78m14r43l36J356N16r99
3770d4o77O05K8K07J46o6p64L04P15K57o06q44M59Q51L1q14l22Q32r9m37K46M37
3792D45q3p43L39J72J55j10k21j16P2L46L14m78n10j32O46J089q94j213K75J077
3812D30q7m59k43L42j07P9M77l83o42j17J093R5o55j81K76N16o56k88M87M15o21
3833b29o40O91O93m24m43j33M60r9L41L1o85J9L88N30J02j337l7R69N73q49n72
$$ plain form
3854 -651 -86 491 -10 364 -148 -245 -226 95 441 62 -81 -726 60 214 -26 -236 497 262 -577 -251 506
3875 506 543 -504 -660 92 572 343 -255 -627 -100 229 186 421 -162 -528 63 716 475 -905 -669 616
3895 616 766 -20 -365 79 311 -48 174 469 86 -77 -11 332 213 -219 -152 245 -254 -156 110 731 -196
3916 -196 -972 -228 678 488 -771 -450 175 74 -14 -169 -7 -196 -470 516 260 -682 -1178 -116 847 183
3936 183 -664 -59 668 -133 -621 305 685 -385 -408 -202 513 2 -557 -223 50 -334 -388 196 353 -619
3956 -619 -788 755 790 -625 -1321 106 998 202 -461 -63 -13 -185 -5 413 270 -702 -609 607 805 -688
3976 -688 -847 537 484 -617 -357 637 503 -651 -603 559 830 -304 -732 141 482 182 47 -110 43
3995 43 -817 -22 1385 469 -1537 -788 1498 979 -629 -728 671 293 -370 -46 182 315 -468 -299 823
$$ packed form
3854f51N65N77n01L74n12r7J9L21L46l79j43o45P86J54k40k10P33k35q39L26P57
3875E06L7j047j56P52M80k29n98l72N27L29m3K35n83l66N91O53k41j380K36J285
3895F16J50p86l45M44K32l59K22K95l83j63O6L43j19m32O7L97m99R8K66O21r27
3916a96p76P44R06j90j259L21O25j01q8j55J62j89k74R86k56r42m96J062R63o64
3936A83q47O05P27q01m88R26L80j070k3K06P15n11n59L34K73l84n4N84J57r72
3956f19j69J543L5j415o96J427Q92p96o63L98N0j72J80M18j43r72R3J216J98j493
3976f88j59J384n3j101K60R94j34j154M8J162K71j134m28Q73L41l00j35j57J53
3995D3q60P95J407r16k006P49K286n19j608r9J399l78o63L24K28J33p83J69J122
$$ plain form
4014 823 324 -790 -468 747 259 -871 144 873 -448 -930 213 946 -14 -1035 -587 1040 471
4031 471 -493 -608 344 15 -699 484 692 -674 -1387 403 1556 46 -1314 -144 1240 202 -852
4048 -852 77 806 35 -633 160 1407 -99 -1129 10 1034 -134 -825 539 720 -747 -816 619
4065 619 1428 -881 -1400 687 1791 16 -1316 109 1094 -10 -646 375 727 -589 -599 809 1109
4082 1109 -599 -810 940 1183 -828 -788 795 906 -739 -1271 585 1036 -802 -1234 484 823 -429
4099 -429 -670 359 610 -783 -563 1093 657 -1364 -1036 1185 895 -977 -1095 789 948 -678 -1048
4116 -1048 747 729 -785 -910 862 762 -1084 -509 1054 104 -955 -350 1437 401 -1362 -487 1090
4133 1090 528 -939 -623 1208 965 -960 -582 635 630 -593 -276 923 -233 -1245 -30 1224 103
$$ packed form
4014H23m99j114L22J215m88j130J015P29j321m82J143P33r60j021M48J627n69
4031D71r64j15R52l29p14J183K08j366p13J790J153j510j360J170J384j038j054
4048h52R29P29p71o68P93J247j506j030J139J024j168o91J364J81j467o9J435
4065F19Q09k309n19K087J104j775j332J425R85j104o36J021L52j316j0J408L00
4082A109j708k11J750K43k011M0J583J11j645n32J856M51j838m32J718L39j252
4099d29k41J029K51j393K20J656m36k021L28K221k90j872j18J884J59j626l70
4116a048J795j8j514j25J772j00j846N75J563r50j059O05J787j036j763Q75J577
4133A090n62j467L16J831k43j925L78J217nj223L17J199j156j012J215J254j121
$$ plain form
4150 103 -1297 -126 1364 352 -1462 -424 1238 472 -1014 -741 1232 274 -940 -335 730 -461
4166 -461 -779 203 994 -326 -1307 452 1149 -339 -1433 -76 1515 -198 -1404 -294 1273 -83
4182 -83 -1164 -3 1197 -36 -1117 276 622 -505 -1081 635 925 -700 -466 770 1176 -518 -1442
4199 -1442 -33 1344 -149 -1196 119 983 -503 -599 339 452 -566 -858 768 828 -782 -818 362
4216 362 960 -532 -1080 754 786 -732 -970 618 1044 -644 -758 419 798 -544 -568 724 100 -826
4234 -826 -147 1030 544 -993 -980 654 843 -883 -1280 702 706 -338 -471 728 454 -728 -411 719
4252 719 468 -753 -373 850 566 -650 -167 765 -206 -1069 -141 1366 534 -1259 -852 989 603 -722
4270 -722 -491 466 126 -576 293 896 -330 -594 15 966 173 -837 -399 663 243 -844 -93 944
$$ packed form
4150A03j400J171J490j012j814J038J662p66j486K73J973r58j214O05J065j191
4166d61l18R82P91j320r81J759O97j488j094J357J591j713j206J110J567j356
4182h3j081J161J200j233j081J393L46j127n76J716K90j625K34J236M06j694r24
4199a442J409J377j493j047J315Q64j486r6R38J13j018k92J626O0j610l6J180
4216C62N98j492n48J834L2j518k38J588M26j688j14J177L79j342k4J292o24r26
4234h26O79J177m86j537J3J634J89j726l97J982Mj044j33J199k74j182L17J130
4252G19k51j221L80J223k84j216M83R32r71q63R28J507q32j793M07J841l86j325
4270g22K31R57l40p02Q69O03j226k64O09R51p93j010M38J062m20j087P51J037
$$ plain form
4288 944 140 -1084 -111 994 375 -923 -129 694 107 -203 289 343 -29 -450 407 942 16 -1132 -104
4307 -104 1297 65 -688 33 698 277 -36 130 538 -86 -478 329 648 -326 -428 90 822 140 -347
4326 -347 325 864 -451 -670 524 892 -756 -723 82 815 400 -425 -72 200 3 -120 247 115 -589
4345 -589 -433 855 654 -500 -931 529 780 -137 -325 158 315 -298 -438 374 442 -282 -187 201 381 -29
4365 -29 -42 -16 182 -589 -425 508 48 -926 -639 858 746 -485 -626 247 346 224 -203 125 -69 -243 105
4386 105 234 122 -921 -633 610 276 -414 -110 283 239 -216 -186 305 294 -344 -446 184 308 -73 -266
4406 -266 -40 336 -284 229 261 -42 -661 166 898 -37 -761 -355 507 352 -29 -423 -121 -96 189 -64 -210
4427 -210 -161 -312 95 402 268 -548 -235 473 176 5 69 387 2 -469 -184 174 357 -459 -245 273 574
$$ packed form
4288I44q04j224R73J105o19j298P94Q23n87l10M92N4l72m21Q57N35r26j148J028
4307a04J401j232p53P21O65m21l13J66M08o24l92Q07L19r74j02N18P32o82m87
4326c47O72N39j315k19J194L68j648L3Q05P33m15q25L53K72j97j23L67j32p04
4345e89J56J288k01j154m31J460K51r17j88M83J57o13j40Q12O8p24R5L88J80m10
4365b9j3K6J98p71J64R33m60r74K87J497j12j231j41Q73R9j22m27L28j94j74L48
4386A05J29j12j043K88J243l34o90L04L93m4m55L0M91j1o38j02O30J24l81j93
4406b66K26L76o20N13L2l03o19Q27P32r35p24M06Q62j55l81l94L02K5K85k53j46
4427b10M9j51M07L07j34q16L13P08k97j71O4L18l85m71K85L58J83q16K14N18L01
$$ plain form
4448 574 -139 -83 -94 -65 -161 382 145 -321 -446 31 555 -141 -513 -195 341 60 -167 -234 -102 156 -92 -24
4470 -24 94 -85 -472 87 272 -17 -171 53 196 -341 -142 326 321 -38 -365 78 238 221 -266 -391 117
4491 117 223 120 282 -121 -132 -117 310 -43 -722 -342 302 236 -25 -460 -225 154 -39 -43 -21 400 -29 -274
4513 -274 -120 245 -59 -146 83 -290 -87 188 551 134 -578 -170 177 157 -351 -523 50 332 184 -253 -68
4534 -68 -34 -256 46 578 -64 -82 -111 341 252 -355 -38 161 211 -45 -102 267 274 -348 56 360 161 -354 -344
4557 -344 -91 373 98 183 115 -277 -258 500 356 36 -346 -167 711 533 -253 -321 114 162 124 -24 -107 -248
4579 -248 -169 263 365 -87 -392 205 200 -90 71 45 -189 -156 -318 8 212 336 -418 64 460 162 24 -317
4601 -317 -292 -156 5 395 -157 -210 -125 264 220 -11 -470 42 393 -83 -217 119 266 138 -270 262 -23
$$ packed form
4448E74p13N6j1K9r6N43k37m66j25M77N24o96l72L18N36k81k27o7J32K58k48O8
4470b4J18j79l87N59J85k89j54K24J43n37J99M68nl59l27M43J60j7m87j25N08
4491A17J06j03J62m03j1J5M27l53o79L80O44o6k61m35K35L79j93mK2M21m29k45
4513b74J54L65l04q7K29l73K03K75L63m17p12M08L47k0n08j72N73K82j48m37J85
4534f8L4k22L02N32o42j8k9M52q9o07L17J99N0k56n7L69Po22M04L04j99n15J0
4557c44K53M64k75Q5o8l92J9P58j44l20l82J79Q78j78p86o8M35M8l8j48q3j41
4579b48P9M32J02m52l05N97nk90J61k6k34L3j62L26K04J24p54M82L96k98j38l41
4601c17K5J36J61L90n52n3Q5L89m4k31m59N12L51m76j34L36J47j28m08N32k85
$$ plain form
4622 -23 -240 -110 73 134 -242 -5 -38 -9 -259 -235 279 170 -664 -520 180 572 -464 -632 -243 318 171
4643 171 85 -202 -84 -112 132 484 26 -526 -5 819 161 -46 -217 417 415 -237 -113 317 273 -606 279 487
4665 487 143 -426 -75 184 204 -201 194 74 -232 -378 -79 598 18 -588 -360 363 -19 -306 -337 -21 26
4686 26 -265 -221 97 -357 -338 137 323 28 -558 230 253 -19 -217 234 277 -127 -733 -154 399 -168 -645 -49
4708 -49 103 -95 -266 3 -207 -300 -206 361 602 -293 -439 -76 573 -230 -899 -302 619 118 -277 214 279
4729 279 -246 -91 333 254 -295 -192 239 337 -194 -294 322 394 -452 -453 371 665 -282 -468 547 512 -336 -400
4751 -400 111 278 -266 130 65 128 -448 -108 712 346 -718 -635 592 569 -381 -396 429 121 -201 174 355
4772 355 330 -514 -122 408 148 -231 -251 579 93 -539 -83 431 290 -651 -8 772 481 -663 -562 589
$$ packed form
4622b3k17J30J83O1l76K37l3K9k50K4N14j09q34J44P00L92j036j68L89N61j47
4643A71q6k87J18k8K44L52m58n52N21Q24o58k07j71O34ko52J24M30m4q79Q85K08
4665D87l44n69L51K59K0m05L95j20l06j46K99O77n80o06K28P23l82k87l1L16M7
4686B6k91M4L18m54J9M75J86k95n86P88K3k72j98M51M3m04o06N79N53n67m77N96
4708d9J52j98j71K69k10r3R4N67K41q95j46L63O49q03o69N97R21n01l95M91O5
4729B79n25J55M24p9n49J03M31R8n31j00O16P2q46jQ24K94r47j86J015l5q48o4
4751d00N11J67n44L96o5O3n76L40Q20l66j064Q3J227k3r50j5Q25l08l22L75J81
4772C55k5q44L92N30k60l79k0Q30m86o32M56N14j41r41O43P80k91j144J01J151
$$ plain form
4792 589 386 -179 -83 295 -83 -231 134 248 -74 -859 -327 865 191 -877 -226 663 244 -544 29 438
4812 438 153 -332 243 517 -151 -563 -274 692 27 -174 -72 222 -86 -664 481 607 -132 -908 355
4831 355 716 70 -487 -356 579 51 -398 248 121 -369 -379 279 338 -125 -465 304 640 -171 -490 -21 326
4852 326 -418 -453 829 221 -353 -477 124 550 67 -579 109 416 -344 -274 230 412 -618 -581 598 114
4872 114 -319 -951 453 216 -94 -729 178 197 -376 -429 235 338 -807 -436 192 365 -542 -417 527 293
4892 293 -325 25 330 265 -721 -186 425 489 -214 -634 64 489 -187 -187 142 -301 -300 318 613 247 -929 -401
4914 -401 485 272 -767 -295 509 415 -545 -197 241 125 -297 133 554 -101 -562 -47 380 32 -581 526
4934 526 428 -377 -515 359 644 149 -584 -91 443 332 -464 -449 378 111 48 222 323 -80 -648 255 842
$$ packed form
4792E89k03n65R6L78l78j48L65J14l22p85N32J192o74j068O51Q89m19p88N73M09
4812D38k85m85N75K74o68m12K89R66o65k01J02K94l08n78J145J26p39p76J263
4831C55L61o46n57J31R35n28m49O46j27m90j0O58N9m63l40P69L36q11l19M69L47
4852C26p44l5J282o08n74j24O01M26m83o46O88L07p60P0N04J82j030L7J179m84
4872A14m33o32J404k37l10o35R07J9n73n3O64J03j145L71O28J73r07J25R44k34
4892B93o18L50L05o5r86N35O11O4p03m20O98M25o76%L29m43JO18K95l66j176N28
4914d01Q86k13j039M72Q04r4r60L48M38j16m22M30M21o55m61N15M27l48o13J107
4934E26r8q05j38Q74K85m95p33M93N34j11p96J5Q27k67o3J74J01m03n68R03N87
$$ plain form
4955 842 -425 -515 -189 519 291 -70 -50 684 233 -233 409 675 -366 -458 -64 364 -174 -22 77 272 -148
4976 -148 -358 641 446 -553 -333 -71 759 -81 -471 5 160 194 -236 152 197 -252 -114 449 93 -245 -205
4997 -205 174 304 -348 -194 176 189 35 -122 148 163 -96 -411 -47 368 -38 -352 129 234 -89 106 45
5018 45 266 -295 -115 313 443 -495 -260 403 586 131 -640 422 246 82 -131 38 325 -74 -78 36 35
5039 35 -164 -21 143 -40 -126 244 448 -3 -251 -465 267 282 -250 -194 469 431 -170 -267 1 -121 216 316
5061 316 66 -266 -121 78 458 -365 -250 -291 218 202 -611 -70 407 96 -81 -106 230 318 -151 -204 89 -98
5083 -98 -86 261 224 30 -121 97 590 5 -350 -336 173 238 -273 -159 241 261 -49 70 -100 -228 71 20
5105 20 230 -176 60 -121 370 255 -376 -115 116 -29 -349 91 302 -168 61 207 251 -189 -91 11 50
$$ packed form
4955H42j267r0L26P08k28l61K0P34m51m66O42K66j041r2L94M28n38J52R9J95m20
4976a48k10R99j95r99K20K62Q30q40l90M76J55L4m30L88M5m49J38N63l56l38M0
4997b05L79J30o52J54L70J3j54j57K70J5k59l15L64M15m06l14M81J05l23J95o1
5018D5K21n61J80M28J30r38K35O63J83m55p71J062j76j64k13J69K87l99mJ14j
5039C5j99J43J64j83q6L70K04m51k48k14P32J5n32N6O63l8o01r7K68j22L37J00
5061C16k50l32J45J99L80q23J15m1N09j6q13N41M77l11j77k5L36Q8m69n3K93j87
5083i8J2L47l7j94j51K18M93n85l55J4N09O5n11J14M00K0l10J19j70j28K99n1
5105B0K10m06K36j81M91j15o31K61K31j45l20M40K11m70K29J46M4m40R8J02L9
$$ plain form
5126 50 -28 -129 -209 145 -57 -189 274 122 38 -553 65 193 -289 -246 -208 231 18 171 -80 -476 -102 230
5148 230 -100 73 -13 -2 48 210 -157 -231 176 106 -339 -353 64 -13 -58 -385 -123 28 98 -140 -19 -87 293
5171 293 135 -50 47 -305 -132 470 167 -217 -161 151 200 -116 391 247 200 174 -176 169 328 147 -40 -81
5193 -81 174 44 -59 342 -194 -114 398 356 -89 4 -328 378 578 -30 -72 106 117 123 -420 29 -101 3 9
5216 9 109 -18 -726 132 -11 -99 -232 -362 220 15 36 -107 -164 52 28 33 -7 -372 -124 -207 -195 -204 -244 27 -56
5241 -56 16 -342 111 320 -114 -206 2 235 91 -79 -216 -161 92 104 315 288 -26 -164 420 426 -166 -301 243
5264 243 361 159 194 234 76 135 -214 279 334 -192 17 -181 126 62 -139 100 36 -216 -201 391 185 -389
5286 -389 -231 219 260 58 -273 -212 -12 -123 -212 -46 -165 -185 67 173 9 -123 -169 315 -56 -148 7 315
$$ packed form
5126E0p8j01q0L54k02j32M63j52q4n91O18J28m82M3L8M39k13J53k51l96L74L32
5148B30l30J73q6J1N0J62l67p4M07p0m45j4M17p7m5l27K62J51P0k38J21o8L80
5171B93j58j85R7l52J73O02l03l84N6L12M9l16N07j44m7k6l50L45J59j81j87m1
5193h1K55j30j03M01n36Q0N12m2m45R3l32P06K00o08m2J78J1On43M49j30J04O
5216IJ00j27p08Q58j43q8j33j30N82k05K1j43n7K16k4Nm0l65K48q3J2rm0K71q3
5241e6P2l58M53K09m34r2K08K33j44j70j37N5K53J2K11k7l14j38N84On92j35N44
5264B43J18k02L5M0j58N9l49M93N5n26K09j98L07o4k01K39o4k52J5N92k06n74
5286c89J58M50M1k02l31O1K00j11q9J66j19k0K52J06j64j32m6M84l71r2J55L08
$$ plain form
5308 315 23 -119 172 118 61 -138 132 -67 165 -301 -210 262 159 -263 -163 35 105 -237 176 199 -27 -513
5330 -513 -126 173 3 -351 -146 -69 63 -193 -91 192 -67 164 263 226 17 -237 165 95 -222 -89 261
5351 261 369 -11 -291 106 22 164 -71 -410 -3 39 76 -230 -262 175 -8 -49 474 -238 -232 269 171 -436 -64
5374 -64 -21 55 137 -390 8 90 181 -62 -39 179 -466 -322 -5 303 -304 30 177 -22 -472 -296 380 67
5396 67 -380 -562 -25 343 107 -58 -193 -43 -71 -43 -144 -64 -74 210 248 -181 -327 -306 95 319 -170 -67
5418 -67 334 174 -79 -359 305 548 -49 -225 -159 -47 -125 -65 114 113 -37 109 -7 -145 -223 27 217 189 -342
5441 -342 -84 446 -235 -461 69 89 101 -149 279 220 -346 -149 105 -15 -37 -320 39 445 -146 -38 -315
5462 -315 402 -97 -185 16 486 194 -372 -91 606 159 -16 195 124 -128 -168 1 36 -387 -304 317 516 -54
$$ packed form
5308C15k92j42K91n4n7j99K70j99K32m66R1M72j03m22J00J98P0l42M13K3k26m86
5330e13L87K99j70l54K05P7J32k56J02K83k59K31R9l7k09k54M02p0l17J33L50
5351B61J08l80k80L97q4J42k35l39M07M2L7l06l2M37j83m1N23p12ON01r8o07L72
5374f4M3P6Q2n27L98Q2R1k43K3K18o45J44L17L08o07L34J47j99m50J76O76l13
5396F7m47j82N37L68k36j65j35J50k8K8j01Q0j0K84L8m29j46K1M01K24m89J03
5418f7M01j60k53k80O64K43n97j76O6J12p8O0J79jj50J46j16j38p8K50J90k8n31
5441c42K58N30o81k26N30K0J2k50M28n9n66J97K54j20k2k83L59M06n91J08k77
5462c15P17m99q8K01M70k92n66K81O97m47j75K11p1k52m0J69L5m23Q3O21J99n70
$$ plain form
5484 -54 -281 148 407 164 -233 13 547 -161 -248 -41 128 -48 -140 195 248 -146 84 255 400 -456 -410 186
5506 186 319 -161 -509 -57 515 -1 -193 36 225 47 -174 187 125 -370 -22 374 407 -118 -87 210 377
5527 377 -292 -255 23 25 -280 -416 528 -82 -40 -236 62 81 27 -251 252 213 -303 -28 291 65 -286 -338 232
5550 232 523 -338 -115 4 -109 -237 -115 356 110 -342 123 327 105 -455 -86 538 131 -239 -321 420
5570 420 128 -124 56 407 5 -427 210 34 324 -211 -154 -102 -95 -286 -30 203 -375 -260 -42 433 -77
5591 -77 -532 -52 296 -311 -207 -37 74 -81 -336 24 283 -107 -154 155 170 -204 -351 21 366 -78 -157
5612 -157 -142 175 -253 -334 -5 245 41 -228 -28 100 -185 -331 -103 -269 55 131 182 119 -359 -265 73 157
5634 157 -135 -284 96 276 55 -79 87 -13 3 -144 155 465 -176 158 123 124 -242 -274 55 194 -231 -446
$$ packed form
5484e4k27M29K59k43l97K46N34p08q7K07J69j76r2L35N3l94K30J71J45q56M6N96
5506A86J33m80l48M52N72n16j92K29J89j78k21L61o2m95L48L96L3n25L1K97J67
5527C77o69L7K78Kl05j36R44o10M2j96K98J9n4k78N03l9n16K75L19k26l51n2N70
5550B32K91q61K23J19j13j28J22M71k46m52M65K04k22n60L69O24m07l70q2P41
5570D20k92k52J80L51m02m32O37j76K90n35N7N2Pj91K56K33n78J15K18M75n10
5591g7m55M80L48o07J04J70J11j55k55L60K59l90m7L09J5l74j47L72L45m44p9
5612a57J5L17m28q1L29K50k04k69K00J28k85j46K28j66L24P6N1o3m78R4L38Q4
5634A57k92j49L80J80k21j34J66j00J6j47K99L10o41L34l5Jl66l2L29J39m25k15
$$ plain form
5656 -446 288 644 -272 -157 399 334 -142 -291 23 38 26 185 171 -96 -302 -286 470 98 -121 -378 51 212
5678 212 -147 -387 94 69 104 28 210 213 31 -152 100 289 -102 -67 308 112 -253 275 137 -189 -200 105
5700 105 453 52 130 176 44 219 -116 -116 46 -115 316 100 43 119 -482 -74 170 28 -320 -46 179 -46
5722 -46 -235 -126 360 169 -266 149 96 138 113 -309 400 0 -150 46 182 -258 -212 437 7 -352 -372 7
5744 7 86 231 -77 -276 299 344 11 268 21 126 -32 59 353 -180 36 48 122 -121 -155 164 -132 106 -31
5767 -31 251 22 -29 -19 -126 310 47 73 -440 125 -57 14 135 -154 -18 -198 210 36 -67 -102 77 41
5789 41 -51 -205 311 -108 -4 -211 -34 -61 -27 -323 72 65 -191 -73 56 92 -143 228 200 78 -348 -193 95
5812 95 135 115 29 8 494 239 73 -272 96 72 -87 135 -197 103 -321 11 50 -35 -348 150 97 -153 -395
$$ packed form
5656d46P34L56r16J15N56o5m76j49L14J5j2J59j4k67k06J6P56l72k19k57M29J61
5678B12l59k40M81k5L5p6J82Lj82j83K52J89l91L5L75j96l65N28j38l26j1L05
5700A05L48m01P8M6j32J75l35%J62j61M31k16n7P6o01M08K44j42l48K74K25k25
5722d6j89J09M86j91m35M15n3M2k5m22P09m00j50J96J36m40M6O49m30l59k0L79
5744GP9J45l08j99N75M5l33K57k47J05j58R1K94n33K16J2P4k43l4L19k96K38j37
5767c1K82k29n1J0j07M36k63K6n13N65j82P1J21k89J36j80M08j74j03l5J79l6
5789D1r2j54N16m19J04k07J77k7L4k96L95pk56J18J29L6k35L71k8j22m26J55K88
5812I5M0k0q6k1M86k55j66l45L68k4j59K22l32L00m24L32L9q5l13M98n3k50k42
$$ plain form
5835 -395 33 169 -95 -194 -52 379 -153 122 162 88 -137 -156 -214 -223 -277 74 -84 93 62 -245 44 101 -80
5858 -80 -79 -79 -51 -264 -281 -269 241 -134 -86 442 17 -45 -186 -178 -75 -252 73 131 -208 -215 -250 321 97 -273 -31
5883 -31 138 122 -106 121 254 92 -144 512 75 -320 146 -115 312 -2 -246 155 304 148 11 -187 352
5904 352 -41 39 26 175 170 10 -61 120 -256 26 61 -74 -406 50 259 134 61 -156 182 223 211 -222 -8
5927 -8 241 139 365 -287 -312 21 279 183 -159 76 -161 119 73 142 310 -10 310 34 -182 215 146 -330
5949 -330 29 86 197 119 -70 -192 102 54 76 5 59 -145 32 151 -178 -97 -128 47 69 123 -231 72 214
5972 214 246 163 65 -379 -314 259 115 109 -263 -67 13 52 -152 -9 456 59 -358 -210 2 -90 61 -45 31
5995 31 -35 86 -217 198 -199 -105 57 8 -19 -294 -152 88 347 -110 146 -4 205 -3 144 198 -100 -171
$$ packed form
5835c95M28J36k64r9J42M31n32K75M0p4k25j9n8rn4L51j58J77l1l07K89N7j81
5858h0J%K8k13j7J2N10l75M8N28m25o2j41QJ03j77L25N8l39pl5N71k24l70K42
5883c1J69j6k28K27J33j62k36O56m37l95M66k61M27l14k44M01J49j56j37j98N39
5904C52l93Q0j3J49nj60p1J81l76K82L5j35l32M56K09j25p3k17L38M1j2m33K14
5927hK49j02K26o52k5L33K58r6l42K35k37K80m6O9J68l20L20k76k16L97o9m76
5949c30L59N7J11p8j89j22K94m8K2p1N4k04J77J19l29Q1l1J75K2N4l54L03J42
5972B14L2q3r8m44O5N73j44ol72J96Q0L9k04J43M65l97m17J48K12r2J51j06P6
5995C1o6J21l03M15l97R4J62m9k7k75J42K40K59m57K56j50K09k08J47N4k98p1
$$ plain form
6017 -171 -61 -28 59 -168 251 79 -97 32 -137 127 93 -30 -43 70 -235 -106 84 209 38 15 -223 111
6039 111 213 98 -15 -210 -490 -46 472 -120 47 -344 -2 221 6 -148 44 126 34 -326 -92 -110 -84
6060 -84 297 353 259 -26 -60 39 136 -117 -106 441 222 -37 -138 100 -80 -45 28 56 212 206 84 -32 246 -125
6084 -125 -155 129 160 -151 -179 345 -139 -212 -225 147 -280 -341 18 45 126 -19 -80 300 399 -39 -107 -181 -171 -118 -133
6109 -133 -91 65 -173 253 212 -145 -307 86 -107 79 -167 -213 14 315 34 131 -8 -198 -227 150 -212 -206
6131 -206 -289 194 -67 -12 41 170 81 -166 -294 -68 305 45 62 -77 269 47 229 113 -30 -109 133 286
6153 286 33 -123 -189 126 381 64 -208 142 208 264 -3 -62 274 80 -26 -95 6 155 -101 97 -77 -167
6175 -167 -233 -14 152 98 -167 348 43 -296 78 36 -113 -303 -347 170 30 144 11 346 11 -265 32
$$ packed form
6017a71J10L3Q7k27M19j72j76J29j69K64l4j23j3J13l05J29J90J25j71k3k38L34
6039A11J02j15j13j95k80M44N18n92J67l91L42K23k15j54J92Q2r2l60K34j8K6
6060h4L81N6r4k85l4R9R7k53J1N47k19k59j01K38j80L5P3K8J56oj22j16K78l71
6084a25l0K84L1l11k8N24m84p3j3L72m27o1L59K7Q1j45o1L80R9m38o8p4J0N3j5
6109a33M2J56k38M26m1l57j62L93j93J86k46m6K27L01k81R7j39j90k9L77l62O
6131b06q3M83k61N5N3J29q9k47j28K26L73k60J7j39L46k22J82j16j43p9K42J53
6153B86k53j56o6L15K55l17k72L50O6N6k67n9L36j94j06o9J01J49k56J98j74r0
6175a67o6K19J66n4k65N15l05l39L74m2j49j90m4N17j40J14j33L35l35k76K97
$$ plain form
6196 32 319 7 -403 -97 275 201 90 -155 -24 28 -35 -232 -109 -13 -177 84 371 -48 -165 -261 70 109
6218 109 -23 271 130 -404 -10 -163 385 141 -92 48 117 -5 -99 -139 174 -17 200 32 135 -196 -99
6239 -99 320 137 -35 -56 -173 140 324 -152 88 552 423 -214 -127 276 145 -85 127 -47 -40 23 -136 31
6261 31 96 -213 120 279 53 -165 214 127 197 -214 -196 204 -53 -159 -273 199 -9 -100 -138 -239 -64 237
6283 237 276 89 -87 -106 -76 246 155 80 375 77 79 -67 133 262 -42 -4 -166 -168 26 65 129 -251 -159 137
6307 137 125 103 47 50 65 -164 92 12 -13 329 -32 -93 101 -244 153 -68 253 93 -33 -162 382 156 -35
6330 -35 15 268 246 42 -33 -5 136 -39 29 472 40 -93 -84 239 175 173 -148 -345 237 93 136 -23 179 -6
6354 -6 121 419 324 -114 -183 125 153 83 42 215 -171 -3 -76 -3 97 23 121 -95 -98 -24 134 38 232 -123 -20
$$ packed form
6196C2K87l12m10L06L72p4j11k45J31N2o3j97J23R6j64K61K87m19j17r6L31L9
6218A09j32K94j41n34L94j53N48k44k33J40O9j22r4m0L13j91K17j68J03l31R7
6239i9M19j83j72k1j17L13J84m76K40M64j29o37Q7M03j31k30K12j74PO3j59J67
6261C1O5l09L33J59k26k18L79q7P0m11J8M00k57j06j14M72k08r1l8j01J75L01
6283B37L9j87j76j9L0L22r1p5K95k98Kj46K00J29l04L8j62kJ94L9O4l80R2K96
6307A37j2k2n6LJ5k29K56q0k5L42l61o1J94l45L97k21L21j60j26j29N44k26j91
6330c5N0K53k2k04p5K8J41j75O8M43m32j33RL23o4kl21j97N82j44M3j59K02j85
6354fJ27K98r5m38o9L08K8p0m1J73l86J68p3P3J00p4R8k16lP4J58r6J94l55J03
$$ plain form
6379 -20 137 60 57 -133 58 -155 -29 -215 22 -79 23 333 88 -62 -251 127 48 -63 -213 154 296 -322
6401 -322 -37 -31 -144 -5 -7 -401 121 -149 -83 199 119 -121 -115 -70 -26 -210 -133 -7 -10 165 22 71 255 -399 27
6426 27 151 101 -74 -183 25 288 147 -43 -272 -84 206 -104 -51 -141 -75 -65 10 6 -128 -70 320 -66 59
6449 59 81 7 221 284 192 -355 2 83 33 173 138 -134 -96 76 30 -70 -278 -91 -183 130 39 324 -26 159
6473 159 43 142 -46 -140 176 -93 -96 -210 -191 163 5 -290 353 32 114 -124 63 231 -5 -154 -83 247
6495 247 68 -137 -12 -9 178 262 131 -86 -361 -48 -395 175 -127 -11 134 -171 71 -146 -139 332 236 131
6517 131 172 173 -43 -105 7 45 87 -45 59 100 -445 -198 148 -72 -287 -97 285 -310 173 -78 -216 -290 5
6540 5 145 134 48 -84 -37 336 299 -29 -347 79 294 -138 -46 138 346 -148 234 -138 -25 169 -97 194
$$ packed form
6379b0J57p7lj90J91k13J26j86K37j01J02L10k45j50j89L78p9j11j50L67J42o18
6401c22K85Oj13J39kl94N22k70O6K82q0k40OM5M4j84P7J26lJ75j43M9J84o54M26
6426B7J24n0j75j09K08K63j41j90k29J88K90l10N3r0O6J0P5mj34N8L90l86J25
6449E9K2p4K14O3r2n47L57Q1n0J40l5k72L8J72m6j00k08J87r2L13r1K85l50J85
6473A59j16R9j88r4L16k69lj14J9L54j58k95O43l21Q2k38J87J68k36j49P1L30
6495B47j79k05J25LJ87Q4j31k17k75L13l47N70l02J16J45l05K42k17PM71r6j05
6517A31M1Jk16o2J12L8M2j32J04M1n45K47L46k20k15J90L82n95M83k51j38p4K95
6540EJ40j1q6j32M7L73l7l28l18M26K15m32R2J84K08m94L82l72J13J94k66K91
$$ plain form
6562 194 240 171 291 -32 34 125 -207 259 -400 -72 61 143 167 179 -45 132 439 -6 224 -6 -264 89
6584 89 -89 -30 -25 -73 -249 184 92 183 45 -118 106 -32 -31 239 114 125 90 -157 0 29 -23 103 68 -22 -15 -253
6610 -253 -148 -79 261 -30 198 -33 89 176 -117 -81 -235 -86 60 132 91 104 52 29 159 -1 138 -77 221
6633 221 74 234 66 110 201 38 -132 -44 -124 203 -40 57 -207 179 -78 -130 281 106 -79 -49 135 -78
6655 -78 84 62 271 78 194 443 143 -45 -207 192 -96 232 180 64 176 -37 50 186 -124 327 -61
6676 -61 20 62 -171 -29 152 2 178 -347 183 -8 5 -21 114 -41 20 111 -137 140 66 -31 -70 -290 -28
6699 -28 88 160 -96 21 -194 32 328 128 -285 67 157 -178 -108 -247 -77 -369 -53 -37 -232 -227 64 -48
6721 -48 245 -265 -35 273 162 -148 -172 132 61 -165 88 216 158 62 382 211 -71 -72 282 46 -113 -84 -249
$$ packed form
6562A94M6o9J20l23O6R1l32M66o59L28J33Q2K4J2k24J77L07m45K30k30k58L53
6584H9j78N9Nm8j76M33r2R1j38j63K24j38JK70j25J1l5k47J57K9n2J26l5r0Pk38
6610b53J05O9L40k91K28k31J22Q7k93L6j54J49J46P2m1J3n2k3J30j60J39k15K98
6633B21j47J60j68M4R1j63j70Q8q0L27k43R7k64L86k57n2M11j75j85L0J84k13
6655g8J62k2K09j93J16K49l00j88j62L99k88L28n2j16J12k13Q7J36l10M51l88
6676f1Q1M2k33J42J81j50J76n25N30j91J3k6J35j55O1R1k48K77p4r7l9k20K62
6699b8J16P2k56J17k15K26K96k00m13L52R0l35P0j39J70k92L16J6j95NK91j12
6721d8K93n10K30L08j11l10k4L04p1k26K53J28n8r6L20j71k82jL54k36j59K9j65
$$ plain form
6744 -249 201 -4 20 -114 219 154 -193 44 74 30 -183 -83 190 -162 78 -47 154 -140 204 -109 358
6765 358 -68 -51 254 196 149 -269 36 -15 109 229 140 78 110 -79 253 28 262 204 -198 -60 188 -71 213
6788 213 19 93 -93 172 253 275 -293 32 411 313 -218 -249 41 -149 -247 84 74 -273 -129 227 274 -235 -43
6811 -43 -64 220 51 -220 -248 53 -58 170 80 117 -229 -201 60 -61 -119 82 492 -93 -119 133 99 -51 -287
6834 -287 110 -36 470 -62 -297 -98 14 -224 -228 -274 -75 22 307 -60 -35 -85 -274 192 167 -266 -19 341
6856 341 203 -110 -65 150 -44 -131 -23 138 250 150 -41 137 -104 138 -170 120 -201 -26 -17 243 250 -89
6878 -89 -106 152 142 -15 -171 46 -3 77 -154 -130 8 -260 -243 -175 141 169 -67 -38 68 121 -202 -381 232 -28
6902 -28 171 1 -223 -65 -83 -35 -83 -73 43 173 -14 -137 -410 3 -126 121 210 264 -66 -291 133 130 -114
$$ packed form
6744b49M50k05K4j34L33o5l47K37L0m4k13J00K73l52K40j25K01k94L44l13M67
6765C58m26J7L05n8m7m18L05n1J24J20q9o2L2j89L32k25K34n8m02J38K48k59K84
6788B13j94P4j86K65Q1K2n68L25L79r8n31l1K90j90r8L31j0l47J44L56M7n09J92
6811d3k1K84j69k71k8L01j11K28r0L7l46K8K61j21n8K01M10n85k6K52l4j50k36
6834b87L97j46N06n32k35J99J12k38mm6J99R7K85l67K5n0j89M66k5m33K47L60
6856C41j38l13M5K15j94q7J08J61J12j00j91J78k41K42l08K90l21J75RK60Pl39
6878h9j7K58j0j57j56K17m9Q0k31K4J38k68J7O8L16K8k36K9J06N3l23j79O13k60
6902b8J99j70k24J58j8M8m8J0J16J30j87j23k73M13j29K47Q9N4l30k25M24lk44
$$ plain form
6925 -114 -262 -26 84 4 4 128 -5 -54 -96 219 212 -218 -366 211 -123 -223 56 126 -59 189 -117 -46 -36
6948 -36 -146 -282 -276 47 30 -12 -236 82 -77 177 -228 -72 -122 -33 26 -157 137 -181 -69 90 -115 -132 -154
6971 -154 107 109 133 178 142 -103 214 -70 253 159 26 -76 -238 -336 -284 277 -208 117 47 143 -159 105 44 41
6995 41 194 109 114 -138 5 -102 -117 384 16 -137 -30 -87 -113 146 -279 -183 -112 -149 -35 97 9 -196 -169 87
7019 87 -132 -165 51 -68 4 -36 -29 91 194 -67 33 583 -64 -358 -348 152 -358 194 -169 -85 -186 -207 -114
7042 -114 -178 -276 -197 141 -194 56 9 -266 -28 -24 84 187 154 69 -5 -163 64 156 182 -169 -26 -90 -72 -25 -41
7067 -41 -40 -30 74 29 -315 138 176 -138 36 -198 88 83 -4 -251 23 177 99 -23 -133 -5 150 216 16 161
7091 161 -41 -98 11 -273 -61 -69 276 186 -194 -96 163 -94 293 -6 -317 -157 -72 -22 36 66 16 -12 295 -187
$$ packed form
6925a14j48K36J10q0%J24j33m9m2L15pm30j48N77l34j00K79P0j85K48l06P1J0
6948c6j10j36OL23j7m2k24L18j59K54m05J56n0Q9N9j83K94l18J12J59k05j7k2
6971a54K61KK4M5l6k45L17k84L23r4j33j02j62r8N2N61m85L25p0R6l02K64o1l
6995D1J53q5Nk52J43j07j5N01l68j53J07n7k6K59m25R6P1l7J14J32q8k05K7K56
7019H7k19l3K16j19P2m0PJ20J03k61J00N50o47k94J0N00n10N52l63Q4j01k1R3
7042a14o4r8P9L38l35K50m7k75K38MJ08J03l3q5p4j58K27R2K6l51J43o4J8M7j6
7067d1JJ0J04m5l44M53L8l14J74k34K86nq7k47K74J54p8j22j10J28J55O6k00J45
7091A61k02n7J09k84K12qL45r0l80R8K59k57L87k99l11J60Q5N0N8L0n0k8L07m82
$$ plain form
7115 -187 135 -96 -17 -23 429 -99 231 -150 -40 -183 -68 118 -251 50 -5 67 113 -115 -170 162 19 69 95
7138 95 236 -270 -141 -114 -207 -69 -92 -147 178 -54 -147 10 120 100 117 109 -144 2 256 222 -241 308 -31 239
7162 239 -43 -22 138 139 170 42 34 -288 2 246 -42 -116 64 320 -27 -45 -2 -240 -24 65 -237 -26 103
7185 103 58 105 -76 -137 -64 37 -112 -266 50 293 162 -38 234 -16 -208 -32 306 226 -116 -164 449 -343
7207 -343 -134 100 100 -80 20 -170 73 -8 190 -166 -92 292 137 -109 166 200 -234 137 189 244 208 -134 173
7230 173 150 -163 -125 -225 -1 -9 33 22 130 132 130 48 285 77 -343 158 25 -221 143 -101 -48 101 192 147 239
7255 239 -249 -229 -141 246 119 3 -97 -13 379 8 85 -70 -52 -81 -66 11 -5 -217 -96 -145 28 217 285 -212
7279 -212 -265 -164 172 65 119 -252 17 52 -320 36 -168 -90 274 105 208 -223 -210 47 -114 41 66 335
$$ packed form
7115a87L22k31P9oM52n28L30l81J10j43J15J86l69L01n5P2M6k28n5L32j43N0K6
7138I5J41n06J29K7r3J38k3n5L25k32r3J57J10k0J7qk53J46K54l4m63N49l39K70
7162B39k82K1J60JL1j28ql22K90K44k88p4J80K56l47j8M3k38K16Q9l02K11J29
7185A03m5M7j81o1P3J01j49j54L16K43j31k00K72k50j92J76L38q0l42m8O13p92
7207c43K09K34%j80J00j90K43q1J98l56P4L84j55k46K75L4m34L71N2N5l6l42L07
7230A73k3l13L8j00K24qM2j1J08Kkq2K37k08m20N01j33k46L64k44N3J49R1m5R2
7255B39m88K0Q8L87j27j16j00Q4L92l71P7j55J8k9J5P7j6k12J21m9J73J89O8m97
7279b12n3J01L36j07N4l71K69L5l72L56k04P8L64j69J03m31J3K57j61J55K5K69
$$ plain form
7301 335 31 67 7 106 223 0 443 183 -201 -72 -226 -32 -94 -449 47 -267 -347 197 -66 186 210 -154
7323 -154 -157 -19 176 77 -310 244 -119 376 95 -178 -236 22 -104 106 55 -464 62 154 -16 103 -490 171
7345 171 46 100 -147 -141 -95 190 88 -9 14 -46 63 67 250 -28 -197 -97 -259 -44 -247 -195 -36 180 266 126
7369 126 315 73 287 -133 -1 -84 -102 39 60 182 137 102 -136 85 -217 -7 -193 46 -135 -204 94 77
7391 77 -65 36 153 29 -21 -127 66 -210 127 60 -73 -73 59 -99 39 -224 265 -224 177 -108 252 -28
7413 -28 187 77 63 16 96 349 43 124 40 165 -59 86 -53 -4 210 -24 101 121 -35 247 73 78 28 -396
7437 -396 160 185 144 -34 -137 304 232 -20 -63 -110 -13 110 234 165 243 -131 -152 -51 -28 -185 -147 87 -121 -132
7461 -132 -184 120 46 193 -53 -41 -12 -57 -106 -102 181 -52 -27 -7 -58 -132 -109 -81 -143 -51 208 168 29 -159 -154 9
$$ packed form
7301C35l04L6o0R9J17k23M43k60l84J29j54J94o2l55M96l14q0N44k63K52K4l64
7323a54lJ38J95r9l87N54l63M95k81k73n8K58j26K10n1n19N26R2j70J19n93O61
7345A71j25N4k47OM6K85j02r7K3o0J09MJ83k78j69J00j62K15k03N2J59K16Q6j40
7369A26J89k42K14m20J32q3j8J41K1J22m5l5k38K21l02K10j86K39j81o9K98j7
7391G7j42J01J17j24n0j06J93k76L37o7j33%J32j58J38k63M89m89M01k85L60k80
7413b8K15j10j4m7Q0K53l06Q1q4J25k24J45j39M9K14k34J25K0j56K82j74Nn0m24
7437c96N56K5m1j78j03M41p2k52m3m7R7J23J24o9P8l74k1J01K3j57L8K34k08j1
7461a32n2L04p4J47k46J2K9m5m9MK83k33K5K0n1p4K3K8o2R2K59m0j39j88NJ63
$$ plain form
7487 9 -11 130 30 -58 13 -222 13 -40 -61 100 -15 316 111 124 -123 187 -106 -5 84 236 354 53 -91
7510 -91 -115 -88 -54 13 70 -62 -88 2 -148 87 91 80 328 -85 -49 48 307 -246 -137 89 98 51 59 20 -96 -50 -168
7537 -168 -93 -133 -55 -85 110 47 43 207 47 75 -138 -221 157 242 -180 -23 -397 227 96 -60 -159 -1 171 19
7561 19 280 170 -229 -76 -16 40 -161 5 43 170 -33 -82 -86 265 -200 83 31 127 -132 -337 15 -1 16 -318
7585 -318 -26 87 183 -64 175 -16 -40 -136 55 51 -79 -88 5 -8 -134 -103 -34 -166 166 168 -139 -391 3 -47 -73
7610 -73 63 118 -51 35 196 -40 53 -32 295 159 135 -78 -186 -449 -80 72 46 -36 -55 -55 49 332 67 136
7634 136 48 198 -82 -161 78 -185 -148 -14 -278 -326 -28 -249 -80 8 -89 139 -267 -38 63 -197 84 -393
7656 -393 45 -86 82 -181 183 219 -163 -114 -95 451 -354 173 89 0 1 -241 90 -145 98 -162 27 -36 76
$$ packed form
7487Ik0J41j00q8P1k35K35n3k1J61j15L31k05J3k47L10k93J01Q9J52J18l01j44
7510i1k4K7L4O7N7j32k6R0j50K35Mj1K48m13L6R7K59n53J09K26Rm7Ql9j16M6j18
7537a68P5m0P8l0J95o3mJ64j60K8k13q3L78Q5m22J57l74O24j31j56r9J58J72j52
7561A9K61j10l99J53O0N6k01J66L8J27k03m9mL51m65K83n2R6k59k05L52j6J7l34
7585c18K92J13R6k47K39j91k4r6J91mj30rR3j3j26L1O9j32L32Kl07k52L94n0k6
7610g3J36N5j69Q6J61k36R3q5L27j36k4k13j08k63L69J52k6q2j9%J04K83k65O9
7634A36q8J50k80p9K39k63L7J34k64m8K98k21J69Q8r7K28m06K29J01k60K81m77
7656c93M38j31J68k63L64L6l82M9J9N46q05N27q4q9Jk42L31k35K43k60J89o3J12
$$ plain form
7679 76 -108 -234 -115 171 160 -117 265 123 92 -253 297 36 -89 297 125 41 -69 -32 140 322 352 7
7701 7 95 -99 368 -98 -48 87 -15 -23 140 -141 27 22 -289 82 -178 80 -43 -17 338 142 309 -147 -109
7724 -109 -59 289 -40 -31 148 -3 -80 -78 47 -60 -216 -99 215 -93 -201 131 231 -285 -245 -19 -28 -52 70
7747 70 83 -63 -136 -51 221 63 -141 -145 25 -49 -166 163 24 13 -78 38 -174 -92 -4 -255 -48 213 -232 133
7771 133 57 -22 -43 1 -2 -38 69 -158 -22 53 -51 -59 28 -57 -102 -330 -28 2 -185 -150 -11 -158 15 144 39
7796 39 283 -29 49 77 -131 -12 -50 -58 50 98 205 -114 229 212 81 125 -22 125 54 104 162 193 -32 -332
7820 -332 176 340 98 -251 258 66 56 -358 147 35 -73 302 110 150 -82 466 20 -360 -141 39 -107
7841 -107 169 206 -113 148 62 59 132 -36 -195 -110 -265 -248 -63 -238 279 285 146 -47 64 136 -198 -3 -195
$$ packed form
7679G6j84j26J19K86j1k77L82j42l1l45N50k61j25L86j72q4j10L7J72J82L0l45
7701GQ8j94M67m66N0J35j02qJ63k81J68nl11L71k60K58j23K6L55j96J67m56L8
7724a09N0L48l29RJ79j51p7KJ25j07j56J17L14l08j08L32J00n16M0K26rk4J22
7747G0J3j46p3Q5K72j58k04mJ70p4j17L29j39j1r1J16k12Q2Q8k51K07K61m45L65
7771A33p6p9k1M4ll6J07k27J36P5j04qQ7q5m5k28L02L0j87L5J39j47J73J29j05
7796C9K44l12P8K8k08J19l8qJ08M8J07l19L43j7j31M4j47J47p1N0N8L1k25l00
7820c32N08J64k42l49N09j92j0m14N05j12j08L75j92M0k32N48m46l80K19J80j46
7841a07K76L7l19K61q6lP3j68j59Q5j55J7J85j75N17Oj39j93J11P2l34J95j92
$$ plain form
7864 -195 167 115 31 131 7 31 -179 -16 -17 132 -51 282 -67 75 133 -539 -43 -59 -147 7 38 -236 219
7887 219 18 71 -84 160 275 -233 92 213 93 -158 -36 -49 -186 313 -329 -109 113 -15 82 -264 -196
7908 -196 118 223 222 147 -123 -59 87 79 -41 138 -150 110 35 141 -246 87 -156 -190 -294 -72 204 121 -140
7931 -140 111 -242 -80 136 59 -156 89 184 86 70 -101 467 60 26 -34 -138 353 190 141 61 -53 202 136
7954 136 20 -129 -254 323 -71 -131 411 146 140 -11 -11 104 46 53 44 47 174 3 179 1 -53 -458 122 45 301
7979 301 -126 -182 26 -115 119 15 -53 126 -92 18 -292 -169 145 -251 33 88 -19 -257 32 110 -110
8000 -110 -225 64 93 10 -94 128 60 74 74 85 -120 272 -71 -68 -40 207 -257 106 -187 78 -74 -227 -329
8023 -329 -6 18 -99 28 -89 -201 87 343 -161 144 -14 198 360 76 -3 120 -295 26 87 114 -12
$$ packed form
7864a95L62n2q4J00j24K4k10J63jJ49j83L33l49J42N8o72M96j6q8J54L1k74M55
7887B19k01N3j55K44J15n08L25J21j20k51J22j3j37M99o42K20K22j28R7l46O8
7908a96L14J05jp5k70O4J46qj20J79k88K60p5J06l87L33k43l4j04K22K76q3k61
7931a40K51l53J62K16p7k15K45R5r8j6j71N68m07l4o0j04M91j63m9q0j14K55o6
7954A36j16j49j25N77l94o0N42k65oj51%J15n8PrLJ27j71J76j78n4m05N80p7K56
7979C01m27n6K08j41K34j04o8J79k18J10l10J23L14l96K84N5j07k38K89P8k20
8000a10j15K89K9q3j04K22o8J4%J1k05L92l43LK8K47m64L63k93K65j52j53j02
8023c29L23K4j17J27j17j12K88K56n04L05j58K12J62k84p9J23m15L21O1K7j26
$$ plain form
8044 -12 -53 199 -293 60 55 24 -140 43 96 -172 -22 43 -91 116 -141 15 -220 -116 -35 101 0 131 230
8067 230 -61 -180 -97 -73 -119 -225 67 53 12 -194 -282 111 204 -65 -226 -61 -254 24 -83 133 101 230 -151
8090 -151 -222 -66 295 401 230 188 -183 -258 0 -145 -56 -114 160 -120 79 51 109 -58 21 -7 18 -80 -330 -206
8114 -206 77 -54 -112 161 97 -189 -89 -184 71 -355 -29 85 -40 365 -134 182 92 64 71 -319 -260 -153 -132
8137 -132 -121 117 72 -259 -104 -126 25 -32 9 -40 -129 -181 134 73 -40 -110 -134 -89 -240 131 -2 -219 -164 105
8161 105 317 -91 129 -69 -293 -171 80 141 13 -117 -55 -108 -39 45 -101 79 -4 -20 -135 -80 -282 55 20
8184 20 -249 60 -143 -281 30 3 -160
$$ packed form
8044a2m1K52m92L53nl1j64J83N3k68J50O5j34K07k57J56k35J04Q1J36j01J31R9
8067B30k91j19Q3K4m6j06K92j4m1k06q8L93R3k69j61J65j93K78j07K16l2J29l81
8090a51p1J56L61J06j71m2l71p5K58j45Q9n8K74k80J99k8N8j67P9k8K5r8k50J24
8114b06K83j31n8K73o4k86J00r5K55m26L26J14j25M05m99L16r0k8Pl90N9J07K1
8137a32J1K38m5l31J55k2J51n7M1m9q9n2L15o1j13p0k4M5j51L71j33k17N5K69
8161A05K12m08K20j98k24J22K51O1j28j30O2n3O9Q4j46J80q3j6j15N5k02L37l5
8184B0k69L09k03j38L11k7j63
8191a60
$$ Imaginary data points
##PAGE= N=2
##DATA TABLE= (X++(I..I)), XYDATA
$$ plain form
0 0 0 0 0 0 0 0 -8 8 -8 8 -8 16 -16 24 -24 32 -40 46 -55 64 -73 86 -98 114 -131 150 -170 194 -220 246
30 246 -278 312 -350 389 -434 484 -538 597 -661 733 -813 898 -993 1102 -1221 1355 -1507
47 -1507 1685 -1884 2118 -2400 2742 -3163 3704 -4423 5433 -6954 9489 -14505 28173 -140062
61 -140062 -425178 -9877 297900 128942 -130114 -91001 -55241 -122788 -18784 227134 128900
72 128900 -236807 -261459 123313 248416 -56519 -220195 -11868 90297 -60648 -55480 145046
83 145046 76338 -220885 -195756 147655 206843 -92387 -196913 26189 117053 -37464 -72592
94 -72592 47475 -9733 -160349 -25065 226326 93274 -254789 -208711 156442 209551 -86217
105 -86217 -185662 -2698 61113 -27852 19567 100105 -71195 -253055 -48401 266481 152235
$$ packed form
0@%%%%%%qJ6j6J6j6K4l2M0m8N6p2Q6j01J19j37J59j84K12k45K81l20L64m14M66
30B46n24N90o62P39q23R18j022J135j258J394j546J711j891K095k323K576k862
47a507L192l569M002m518N142n905O867q127R856j2387J6443k3994M2678j68235
61a40062k85116M15301L07777j68958k59056L9113L5760o7547J04004K45918r8234
72A28900l65707k4652L84772J25103l04935j63676K08327J02165j50945N168K00526
83A45046o8708k97223K5129L43411N9188k99230j04526K23102R0864j54517l5128
94g2592J20067n7208j50616J35284K51391j33052l48063M6078L65153N3109k95768
105h6217r9445J82964O3811q8965M7419Q0538j71300j81860K04654L14882j14246
$$ plain form
116 152235 -208448 -223065 62731 131383 -30902 -44077 43777 -58202 -168461 24035 234093
127 234093 49633 -249310 -165961 124330 140039 -43406 -58504 22554 -54156 -120203 56824
138 56824 193738 -13735 -239733 -79924 187581 115774 -109660 -92640 38249 -1880 -56437
149 -56437 65630 121297 -71108 -183401 24943 201658 31504 -178508 -67613 131413
159 131413 73573 -71442 -26831 51123 -28874 -66532 75271 120147 -68846 -154397 42781
170 42781 175708 11798 -142459 -35276 95483 25757 -49593 33579 68103 -65082 -108466
181 -108466 60293 145185 -11959 -125141 -14459 79651 5953 -29770 52484 33672 -105887
192 -105887 -85328 116327 153869 -58421 -169274 -11088 126582 46381 -52405 -16349 9799
$$ packed form
116A52235l60683j4617K85796O8652j62285j3175Q7854j01979j10259J92496K10058
127B34093j84460k98943Q3349K90291J5709j83445j5098Q1058p6710o6047J77027
138E6824J36914k07473k25998J59809K67505p1807k25434J7020J30889m0129n4557
149e6437J22067N5667j92405j12293K08344J76715j70154k10012J10895J99026
159A31413n7840j45015M4611P7954p9997l7658J41803M4876j88993q5551J97178
170D2781J32927j63910j54257J07183J30759o9726p5350Q3172L4524j33185m3384
181a08466J68759Q4892j57144j13182J10682R4110p3698l5723Q2254j8812j39559
192a05887K0559K01655L7542k12290j10853J58186J37670q0201r8786L6056K6148
$$ plain form
203 9799 -39823 -7797 95063 51502 -102848 -86992 85997 109562 -45563 -88888 37136
214 37136 77870 -27285 -56984 41442 64289 -29199 -44720 45271 52334 -35451 -30456 59348
226 59348 44474 -48622 -25271 73166 46069 -56471 -29254 78819 57110 -55493 -46132 66686
238 66686 77989 -21642 -47282 24005 43779 1192 10846 44354 -2973 -55000 13629 97887
250 97887 35728 -71333 -39750 64906 61380 -19301 -25692 26386 20604 -20184 2358 46543
262 46543 14442 -38597 -7347 46295 14457 -35785 -392 47079 4265 -47556 -5857 50333
274 50333 18004 -37870 -18725 25219 9642 -21850 606 26903 -7570 -40862 -2753 38588
286 38588 5055 -37024 -10098 23008 -4908 -29825 3833 28144 -8343 -38562 -9428 23385
$$ packed form
203I799m9622L2026J02860m3561j54350J5856J72989K3565j55125m3325J26024
214C7136M0734j05155k9699R8426K2847r3488j5521Q9991P063q7785M995Q9804
226E9348j4874r3096K3351R8437k7097j02540K7217J08073k1709j12603R361J12818
238F6686J1303r9631k5640P1287J9774m2587R654L3508m7327n2027O8629Q4258
250I7887o2159j07061L1583J04656l526q0681o391N2078n782m0788K2542M4185
262D6543l2101n3039L1250N3642l1838n0242L5393M7471m2814n1821M1699N6190
274E0333l2329n5874J9145M3944j5577l1492K2456K6297l4473l3292L8109M1341
286C8588l3533m2079K6926L3106k7916k4917L3658K4311l6487l0219K9134L2813
$$ plain form
298 23385 6825 -17501 -7593 1564 -16879 -17781 18701 27075 -22149 -47835 -2237 37442 9351
311 9351 -29370 -20780 2394 3187 416 4054 -5871 -21748 -10387 17391 12552 -21808 -28276 9348
325 9348 26172 -7637 -34068 -9223 19503 8564 -13490 -15113 -7171 -2471 5287 6989 -8113
338 -8113 -20586 -8447 10646 6210 -13263 -14331 3517 4855 -15172 -17270 8207 17369 -9528
351 -9528 -30096 -14089 12633 18060 -208 -24679 -28680 -2164 26066 17355 -20213 -39465 -12780
364 -12780 26418 25215 -14948 -36738 -12688 18123 15196 -7803 -19943 -11600 4770 9865 -2059
377 -2059 -14541 -8898 5013 5338 -6054 -11107 -2841 6352 2655 -8996 -10508 2454 8058 -2808
391 -2808 -10871 -3512 5839 4572 -4801 -11447 -3849 10831 10938 -7549 -18661 -5937 14805 17774
$$ packed form
298B3385j6560k4326R908R157j8443r02L6482Q374m9224k5686M5598L9679k8091
311I351l8721Q590K3174P93k771L638r925j5877J1361K7778m839l4360o468L7624
325I348J6824l3809k6431K4845K8726j0939k2054j623P942M700P758J702j5102
338h113j2473J2139J9093m436j9473j068J7848J338k0027k098K5477R162k6897
351i528k0568J6007K6722N427j8268k4471m001K6516K8230q711l7568j9252K6685
364a2780L9198j203m0163k1790K4050L0811k927k2999j2140Q343J6370N095j1924
377b059j2482N643J3911L25j1392n053Q266R193l697j1651j512J2962N604j0866
391b808q063P359R351j267r373o646P598J4680J07j8487j1112J2724K0742K969
$$ plain form
405 17774 -2464 -21978 -15039 13011 24421 4461 -18625 -17638 2013 18873 15217 -5592 -18955
418 -18955 -7859 11421 15900 3947 -7861 -9040 152 9324 8874 2780 -2460 -4350 -1354 8280
432 8280 11914 1934 -5650 -1108 6508 7037 5006 2460 -334 -177 5612 9155 5210 -1349 -1743 6202
448 6202 11449 4869 -2670 1714 6626 4506 5044 9329 3026 -7646 -830 17180 16033 -3347 -13405
463 -13405 -837 15605 15514 2480 -7459 -6959 1194 15278 19598 -712 -22678 -9130 23658 23356
477 23356 -8369 -19785 619 15045 6581 -1700 -809 -972 -3960 1813 9601 3372 -9477 -4485
491 -4485 10672 4247 -11685 -2167 16606 3634 -20485 -7986 21991 14297 -16413 -17354 8630
504 8630 16179 -873 -8199 -1033 -154 -2520 8919 13965 -9514 -24650 6353 35623 6399 -34236
$$ packed form
405A7774k0238j9514O939K8050J1410j9960k3086R87J9651J6860l656k0809j3363
418a8955J1096J9280M479j1953j1808j179R192R172m50o094n240j890K996R634
432H280L634r980p584M542P616N29k031k546k794J57N789L543l945o559l94P945
448F202N247o580p539M384M912k120N38M285o303j0672O816J8010j147j9380j0058
463a3405J2568J6442r1j3034r939N00Q153J4084M320k0310k1966J3548L2788l02
477B3356l1725j1416K0404J4426q464q281Q91j63k988N773P788o229j2849M992
491d485J5157o425j5932R518J8773j2972k4119J2499K9977p694l0710r41K5984
504H630P549j7052p326P166Q79k366J1439N046k3479j5136L1003K9270k9224m0635
$$ plain form
518 -34236 -14591 28935 22371 -14501 -16101 7342 8850 -3007 4604 11805 -6365 -18906 7670
531 7670 28326 792 -26572 -1258 27397 2465 -24208 2489 29011 -1506 -30397 -854
543 -854 30915 6767 -25665 -8654 17916 3592 -14750 3289 14516 -14044 -24891 14036
555 14036 30396 -16156 -41406 5515 37481 -4817 -38999 -5081 25019 -2998 -25500 1514
567 1514 15543 -16715 -27186 12881 25600 -20962 -39804 7971 32098 -13175 -36078 5304
579 5304 22196 -19722 -29034 18741 25278 -29566 -39655 18593 35785 -17794 -39090 6986 26039
592 26039 -14756 -24479 18784 20269 -31431 -28632 32191 33697 -31901 -37979 25158 34343 -21911
605 -21911 -27092 24481 22759 -29914 -22262 37394 30230 -36091 -34214 33489 38083 -23593 -29340
$$ packed form
518c4236J9645M3526o564l6872j600K3443J508j1857P611P201j8170j2541K6576
531G670K0656k7534k7364K5314K8655k4932k6673K6697K6522l0517k8891K9543
543h54L1769k4148l2432J7011K6570j4324j8342J8039J1227k8560j0847L8927
555A4036J6360m6552k5250M6921L1966m2298l4182L3918L0100k8017k2502K7014
567A514J4029l2258j0471M0067J2719m6562j8842M7775K4127m5273k2903M1382
579E304J6892m1918r312M7775O537n4844j0089N8248J7192n3579k1296M6076J9053
592B6039m0795r723M3263J485n1700K799O0823J506o5598o078O3137R185n6254
605b1911n181N1573j722n2673P652N9656p164o6321J877O7703M594o1676n747
$$ plain form
618 -29340 24361 22626 -25947 -11008 39798 13862 -46435 -17352 53338 30402 -45818 -33797
630 -33797 39033 35279 -27759 -24831 28792 16718 -33354 -10178 43871 12581 -48458 -16820
642 -16820 48646 20120 -43736 -17393 40318 10446 -43261 -6110 49895 8029 -56667 -16709
654 -16709 55350 24447 -46925 -24521 35556 14214 -31729 439 38811 -10923 -51178 11172
666 11172 63613 -664 -64657 -8537 59303 15497 -46725 -8714 43617 3399 -41259 8341
678 8341 51305 -5323 -52507 7637 57778 152 -47967 7235 48895 -7982 -42436 20869
690 20869 53922 -16980 -55293 18804 65617 -3581 -55958 3596 52455 760 -36938 14665
702 14665 38677 -22073 -38796 34481 52488 -28541 -55318 24764 57867 -14312 -47866 16253
$$ packed form
618b9340N3701j735m8573J4939N0806k5936o0297K9083P0690k2936p6220J2021
630c3797P2830l754o3038K928N3623j2074n0072K3176N4049l1290o1039L1638
642a6820O5466k8526o3856K6343N7711k9872n3707L7151N6005m1866o4696L9958
654a6709P2059l0903p1372K2404O0077k1342m5943L2168L8372m9734m0255O2350
666A1172N2441o4277o3993N6120O7840m3806o2222L8011N2331m0218m4658M9600
678H341M2964n6628m7184O0144N0141n7626m8119N5202M1660n6877l4454O3305
690B0869L3053p0902l8313P4097M6813o9198n2377N9554M8859n1695l7698N1603
702A4665K4012o0750j6723P3277J8007q1029k6777Q0082L3103p2179l3554O4119
$$ plain form
714 16253 42579 -20225 -39288 28394 44613 -30434 -49610 27475 50659 -22993 -45892 20268
726 20268 36039 -26635 -31672 33985 31059 -43312 -40139 41878 45488 -37879 -50184 27600 42754
739 42754 -27195 -36809 28510 28541 -38464 -30606 42413 32547 -44324 -37071 38787 34281 -36199 -28866
753 -28866 35714 22320 -41947 -21886 48122 26817 -50854 -32784 47789 35602 -40390 -31609
765 -31609 35857 23930 -35074 -14651 41072 11844 -47094 -12701 51557 18395 -49292 -20947
777 -20947 45402 20255 -42147 -15774 43057 11278 -46993 -11614 49253 13768 -49256 -17591
789 -17591 41754 12553 -38491 -8690 33786 -2853 -42260 2622 46403 -4301 -56951 -8822
801 -8822 50225 9021 -49404 -14997 35762 1814 -39380 -1114 34478 -10122 -46137 2139
$$ packed form
714A6253K6326o2804j9063O7682J6219p5047j9176P7085K3184p3652k2899O6160
726B0268J5771o2674n037O5657k926p4371L173Q2017L610q3367j2305P7784J5154
739D2754o9949r614O5319L1o7005P858P3019r866p6871P253P5858m506p0480P333
753b8866O4580j3394o4267K0061P0008k1305p7671J8070Q0573j2187p5992Q781
765c1609O7466j1927n9004K0423N5723k9228n8938L4393O4258l3162o7687K8345
777b0947O6349k5147o2402K6373N8831l1779n8271L5379O0867l5485o3024L1665
789a7591N9345k9201n1044K9801M2476l6639l9407M4882M3781n0704n2650M8129
801h822N9047m1204n8425L4407N0759l3948m1194L8266L5592m4600l6015M8276
$$ plain form
813 2139 40689 -6355 -45871 -2170 34362 -8047 -39424 6473 35523 -16555 -47753 8967
825 8967 46236 -9470 -50566 -1700 37852 -2648 -33054 3883 23397 -16912 -28678 20747
837 20747 32834 -23494 -41651 16152 41841 -11605 -38305 9166 32015 -12671 -28605 19131
849 19131 30598 -20881 -33364 20146 35934 -13087 -30002 11525 24592 -11749 -16254 21652
861 21652 19273 -26405 -22911 31903 33207 -24470 -34267 18897 33340 -10444 -21481 13414 16159
874 16159 -16981 -10696 26109 16664 -26503 -20397 25622 24798 -17622 -19923 16748 15333 -18331
887 -18331 -9148 26359 12656 -29912 -17196 29677 23776 -20625 -21217 13925 15525 -9634 -5049
900 -5049 15187 583 -22599 -759 30714 9476 -30145 -14461 27061 18197 -17590 -11540 15944
$$ packed form
813B139L8550m7044l9516M3701L6532m2409l1377M5897K9050n2078l1198N6720
825H967L7269n5706m1096M8866L9552m0500l0406L6937J9514m0309j1766M9425
837B0747J2087n6328j8157N7803K5689n3446k6700M7471K2849m4686j5934M7736
849A9131J1467n1479j2483N3510J5788m9021j6915M1527J3067l6341m505L7906
861B1652k379m5678L494N4814J304n7677r797N3164J4443m3784j1037L4895K745
874A6159l3140O285L6805r445m3167O106M6019q24m2420k301L6671j415l3664
887a8331R183L5507j3703m2568J2716M6873n901m4401n92L5142J600k5159M585
900e049K0236j4604k3182K1840L1473k1238l9621J5684M1522q864l5787O050K7484
$$ plain form
913 15944 6766 -15602 150 22635 3499 -22822 -4977 23765 11718 -14955 -7745 13394
925 13394 4852 -10176 5795 19356 -4863 -23997 4272 31320 7373 -23931 -9521 18999
937 18999 12581 -6813 -2321 7253 -2280 -7817 9616 17698 -4909 -19351 2168 21765 4403
950 4403 -14179 -1529 12058 -1019 -9266 7421 14051 -5944 -16471 3810 18766 3456 -13537
963 -13537 -5268 7243 3300 -2045 4180 2732 -10693 -8157 13378 15547 -9926 -19142 2467 16473
977 16473 2385 -10244 -3838 3489 -1333 -1983 4916 3334 -8500 -8958 5444 10276 -3221 -9440
991 -9440 310 4477 -3107 -2670 6198 1732 -10931 -7158 8979 10234 -5797 -13485 -1998 7756
1005 7756 4493 -3518 -4926 -3905 -2877 2966 7438 -1228 -12988 -6453 8977 7702 -6140 -9607
$$ packed form
913A5944r178k2368J5752K2485j9136k6321J7845K8742j2047k6673P210K1139
925A3394q542j5028J5971J3561k4219j9134K8269K7048k3947l1304J4410K8520
937A8999o418j9394M492R574r533n537J7433Q082k2607j4442K1519J9597j7362
950D403j8582J2650J3587j3077q247J6687O630j9995j0527K0281J4956j5310j6993
963a3537Q269J2511l943n345O225j448j3425K536K1535K169k5473r216K1609J4006
977A6473j4088j2629O406P327m822o50O899j582j1834m58J4402M832j3497o219
991i440R750M167p584M37Q868m466j2663L773J6137J255j6031p688J1487R754
1005G756l263q011j408J021J028N843M472q666j1760O535J5430j275j3842l467
$$ plain form
1019 -9607 -787 3207 -155 -1897 -276 -1182 -5205 -3261 3167 3448 -3582 -6561 -1475 1751 336
1034 336 268 -837 -5668 -5985 2689 7263 -971 -10437 -6294 5003 7344 -1189 -8827 -5356 2069 4467
1050 4467 1144 -3042 -5415 -3578 3018 5108 -1322 -6870 -2931 2902 2133 -849 -1192 -1359 -1697 -1522
1066 -1522 749 2734 541 -4316 -4456 1507 4875 1376 -3563 -4500 -1643 3320 4932 -317 -7540
1081 -7540 -4820 4048 7008 683 -6770 -5623 2307 5984 1607 -4553 -4439 57 2838 2696 -217
1096 -217 -4216 -2693 1982 2926 -27 -1628 -686 -891 -1171 618 2524 1311 -2754 -3991 658 5931
1112 5931 3036 -4526 -4979 937 4796 3784 -629 -4763 -3327 4235 8055 1195 -6653 -4339 4646
1127 4646 8029 1654 -4366 -2330 3460 4350 1650 1022 564 -1348 430 5341 3766 -1262 -1367 2320
$$ packed form
1019i607Q820L994l362j742J621r06m023J944O428K81p030k979N086L226j415
1034C36o8j105m831l17Q674M574q234r466M143J1297K341q533p638L471P425K398
1050D467l323m186k373J837O596K090o430n548L939N833p69k982l43j67l38J75
1066a522K271J985k193m857j40N963L368l499m939r37K857M963J612n249p223
1081g540K720Q868K960o325p453J147P930L677m377o160J14M496K781j42k913
1096b17l999J523M675R44k953j601R42k05k80J789J906j213m065j237M649N273
1112E931k895p562m53N916L859j012m413m134J436P562L820o860p848K314Q985
1127D646L383o375o020K036N790Q90k700o28m58j912J778M911j575n028j05L687
$$ plain form
1143 2320 2212 1058 2813 3658 -641 -3691 1601 8005 4947 -5086 -6100 4326 9021 1966 -4038
1158 -4038 -1796 1263 2230 4982 3219 -4244 -6543 3241 10237 2598 -7885 -4772 5511 6348 -1342
1173 -1342 -3006 1767 703 -3321 1058 6416 276 -7776 -2608 6584 3272 -3451 -1394 1631 -2072
1188 -2072 -2785 4737 6275 -4782 -11369 938 13052 3780 -11828 -7552 6813 6635 -2211 -1712
1202 -1712 424 -4265 -2930 7715 8181 -6716 -12185 2570 12658 1607 -9636 -2533 5908 -201
1216 -201 -5444 4605 8148 -6210 -12328 4548 14359 -393 -12236 -2774 7005 1256 -1929 4032
1230 4032 1195 -10414 -6268 12962 12952 -11289 -18795 4324 17738 257 -13504 -2509 5691
1243 5691 -2629 -3398 8069 3508 -14169 -10432 11459 12979 -8753 -15120 2577 8604 -4002 -6163
$$ packed form
1143B320j08j154J755Q45m299l050N292O404l058j0033j014J0426M695p055o004
1158d038K242L059R67K752j763p463k299R784O996p639j0483L113J0283Q37p690
1173a342j664M773j064m024M379N358o140q052N168R192l312o723K057L025l703
1188b072p13P522J538j1057o587J2307J2114r272j5608M276J4365j78q846M99
1202a712K136m689J335J0645M66j4897n469J4755J0088j1051j1243P103Q441o109
1216b01n243J0049L543j4358o118J6876R811j4752j1843R462R779n749l185N961
1230D032k837j1609M146J9230j0k4241p506K3119J3414j7481j3761J0995Q200
1243E691q320p69J1467m561j7677L737K1891J520k1732o367J7697O027j2606k161
$$ plain form
1257 -6163 7365 3369 -15229 -9616 16040 14246 -14767 -19355 5567 14616 -2177 -8536 1050
1270 1050 -733 -9030 1748 16306 2069 -22193 -11365 19783 17155 -13583 -17550 6795 10740
1283 10740 -6039 -3434 10718 292 -16948 -2660 21212 9271 -18089 -12160 13022 11386
1295 11386 -7020 -3567 9742 -1481 -15642 3993 25663 3354 -26876 -10263 24136 16079
1307 16079 -13593 -11421 7779 4011 -6510 5872 14382 -7096 -22128 3740 28139 4842
1319 4842 -24739 -9286 18935 8204 -12805 -424 13153 -6016 -18798 7644 24939 -2583
1331 -2583 -26744 -4000 21903 7336 -14058 -3594 8403 -5133 -11394 12238 19059 -13736
1343 -13736 -28306 7253 30767 712 -26165 -5248 17158 1395 -10855 5926 10715 -12893
$$ packed form
1257f163J3528l996j8598N613K5656j794k9013m588K4922R049j6793o359R586
1270A050j783q297J0778J4558j4237k4262J0828L1148k628l0738l967K4345L945
1283A0740j6779K605J4152j0426j7240J4288K3872j1941k7360N929K5182j636
1295A1386j8406L453J3309j1223j4161J9635K1670k2309l0230J6613L4399q057
1307A6079k9672K172J9200l768j0521J2382Q510k1478j5032K5868K4399k3297
1319D842k9581J5453K8221j0731k1009J2381J3577j9169j2782K6442J7295k7522
1331b583k4161K2744K5903j4567k1394J0464J1997j3536o261K3632O821l2795
1343a3736j4570L5559K3514l0055k6877K0917K2406j5763j2250J6781M789k3608
$$ plain form
1355 -12893 -16827 14361 23736 -9896 -25620 4424 22423 -1355 -15516 5943 12627 -12193
1367 -12193 -13471 18956 20928 -16790 -25212 12522 27278 -3696 -19358 2794 12782 -5142 -6374
1380 -6374 15712 10014 -21018 -15326 23692 23588 -17195 -23829 12576 21137 -7848 -12566 11907
1393 11907 9852 -16378 -9616 21083 15526 -19573 -18023 16043 18262 -11438 -13083 12073 7254
1406 7254 -16641 -4995 23001 7735 -27402 -13830 24695 17785 -19298 -18372 12120 12295 -11152
1419 -11152 -6973 13425 1795 -20391 -4471 23986 6768 -25252 -11510 21149 9843 -18919
1431 -18919 -8272 16827 3234 -20710 -3522 22106 3791 -24567 -8004 20922 8067 -18646
1443 -18646 -7645 14677 1488 -17090 1680 19631 -4319 -25216 1291 26515 1319 -25564
$$ packed form
1355a2893l934L1188R375l3632j5724L0044J7999k3778j4161K1459O684k4820
1367a2193j278L2427J972l7718q422L7734J4756l0974j5662K2152R988j7924j232
1380f374K2086n698l1032N692L9018j04m0783o634L6405Q561k8985m718K4473
1393A1907k055k6230O762L0699n557l5099J550L4066K219k9700j645K5156m819
1406G254k3895J1646K7996j5266l5137J3572L8525o910l7083R26L0492J75k3447
1419a1152M179K0398j1630k2186J5920K8457j7218l2020J3742L2659j1306k8762
1431a8919J0647K5099j3593k3944J7188K5628j8315k8358J6563K8926j2855k6713
1443a8646J1001K2322j3189j8578J8770J7951k3950k0897K6507K5224k5196k6883
$$ plain form
1455 -25564 -4986 20895 4025 -17853 -2113 15958 -1878 -18290 2947 19576 -3700 -22145
1467 -22145 2045 20605 -2504 -19842 2954 17842 -6095 -19788 6339 19829 -7097 -22026
1479 -22026 3695 20312 -2933 -19411 1533 15422 -4409 -15743 5794 14056 -9727 -16819
1491 -16819 9613 16554 -11165 -18863 8320 16706 -9255 -17547 7295 15361 -8443 -16628 7518
1504 7518 14465 -8452 -15309 7111 12922 -9694 -12766 9973 11004 -12408 -12040 12596 12093 -13347
1518 -13347 -13225 12238 13186 -11300 -12874 10772 12317 -10485 -11863 10948 11659 -10556 -9826 11198
1532 11198 8712 -11298 -6614 13186 6656 -13828 -6332 15900 8756 -14107 -9353 13866 11119
1545 11119 -10761 -8777 10736 7859 -9395 -4660 11741 4768 -11811 -3414 14180 4806 -12545
$$ packed form
1455b5564K0578K5881j6870k1878J5740J8071j7836j6412K1237J6629k3276j8445
1467b2145K4190J8560k3109j7338K2796J4888k3937j3693K6127J3490k6926j4929
1479b2026K5721J6617k3245j6478K0944J3889j9831j1334K1537Q262k3783p092
1491a6819K6432O941k7719p698K7183Q386k5961q292K4842Q066k3804q185K4146
1504G518O947k2917o857K2420N811k2616l072K2739J031k3412L68K4636n03k5440
1518a3347J22K5463R48k4486j574K3646J545k2802j378K2811P11k2215P30K1024
1532A1198k486k0010M684J9800o530k0484P496K2232p144k2863M754K3219k747
1545A1119k1880J984J9513k877j7254M735J6401o973j6579Q397J7594r374j7351
$$ [...]
8191H4
##END NTUPLES=NMR FID
##END=
