##TITLE=1H_CG-1104-82
 DMSO, 8 sc, 
 28.5.2019
##JCAMPDX= 6.0         $$ Bruker NMR JCAMP-DX V2.0
##DATA TYPE= NMR FID
##DATA CLASS= NTUPLES
##ORIGIN= UXNMR, Bruker Analytische Messtechnik GmbH
##OWNER= root
$$ XWIN-NMR		Version 3.5
$$ Tue May 28 15:40:50 2019 Russian Standard Time (UT+4h)  she@DPX200
##.OBSERVE FREQUENCY= 200.1315
##.OBSERVE NUCLEUS= ^1H
##.DELAY= (6, 6)
##.ACQUISITION MODE= SIMULTANEOUS
##.ACQUISITION SCHEME= undefined
##.AVERAGES= 8
##.DIGITISER RES= 18
##SPECTROMETER/DATA SYSTEM= spect
##.PULSE SEQUENCE= zg30
##.SOLVENT NAME= DMSO
##.SHIFT REFERENCE= (INTERNAL, DMSO, 0, 15.7039)
##AUDIT TRAIL= $$ (NUMBER, WHEN, WHO, WHERE, WHAT)
$$ ##TITLE= Audit trail, XWIN-NMR		Version 3.5
$$ ##JCAMPDX= 5.01
$$ ##ORIGIN= Bruker BioSpin GmbH
$$ ##OWNER= she
$$ F:/spectra/data/she/nmr/H-F/1/audita.txt
$$ ##AUDIT TRAIL=  $$ (NUMBER, WHEN, WHO, WHERE, WHAT)
(   1,<2019-05-28 15:39:34.71 +0400>,<she>,<DPX200>,
      <created by zg, POWCHK disabled, PULCHK disabled
       configuration hash MD5:
       00 E9 B6 7A A2 85 ED C7 34 08 36 98 17 FE 4E 26
       data hash MD5: 16K
       9F 05 1C 1C 32 7B 0D DE B2 80 66 6A FE 31 FB 64>)
$$ ##END=
$$ 
$$ hash MD5
$$ F7 04 62 0A E4 E0 17 8B B3 7A F2 23 26 F8 72 58
##$RELAX= 
##$RELAX= 
##$RELAX= 
##$RELAX= 
##$RELAX= 
##$RELAX= 
$$ Bruker specific parameters
$$ --------------------------
##$DU= <F:/spectra>
##$EXPNO= 1
##$NAME= <H-F>
##$PROCNO= 1
##$TYPE= <nmr>
##$USER= <she>
##$AMP= (0..31)
100 100 100 100 100 100 100 100 100 100 100 100 100 100 100 100 100 100 
100 100 100 100 100 100 100 100 100 100 100 100 100 100 
##$AQSEQ= 0
##$AQ_mod= 1
##$AUNM= <au_zg>
##$AUTOPOS= <>
##$BF1= 200.13
##$BF2= 200.13
##$BF3= 200.13
##$BF4= 200.13
##$BF5= 200.13
##$BF6= 200.13
##$BF7= 200.13
##$BF8= 200.13
##$BYTORDA= 1
##$CFDGTYP= 0
##$CFRGTYP= 5
##$CHEMSTR= <none>
##$CNST= (0..31)
1 1 145 1 1 1 1 1 1 1 1 1 1 1 1 1 1 1 1 1 1 1 1 1 1 1 1 1 1 1 1 1 
##$CPDPRG= <>
##$CPDPRG1= <>
##$CPDPRG2= <>
##$CPDPRG3= <>
##$CPDPRG4= <mlev>
##$CPDPRG5= <mlev>
##$CPDPRG6= <mlev>
##$CPDPRG7= <mlev>
##$CPDPRG8= <mlev>
##$CPDPRGB= <>
##$CPDPRGT= <>
##$D= (0..31)
0 1.2 0 0 0 0 0 0 0 0 0 0.03 0 0 0 0 0 0 0 0 0 0 0 0 0 0 0 0 0 0 0 0 
##$DATE= 1559043574
##$DBL= (0..7)
120 120 120 120 120 120 120 120 
##$DBP= (0..7)
150 150 150 150 150 150 150 150 
##$DBP07= 0
##$DBPNAM0= <>
##$DBPNAM1= <>
##$DBPNAM2= <>
##$DBPNAM3= <>
##$DBPNAM4= <>
##$DBPNAM5= <>
##$DBPNAM6= <>
##$DBPNAM7= <>
##$DBPOAL= (0..7)
0.5 0.5 0.5 0.5 0.5 0.5 0.5 0.5 
##$DBPOFFS= (0..7)
0 0 0 0 0 0 0 0 
##$DE= 6
##$DECBNUC= <off>
##$DECIM= 24
##$DECNUC= <off>
##$DECSTAT= 4
##$DIGMOD= 1
##$DIGTYP= 9
##$DL= (0..7)
0 120 120 120 120 120 120 120 
##$DP= (0..7)
150 150 150 150 150 150 150 150 
##$DP07= 0
##$DPNAME0= <>
##$DPNAME1= <>
##$DPNAME2= <>
##$DPNAME3= <>
##$DPNAME4= <>
##$DPNAME5= <>
##$DPNAME6= <>
##$DPNAME7= <>
##$DPOAL= (0..7)
0.5 0.5 0.5 0.5 0.5 0.5 0.5 0.5 
##$DPOFFS= (0..7)
0 0 0 0 0 0 0 0 
##$DQDMODE= 0
##$DR= 18
##$DS= 0
##$DSLIST= <SSSSSSSSSSSSSSS>
##$DSPFIRM= 0
$$ [...]
##$SUBNAM2= <"">
##$SUBNAM3= <"">
##$SUBNAM4= <"">
##$SUBNAM5= <"">
##$SUBNAM6= <"">
##$SUBNAM7= <"">
##$SUBNAM8= <"">
##$SUBNAM9= <"">
##$SW= 24.9337058887773
##$SWIBOX= (0..15)
0 0 2 0 0 0 0 0 0 0 0 0 0 0 0 0 
##$SW_h= 4990.01996007984
##$TD= 16384
##$TD0= 1
##$TE= 0
##$TE2= 300
##$TE3= 300
##$TEG= 300
##$TL= (0..7)
0 120 120 120 120 120 120 120 
##$TP= (0..7)
150 150 150 150 150 150 150 150 
##$TP07= 0
##$TPNAME0= <>
##$TPNAME1= <>
##$TPNAME2= <>
##$TPNAME3= <>
##$TPNAME4= <>
##$TPNAME5= <>
##$TPNAME6= <>
##$TPNAME7= <>
##$TPOAL= (0..7)
0.5 0.5 0.5 0.5 0.5 0.5 0.5 0.5 
##$TPOFFS= (0..7)
0 0 0 0 0 0 0 0 
##$TUNHIN= 0
##$TUNHOUT= 0
##$TUNXOUT= 0
##$USERA1= <user>
##$USERA2= <user>
##$USERA3= <user>
##$USERA4= <user>
##$USERA5= <user>
##$V9= 5
##$VALIST= <valist>
##$VCLIST= <CCCCCCCCCCCCCCC>
##$VD= 0
##$VDLIST= <DDDDDDDDDDDDDDD>
##$VPLIST= <PPPPPPPPPPPPPPP>
##$VTLIST= <TTTTTTTTTTTTTTT>
##$WBST= 1024
##$WBSW= 4
##$XGAIN= (0..3)
0 0 0 0 
##$XL= 0
##$YL= 0
##$YMAX_a= 137418
##$YMIN_a= -139613
##$ZGOPTNS= <>
##$ZL1= 120
##$ZL2= 120
##$ZL3= 120
##$ZL4= 120
##$ABSF1= 10
##$ABSF2= 0
##$ABSG= 5
##$ABSL= 3
##$ALPHA= 0
##$AQORDER= 0
##$ASSFAC= 0
##$ASSFACI= 0
##$ASSFACX= 0
##$ASSWID= 0
##$AUNMP= <proc_1d>
##$AZFE= 0.1
##$AZFW= 0.1
##$BCFW= 1
##$BC_mod= 2
##$BYTORDP= 1
##$COROFFS= 0
##$CY= 11.3945322036743
##$DATMOD= 1
##$DC= 2
##$DFILT= <>
##$DTYPP= 0
##$F1P= 18.9103706918063
##$F2P= -1.10871071338519
##$FCOR= 0.5
##$FTSIZE= 0
##$FT_mod= 4
##$GAMMA= 1
##$GB= 0.15
##$INTBC= 1
##$INTSCL= 1
##$ISEN= 128
##$LB= 0.24
##$LEV0= 0
##$LPBIN= 0
##$MAXI= 10000
##$MC2= 0
##$MEAN= 0
##$ME_mod= 0
##$MI= 1.114404
##$NCOEF= 0
##$NC_proc= 0
##$NLEV= 6
##$NOISF1= 3.799351
##$NOISF2= 2.8
##$NSP= 1
##$NTH_PI= 0
##$NZP= 0
##$OFFSET= 15.70392
##$PC= 1
##$PHC0= -8864.568
##$PHC1= 23.20025
##$PH_mod= 1
##$PKNL= yes
##$PPARMOD= 0
##$PSCAL= 0
##$PSIGN= 0
##$REVERSE= no
##$SF= 200.130013532006
##$SI= 16384
##$SIGF1= 3
##$SIGF2= 2
##$SINO= 400
##$SIOLD= 16384
##$SREGLST= <1H.CDCl3>
##$SSB= 0
##$STSI= 0
##$STSR= 0
##$SW_p= 3612.71676300578
##$SYMM= 0
##$S_DEV= 0
##$TDeff= 0
##$TDoff= 0
##$TI= <>
##$TILT= no
##$TM1= 0
##$TM2= 0
##$TOPLEV= 0
##$USERP1= <user>
##$USERP2= <user>
##$USERP3= <user>
##$USERP4= <user>
##$USERP5= <user>
##$WDW= 1
##$XDIM= 8192
##$YMAX_p= 0
##$YMIN_p= 0
$$ End of Bruker specific parameters
$$ ---------------------------------
##NTUPLES= NMR FID
##VAR_NAME=  TIME,          FID/REAL,        FID/IMAG
##SYMBOL=    X,             R,               I
##VAR_TYPE=  INDEPENDENT,   DEPENDENT,       DEPENDENT
##VAR_FORM=  AFFN,          ASDF,            ASDF
##VAR_DIM=   8192,          8192,            8192
##UNITS=     SECONDS,       ARBITRARY UNITS, ARBITRARY UNITS
##FACTOR=    0.0002004,     1,               1
##FIRST=     0,             0,               0
##LAST=      1.6414764,     0,               0
##MIN=       0,             -139613,         0
##MAX=       1.6414764,     137418,          0
$$ Real data points
##PAGE= N=1
##DATA TABLE= (X++(R..R)), XYDATA
$$ [...]
2364H62k050n89K238J847j142j785j122Q84J753J461j554k123O9R84R88J159q42
$$ 862 -1188 -1777 461 2308 1166 -619 -1741 -857 896 2357 803 -1320 -1251 -267 721 1880 1038
2381A038j994q42J045K032P52q03k482j637J975L406K87k515k362q63K784L515
$$ 1038 -956 -1798 -753 1279 2031 1228 -1254 -2891 -916 2490 2777 262 -2100 -2963 -179 3336
2397C336j020l721k363J894L559J091j384l553p56K818K668r32k554r27N43J938
$$ 3336 2316 -1405 -3768 -1874 1685 2776 1392 -2161 -2917 -99 2569 1637 -917 -1844 -1301 637
2413F37J223j619j604J83J090K14K61n11m98L69N20m94l15N23k70k73M08K50l72
$$ 637 1860 241 -1363 -1180 -90 124 385 -126 -624 -255 265 -229 -544 -21 -291 -564 -156 94 -278
2432b78m59M15J86K96K19j128q85O68K267l02j324j338j05J849K326r13l085j799
$$ -278 -737 -322 -136 160 379 -749 -1634 -966 1301 999 -325 -1663 -1768 81 2407 1494 -1591 -3390
2450c390K804K639O88k288l216m57L860K780j547l205k071J985K949J576k627
$$ -3390 -586 2053 2741 453 -2763 -3220 640 3420 1873 -1332 -3403 -1418 1531 3107 480
2465D80k699K37J906J540K45j672j427K75J394J016m14l99r99r92J364J540j09
$$ 480 -2219 -1982 -76 1464 1709 37 -1390 -1115 279 1295 881 482 -517 -1509 -145 1395 1286
2482A286q40r49n06J126J517r6j912r15J185J206O47j329j541K11K437N19k038
$$ 1286 446 -503 -1009 117 1634 1538 -374 -1289 -104 1102 1749 420 -1121 -910 1527 2046 8
2499Hr42M94J434R61r79k441j02K609J877j784k649n52J922K369K41k450k363
$$ 8 -934 -440 994 1955 976 -1465 -1567 1042 2919 1135 -1514 -2066 -144 2225 2466 16 -2347
2516b347J224K439J213j356k167p85J182J990J38j386n82q30L64J891O51r81j494
$$ -2347 -1123 1316 2529 1173 -994 -1779 -597 1393 1531 145 -437 -1267 -903 988 1639 658 -836
2533h36o73K4J971J751j053k836j297K194K360P22k094k744j1L146J766j510k518
$$ -836 -1509 -1485 486 2237 1184 -1652 -2949 -755 1605 2327 233 -2511 -2522 624 2390 880 -1638
2550a638q23J664K231J6k438j306J016K204o3j358j024M02J043J122j544r05K14
$$ -1638 -2461 -797 1434 1450 -988 -2294 -1278 926 863 -495 -1519 -1117 -74 1048 -496 -1401 -1187
2567a187J642j6o87q77k22J272J142p60j115k21M90Q31J77K77j311j45QM71O28
$$ -1187 455 439 -248 -1125 -1347 -75 1067 307 -808 -1029 -539 292 469 746 -565 -710 -702 -231 397
2586C97J031q81j962l30J594J981q0j847k709J028K880K185k546k763q89K548
$$ 397 1428 547 -1415 -1745 -151 1830 1750 -97 -2806 -1778 1102 3287 741 -2022 -2911 -363
2602c63L188J46l193k768J568K975J114j528k426j022K156J861l44j902l65P55
$$ -363 2825 2971 -222 -2990 -1422 1553 2667 1139 -1287 -2309 -153 1708 1364 -538 -903 -148
2618a48N67N29m62p39j83O47k44j89M76K10o56l35M62K32K80l50p21j1J118N21
$$ -148 419 948 486 -253 -436 211 -33 -222 254 464 -192 -527 -65 167 447 97 -624 -635 483 1004
2638A004j050r58P32J370op29j825N6K239J397j465k206j94J923K184o1l179j914
$$ 1004 -46 -1004 -272 1098 1092 363 -1462 -1406 833 2230 765 -1441 -1635 288 2472 2411 -768 -2682
2656b682J412L334O83k283k533J98J997K475p43k948n94P96J745O75n63j895m76
$$ -2682 -1270 2064 2747 464 -2069 -1871 126 2601 1858 -1090 -1684 -888 857 1532 969 -926 -1402
2673a402J223N89L87%r49j131K60J094P67N1r93j380O0J958R39j261j799K69P90
$$ -1402 -179 410 797 797 -152 -1283 -1023 71 838 889 -104 -1484 -1424 534 1473 212 -1587 -1318 -528
2692e28J860k74k181q88J306J692m10j397r38P63J233J257k281j566J232J818
$$ -528 1332 1058 -1123 -2011 -705 987 577 -820 -1758 -995 238 1495 -786 -2352 -1120 698
2708F98K29j400j450k3K052J534j507k305k9J512J403M63j355j526L03J391O71
$$ 698 927 -473 -1923 -1946 106 1640 133 -2172 -2201 -689 714 1177 -178 -1704 -1401 -10 661
2725F61m43l23j073j42R27Q84j95j45r84j070J117K359J87k031j575N27J572J973
$$ 661 218 -105 -1178 -1320 -393 491 296 151 -833 -1903 -786 1573 1760 -271 -1846 -1319 253 2226
2743B226k62k809j794K188K700K38k025k293K8K648J924j431k464l68J626J463
$$ 2226 1964 -845 -2639 -451 2249 2487 462 -1831 -1803 845 2769 1338 -1126 -1494 132 1595
2759A595k2j326j024N61J683j11j378j56P30J28K59p22n24L57R77l56p85J53L04
$$ 1595 1573 247 -777 -216 1467 1356 -22 -178 552 680 939 217 -307 50 1027 671 -114 39 343
2778C43m57M46K33j03m27J48n50K60J275K22j399j158N07Q85J467o11k059j421
$$ 343 -114 332 565 462 35 183 -367 -107 1168 1390 -9 -1167 -660 225 1692 1081 -978 -2399
2796b399J772K480J1k207j674j57K769K193j667l085l54K051J948N74k379k398
$$ -2399 -627 1853 1864 -343 -2017 -2174 595 2788 1121 -1964 -2318 -267 1681 2255 -124 -2522
2812b522Q43K475O37j014j177m01P32Q11N67q59l15N6j25J66N79n8o18n35M89
$$ -2522 -1679 796 1433 419 -758 -1159 -427 384 951 92 -223 -167 -292 -126 453 395 -223 -758 -269
2831b69l7R67L46j123j026J375O40l15q41l78L76J259M46j678r91P23J738K71
$$ -269 -306 661 1007 -116 -1142 233 873 558 -283 -661 -285 974 1420 -258 -1249 -526 1212 1483
2849A483j213j233j06J824J799j572k297m08K248J136P0k169j365Q27K561K41
$$ 1483 270 -963 -1069 755 2554 982 -1315 -1723 525 1661 1731 -438 -1803 -976 1585 1826
2865A826j418j597j88J190J566J53j260j392O40N13M00O43p06j364j48R74P71
$$ 1826 408 -1189 -1377 -187 1379 1532 272 -1120 -480 33 433 1076 370 -994 -1142 -168 603
2882F03M78r00j127r87J712J419j9j530j442M74J760J257j499k095K33J578J089
$$ 603 1081 181 -946 -1933 -221 1198 1179 -351 -1793 -1319 441 1698 199 -1896 -1663 -85 1004
2899A004l6j824o16N85K338p12j703n87J104Q19N65j298j243P07J523M06j391
$$ 1004 968 -856 -1472 -887 1451 739 -964 -1551 -447 372 937 -361 -1604 -897 626 1032 -359
2916c59j260N27Q03R67j8j619j98Q92L39K92M8q72n50L29N72O18k67n64r09j19
$$ -359 -1619 -1092 -289 678 660 -959 -1157 -265 74 366 414 -458 -1008 -679 -107 511 244 -320 -1229 -1348
2936a348J291J394p88j396p21J57J975J321j689k197J67J921J312L2k363j671
$$ -1348 -57 1337 549 -847 -1568 -1411 564 1885 196 -2001 -1834 87 1399 1431 -932 -2603
2952b603J231K521O51j936j230Q8O12K085k36k140m53J252P67k50l09p13L53L35
$$ -2603 -1372 1149 1800 -136 -1366 -1278 -666 1419 1183 -957 -1410 -158 609 359 50 -663 -310 25
2970B5K93l47n5P6mj88K32L19n05L29j02k04L60L04j010n39J187O89l56q14o9
$$ 25 318 -29 -84 -8 -12 -200 32 351 -154 175 73 -131 229 533 -477 -1016 171 860 504 -310 -379
2991c79k62J598O12j283j794O50J849O68j63j979j118J076K375L99k156j334K98
$$ -379 -641 957 1569 286 -1508 -858 991 1659 1496 -483 -1601 -525 1850 2249 93 -1241 -943
3008i43J551J496n33k138r91J431J865k10n92j150n01J170J160m64n86m04l40
$$ -943 608 2104 1571 -567 -1558 -127 1738 1528 936 -214 -715 455 1615 1151 565 161 -179
3025a79J28J257J70n93p06l70O79O76O79j083j165M01J112L46l24q59p40J275
$$ -179 -51 1206 1376 783 77 -293 386 1062 1741 658 -507 -106 1006 1352 1028 169 -571 704
3043G04J151n38j789o0P13R70N0j273j239J199J457K08j585q29L69R32J075m35
$$ 704 1855 1317 -472 -532 181 1151 1201 -72 -1311 -112 1345 1553 -32 -861 -492 440 1515 1080
3061A080j724n65J449O46P8r61j036l49J784O90m00j348l20K48O87O34j77j083
$$ 1080 -644 -1209 240 886 964 3 -1033 -1382 402 1092 692 -656 -976 -728 -41 593 416 -667
3079f67o91K52R94P63j92j221r90O71J457J90p25j307m05J050K068m27j368j295
$$ -667 -1358 -1106 -112 651 459 -762 -1752 -1081 376 566 -159 -1466 -1871 -821 1247 820 -548 -1843
3097a843P87J213R42n19j661n45J698P14m55p97k10j18J501pj201o03R55L66N9
$$ -1843 -1056 157 1099 580 -1081 -1626 72 786 331 -466 -676 -794 707 700 -501 -1104 -149 217 276
3116B76J03j157M0Q83O34n35o43o7R4P05N74k89p86l04J32M35P86k72q41p47R84
$$ 276 379 -778 -738 145 779 244 -399 -466 -372 333 907 618 -168 -472 -340 95 881 609 -232 -979 5
3137EO33M45p72j422l1J257J412l73j519j035N75J683N31q85k055j33J594J533
$$ 5 638 1083 311 -1111 -1142 115 1527 1154 -365 -1400 -825 858 1389 504 -1551 -1684 -90 1443
3155A443o02j299q41N8J865O53q83j563J81M49O38N77p83j001K22Q41J98j01k28
$$ 1443 841 -458 -1299 -1241 624 1277 394 -1169 -988 -539 99 676 -107 -1108 -886 -45 153 52 -176
3174a76q16J43O48L24j69k95k41P3K42P30o99o81K06P34L94l07q90m92P48J640
$$ -176 -992 -849 -201 123 -46 -341 -582 -509 -267 463 -236 -917 -711 23 417 110 -780 -1272 -524 1116
3194A116o18j260m70P07R63P26o69j504m8J260O74k32j105j168P80J513J148j457
$$ 1116 498 -762 -1232 -525 438 1164 495 -1009 -1057 203 877 645 -460 -1628 -848 665 1813 356
3212C56j380l8J200R33j7j207j132L00J088N48j0p12o82N5J330L42p01l11p33
$$ 356 -1024 -1062 138 1071 1054 -153 -1285 -985 103 651 641 -71 -753 -698 632 974 273 -38 -771
3231g71K17O42J306q24j197K30K75M65O19r58j023L04J443N04j024p18J4L44R35
$$ -771 -554 88 1394 570 -627 -397 -122 343 962 4 -1019 -715 728 1232 208 -510 -496 -152 783
3250G83k52j109J44K75O45J52p07r12L70J277P38j165q49j5M83P58O8n57j119
$$ 783 531 -578 -434 -159 486 638 -69 -981 -611 666 1404 239 -610 -625 -142 616 684 127 -992
3269i92O19J011M02o21o28k68J19J008R13j306m54l97N9J375N75q68j148j35R81
$$ -992 -373 638 1040 419 -209 -477 -358 650 1563 257 -197 -594 -535 840 1415 547 -601 -736 245
3288B45R66k79j089j014O51J294K96q42j210j22N64J426N1r77p96kJ141N37k88
$$ 245 1211 932 -157 -1171 -520 774 1070 228 -982 -1104 -540 886 937 -40 -836 -838 303 840 552
3307E52p71q30O02J096o7q15l65J95O9P03l58n06K7K62M11o8j19p06k32J085K32
$$ 552 -219 -1049 -447 649 582 -233 -598 -403 -334 369 11 -495 -468 -206 205 137 18 -688 -920 165 397
3328C97k28o88J4J21O38K0p37m02K55Q92J0n2o53q05N04J207M02r79p19l97P00
$$ 397 169 -519 -505 -384 254 274 -463 -865 -610 282 292 240 -413 -1218 -714 493 895 -84 -803 -1200 -500
3349e00J343K40j307j088N02J154O86o20j227n51R06J444J0q90m73o58O11J207
$$ -500 843 1083 -224 -1312 -810 344 1030 410 -817 -1368 -462 982 992 102 -371 -1029 -418 789
3367G89K0r78o49M20R73K46m4j018o45R33O21j50op91o5K09P10n3r79L6M76J19
$$ 789 809 -169 -818 -398 575 821 777 -241 -886 47 668 518 512 -279 -344 -135 575 522 -457 -421 55 174
3389A74N22k92q65j66J006L10l79l77n75L54R02L45r35p53L76P66M70j06j100
$$ 174 696 404 -461 -627 379 689 310 -67 -642 -288 614 959 24 -729 -353 413 883 777 -323
3408c23q28P81J578p11l40n05n92Q83J098l30j381l26O63Q47M3J21j292n15R80
$$ -323 -1151 -370 1208 497 157 -348 -940 -57 1041 711 -670 -996 -333 514 557 678 -614 -1129 -149
3427a49Q84o8m82l46o21Q44J051n66q30m48J96O40O63K3j205k05N08Q55l65k93
$$ -149 735 667 185 -161 -782 62 1113 547 -283 -731 -535 105 768 791 -414 -619 -111 744 379 86
3447H6l76n13R53N29n68m70p0L66L72L69m51j068K93Q46P5k37k84j28J80P08j28
$$ 86 -290 -803 150 679 111 -359 -429 -63 309 678 227 -841 -548 298 373 136 -148 -276 -96 612 484
3468D84m11p20M18L92N28k43j046j81P66P93m83j10o15r9O01J142m11j396l21
$$ 484 73 -647 -229 163 691 448 -598 -779 -13 780 297 187 -428 -527 74 1216 805 -591 -912
3487i12L64O08Q35m94q20o28J106P84K40j036p52O6O72J137p25q39j13J77M48
$$ -912 -548 60 895 401 -419 -1047 59 843 1083 47 -705 -639 33 1170 445 -394 -507 -330 118
3506A18J022n70j304q5J055rM83n31o77K19P28L14j015J5J7kQ03K9m52n53J54
$$ 118 1140 570 -734 -819 236 227 710 179 -498 -279 449 763 -252 -237 -220 -222 581 610 158 -395 -241
3527b41N14K13j85l78p93P15N14K14p34m97K09L37O59j89j292k7J161P8J16k40
$$ -241 273 486 301 -77 -870 -155 359 573 -161 -658 -449 -112 547 358 -934 -961 200 278 394 154
3547A54j213J8J272P30p78q60l46O78O04N06q63q01k23J107O63m23n71p13K65
$$ 154 -1059 -1041 231 961 183 -677 -1023 -345 259 765 -98 -899 -1122 -15 648 225 -346 -1059 -794
3566g94J095K98m79q35J01n3J050O82p14j029N4P63J21L17p02q52N14J032j30
$$ -794 301 599 120 -715 -614 -667 383 1065 351 -678 -624 139 260 577 -125 -977 -463 569 439
3585D39k11n42m59L27O16K26o87m24M10L93p9J50o55l95Q45M97j80n70l89K57
$$ 439 228 -314 -773 -446 170 396 -291 -715 -305 88 9 159 -496 -891 -46 451 271 -299 -688 -431
3605d31L88N87l08r34K05L98P16n07k44p88M13O95L99o86J25n44K48O88K63p52
$$ -431 -43 544 236 -698 -493 -95 621 114 -130 -918 -505 190 589 -97 28 -516 -268 420 683 -69
3625f9p80K18Q20L05M35r18r32N27J059K81p06m67j80L0J044M30j177m47J27Q57
$$ -69 -849 -631 189 494 929 11 -921 -394 665 946 240 -227 -407 -377 667 1097 -80 -527 -400 457
3645D57L67k0p79o29M87J113R0p62p70K99K00N77m8p20r8O74j97N03N2o27k45
$$ 457 824 804 25 -604 -117 996 1086 324 -446 -147 53 630 582 -138 -236 438 241 744 796 169 -76
3666g6K73N30j16l52l10j64P08M29o85m80p2J146n9L7o99l78l9J337K2n70o03
$$ -76 197 727 611 259 -51 -215 493 922 237 -243 -315 831 772 809 110 -268 -307 1030 1052 482 -121
3687a21q7j8J101J48r98p56M36O83L84Rp88o74M39R39J93r51k16p1L57R64L1r03
$$ -121 -208 -226 875 1023 25 -731 -295 388 772 781 -7 -681 -242 697 890 -61 -277 -348 9 973 1004 101
3709A01o44M29M05L00j12o27n91N46P88j34k67k42m38Q79L18k48j134K30J75J76
$$ 101 -543 -114 291 591 479 -148 -739 -193 595 461 194 -48 -486 393 711 463 -671 -441 -266 -90
3729i0P53o22k65L4K21K71k68j08L5O3M03M53p58l22m27R66J98m7q13o67N68P28
$$ -90 663 41 -224 -190 31 302 34 -74 -39 24 427 880 122 -200 -627 339 537 490 -323 -990 -422 306
3751C06M56p54m43J13N01O69l97p89l35N08M28K92kr57n09O83J010n71j33o06
$$ 306 762 8 -435 -322 179 848 451 -338 -673 -165 263 555 553 -404 -913 -230 780 209 76 -530
3771e30j58M68R54M3j016m17P7P23L67k33r20p1P32Q6J77N0q94LP74J70j56n02
$$ -530 -688 -220 734 777 -239 -656 -579 144 511 278 -642 -713 19 105 282 332 -562 -559 215 385 229 -273
3793b73j49L91N20j50k01m59l31P73Q2n00n22J15J41P60k02n63j58L70J50K94
$$ -273 -422 -31 489 339 138 -321 -652 121 203 -297 -819 -704 -563 197 -5 -568 -726 -356 -206 88
3813H8k96k53l05O02K82L1j52n06j78L75P89m92o67j9R9N18M41n58p37j95R16
$$ 88 -208 -461 -766 -164 118 149 -3 -509 -687 -312 477 -15 -682 -701 -602 -84 357 -201 -938 -1133 -217
3834b17N21j85k99p23l7R28L83k16n43J4k91N38P95j32j342J14M78J82N29m50
$$ -217 304 119 -180 -903 -940 -12 371 155 -388 -374 -665 -127 668 536 -806 -692 -214 -32 497 47
3854D7m74o7P35N14m71n49l29K46N88K04j96o78K27j8N52J26n96k76M15P52k42
$$ 47 -427 -494 241 755 284 -265 -594 -348 240 444 248 -430 -203 -221 331 457 -139 -415 0 752 510
3875E10q14j17K50L43K60J24p62l29P27J82K76m05n03R8L22M59O0j004j94J49
$$ 510 -304 -421 -171 172 432 556 -206 -535 192 374 650 245 -258 -160 162 621 681 -323 -517 -368
3895c68P60M21l99j017K31N37K98Q7p31m90J92Q88J70l67l87n1j5Q75K51l93j314
$$ -368 392 813 414 -603 -372 165 463 550 -181 -671 -479 409 579 212 -175 -226 -241 634 885 492 -822
3916h22M63L33L92K18n86o67M66J61K93rm00m83M53M38M36o16l54Q1J84N50j79
$$ -822 -359 -26 366 584 -2 -669 -203 -42 251 242 -158 -641 -188 250 686 70 -284 -203 -19 531 352
3937C52n91k87M71N37l41k22l19K6M01L00k99n10K64P09o1k28q2n96NP05K56k39
$$ 352 -239 -526 -55 482 141 -81 -400 -374 27 327 28 -482 -218 491 430 202 120 -476 -471 234 490 251
3959B51l7m29k01J070k4l25r72L10M88R5p9K24q39k37J290R0l61p63m8J88Q98
$$ 251 214 -215 -416 654 630 305 -667 -357 131 226 147 371 -468 -705 585 675 314 -449 -497 -309 589
3980E89P5n26m31P2J22N00J55p54k45n1Q46L64n97l15o2j6R41j00o45n77L56Q1
$$ 589 664 138 -293 -221 -99 401 556 -198 -443 -494 352 716 119 -196 -258 -274 667 567 -78 -655 -299 -218
4002b18M49K18l99m24O20J64m14q0k28j22O59K25o81k34K56K08L1L29k82k08j24
$$ -218 231 449 50 -374 246 410 -4 -84 -312 -434 225 450 -231 -465 -209 -1 30 359 77 -131 -255
4023b55O32K31o32l05J19m7M17M32p33o06J5Q16K92O3m27o81K69Q31J77p90R9
$$ -255 377 608 -24 -329 -210 -257 160 592 -141 -747 -732 84 376 439 12 -669 -400 431 608 -182 -83
4044h3o90O19N91L15j151k73L91K07N07k08j92n62J85P77j95p3k89m46L94Q28
$$ -83 -773 -154 437 752 -399 -672 -281 -74 433 225 33 -529 -344 433 238 165 -124 -570 -176 652
4064F52j17q53L32k38J84L69k40o39J49M13L03m24N30q13J9O43N16q09n11K94
$$ 652 535 -318 14 -224 -40 329 89 -550 -401 12 315 -109 421 -392 -373 270 786 -23 -534 -240
4084b40o1Q23m3p24M8LN44J72l54l24l32L11P88r6p22j52K12M65J11P2p48k47
$$ -240 -301 522 479 -245 -197 -194 350 522 168 -156 -488 -177 611 515 -207 -359 -147 318 429 501 -247 -494
4106d94L09N75k77M3l67k10N35K71M16r61l08M20K42M05l08q14R0M94O23k69O2
$$ -494 -185 390 113 156 -211 -421 114 385 801 -160 -468 -48 194 599 291 -523 -433 61 684 415 477
4127D77p40m79O91M85j25l96j57K02LM34k83k30j97P04Q1k37m1m03p5M18K89k05
$$ 477 -263 -742 -51 434 309 -87 -244 -42 -39 395 112 -118 -315 389 470 233 192 -211 -286 132 421 216
4149B16n19J17O2L06M13n92o37L76Q32j21l76m76k60L07Q79j66p26k37K99K03
$$ 216 -303 -186 -124 182 595 3 -634 -258 574 453 77 -399 -659 -352 527 361 -365 -602 -303 -100
4169a00N76j76o51l86O84J86K18j14q77K46K06P89m43k20m55k1P17k2N6o10L4
$$ -100 476 300 -351 -737 -53 133 351 237 -640 -394 -188 601 158 -62 -517 -538 179 157 213 -397 -363
4190c63j19N07M47l61n57l0L38N72k58q9m62j58O95Q0j68l18j6M47k47K88k85
$$ -363 -482 25 472 111 -446 -476 -138 434 176 87 -375 -533 162 242 74 -244 -260 187 -60 228 -57
4211e7m32J76K28j6j31PL1L2O15R8r81k6RN57j75K59l25j75K89L92n3m90k99O9
$$ -57 -489 -313 -85 -101 -232 -225 -194 -162 453 551 -430 -456 -447 110 -65 194 -131 -306 -17 375 322 -168 -467 -398
4235c98M23L68O7q41k03M96J53J2J17p49R6L19N80k13m88j00Q6M67L80n09o45
$$ -398 25 393 460 -381 -584 -88 65 77 194 -555 -459 -140 440 227 -261 -361 -275 192 572 63 -582
4256e82J1L23M22J22l0p32K35K61L68n4l56l91K43M41L60m73o68M24M27l71M91
$$ -582 -571 -248 174 296 266 -466 -231 30 398 344 -12 -403 -160 281 641 168 -500 -76 351 -20 471
4277D71k01o69J92M56M3k85j06J40J37K43j96n60j24N91m9L67l3n98j94N33N36
$$ 471 270 -399 -207 249 292 7 -99 41 178 421 225 -335 -459 132 83 450 417 -181 -375 158 694
4298F94j63o20j21l4P11L00o86j91j90L89k9K33k47k22j23R17j43k34l25l68K39
$$ 694 531 -89 -210 -244 467 767 81 -110 -300 89 60 293 46 -176 -299 618 475 241 -84 -452 -213
4319b13O29K50m89k24k0O72%P5p54j71j36R44j37j31k54k92K96K10L36n81j9j22
$$ -213 416 666 177 -47 -67 605 605 680 -74 -245 -381 563 426 295 41 -251 45 255 591 10 -9 -131
4341a31K76L43l08l29l51O98q1K98q2j49k48L01M55p23J55l18L85J3R4N2p49j22
$$ -131 145 488 180 -149 -500 198 117 415 333 184 -64 237 692 -31 124 -194 191 204 298 350 -399 -521
4363e21R26K20j93o98j67N72L23Q8o46j86n8N20K34n1J2j011O15L07K54k54k70
$$ -521 405 625 432 -266 -433 139 462 550 -96 -282 -340 180 414 363 375 -636 -21 286 540 286 16
4384A6m00j4J247l45r66K03m2K11L03L3k86o61M46O38n1%l77l74M47Q7L63m99
$$ 16 -384 -398 849 504 -462 -259 -301 -90 213 246 -40 -701 -255 383 332 332 -45 -419 28 115 478 -21
4406b1j91j79M50M86k33o46p1N35j27L7p7k87k66L62N03l17j08l55L31L76l26
$$ -21 -212 -391 59 545 312 -334 -405 130 3 40 -37 -324 -590 -228 275 -42 -150 -505 -174 202 -124
4427a24L06p80M42K1K93l1k12k73L46M21k81n06m5L29L13N7j81k3p34M29P9L05
$$ -124 182 -598 -156 -135 158 127 -85 -358 -12 409 128 -378 -423 -94 219 276 95 72 -662 -233 -154 151
4449A51k38j08m74N74L24J77n33k7j16L45J89J72q91k77O22K16J96k97m82j34
$$ 151 -87 -195 -669 -95 229 406 -127 -154 -270 75 264 436 -455 -732 -110 106 302 5 -477 -611
4469f11J48O45k34j18l03m40Q68L95k97m58j36K52L27k1k03l84O8N90K18k08l71
$$ -611 -463 182 -52 -170 -473 -913 -45 350 53 -405 -541 -289 38 17 -186 -570 -502 88 306 98 -273
4490b73n8q4M52K13k79n94K58L98m59L59j33pNN46r5o06oK83JK73j16n42j63L25
$$ -273 -331 -415 37 250 -29 -623 -365 33 -426 -67 -200 -207 -202 344 249 -357 -363 -80 -79 194 78 -464 -627 -302
4514c02N59j49o2l49j75K68N35j54k29j78k52M46L91m32m57J25L52L41m5J9l36
$$ -302 257 108 46 -303 -478 -210 325 171 -58 -236 -488 -42 349 -83 -540 -415 -63 278 233 252 -84
4535h4j47L25N77k58m28j09j50L48L88k26p18M26K08j70M06j9q10L08M87R2n50
$$ -84 -231 94 671 413 -15 -124 -274 74 462 236 -482 -56 152 -18 388 369 -441 -133 354 446 -104
4556a04J21m8o8J64N77o37m05L56J09k93N31l67L5K73l3j14j01k93r8K8N96j81
$$ -104 17 -31 -99 65 642 5 -400 -44 65 -228 303 -64 -29 244 211 97 -4 -297 -395 -367 229 48
4578D8m53L21J0P0L32l36m75j22N76M97l25k5k83r2K93L68l92m35Q4L96L49J44
$$ 48 -405 -84 -74 -4 328 -8 -483 -605 -29 468 143 118 -165 -257 36 404 12 -423 -339 57 406 550
4600E50l19m81j45Q46J59l30k10p27L23O09L29l75n95N33l43P67k97l20l78O21
$$ 550 231 -250 -395 451 610 280 70 -657 -334 275 604 229 -366 167 -176 591 294 -26 -404 217
4620B17Q4j10o3k12pk49N85N3l20j39J22O2R2K65m54k30J87L97K3n37n1m0J87
$$ 217 301 191 128 -84 -91 -340 245 298 -22 -161 -39 23 115 380 -74 -304 -117 280 303 -234 -285 -325 -138
4643a38M54k61q6o8K3Q8M24m54r9o50J014K99l64J24n20m31P70N21r04K0J07J42
$$ -138 316 55 -31 -99 -76 12 436 -18 -117 -767 247 546 182 306 -214 -645 125 646 -258 -238 -131 11
4665A1K02j09j65l98K58N28l7J97n22n55M36M93L8l17k46K3L51K60j08p85N9M73
$$ 11 213 104 -61 -459 -201 327 290 487 -35 -590 -154 339 377 60 -186 -163 188 448 340 -445 -386 87
4687H7L3m9r2l27Q4M40N45o05l6k76K9M22j03k38k18o4M92L89n56j11j4K1L23
$$ 87 120 71 -21 -348 -264 176 721 116 80 -196 -167 255 152 -86 -304 -368 124 513 -43 -154 -168 -147 176
4710A76J20l16m17J58M0N04k7k83k58R3J83J74j44k95m51P79K14J64m40m31M0
$$ 176 296 -20 -437 -279 -239 265 238 -45 -303 -210 -27 147 3 -292 -743 36 250 414 -26 -457 -417
4731d17L42M09j59j95n13k5O71J82k6o81J0J41N29Nj57l72pJ22K26K62n86o4M26
$$ -417 -75 334 175 -20 -533 -558 113 295 269 -412 -402 -261 268 273 116 -256 -263 -141 85 347 -239 -303 123
4754A23q1Q0l79J30j07N9M04p6m70L16K9j21L90l28j24j23M79k34K41J02n71O2
$$ 123 42 122 -257 -127 -234 -175 229 153 -317 -1 28 -93 297 -31 -155 -278 201 -33 208 310 -261 -199
4776a99M32l2J19o28K91O0J89k9m1k96m20N49K71j28k69n4K2M69m8o6n78R0K95
$$ -199 233 201 320 -308 -17 43 232 203 162 -134 -554 -5 266 138 -131 -185 -163 306 258 192 -386 -296 -1
4799aJ86R3q18L4M61L4J73Q6l69q3J64N20j56l51j55J27J80K27o6n38J57l7L03
$$ -1 185 278 -540 -506 -45 -11 162 248 -121 -204 -40 480 324 -27 -182 -55 125 352 286 -252 -95 -132 171
4822A71l20J71l08RK11M17j53l43M0K6K86L5j6k16n0J38j87N14k40l96j98O50
$$ 171 -149 22 -286 -277 -66 351 198 -145 -105 -79 207 242 226 10 -40 98 -89 425 185 -211 -409 241
4844B41K39n43j28K5r9N22J21p28J55PK77k8L73n64j64M66J22k76j42m35R6K98
$$ 241 480 -63 -191 -166 -265 257 378 -350 -195 -188 89 61 434 -130 -294 172 294 18 -124 -559 -463 -165
4866a65P28k51o75k07M75M17p4L9o84j6J42M21l9J00m31l24M99L31J29n91K53
$$ -165 563 312 -363 -570 -95 322 248 287 -397 -413 -271 150 111 211 -220 -544 -45 286 415 -176 77
4887G7m06M51L52n51m00L91J57N9j98j84l98O04L04j30k09j12K49k78M48l0m80
$$ 77 -329 122 474 -77 -477 -86 71 130 -68 -252 -650 -46 258 128 -81 -193 56 -222 226 196 -284
4908b84M4J73M30q49L75o2m1K20K02J24n23j20J57K50j45K85m56O3L10K34n73
$$ -284 -240 -67 363 -486 -111 -173 -214 6 208 332 -191 -311 -154 96 -49 236 -220 -157 153 387 -186
4929a86Q8j43N5J32M07k29l12m5J08K60K24k99m99K82J58M11j67k98m99L03M38
$$ -186 -98 -241 -186 -54 353 124 -188 -233 -125 135 359 60 -439 -157 1 412 245 -53 -552 -249 189
4950A89L08l53m77K43J34M15mo32j45j18P13j6k82J07k53J29J82J6m75M3O52p2
$$ 189 497 144 -333 -90 44 459 455 -177 -322 -440 273 257 -25 82 -171 -42 140 156 -319 -276 376 304
4972C04p7j01j96p9L83l19L61J48l82k4J62K86k05k20J59p8J95j06R3n92MQ64
$$ 304 227 126 -70 -149 234 -85 276 424 42 18 180 466 261 41 200 122 317 211 304 -288 -284 580
4994E80j46l5n91q5M80mK04k52l71K76J17o8M14n58k54J66N85j71m83LQ0J99K57
$$ 580 434 399 -192 -277 203 199 403 151 -220 56 173 105 519 -39 -293 -127 458 287 -196 -193 -113 86 343
5017C43L0j75k76k18J31N02qo24l06M50J81lR0j53j29j0L40Q5l57q1q6K00L67
$$ 343 373 198 -78 -296 -165 337 329 -295 -601 -151 30 27 117 -36 -165 -175 165 250 -107 -188 -274 -74 293
5040B93M5n17o0M21K50l75k0j79J81K90o6j77k31J88l4O19n84N5j62j60K62j59
$$ 293 338 -179 -239 182 432 57 37 -142 39 329 263 86 -145 43 9 628 44 99 -63 -223 39 -120
5062a20lK10k48p0M39n5j45j95j22j4N86R8l77m24M04J11K06l76J72m27M93r7
$$ -120 -123 87 -161 -231 208 153 8 -187 -309 -323 263 361 -16 -440 -36 75 281 -95 77 -350 143 46
5084D6J44k23m52Q4M41J35J30l16m64M00R8K62j73k01l92M20K82n7j31o6k48J3
$$ 46 190 -33 -485 -401 40 175 305 -11 -475 -75 23 285 112 -89 -481 -61 221 164 33 -33 -281 -268
5106b68L50k38J44k70K15J13k69K61k01J04J41r6o5q2k45K15K00J65k4n67K3K79
$$ -268 82 -156 -12 -282 -67 46 -223 38 -163 -59 82 -14 -79 -161 -406 -191 9 174 150 -417 -394 -115
5128a15K68j14kl43Q7L71k46J42O5m89L45J42J90o00j59lL07M56rl29n50M80N64
$$ -115 153 39 37 -306 -219 152 -94 48 113 -376 -31 111 301 -299 -458 -461 -154 302 293 -36 -586 -106 458
5151D58m42l60J34LL38N6l00j58L24j18L63l00l6j77l06L38K30J8J78m15j9mO00
$$ 458 16 -344 -210 -207 131 187 -113 -271 53 -65 298 -2 -38 -215 -521 -183 47 65 243 -172 -191 -195 405
5174D05k02k38m3l61K85N0J17l87j16O46L9j39on25J28M22J33k48j80l1L82K37
$$ 405 203 -35 -78 -439 -154 -104 13 -374 -490 156 195 56 50 -475 -347 75 208 -40 -220 -251 131 368
5196C68l35P5k90M06J72k46j64j83M33KL30p3o36J20P4P7Q2o7k75m0J89K49J87
$$ 368 33 108 -182 224 396 150 -14 -197 236 238 568 495 -141 -21 53 130 212 145 -130 -170 19 268 455
5219D55o58J10l0K3M65k9l12P0j1J59j29J11l82J07j80L33K57l56j71P3L73J4
$$ 455 -203 -93 -123 -100 365 336 24 94 83 242 113 224 -158 -51 -231 102 359 3 -168 -95 278 292
5241B92m70j49K89k7K12R2n45p7j19O08L4k04k17K07K1L89l73m40N00J56J86n37
$$ 292 -178 -327 -38 -65 147 239 -306 -383 -502 106 140 -64 -281 -74 -53 336 -37 -477 23 179 365 -172
5263a72J95J1m05J80N43n60K78k43m4k1K07M3k22o4j32O04J54j37l06K0N5J44
$$ -172 23 34 -371 -191 352 -208 70 -173 -217 -238 -31 12 -210 -274 -406 198 352 215 -91 -71 -16 128
5285A28m5K88p24J10O10m6k80k77KK28M24K1o42k4R1M25j53k1j36p0Q7K13k47
$$ 128 83 371 -353 -243 367 321 41 -236 -234 -6 418 439 -203 -227 -136 289 136 115 -21 -91 -4 209 -38
5308c8J44j38J45L8N1k71j41M05l92M25j27R5j41J25l2J21l38j98J64L25m44K87
$$ -38 106 -32 113 151 202 -69 -210 195 -197 228 101 196 55 180 148 269 -69 -267 -103 222 -222 65
5330F5K8j46k48L93JJ22l13m94M4P26K93k06m18l61M19J54J36Rm56K28J22Q1j95
$$ 65 93 -53 -301 92 93 215 -98 -592 -548 178 471 265 -153 -514 -95 59 195 204 -252 -24 98 179 -16
5353a6l01J08j08O27j44l47k06K07j1L76k17L6k68K33j5k52L00k85J19k5M65k26
$$ -16 -317 -209 -317 310 166 -181 -387 -180 -191 185 -32 4 -264 -31 -46 -298 2 -283 -164 -189 276 50
5375E0j53j00L4L14M8Pk53r9K68j5k04N22o69j26N50J59n33R0p3o6M13n2j03n11
$$ 50 -103 -203 -169 145 193 200 -53 -152 116 101 -103 419 -250 -376 174 333 -200 -110 -183 -249 164 112 9 -502
5399e02L89K05J10j65j63q2p2J00L05m56l7K84J57M1J11l06j93L07m2J03k06J47
$$ -502 -113 92 202 37 -126 -208 -280 -180 125 -331 -368 -84 73 114 225 -81 -274 33 -9 94 -112 35
5421C5p6j33J88P3q6L8j08P4L8J31k71j66l8P3M72J9o05j44L78J20J52l50%O0
$$ 35 -41 -174 14 87 1 39 -69 5 43 174 -97 -263 -301 -228 244 263 -342 -486 -108 12 164 -186 -186 -126
5445a26L9J51j18j30L37k28j81K37J10n06L24J12j1m2o0N3j40Q6K06m20J34J87
$$ -126 -87 64 -54 -184 153 -75 -256 -19 91 -415 -91 21 10 -32 -92 -39 -179 -93 113 -307 -173 14
5467A4K06j86j45M7j96K86J29k7j3j97k12K9M51rk60j30p7L52j31Q1j43l52K89
$$ 14 220 34 -111 -64 -260 26 155 128 115 -82 -294 -265 186 177 -83 -213 -290 62 -69 12 -131 -483 -194
5490a94M80k12rl20J98j1M44k19m13L1M18j26J99K6m97k6M64R4k99k66J44P9r6
$$ -194 286 74 65 -255 -57 -68 376 157 -256 -225 193 67 266 292 -205 -231 233 327 28 -238 -94 -15 -111
5513a11K66P7k13M5J29j44Q2K76n88M03m79K8M67k30K42j37j06k4j22K04m88O15
$$ -111 155 232 19 64 193 49 131 407 -181 222 -257 -229 238 8 250 113 7 -17 -139 65 -423 192
5535A92J29P2k10m34K16J30M5l57N0k59J26L87j01j30RM69k20MJ69p01K93L91
$$ 192 321 393 183 -251 -35 95 140 -217 -167 -426 -300 87 -14 -144 -135 334 114 118 287 -414 -121 270
5557B70J3r6k6j25j21K33M50l06j72j34j86J54L22k92p0j12K04j26L67l41K19
$$ 270 283 187 161 36 -85 148 598 292 120 -14 -200 -46 276 -16 -86 -198 6 -120 247 -94 125
5578A25m49L90K94p5l7o67J70J91L35k00k14J8L05o2J3k05j67Q2M22j98k74j23
$$ 125 -324 66 360 285 248 -419 -249 -58 277 77 -137 -119 186 124 137 -68 -235 -153 269 71 -203 -326
5600c26L16l8Q1m7j73J3K66K3J04m24J90m47K96L66k40N2N6j57L14p6l1n20K89
$$ -326 -10 -48 33 -14 -187 -174 92 115 219 -205 -15 -462 -166 200 -40 12 68 -89 225 149 118 -402 -113
5623a13K57j57L58l37k81k41P51R0k53l71L15K5j39N70l06m86M0M48j40L2k12
$$ -113 144 -13 345 8 -273 -514 237 327 74 -297 18 43 -96 474 168 -318 -278 170 30 62 -150
5644a50j70P0M35J8k28j67j43L71J59k51k57j09J48L76N7j90j6P9K95Pk76l40
$$ -150 -320 -250 185 203 -25 -192 -335 36 195 -56 -313 -422 -274 102 159 -31 -47 32 327 334 58 -282
5666b82M54k23J51L1l07Q5k0K59m5o5q9m54M30K32r0Q5j44pk7q7J22Km69L59J70
$$ -282 172 -51 100 131 -176 -91 -111 148 103 38 -51 -505 -75 157 67 152 8 1 -26 -113 9 11 -458 -99 71
5691G1K73M3m17J63j62q0M86n52Mk72K99J93J1p5j10K6K56j89N9K59o49M22J57
$$ 71 344 387 -30 133 -29 -109 377 -175 -171 -443 -144 49 60 -15 -125 -99 157 -32 27 286 -363 59 216
5714B16j30k6j96P7J18R0P8j22k26L58j15j94J30j74K04r6J54k17K47L0l16J19
$$ 216 86 60 -136 -59 59 149 227 105 -121 237 122 -72 58 -116 88 -8 146 -71 176 206 -110 9
5736IM30m60k61N43k99qK51K8p4m71L53K91k56j04j44j40M51J27m21j70K65J00
$$ 9 439 -21 -282 261 -38 -46 205 233 159 -312 41 332 76 -28 -172 -312 139 266 -155 -325 -60 40
5758D0J79k26J3j98K96j29Nn1j4l75M20L34m04J2J73l13K03k28O46n73k10J63
$$ 40 219 -7 6 -192 104 -25 -20 -71 -85 -460 -40 294 -110 -98 75 -238 -35 -263 383 -190 -400 -237
5780b37K45q6l2K21m37K54K25L0m72p1J80J98k09J75m17LL59K85r2k75J72mM3
$$ -237 8 -78 -110 111 -326 -72 153 183 -289 -360 -180 18 -191 -16 -433 -430 -71 214 122 -153 19 15 58
5803E8j22M18n34P0M33n64Q8L51l51J7K57J10k87o2k23J97L30J76k45k56K73k35
$$ 58 -64 354 -180 -110 323 -241 -153 198 -153 -136 121 231 -56 -118 -341 -144 186 362 117 -139 134 -101
5825a01PL11j31k37J50K71P6l01P5j89K5L28j51k77K43k45Q4Q9J77k80n1K57P4
$$ -101 -94 217 86 -151 -1 270 346 45 120 -69 -44 284 133 -144 99 -146 -62 27 204 -76 -127 130 204
5848B04Q9l53j5j76M17j1k25m6n5J53n8n4L86o84M51J94j64k00m1J90ko9Q4J02
$$ 204 293 -60 -75 -251 166 155 -70 -116 -171 -18 -76 -130 256 -428 23 217 53 -147 -188 2 0 -69 15 117
5872A17k63L68n38N25J48m73K8k50J57L7K5P3o2j23L10J44m73O7j8k5K80j72k6
$$ 117 -146 222 -316 209 357 -116 -88 -338 -181 -144 -119 -46 -108 -231 79 223 -250 -183 -201 -226 54 -118 -144
5895a44m08M48q8m0K45r4k70K85N32k54p12M07J35j67M94k15k80Q7L13k86J50
$$ -144 -552 -104 -192 -232 13 -81 -351 -66 466 212 -500 -93 42 -125 369 154 -126 -39 274 -12 138
5916A38k24j93K92P4k61K23M22n29M3J55J76j29m36K7L27J9Jm1o8k04L18L34l28
$$ 138 -86 -279 13 87 -174 49 471 -58 -15 140 316 187 -249 -222 105 124 125 84 16 -188 130 464 136
5939A36J65k32j07K23j26l7J2J67o0j52m9K54m61L57J28k29J15Q5j40k3J60l16
$$ 136 301 69 -38 185 59 22 34 201 141 -11 -60 194 -267 90 218 -11 104 189 49 26 186 -130
5961a30Q5M9L73l06J2n3k13L6J87L9j47j3J85m24M18M21l82p0j23j29K01j91K00
$$ -130 -45 4 377 71 83 30 -183 -147 40 79 -68 -81 104 -320 98 519 137 67 -56 -185 16 -175 25
5984B5j29J39J02J9o2j17j38k76L88J75l89l7O23k67K09Jl63m17J45N59j99j56
$$ 25 -104 35 137 156 94 -23 -161 -437 -49 126 -263 -300 323 56 265 266 -97 -514 -369 190 -9 -165
6006a65j0j39J40L6J61l06J98M49m35J68j3k05j36K23J26Q2n50M33M7o5J57j68
$$ -165 -175 -314 -174 -138 23 -283 -85 364 -71 97 84 -121 -257 -34 92 174 -376 57 104 39 196 28
6028B8m04M17P6K78M3j67m26n0N48Ko31L89j74Km8M29k09k85r8K85K04j51j11
$$ 28 -376 41 117 395 438 271 -155 -205 343 345 -286 103 -71 -69 -117 312 103 -182 -280 5 209 58 -53
6051e3l34K06M27m96O3kJ18L79J86j22n9k21j66r8J74R7k24K26K18l1j09ll19
$$ -53 -387 -181 246 -250 -187 -189 -71 308 494 372 313 92 -74 -172 2 99 -125 101 319 288 179 176 -143
6074a43j7K89j94N6m8J37k75J16K76k99J45L4J14l45J50p8J40l63K92M06n21J55
$$ -143 -160 129 -65 -9 -57 80 -195 -79 197 -102 43 77 191 -154 -4 -82 58 -305 -13 393 -128 27
6096B7J69l45K97J71m27oK92k84l3J50k67J10M7L88l8l40L8j55L40R2K01j19k83
$$ 27 196 -149 148 319 -108 -114 178 -106 -139 11 -256 -146 -99 289 251 -89 -51 -206 134 226 427 308 25
6119B5r2k3K21k03J32j85k60O22N0k41KK8P1pQ5m89O0R8K43j28K39m01J14N2j68
$$ 25 -67 -90 131 -72 60 -125 -385 237 287 46 48 76 147 140 225 -264 -204 -106 137 9 248 -153 -39 13 -155
6144a55N9K73o91M71j50P2K22m39L13j13L71m76K8M68j85m4L46k38k52K01j33
$$ -155 -96 177 -514 -43 -193 -121 101 -338 -25 -138 233 -243 -215 253 68 24 370 132 -120 81 -52
6165e2J76J85l87j82R2M93n36M59l21l26L61L61k76j92q1j0o3L39Nj4j45J68n9
$$ -52 124 309 -78 -260 -168 325 -211 248 -73 -399 -38 323 47 -145 -226 -236 -299 40 45 31 -114 54 -5
6188eL0m7j58L82k43K14j96j39K47k26JJ59p8m3j58L35N3n2k6k46K21K9P6q6k93
$$ -5 25 -22 -180 202 -41 173 -23 -162 85 -141 -140 19 -59 -102 -260 75 128 76 50 -196 25 54 130 44 -249
6213b49L47k38j92N20j42J24j29K7J85j19k5j34j66M50M07q27J63k93K74N3L21
$$ -249 98 -140 -332 188 46 170 41 68 253 134 109 -25 -191 259 666 -161 2 -291 -17 36 357
6234C57m88M74l52L71k22k59M7j7K15j2K1j46k4J7R0J46K8k95m00K52M01l08J61
$$ 357 -131 343 -9 362 140 -119 -72 -89 126 114 135 -11 -35 -18 72 218 246 -49 -449 -197 204 -104 57
6257E7o1j14N42L7m12J08o5j68L05k1l3k36j19J82Rm0J03k14L78k54J83K0n02
$$ 57 -4 -118 424 461 49 157 92 -76 229 208 175 -61 -180 2 11 -29 74 -140 238 -16 167 187 -315
6280c15L33k45L55J33l03l55J64j8J66J04j15j82L01J68n40J0N4K03J10O3O1n88
$$ -315 18 -227 128 261 -42 -397 -233 -251 -85 19 -96 -278 23 191 -349 -339 -285 -82 28 91 152 -436
6302d36L95N4J34l22K70o5J04j03n7J5r8L02k66n4N84m71j20k22N41l8J88j62
$$ -436 -41 13 147 -175 95 30 134 31 -26 -11 -109 193 -73 -127 457 -14 -134 -356 185 147 335 173
6324A73p64O72q2Kk92J31j24K16J45J91l30l36Q6J69L27l62j19J31N7j94L88j04
$$ 173 -591 81 -1 1 -291 -160 -284 -68 77 268 -62 -398 -312 -143 184 -178 -297 -166 -109 -303 85 -19
6346a9o5j90N3L26j03k86K13J09k47N07j83mq1k84N39l77N0N2j50J84L3j10m09
$$ -19 -84 -274 -221 105 2 -284 -71 38 -209 298 115 111 30 -254 285 -92 -42 10 -140 44 77 -33 -442
6369d42M6K85M68k67j20K29o56O63K7l40J02q7r1L22M0n9o4J94j57M05l17Ok42
$$ -442 -396 -111 357 90 -30 199 -457 206 233 -107 -5 -92 -183 139 179 120 56 250 93 498 181 187 -55
6392e5m4J0J87K1p6j51r2L80J05km79L79k42L07l00K36l22K16J08k20Rk19K99
$$ -55 -99 -89 98 119 43 -108 -200 180 285 283 -196 183 -59 248 -52 184 -138 78 186 -34 -25 -244 55
6415E5l27M40k95J09n5r4M26J10l90j47Q6K87o7k82J92j60q6J97l9J98k07p2L5
$$ 55 -272 168 -127 -18 -73 -167 259 369 -21 -168 -82 205 138 -144 48 -112 -198 -1 -40 158 -49 -121 -86
6438h6J9j09N04m75R7Q6j22J35J05j09k98L68K40m96J25m1M41l52l2K36o8l02
$$ -86 -67 -176 328 -147 -50 36 -86 49 154 45 -253 115 355 -141 -16 -57 384 32 0 236 168 -134
6460a34K11P8L9k1j82l1Q3J67m07J09K16Q3j46J02l33L1M12k10P3l08Q4J44q6
$$ -134 77 155 194 173 -9 -40 43 210 -197 -88 128 211 65 167 -166 -135 277 67 140 -168 -84 60 -26
6483b6K40K40n24l00J92L72k84N1n3O8M45p18N58k49j52J24R2k25L82n76M45J04
$$ -26 214 454 -70 -370 -178 194 -90 -39 -92 -24 421 -297 261 12 -140 -16 76 -149 233 -343 102 206
6505B06k86o1K19m53K09PJ86J9J62p46M74J13j74L58n12J55j46N46l10J83j46
$$ 206 -80 -141 78 -375 -166 -159 27 46 208 -538 -64 49 -125 233 -279 -124 -270 276 -34 149 3
6526CRk46N77l40r4o0k5J44k1j64q2J53j03J97k07L4J42l8NJ07j37J59j59o2K58
$$ 3 12 -234 343 3 -91 -151 -176 -32 -53 -217 -299 -146 -249 -52 -259 -225 -83 -121 -116 -9 -146 13 -146 -208 50
6551E0k21K79J23j63k2j24J51j85P1L68r9j36k7J9l38L63o0l59K39J23n9LL21
$$ 50 -171 108 231 68 46 -78 73 -112 -41 327 228 92 65 84 -254 109 49 -310 -71 52 -7 -4 317
6574C17k27l49L88k6J8R2j83l5l51O61j89j35l23k68L26N60k32n5k04L50J25j93
$$ 317 90 -259 129 103 121 213 30 -5 -356 305 116 -19 -342 -610 -284 276 44 -11 -215 135 260 67
6596F7R4j51j45N79k2o52r8r4N17n6L4j10J74k81q2L51K5M30o04j47K88j76L26
$$ 67 161 10 -135 444 422 -230 -328 -422 95 39 73 -37 137 -144 -226 125 150 580 -24 -171 117 -59 267
6619B67k39j08j38J38M34l33Q4k25L34P9j17j08j19J58O7j12k27J76qj23J37r7
$$ 267 28 -80 -218 -80 354 21 105 -120 214 293 176 68 -51 107 174 62 -165 11 3 -120 17 -80
6641h0j85M29j60Q2k36J69K19l41L08J40m85J06j58j26L8N63l09J24k24J44N0
$$ -80 -265 164 4 86 -150 19 238 -103 205 345 -140 -34 -192 -318 -280 283 -26 98 -126 18 68
6662F8k45J15k76L41L37m23l16M39P1r4M9J79K41o11K15k26L08j08J74l61k76
$$ 68 -177 -62 -338 3 340 -83 -399 40 111 17 66 245 486 -125 90 -136 172 64 238 -123 -399
6683c99K60O30m35j84M9L26k36J81k6k77J51j46K80j26j45L8N1l20M14k99K28
$$ -399 -139 491 56 -128 -79 247 11 192 166 -111 40 -106 174 48 -97 -59 -8 -328 86 -213 15
6704A5R6n5k3n4pj03J11r8M3p1K89k50L28J16l16JK67l82J44J16j43o0M5J82l1
$$ 15 111 56 33 -21 -28 -131 -20 -118 -75 -146 143 -107 221 337 21 22 289 -93 51 167 24 -36 9 191 160
6729A60k24k7k29j47K71m3K16q9J65l78N24k67n7M59l32j68K73l29M53k54l09
$$ 160 -64 -91 -320 -467 -196 -239 -23 -112 53 -325 199 -68 -125 334 2 -166 107 -222 231 -23 -332
6750c32J96J43J35K3k91j3M23l01O9Q1R3Q2Nk91k04j48L50L41n69N8R7J44R0k77
$$ -332 -136 7 142 165 -126 -139 284 -17 52 133 226 308 313 22 -182 -330 20 361 -208 -150 -53 91 181 -96
6774i6J07J2j84K49k55MJ70j65R2k7M01l23J90m73J83K58J40k61l49K00k32N13
$$ -96 11 23 -161 88 -167 -163 7 -158 -66 -93 308 -15 175 -298 -115 143 283 22 -327 -127 -359 154
6796A54np9l24L28j72R1mP8L5j48j82N15j80j70K31k02K23J31n09k62M08k55M79
$$ 154 149 70 -254 74 -98 -7 -11 67 102 -46 -228 287 107 -63 168 -34 189 320 -189 -451 -43 -298 181
6819A81j60k16q1K43K50p3j95R8k87L33Pj32j18k73K40K09J47j53J42k27J08j
$$ 181 21 -195 -276 -33 217 144 -51 47 -240 93 100 -32 -150 -423 -183 26 173 20 162 -65 43 42
6841D2m4j48M10l90L48p0k8j28K9J75m89L81m89L00L14NM7m10j6J06j58K14l9
$$ 42 -2 -150 260 -130 218 148 120 -8 21 196 -293 88 -401 -101 213 218 265 -145 -161 -55 -213 1 -38
6864c8j71M15J2k02N9m47M35j71O0J98j06J7j35N1J14K33m51j10pL63p8N3K87
$$ -38 -209 206 218 16 75 -372 63 -108 -48 150 44 61 -74 -23 91 324 -127 -237 -244 119 41 94 381
6887C81l22k34M47l31K41j60k29P5J21L60l42l85M72j19J30K87n13O5l0L97j64
$$ 381 59 -175 272 -59 182 22 -207 -132 -11 349 7 -378 94 -25 105 392 -121 -56 -86 311 147
6908A47Q4m6k12K8Q1N8l31P4R5R6O2l89L81j00o00M67jJ38l11K58K54j50Jk87
$$ 147 231 185 -27 1 82 140 -191 -117 -22 74 136 -253 128 28 -572 -105 -106 32 -279 -21 233 83 84 -203
6932b03L6N78m20j65L22j24OJ77N2k63o3j7m0M32p8k36k68K88k41P6LP4J94l47
$$ -203 -167 411 -9 -174 148 24 30 207 259 -4 -67 -84 -124 308 230 -6 -274 14 -227 -151 -148 -74 120 -227
6956b27Q7L35n16K17J40k06K34l8K80l69m4j51P1M60j8m66O1L05j48L9k76P5K68
$$ -227 -140 195 -321 -104 36 -170 64 26 306 -63 -107 -258 -187 273 255 -211 -150 155 7 46 -230 -155 113
6979A13n7o4J81m8L6k46mJ46p5k12K81j70K55P6j37o4J69r2N6j28k65M66l33M53
$$ 113 56 -8 173 125 161 -85 -89 57 -18 -230 51 -119 136 212 75 11 180 88 144 16 -249 217 -116 337
7003C37o01j77L78J93L01n43j20K36M3Pk2k73L0R1l5J45J20l94R3j1K89l34K21
$$ 337 -264 -441 -63 130 431 -112 -232 4 47 54 32 -241 -211 -120 -155 -10 110 -284 -191 -202 87 -247 -26
7026b6ql92L98J87R5o14J62P6L98j93j3K79m01J33Ll73j3Q5K5K66j02o7p6j73
$$ -26 -34 -426 -28 159 254 -360 -198 -122 276 83 70 349 -52 81 84 -289 -302 -217 -192 74 -28 -95 -171 -344
7050c44M32l3q5M0l69N78k37P8n1J89k06J27J20q3M1jk11J16r8p1L3J60l23L82
$$ -344 88 55 -30 10 -359 219 -18 60 9 198 -8 119 239 156 197 196 -15 101 3 -68 -35 125 -198 184
7074A84k2l3o0J94J5M0K40o74L8K40l8k44L85J3l83O6m4L60m4k27j09K18O7q4
$$ 184 162 129 69 263 278 318 558 -116 -78 162 124 -120 265 278 -105 -39 -83 277 233 6 -103 115 182 98
7098I8l20r9M86k49n8K83R5k06L8k22p9L06p2j95P4R5k65M61j21l87L92j11K25
$$ 98 -222 -321 165 -84 -142 141 236 30 68 -154 -233 73 1 -194 -120 -25 -290 171 50 -337 55 -56 169
7121A69k93J00J84J13k14j32M3M8P3j45J24l29J56R9j02L9p5J81l58M10L4n7j80
$$ 169 -124 -24 160 273 59 -73 -30 18 91 -54 70 -259 -103 -4 -106 -67 -142 39 -319 91 125 68 -112
7144a12J90k5j84L50k42k74J20K50K49l4m15j12L45k32K36j10L4k54L22k4j2J3
$$ -112 78 53 -131 219 -23 -297 -177 73 322 288 -127 -239 106 -126 110 0 34 -220 102 78 66 79
7166G9J82j54K6j92K98l64J47j04j59M23M8l15P9m0r3J66j5%l52K08K96k28Q5
$$ 79 261 107 133 -59 239 -125 22 -82 -241 182 230 -85 -6 -46 -139 27 12 12 -340 -132 164 -64 21
7189B1k66R0J25R0k16P8J06J38l41J59J43r9j66J58P9j25L7j44L04l44J8J9l5
$$ 21 -245 -155 -30 60 -156 -78 28 166 -175 -16 127 28 -138 20 99 -26 11 -133 171 -173 -155 -136 -171
7212a71J62J37j72l5O6p2m6K48M6k15k5Q7j04lQ3k43J65j53K74j54K66k8J1K1
$$ -171 -9 128 -44 -79 -13 -85 -131 117 163 -52 -77 10 -94 -97 -14 -257 -92 -245 29 -125 141 113 124 145
7236A45m5J33q1N7nJ35j94j11j1j63J69K8k09P7l2k1J93N37m87j05N7j83O5J39
$$ 145 100 233 152 209 204 339 145 34 23 -140 29 57 -152 -75 -107 -128 65 602 115 10 67 -116 -51 88
7260H8J97l54L6o3L21j27m94K70L32j79K7m3l15L29q4k15J33R1J20j12J31K8k40
$$ 88 285 -69 -33 -96 225 98 -396 -126 206 27 54 11 -304 25 -59 -274 -141 -50 70 -42 89 117 -123
7283a23J64j05K33OP4o69L37J93k57M34n78J02K93J14P6j74o9L2k24M16K6n00
$$ -123 41 -64 169 175 249 -420 -83 110 -147 287 -291 -189 104 218 294 120 51 83 -141 275 301 -199
7305a99M2J92j5j00L60j77M7j47K13l17P9j17K92k22N2J66j03K18k47j27K09q4
$$ -199 -157 35 20 -80 280 103 150 3 216 -101 -22 -139 153 -69 -17 149 46 264 17 -110 99 15
7327A5k46Q1K22k69L42j71m7o2J73m5K74n25m2J69k5J29J73j34k15M31l50O7l8
$$ 15 -231 -150 72 -197 145 -26 -73 -135 38 -7 267 -258 -300 -131 -156 -27 146 12 -203 228 -122 -55 -93
7350i3k50L29J27L1l8k07j15L70p0jl1l03K19o4L57j81J85p2l1l4kk36K99K1l04
$$ -93 -343 -14 113 144 106 -101 -216 154 84 83 52 -251 -32 -96 261 80 265 193 162 128 126 -110 189 210 -94
7375i4j05L34K02l79K74n34K4K14j58J79k68M71j47p4K0nLKK44k12j83K72L7j04
$$ -94 -199 135 337 -42 232 -302 -278 -64 -222 -43 -311 160 13 -61 -41 -46 -43 -41 203 -9 -192 80 117 13
7399A3K55m06K6K16Kj83R8ml31N92k56L02o90M35j7J53K5l91K83j90J09r4l83
$$ 13 268 -138 -112 104 106 -77 21 17 -314 278 22 324 -366 69 52 205 230 -161 122 -68 41 -53 -436
7422d36L77j33J51L2k05MK30N9n6L01k29j86o1K4K56j10L6k48l9K27j83M0M19
$$ -436 -59 -192 -41 -9 -214 -210 20 79 23 324 95 -91 -152 -128 128 18 54 -194 -233 -6 -189 -149 270
7445B70k36j88L25n98M13l0J51j92K31K17l68J56p3m28N39m97J6O0M0J96q6L0
$$ 270 34 -154 171 -427 -14 -44 107 -85 146 363 -5 151 78 -350 189 -308 -292 -232 -192 4 -82 -52
7467e2k59K36j39P4k9J88jM1J76j4k02k22qL06R7l6l63O0lJ36J32j59j6j91L35
$$ -52 -311 -75 -214 -140 -169 19 18 59 235 221 19 -203 -211 95 192 156 -207 -147 -150 -14 118 -41 -57 -248 87
7492H7r1j7j92K30l98K11K42J20j92k28L38j8K6p4l88J26J46K21k44r5K52P3l31
$$ 87 -4 -21 -213 17 -381 -170 72 192 0 -228 110 92 118 44 -344 -218 -72 149 -95 -190 62 135 -196
7515a96J92J79r5l05K8L68R6q0j64J2j5K15j65k3J12m6K66l71J77j73l52M52m3
$$ -196 -4 175 80 -225 -197 171 267 187 23 35 20 235 70 47 159 113 379 8 185 12 -340 112 69
7538F9pj92Q8L56n72K78J52l0P6l3k10j34K64k3J52l26K35k48N3J23j47K25M5
$$ 69 62 -130 -42 314 -258 20 172 142 218 185 -25 -159 105 82 234 -92 143 -105 -52 71 -76 149 194
7561A94j06m2L6L58l54j39Q7j02J09l3j08k49J72j67L26r9L01k89N1MJ70k96L4
$$ 194 88 46 82 440 86 -53 34 -68 41 8 -100 -349 -177 -344 -18 -117 184 -105 -54 -50 120 -176 -142
7584a42P9l5K97j27l04K44j51K1k3K71K70m03k6J53o3j03L02l83lJ41J93l91M39
$$ -142 -63 -98 199 72 -232 12 -139 -118 -141 130 400 -3 -29 124 61 -42 260 -123 -126 15 208 -183 256
7607B56j20p7J81M4m30N22j88k63p7J49J46l32RK02k37L89j24l06J79J86j53K7
$$ 256 136 59 240 284 -146 376 188 -75 -152 -3 143 -189 -180 22 -215 174 50 -256 -77 109 -44 -17
7629a7o7k0K45l70O5J80q2k03N69m72R9J37J5j18j58N49l26j00J41J31k90J07
$$ -17 -84 -104 141 -229 -164 16 -66 -269 300 -172 -73 64 79 -39 -197 352 26 -74 67 198 -92 15
7651A5k56L21k4q1n9K10j20J48k92L80k42r7L21Mj59k0L62m71N0j27J50k3j39
$$ 15 -241 80 56 -25 -84 126 6 154 -138 242 0 -97 224 228 69 49 411 -60 -10 -137 13 -10 -149
7674a49mn4K63J08l29K59n3Q2J88j70q9O3l3k7j91J80J01j11J04Nj34l80M11R6
$$ -149 -153 -207 56 164 -165 94 41 123 311 141 52 115 82 55 -136 44 145 34 138 143 9 -371 40 136
7698A36j87p7O5j61J87Q4j41m8k15K03L34J20l88j00L42j54k4l15L06M0k47Q0
$$ 136 -51 -128 -63 -224 -37 47 -94 -142 -357 -154 180 300 -88 -188 154 0 -24 -339 -33 7 -240 -160
7720a60K47M4j42K02k71k43J70P2l30K20K01r1j93K74r5k3kL89j6p2j99j96P1
$$ -160 87 131 -11 191 -80 -323 -153 -81 -411 -191 10 -81 -274 0 -95 -118 -120 269 253 181 -18 -214 -143
7743a43K73R6l84J60r5J02K53j99j69K5j45L54J15m98J9l2L49J26l41J41k29N11
$$ -143 130 226 -158 2 -93 9 262 63 -106 -81 -226 128 243 -255 -236 -268 81 207 -134 7 -222 289
7765B89k29R5m18L14J06j19O2m15K88m5M6n7L4N0J46j9k97K16R5j59j93n5K52
$$ 289 60 155 -263 51 157 38 100 -315 -27 -72 -26 -83 -49 1 147 128 -169 47 142 -17 -210 -265 -13
7788a3J53Kl86K86q3Q6q9L89m73L72l90J67K6K4l38K93K43n54J55R2m3K27K8k44
$$ -13 140 142 -244 42 -41 45 -44 345 -128 244 -146 21 47 71 -267 26 269 -285 -130 -38 -81 146 174 -70
7812g0K57L1k73j65o4J46J06P8K73l71L1K98k43j81J58J79n47L93M1l80L62l08
$$ -70 187 218 -55 -220 -284 -138 -32 46 319 -52 -21 277 34 -147 11 190 -357 36 77 -303 59 -249
7834b49L43l31K37K56q7m50K18j86N74l47K18p3n13K06K10n5j04j23j21K74q0
$$ -249 94 -237 0 256 169 -281 -63 -249 325 -22 196 123 -390 -184 26 -29 -133 -256 -377 -103 -183
7855a83J87J11K6j81K9LJ61o75O88l75J82K27j84L6j68q1J38J74o8j5k79J74j01
$$ -183 4 115 141 -40 -11 -8 153 -522 166 -209 -27 200 16 52 -116 -197 -59 115 47 32 -247 -73 -174
7878a74J13J33rk11J75J51l29L7K77j28L2J13k72j58L53j29m0K72k00k65K13J75
$$ -174 -61 72 63 -148 27 178 -151 -114 163 35 67 180 -92 -250 103 -26 -66 206 6 -259 -46 129
7900A29R0k49k20j5O99m53O5j84O0L6K39k9k10l0O1J11K76l81Q1l04L68k64J34
$$ 129 219 -30 -250 -265 434 -19 46 -138 -78 -42 197 168 -42 -72 -11 100 376 -5 76 -228 140 -124 10
7923A0q2J0p5J85R6l73L65j12p5J78K60n47k52K84O9L59l41J25l35K48J49j26
$$ 10 -72 -62 -137 48 144 -229 136 24 -51 127 387 -160 -412 -128 -59 300 -41 84 -251 -3 146 20
7945B0RO7j36K50j75j41p6J96O7J3j49R0L71n62J55p9L9K46k76p6Q6L33j38J08
$$ 20 29 96 -40 210 35 -106 -182 14 81 94 -55 35 406 -156 -1 -80 -41 205 -71 -147 -61 272 134 242
7969B42m19K69p7K23N7r2j50J2j37K46O5n56L88m12K49K27k25m1J42k2O7Ko2k98
$$ 242 -177 92 15 238 295 203 53 65 -72 174 239 -317 71 -341 -92 135 -90 -131 11 -11 56 58 -4 -302
7993c02M01k62Q1j06L05j40k7J99l70J42L54m9l11O8J99l95L85k54R1p9J19j40
$$ -302 99 -163 -82 -188 117 -23 -50 149 -221 -79 275 226 -85 -17 182 -213 172 -82 9 -70 49 -91
8015i1N9L5l2%J45L9m61J96K77j48n5l79N56R3p5l6k39r8L03l57K45J23j15n8
$$ -91 -32 3 -29 -29 116 155 -306 -110 167 19 -36 -415 141 234 159 123 -116 -214 89 -268 -23 100 -15 -73
8039g3O1p5K56k60K30j42J30l31R7Q0K7N5r9P3k78k5K04n0L77J12n58J59J38j10
$$ -73 -12 -87 169 -91 139 -3 127 -204 -107 -27 0 55 -44 29 -249 -274 -70 -120 257 369 -189 -30 108 -2
8063bn4J14l49K74n2J28m39N58j67J45k36J90k20J11L4K25k55j86L02l54K65L7
$$ -2 -56 58 -291 -17 -69 59 -380 178 11 156 -80 110 -110 1 35 260 5 -181 121 -233 32 69
8085F9j93r9O15l99J72p3j56j56J94j3j82Q7r9K5n5K0L40j60J16J02l54J75j28
$$ 69 -124 -223 392 -7 165 92 -64 -220 -26 -39 -221 -134 -233 -208 -263 -243 97 -63 53 155 -199 -24 -152
8108a52K06n2l3Q3M3P4m16N58k94q6J29r2l4j36J63l7r3L31k94K25k24J75j69
$$ -152 54 2 -31 52 95 169 -247 311 17 -69 60 -32 -66 -202 -39 -76 -169 162 -132 93 -131 44 -125
8131a25p1J89o9Ml9Q5pO2J79j52q8O1J09O8k01k99L40k89J86K99j61K04k88J95
$$ -125 -196 -7 -76 -72 -111 -26 -33 29 208 56 -32 29 138 206 5 -294 46 -243 -57 242 81 285 -3 192
8155A92l4r4r5o2o4J87j43J50q4q5Q4k6J39l45j20L97r9M7M35k89k68P8J58j12
$$ 192 158 64 -31 -93 -157 30 -113 37 -47 -132 -48 -74 65 -280 -400 -3 -102 -55 380 91 -177 -99 59 -53
8179e3j14O04n37j14K17r7J62m0L0p7o5J51
$$ -53 -167 437 -100 -214 3 -94 68 28 58 -19 -84 67
8191F7
$$ Imaginary data points
##PAGE= N=2
##DATA TABLE= (X++(I..I)), XYDATA
0@%%%%%%%%%%pJ5j6J6j6J6k4L2l2M0m8N5o3P1q3R4j08J24j41J58j79K02k26K53
$$ 0 0 0 0 0 0 0 0 0 0 0 -7 8 -8 8 -8 8 -16 16 -16 24 -24 31 -32 39 -44 50 -58 66 -75 83 -96 106 -120 133
34A33k81L13l49L89m31M77n29N85o49P18p95Q83r80J092j220J368j543J753k008
$$ 133 -148 165 -184 205 -226 251 -278 307 -342 376 -419 464 -516 576 -644 724 -819 934 -1074
53a074K329k748L315m138N449p860J3760n3750r4896P7944J02192M2382o4525
$$ -1074 1255 -1493 1822 -2316 3133 -4727 9033 -44717 -139613 -61669 40523 82905 18380
66A8380r2307l5709O5771Q5353J7558o1949o4229j0910M8448N1633P209l4100
$$ 18380 -73927 -109636 -43865 41488 59046 -2903 -67132 -78042 -29594 22039 29248 -4852
78d852l0932j3984M664K9968M1840K620m6430n0323J420N6718N7090j2147p0977
$$ -4852 -35784 -49768 -45104 -15136 26704 29324 -17106 -67429 -66009 -9291 47799 35652 -35325
91c5325m3725L2673N9614J9823k8681l8692j0403J9818J7130L042N322N236k0042
$$ -35325 -79050 -46377 13237 33060 4379 -34313 -44716 -24898 -7768 -4726 596 5832 -14210
104a4210l2838j699L8674M1509J153n1993n6269P907P2435N7478k1748q0510n6941
$$ -14210 -47048 -48747 -10073 31436 32589 -19404 -75673 -67766 4669 62147 40399 -40111 -97052
117i7052L2121R5196N2234n4592r6181k8741O2805Q3498J9297o3226p2381k233
$$ -97052 -64931 30265 82499 27907 -68274 -97015 -34210 49288 68585 5359 -67022 -69255
129f9255N6777M9536M796l1343m3414k0756K4127M9729L2573j6294n9754m5672
$$ -69255 -12478 37058 41854 10511 -32903 -53659 -29532 20197 52770 36476 -23278 -68950
141f8950K8348P8957L8510m4775p3221k4783M8647P1476J5381n5434n7300K563
$$ -68950 -40602 38355 76865 32090 -41131 -65914 -17267 54209 69590 14156 -43144 -40581
153d0581M7993L8438k701l5912k8504Q589K4619R140k477o94l409j2150j2542
$$ -40581 7412 45850 43149 7237 -21267 -12678 11941 21081 18604 17910 14501 2351 -10191
166a0191Q86K4445L1715n883n1451l7389K7933O2917K6096m0571o6787j7644N3501
$$ -10191 -9305 15140 46855 40972 -10479 -47868 -19935 42982 69078 28507 -38280 -55924 -2423
179b423N9630r37n1293m3073j77L7259L9749M599l1685l6651j4336J8710M4001
$$ -2423 57207 56270 4977 -38096 -38273 -1014 38735 43334 11649 -25002 -39338 -20628 23373
192B3373L0437k4386n9408l1759L1438O4255L3818l9553p6540k7554N5438P3850
$$ 23373 53810 29424 -29984 -61743 -30305 33950 67768 28215 -48325 -75879 -20441 53409
204E3409J3767n8866p0250m989O7784O1798j4351o5047l9082K0679N0576K6763
$$ 53409 67176 8310 -61940 -66929 855 62653 48302 -16745 -55827 -35148 15428 42191
216D2191k0594l7173j0128J4633J3231P816P149l274j6511j6900m64K3527L0666
$$ 42191 21597 -15576 -25704 -11071 2160 9976 17125 13851 -2660 -19560 -20024 3503 34169
229C4169j055l8066l0318J3540L8667K2992j2492l5377k1678J4450L1782J4027
$$ 34169 33114 -4952 -35270 -21730 16937 39929 27437 -7940 -29618 -15168 16614 30641
241C0641q267j9558j9135k897J9670K3794P234j4139k9892k2395J6763M6399K4904
$$ 30641 22374 2816 -16319 -19216 454 24248 31482 17343 -12549 -34944 -18181 28218 53122
254E3122k8010n4201k6095L5129O5619K1308n4006o9125m225O0790N9879o487
$$ 53122 25112 -29089 -55184 -20055 45564 66872 12866 -56259 -60484 306 60185 53698
266E3698o5087n1764J9365O1418L1662k2937m5209k5611J5004L7718K1544j1593
$$ 53698 -11389 -63153 -43788 17630 49292 26355 -18854 -44465 -29461 8257 29801 18208
278A8208k6922k1155j620K3442K9938M575k7122l0829o044K5523L6142O922l3425
$$ 18208 -8714 -29869 -31489 -8047 21891 26466 -656 -31485 -37529 -12006 24136 31058 -2367
291b367l4610J824L1748K7575j989k9456k3533Q774K4547R882o481p959n024l434
$$ -2367 -36977 -35153 -3405 24170 22181 -7275 -30808 -22034 2513 12395 5914 -2045 -7069 -10503
305a0503o18L778J2958J4917o983l2450j8214K3977M1932J2652l2398m7253p747
$$ -10503 -11121 -7343 5615 20532 13549 -18901 -37115 -13138 28794 41446 9048 -38205 -45952
318d5952M6908M8154p300n0541l7212J2353M7101L4058j5142m6568k5212J6300
$$ -45952 956 49110 41810 -8731 -45943 -33590 13511 47569 32427 -14141 -39353 -23053
330b3053L6827K3430q590l4365k7085P995L2348K6690j209l1959l5174K5M0152
$$ -23053 13774 37204 28614 -5751 -32836 -24841 7507 34197 32988 1029 -34145 -34120 6032
343F032L6456n408m1795l6512P791M8504L3761j9810m7861k0510K3231L8937J3799
$$ 6032 42488 37080 -4715 -41227 -33436 15068 48829 29019 -18842 -39352 -16121 22816 36615
356C6615k4706l1617k523K1266J4687n64o992p339l775o23P82O667J3583K685
$$ 36615 11909 -19708 -22231 -965 13722 13158 6166 -1173 -4948 -5571 -4789 1878 15461 18146
370A8146j9338k0146M197K4058K0183m614k9419k3227J1601L3184J7092j3433
$$ 18146 -1192 -21338 -17141 6917 27100 22486 -6933 -30160 -18559 14625 31717 18284
382A8284k8667j8019J1699L0378J6290j2909k5164j5726M602K4237K4133l059
$$ 18284 -10383 -28402 -16703 13675 29965 17056 -8108 -23834 -19232 5005 29138 26079
394B6079k8850k6501O82L1155L4702j476m2783l6445J1171M6808L1700j6019m9901
$$ 26079 -2771 -29272 -28590 2565 37267 35791 -6992 -43437 -32266 14542 46242 30223 -19678
407a9678k9058K6292M9559J6475l0072l9900j0739K7541L5193M688k7061k4268
$$ -19678 -48736 -22444 27115 43590 13518 -26382 -37121 -9580 25613 30301 3240 -21028
419b1028k70J6940J7453M707j1498j5317n339M978J0748J2824J714j6549j6815
$$ -21028 -21298 -4358 13095 17802 6304 -9013 -14352 -9374 1374 14198 15912 -637 -17452
432a7452J110J6609J6541J664j8130j9620K590J9041J3345k764j1881j1826k596
$$ -17452 -16342 267 16808 18472 342 -19278 -16688 2353 15698 12934 1053 -10773 -13369
445a3369R158J0405N709j597j1370j7052j568K1735K1496j909k5672k7167L171
$$ -13369 -4211 6194 11903 10306 -1064 -18116 -19684 2051 23547 21638 -4034 -31201 -28030
458b8030L5621K9727j3374m1173k4122J7965M0982K1724k3058m3893j3869K8090
$$ -28030 7591 37318 23944 -17229 -41351 -23386 17596 39320 16262 -27631 -41500 -13410
470a3410L6213Q112k4769l3586p174K5348K7970L350j9210k3329q571J5707K5852
$$ -13410 22803 30915 6146 -27440 -34614 -9266 18704 22054 2844 -20485 -29056 -13349 12503
483A2503Q341j5419k3729j0856J2440K7584J2469j8088k7143o512J7977K2742
$$ 12503 20844 5425 -18304 -29160 -16720 10864 23333 5245 -21898 -28410 -10433 12309
495A2309O601j7668k1219o94J7218J2289o55q380q266j764M929M519L065M506
$$ 12309 18910 1242 -19977 -20671 -3453 8836 8181 -199 -8465 -10229 -5300 -781 2284 6790
509F790n42j1370r720N049J5801J2435l929k1731j6724J1028K8372J3500j5247
$$ 6790 6248 -5122 -14842 -9793 6008 18443 14514 -7217 -23941 -12913 15459 28959 13712
522A3712k7118j2385J7176L1061R825k1760k7397n472J8801K5771Q321j9606k6192
$$ 13712 -13406 -25791 -8615 22446 32271 10511 -16886 -22358 -3557 22214 30535 10929 -15263
535a5263o244J8131K3858R530j5611k8920j1148K0573K9086Q192j9604l0788r748
$$ -15263 -21507 -3376 20482 30012 14401 -14519 -25667 -5094 23992 32184 12580 -18208 -27956
548b7956K4706L1860K531k7425k5959l43K5270K4503l997k6201j6925P260J8284
$$ -27956 -3250 28610 31141 3716 -22243 -22586 2684 27187 23190 -3011 -19936 -12676 5608
561E608J1502m336j5034r318M619Q989L713J012j506p586o337J394P351Q807K899
$$ 5608 17110 12774 -2260 -11578 -6959 2030 5743 6755 5249 -2337 -8674 -7280 71 8878 11777
576A1777j0479j4069r79J3443J2978P24j1378j5038k554J4418J5246M34j0888
$$ 11777 1298 -12771 -13750 -307 12671 13395 2017 -13021 -15575 -1157 14089 14523 3635
589C635j4333n881J0416J9798P073j2752k0576q590J2802K5148J0976j8520k8345
$$ 3635 -10698 -16579 -6163 13635 20708 7956 -12620 -21210 -8408 16740 27716 9196 -19149
602a9149o794K0767K8029O806k4088l0759j212K8562K5073k870k5866k3441L550
$$ -19149 -25943 -5176 22853 29659 5571 -25188 -26400 2162 27235 24365 -1501 -24942 -21392
615b1392K7565J9293q159k3575j4453N677K0030J4401o547j8561j0553M285J2962
$$ -21392 6173 25466 17307 -6268 -20721 -15044 4986 19387 12840 -5721 -16274 -11989 973
628I73J1580q01j4591j1535K376J1234R531R37r881j1663J01R960P602R83n162
$$ 973 12553 11752 -2839 -14374 -11998 -764 8767 9704 -177 -11840 -11739 -1779 5823 6806 1644
643A644q270l733M678P305L427N93n154r431k947R035J1744L981q401j5091p390
$$ 1644 -6626 -10359 -5681 1624 5051 5644 490 -8941 -11888 -2853 8891 12872 4471 -10620 -18010
658a8010J3162K0640M825j6299j9946l931J8077K4149J436k3221k1001K627K2563
$$ -18010 -4848 15792 20617 4318 -15628 -19559 -1482 22667 24103 882 -20119 -17492 5071
671E071K0058j459k4560j9147O312K3739J5762n383k0833j6756N669K2306J4676
$$ 5071 25129 23670 -890 -20037 -13725 10014 25776 20393 -440 -17196 -11527 10779 25455
684B5455p045j9060j3981M158K0671J4537p874j9985j1068O766J6979J2004p729
$$ 25455 18410 -650 -14631 -10473 10198 24735 16861 -3124 -14192 -7426 9553 21557 13828
697A3828j8621q205Q846J3402N109o149j1931n144O100P181J077j592k781m686
$$ 13828 -4793 -12998 -4152 9250 14359 8210 -3721 -8865 -2765 4416 5493 3901 1120 -3566
711c566k952K682L934M390J478p254j0653l25J0761J0365r87j1492j2571j55J5100
$$ -3566 -6518 -3836 98 4488 5966 -1288 -11941 -12266 -1505 8860 7873 -3619 -16190 -16345 -1245
726a245J3355l324j4366j3171R53J6452J5585k804j8826j3579L816J7467J5854
$$ -1245 12110 8786 -5580 -18751 -17798 -1346 14239 11435 -7391 -20970 -17154 313 16167
739A6167k590k0999j6196O547K1211J4815n439k1795j5632R408K3592J1527r926
$$ 16167 13577 -7422 -23618 -17071 4140 18955 13516 -8279 -23911 -14503 9089 20616 10690
752A0690k0923j0826J0612K2197Q767j3066j8231n009J1099J5533N825j0793j4506
$$ 10690 -10233 -21059 -10447 11750 20517 7451 -10780 -15789 -4690 10843 16668 5875 -8631
765h631k366R229J0272K878o129j0312k455N827O415J860j279n014n599J45N048
$$ -8631 -10997 -1768 8504 11382 5253 -5059 -7514 -1687 4728 6588 5309 295 -5304 -5159 -111
780a11M142Q71j740o712n483L351P674M511k218q321r062J604J1853Q504l261
$$ -111 4031 4902 3162 -3550 -9033 -5682 1992 6503 4285 -4036 -13098 -11494 359 8863 5602
795E602j1869j0363R13J5122J2596m474j7681j1576M956J7253J3135o036k1637
$$ 5602 -6267 -16630 -15717 -595 12001 7527 -10154 -21730 -16774 479 13614 7578 -14059
808a4059j1605J0058J9877J0250r540k1565j0254J3946K0657N789j2471j7646
$$ -14059 -25664 -15606 4271 14521 4981 -16584 -26838 -12892 7765 13554 1083 -16563
820a6563o364J2877J8835L640j3645j4328k224J1243J4268L139j1791j1949k37
$$ -16563 -22927 -10050 8785 12425 -1220 -15548 -17772 -6529 7739 10878 -913 -12862 -13099
833a3099R423J0305K600q047j0394l18Q705O339Q76m020n455k355M306N129N76
$$ -13099 -3676 6629 9229 1182 -9212 -9530 -825 5514 6390 2370 -3085 -5440 -1134 3995 4571
848D571j20j827l999j746L053N124L568q23p202p227K907J0945O607m262j0388
$$ 4571 4451 2624 -1375 -3121 -68 5056 8624 7801 599 -6628 -3721 7224 13831 9569 -819
863h19q730L857J4569R058p602j4633p676O995J6051Q800r621j7744o726J0805
$$ -819 -9549 -5692 8877 17935 10333 -4300 -11976 -4981 11070 19870 10249 -7495 -14221 -3416
877c416J6323O716j0393j8981o006J3987J7215K892j2602j6206m024J3848J6572
$$ -3416 12907 19623 9230 -9751 -15757 -1770 15445 18337 5735 -10471 -14495 -647 15925
890A5925N03j4306j2902p39J2517J3445j20j4142j0425K538J0391Q524m93j0170
$$ 15925 16428 2122 -10780 -11519 998 14443 14323 181 -10244 -7706 2685 11209 10716 546
904E46q634L050Q496M729j193m980n851M13N251K853l27r75k517l178K36L321
$$ 546 -8088 -5038 3458 8187 6994 2014 -3837 -3424 1827 4680 4353 3378 861 -2317 -2081 1240
920A240K935J698j619o260m691M535Q283L267l842q869o640N072J2861N058q000
$$ 1240 4175 5873 4254 -2006 -6697 -2162 6121 9388 5546 -3323 -9963 -4891 7970 13028 5028
935E028j1988n071P070J4162N647j0266j5435l161J0978J3806M433j2230j6453
$$ 5028 -6960 -12031 -4961 9201 14848 4582 -10853 -14014 -3036 10770 15203 2973 -13480
948a3480k372J4424J3717Q10j2776j5031n77J5240J4088l310j3987j0998K099
$$ -13480 -15852 -1428 12289 13099 323 -14708 -15285 -45 14043 10733 -3254 -14252 -12153
961a2153J3403J1206m136j3660q021M631J0423P503l161j1050o059M589Q143L353
$$ -12153 1250 12456 8320 -5340 -13361 -8730 1693 9196 6035 -5015 -11074 -6485 1658 5011
975E011k173o032m852K823N472J900j279j480l014r82J958K484J319L65j469m466
$$ 5011 2838 -3194 -8046 -5223 249 2149 870 -610 -3624 -4606 -2648 -164 1155 1520 51 -4415
991d415k331L875N865J963l176p537m013N670J0173K711p195r651l778P287J3450
$$ -4415 -6746 -2871 2994 4957 1781 -5756 -9769 -4099 6074 8785 1590 -8061 -11839 -4552 8898
1006H898K563j0942j2241m69J0261J2616J519j2414j3889J724J3151J1641j117
$$ 8898 11461 519 -11722 -12191 -1930 10686 12205 -209 -14098 -12374 777 12418 11301
1019A1301j3240j2469K553J5170J0386m667j3561q521L380J4374Q780o466j3099
$$ 11301 -1939 -14408 -11855 3315 13701 9034 -4527 -13048 -9668 4706 13486 7020 -6079
1032f079n242N739J0578N722n508j1022l110O324P214K534l507o893k972M852
$$ -6079 -11321 -5582 4996 10718 5210 -5812 -8922 -2598 4616 7150 3643 -3250 -6222 -1370
1046a370N269R8j593k631k409R04K780J503n4k13j250l451l22L920L169Q19k784
$$ -1370 3899 3997 2404 -227 -2636 -1732 1048 2551 2497 2284 1034 -2417 -2739 1181 4350 5169 2385
1063B385o318k396N941Q170K02o415q001k097P986J0852J13j1020r089R21J0031
$$ 2385 -3933 -6329 -388 7782 7984 1569 -6432 -8529 -543 10309 10422 -598 -9687 -8766 1265
1078A265J0340q03j2803j0507L778J2368Q880l033j2667j0221N159J4177P297
$$ 1265 11605 10802 -2001 -12508 -8730 3638 12518 9485 -3182 -13403 -8244 5933 13230
1091A3230o319j1978p251N519J3966N588q401j1493l313O449J0682L957p614j0198
$$ 13230 6911 -5067 -12318 -6799 7167 12755 4354 -7139 -10452 -4003 6679 10636 3022 -7176
1105g176o97O757O904J293m991p059r00O008M572o07k876k742j295K234K980p
$$ -7176 -7873 -1116 5788 7081 2090 -4969 -5869 139 4711 4104 1228 -1514 -2809 -575 2405 2398
1121B398p56l72j375k109J291K369K100J83k779m887q89N985N581j123n179o444
$$ 2398 1642 1270 -105 -2214 -923 1446 3546 3729 950 -3937 -4826 1159 6740 5617 438 -6006
1137f006n64P928P898j597r364p331K112Q889R088k792j2733p046M917J1098O612
$$ -6006 -6570 1358 9256 7659 -1705 -9036 -6924 1965 11053 8261 -4472 -11518 -6601 4497 11109
1152A1109m572j2948o650O956J2748L871p031j1475m454P661J2253K672r240r802
$$ 11109 6537 -6411 -13061 -6105 6643 10514 3483 -7992 -12446 -4785 7468 10140 900 -8902
1166h902j701P222R844J728q908q814J250P521N940m1o557o227J323O549L295
$$ -8902 -10603 -3381 6463 8191 -717 -9531 -8281 -760 5180 5139 -1418 -7645 -6322 227 3522
1181C522j544l060k944k03L722K464j123j246n74j035l66K001J346N58J94k061
$$ 3522 1978 -1082 -4026 -4229 -507 1957 834 -412 -986 -2021 -2387 -386 960 1518 1712 -349
1197c49l489N26M591L562j037l946n087q3P444O299l063p719n033J789R547P097
$$ -349 -3838 -3312 1279 4841 3804 -142 -5229 -5312 2132 8431 5368 -2351 -7384 -5595 3952 11049
1213A1049m807j1251m741O195R973M729o095j1683l916Q622J0553J348p443r822
$$ 11049 6242 -5009 -9750 -3555 6418 11147 5052 -6631 -10547 -1925 8628 9976 2533 -7289
1227g289k674Q646J0641j12r610p597p24Q506Q673m43r598p083K239P389N910
$$ -7289 -9963 -1317 9324 9212 -398 -7995 -8719 -213 8460 8017 -1581 -8664 -6425 964 6874
1242F874j609p597n735L705O621K035j959m596k825J995M736J113k883q01m21
$$ 6874 5265 -2332 -8067 -4362 2259 4294 2335 -2261 -5086 -3091 1645 2758 -125 -926 -1347
1257a347n63J077J142J53M96P81k559k750J563M045J577p00l671m517K342O905
$$ -1347 -1910 -833 309 462 958 1739 -820 -3570 -2007 2038 3615 2915 -756 -5273 -2931 3974
1273C974L291l139o648l196L072Q004M521n723q657k352N744Q457L567o649j0332
$$ 3974 7265 4126 -2522 -5718 -2646 5358 9879 4156 -4501 -6853 -1109 7348 10915 4266 -6066
1288f066j431Q589Q637P27p913r263m29R773Q697j672r392o813Q48R065P738l215
$$ -6066 -7497 1092 9729 10456 2543 -6720 -7149 2624 11321 9649 257 -6556 -5708 3357 11095 7880
1304G880r853m888L529P579M272l285p956l654M563O239J088k857m837j955L357
$$ 7880 -1973 -6861 -3332 4247 8519 5234 -2722 -6376 -1813 4426 5514 2657 -2180 -4135 -778
1319g78L480l82k177j140n48k31J636R47r46K91q2k075j184J772K335L30o03l283
$$ -778 2702 2320 143 -997 -1545 -1776 -140 807 -139 152 70 -2005 -3189 -1417 918 1248 645 -2638
1337b638k590K166N418J442l331m310k736K989O974K680n536o952j678N738Q113
$$ -2638 -5228 -3062 2356 3798 467 -3843 -6579 -3590 3384 6064 528 -6424 -8102 -2364 5749
1352E749K003p416q949M17Q366P551n99q268q398J840J0582N913l745q056n245
$$ 5749 7752 336 -8613 -8196 170 7721 7122 -1146 -9544 -7704 2878 8791 5046 -3010 -8255
1367h255K753R580N087n178q472k673M177O590L422m064p202j958N176M814J029
$$ -8255 -5502 4078 9165 3987 -4485 -7158 -2981 3609 7031 2967 -4235 -6193 -1017 3797 4826
1382D826l248n084r90M230L976p17l085j677m78J652K572p25k007L68Q26j018
$$ 4826 1578 -3506 -4496 -266 3710 2993 -92 -1769 -2247 -595 1977 1252 -755 -387 439 -579
1398e79o07N06Q25J529m95l196k017K501M205P42k942l908k585M435O177R49n911
$$ -579 -1186 -680 145 1674 1179 -2017 -4034 -1533 2672 3414 472 -3436 -6021 -1586 4591 5540 -371
1415c71n479j55N512O504J43p787o761K529P586N294j760p971o408L695R108L882
$$ -371 -5850 -6005 -493 6011 6154 -1633 -8394 -5865 1721 7015 5255 -2716 -9124 -5429 3679 7561
1431G561m072p119m577L942Q658L762n760p627j897M949O736K393n308p117l16
$$ 7561 3489 -3630 -8207 -4265 4393 8155 2395 -5232 -7129 -2180 4556 6949 1641 -5476 -5792
1446e792N926M517N88m498n594Q52N315L370k244l189j809M72L221J489j892j841
$$ -5792 134 4651 5239 741 -4853 -4001 1314 4684 2440 -749 -2558 -2086 1135 2624 732 -1109
1462a109P15M60p16J43P58k01J214l22l275q81L158K274r2k234l701r01M484M304
$$ -1109 -394 66 -650 -507 251 50 1264 942 -2333 -3214 -56 2218 2126 -108 -3809 -4710 -226 4078
1480D078p59n161l738P98N066M787j038p050m178K484O269M355k170p705n090
$$ 4078 3319 -1842 -5580 -4782 284 5071 4033 -3017 -7195 -4711 1558 5913 3743 -3962 -9052
1495i052M753Q170L069m637p505k964N185Q319J703o938o591n46N976O583N11
$$ -9052 -4299 3871 6940 2303 -5202 -8166 -2981 5338 7041 103 -6488 -7034 -1058 5525 6036
1510F036o957n251J559N717L790p77n115m144J965N279J902j905k995j838R25
$$ 6036 -921 -6172 -4613 1104 4894 4117 -998 -5142 -3177 2102 4004 2099 -896 -2734 -1809
1525a809L502J161k077j689M45n8Q64Q60o41l81J115j13k036k51J921J512J09
$$ -1809 1693 2854 777 -912 -467 -525 339 1199 558 177 1292 1179 -857 -1108 813 2325 2434
1542B434j625k507q10L725L297j263m062k428L17N031M300k382o234l390L293
$$ 2434 809 -1698 -2508 1217 4514 3251 -811 -3239 -2922 2109 6409 4027 -2207 -5597 -2304
1557b304N839L359l063p784l005N609O956P97m810o342j728N968P048l01o594
$$ -2304 3535 6894 3831 -3953 -6958 -1349 5607 6404 1594 -4748 -6476 -508 6540 6239 -355
1572c55m992L47N809N511r54o792m379K552N178L347j505n370l212K558N292J368
$$ -355 -5347 -5000 809 6320 5366 -1426 -5805 -3253 1925 5272 3767 -1603 -4815 -2257 3035 4403
1588D403k212l696j799J840M253K58k461k034L21P05J809L45k034k10J147J20
$$ 4403 2191 -1505 -3304 -1464 2789 3047 586 -1448 -1127 -422 1387 1732 -302 -512 635 755
1604G55j516m6J128P91Q68j618k600j63L713K134j415l428k291J042M750L231
$$ 755 -761 -807 321 1112 1980 362 -2238 -2401 1312 3446 2031 -1397 -3688 -2646 2104 5335
1620E335l496m988j593K981M730K190l769o350q13N294M858O29m608n891n76O161
$$ 5335 1839 -3149 -4742 -1761 2969 5159 1390 -4960 -5773 -479 4379 5008 400 -5491 -6067 94
1636I4O022j750n682m724J143N771N034k327o565l081L000M730L105k262n934
$$ 94 6116 4366 -1316 -6040 -4897 874 5908 3581 -2984 -6065 -3065 1665 4770 2508 -3426
1651c426j928L582M488N61k405l579j376L283L378p02l011j185N54J216J596n03
$$ -3426 -5354 -1772 2716 3277 872 -2707 -4083 -800 2578 1876 -1135 -2320 -1766 -550 1046 543
1667E43j778J68J077j56p83M30K07N57M7j020k010J157K770J036j947j864j806
$$ 543 -1235 -1067 10 -146 -929 -499 -292 265 312 -708 -2718 -1561 1209 2245 298 -1566 -3372
1684c372J387M065K078l466m059r17L296M299J539m546n257J85N133L959P7m637
$$ -3372 -1985 2080 4158 692 -3367 -4284 -988 3311 4850 304 -4953 -4768 365 4324 4401 -236
1700b36n379J202N990M046k116n430l479J561O505L655l820n940j918L374N218
$$ -236 -5615 -4413 1577 5623 3507 -1923 -5402 -3841 2664 6319 2499 -3441 -5359 -1985 3233
1715C233K374l700n424o16M150L610J23k830l666l54L911K907j161k689j166J87
$$ 3233 5607 1907 -3517 -4133 17 3627 3750 920 -2746 -3100 811 3718 2557 -132 -1298 -1111
1731a111J873J979j082j970l2P77j99L73L2o09L78P89j028j586R99J930N72p59
$$ -1111 762 2741 1659 -311 -343 434 235 608 640 31 409 1198 170 -1416 -417 1513 2085 1326
1749A326j887j990J629L773J180l782k729l00K754L879M50m716m437J313M733
$$ 1326 -561 -2551 -922 2851 4031 249 -2480 -2780 -26 3853 4303 -413 -4850 -3537 1196
1764A196L310n28m996m332K094O125K339k710m808k723K426O046K379m677m661
$$ 1196 4506 3978 -1018 -5350 -3256 2869 5208 2498 -2310 -5033 -2607 3439 5818 1141 -3520
1779c520j273L165M876J746m423n010N46M421K982M8l813l542O25M222K121j787
$$ -3520 -4793 -1628 3248 4994 571 -4439 -3893 528 3510 3558 -255 -3797 -3172 1050 3171 1384
1795A384k187j510N95K746J385j686k048K76Q31N64K57k27j349P45R80j036r24
$$ 1384 -803 -2313 -1718 1028 2413 727 -1321 -1045 -214 350 607 380 -969 -224 756 -280 -1204
1812a204Q49J193M42n46j632j197J663K780J19k620k198k81K584L465k19m365
$$ -1204 -355 838 1280 734 -898 -2095 -432 2348 2467 -153 -2351 -2632 -48 3417 3198 -1167
1828a167k751J301L993K583j356m601l138K916M926J545k772l806k887L076N955
$$ -1167 -3918 -2617 1376 3959 2603 -1998 -5136 -2220 2706 4251 1479 -2327 -5214 -2138 3817
1843C817O11m069m311k04L176M843L68m857m162J474M146K803r08l829l135J542
$$ 3817 4428 359 -3952 -4156 -980 3863 4231 -626 -4788 -3314 832 3635 2727 -1102 -4237 -2695
1859b695M881Q96j984k550j488J640L114N06k237j792N42J142R21K72j158r67
$$ -2695 2186 3082 1098 -1452 -2940 -1300 1814 2320 83 -1709 -1167 -25 896 1168 10 -957
1875i57J256P15j156k42L97M22J58L0j261j154J596K460k46j975k126k83K885
$$ -957 299 1014 -142 -384 13 435 593 623 -638 -1792 -196 2264 2018 43 -2083 -2366 519
1892E19K886q28l903k034J698L679K041j748m506j966L269M372O74k649m452j449
$$ 519 3405 2577 -1326 -3360 -1662 2017 4058 2310 -2196 -4162 -893 3479 4153 1504 -2948 -4397
1908d397M116M462j15m076l651M1L936M038m84n377l037K179L610K891j646m191
$$ -4397 -281 4181 4066 -10 -3661 -3620 316 4354 3870 -1507 -4544 -2365 1245 4136 2490 -1701
1924a701k559K596L889O02k138k707j071J990L250K52k997j373Q96O66J695k69
$$ -1701 -4260 -1664 2225 2827 689 -2018 -3089 -1099 2151 2403 -594 -1967 -1071 -405 1290 1021
1940A021j142j224J000R10m01m10m35L14P34M02j666p20J640J394l44j293j432
$$ 1021 -121 -1345 -345 565 164 -246 -681 -367 367 769 -897 -1617 23 1417 1073 -220 -1652
1957a652n67K851K502j705l354j048J784K606J895j945m180j246L489L473N80
$$ -1652 -2219 632 3134 1429 -1925 -2973 -1189 1417 3312 1367 -2813 -4059 -570 2903 3483
1972C483l041l961l81M102L821r77m070k602P40L745L328j313m571k334K028L723
$$ 3483 442 -3519 -3900 202 4023 3046 -1024 -3626 -2886 859 4187 2874 -1697 -4031 -2003 1720
1988A720K304j845m879j276K839L674K07k093l050p58K892L369o82k915j671M95
$$ 1720 4024 2179 -2700 -3976 -1137 2537 2744 651 -2399 -3157 -265 3104 2422 -493 -2164 -1669
2004a669J903J704o21k709j47J645M79l89k24j055K81J572J46j952j40J543P32
$$ -1669 234 1938 1317 -1392 -1539 106 585 196 -28 -1083 -802 770 916 -1036 -1176 367 1099
2021A099n89q49j494J98K179J764j918k084n21Q90K655J621k548l309n42L069
$$ 1099 510 -339 -1833 -1635 544 2308 390 -1694 -2215 -1325 1330 2951 403 -2906 -3448 -379
2037c79K717K98k663l793M97M069K946j478l386k453J142L657L075k407m433j069
$$ -379 2338 2636 -27 -3820 -3323 746 3692 2214 -1172 -3625 -2483 1174 4249 1842 -2591 -3660
2053c660K064L843J953l169m103m16L385K772K20k544k648k46L301K327j389k557
$$ -3660 -1596 2247 4200 1031 -3072 -3488 -103 2669 2889 345 -2303 -2549 752 3079 1690 -867
2069h67p06O83J736J706j499j972J39J205L89J55n13q12P2J482M5j402J89J015
$$ -867 -1573 -890 846 2552 1053 -919 -780 425 814 969 456 -356 -284 1198 1243 -159 30 1045
2087A045k76N66m42j560J71J922O46j130j427q09P14K812Q91k292l405P07K351
$$ 1045 769 1335 893 -667 -496 1426 2072 942 -485 -1294 -580 2232 3123 831 -2574 -1867 484
2104D84K718L98l459l514J204M016J974j731l703j958K234M078J343l389l162
$$ 484 3202 3600 141 -3373 -2169 1847 3821 2090 -1613 -3571 -1337 2741 4084 695 -2467
2119b467n8J924L114Q63k924l425K83K975K105l20k356k835N77K894K215j430
$$ -2467 -2525 -601 2513 3376 452 -2973 -2690 285 2390 2070 -286 -3121 -2544 350 2565 1135
2135A135j937j921O35K928J015j385k143j33J201J268J04j007j681O48J794K7
$$ 1135 -802 -2723 -2088 840 1855 470 -1673 -1806 -605 663 767 -240 -1921 -1273 521 548
2151E48j412l99N65P27P18r98k002J014K208L23j249j643p91J486K889k85k767
$$ 548 -864 -1263 -698 29 747 -251 -2253 -1239 969 1292 43 -1600 -2391 -905 1984 1699 -1068
2168a068j731R72K350J505n19k953j930K053K753Q05j585k598j142J851L697K74
$$ -1068 -2799 -1827 523 2028 1509 -1444 -3374 -1321 1432 2237 652 -1946 -3088 -1237 2460 2734
2184B734k346k527p61K314K887R81l349l147O47L083K579m48l120k844J568L234
$$ 2734 388 -2139 -2900 -586 2301 3282 -67 -3214 -2567 516 3095 2647 -473 -3317 -1749 1485
2200A485J499j762k785r55J609K879N86l029j638R86J711P71m74j355q26J472
$$ 1485 2984 1222 -1563 -2518 -909 1970 2556 -473 -2111 -1125 586 1357 883 -472 -1298 174
2216A74O64p54m15J6L88L33J09j133k93R85J001o41o31o86j44Q93J616j22j941
$$ 174 838 84 -331 -315 73 406 515 -618 -911 74 1075 434 -197 -883 -1027 -134 1482 1360 -581
2235e81p61M59J079J368J94k470j923J403K611J218p73l656j772K436M106k01
$$ -581 -1342 -883 196 1564 1758 -712 -2635 -1232 1379 2597 1824 -1832 -3604 -1168 2938 2737
2251B737k702k883lL385L113p46m422k074K110K977J399j521l123j176K537K608
$$ 2737 35 -2848 -2851 534 3647 2901 -1521 -3595 -1485 1492 2891 1370 -1753 -2929 -392 2216
2267B216k26j744j466k11J362K014l75j672j094KJ018J279K12j131j177O07J120
$$ 2216 1990 246 -1220 -1431 -69 1945 1570 -102 -1196 -1194 -176 1103 1315 184 -993 -386 734
2284G34P0K22j006p57P34J003l71j130j22R29M07M80j393j270R62K572k38j693
$$ 734 804 1026 20 -737 -3 1000 629 -501 -623 306 713 1193 -200 -1470 -508 2064 1826 133
2302A33k082M97K161K261j601l142j048K378K823L32k338l015J91L026K732j555
$$ 133 -1949 -1452 709 2970 1369 -1773 -2821 -443 2380 2712 374 -2641 -2450 576 3308 1753
2318A753k802j435P71K622K128j733l142k24J221J765J069o72k990r41J960K017
$$ 1753 -1049 -2484 -1713 909 3037 1304 -1838 -2062 -841 924 1993 1321 -1669 -2610 -650 1367
2334A367N37p71k698j165K022K682M3k386j745J1K121K649j174l228n85K076J624
$$ 1367 1904 1133 -1565 -2730 -708 1974 2017 -369 -2114 -2103 18 2667 1493 -1735 -2320 -244 1380
2351A380j34j270j524M44K131O01k019j053O74J702J83p65j798k05K184J603j773
$$ 1380 1246 -24 -1548 -1104 1027 1628 -391 -1444 -770 932 1115 350 -1448 -1653 531 2134 361
2368C61j907j25J455R63P27j803j724J027J348Q22j03r08j805l5J675J899m66
$$ 361 -1546 -1671 -216 747 1474 -329 -2053 -1026 322 1144 1041 133 -1672 -1707 -32 1867 1401
2385A401r92k347l35K567K101o51l177j258O45L213K071k129l733q03K952K672
$$ 1401 409 -1938 -2273 294 2395 1744 -1433 -2691 -2046 1167 3238 1109 -2624 -3427 -475 2197
2401B197J59k967k654N97L477K057k135k780k73J507K121K36j778j560O53J667
$$ 2197 2356 -611 -3265 -2668 809 2866 731 -2049 -2322 -815 1306 1542 -236 -1796 -1143 524
2417E24J14p78J59o85L38P63n31p32P63l7k40J11L23n26J36L34M24k65k61m23
$$ 524 638 -140 19 -666 -328 435 -96 -828 -65 -102 -342 -231 92 -434 -298 36 460 195 -66 -489
2437d89k33R41J207m98j690o68P21J961J132j228l273l24L037K427q63k773k348
$$ -489 -722 219 1426 928 -762 -1430 -709 1252 2384 1156 -2117 -2441 596 3023 2160 -613 -2961
2454b961J517L782J627k552l579l83K778K973j53l366k073J355K585J080j152
$$ -2961 -1444 2338 3965 1413 -2166 -2549 229 3202 3049 -317 -2390 -1035 1550 2630 1478
2469A478j724j158J026J554L97p73q72p32k0J316J407j258j020o83L96J225J222
$$ 1478 -246 -1404 -378 1176 1573 800 -72 -804 -824 492 1899 641 -379 -1062 -666 559 1781
2486A781r64j943o78K383O08n69q77j244N47K158L1k100r86J325J715q2j612j554
$$ 1781 817 -1126 -1804 579 1187 618 -259 -1503 -956 1202 1233 -867 -1853 -528 1187 1105 -507 -2061
2504b061M04K594J231k356k600P57K319J635n91k807j397J985K282J7j504j941
$$ -2061 -1657 937 2168 -188 -2788 -2031 288 1923 1332 -1475 -2872 -887 1395 1412 -92 -2033
2520b033l12J997J951n77j680j061N17Q32J139P10j551j782K1J615J070R22k098
$$ -2033 -2345 -348 1603 1026 -654 -1715 -1198 -366 773 1483 -68 -1850 -1829 -214 856 1778 -320
2537c20k055J77K403J807l60k731j867J458K943J243k801k419N74K111J631l90
$$ -320 -2375 -2198 205 2012 1652 -1079 -2946 -1488 1455 2698 -103 -2522 -1948 163 1794 1404
2553A404k569j197K038J913l38k153n05P41J533J52j392j116J176J406k29j141
$$ 1404 -1165 -2362 -324 1589 1251 -902 -1407 -666 867 1019 -373 -1489 -313 1093 864 -277
2569b77p41M74J001R73j063j311J72J078O7R6j87q06l28L87P34P93L7j200j329
$$ -277 -1018 -544 457 1430 367 -944 -772 306 373 469 282 -524 -852 -465 269 1062 1099 -101 -1430
2588a430N62J897Q20o29k105j346J261L178O59l232k362J017K861K001j120l347
$$ -1430 -868 1029 1849 1220 -885 -2231 -970 2208 2867 -365 -2727 -1710 1151 3152 2032 -1315
2604a315j785K674L140J82k897j807O49K043J561j127k365k35J304Q43J94p31
$$ -1315 -3100 -426 2714 2896 -1 -1808 -1159 884 2445 1318 -1047 -1282 22 865 1059 328
2620C28n90K57L88k2j31L72K26q71n74R04L41j32k48p36%J408J18j488n61J076
$$ 328 -262 -5 383 361 230 602 828 -43 -617 287 628 496 248 -488 -488 920 1038 -450 -1011 65
2640F5P63o38l34j472M26K769P2k250j668M42K369J251q50l002p64K711K155l72
$$ 65 828 190 -144 -1616 -1190 1579 1651 -599 -2267 -1825 544 1795 945 -2057 -2821 -110 2045 1673
2658A673k666j940J059K632J521j825k982K74J842J593r2j712j162N1J687Q92
$$ 1673 -993 -2933 -1874 758 2279 454 -2528 -2254 -412 1181 1089 -623 -1785 -1734 -47 845
2674H45p40l35o90j017J070J349O95q82j606m27J013J931J70j744j421O83J521
$$ 845 105 -230 -920 -1937 -867 482 1177 295 -1311 -1738 -725 1206 1376 -368 -1789 -1106 415
2691D15J076p68k184n37K261J308j007j481n49J271J380J87j939j479J611K307
$$ 415 1491 723 -1461 -1998 263 1571 564 -917 -1466 -195 1185 1372 -567 -2046 -435 1872
2707A872p16j295j249N49K097Q64j353k313N32J895Q37q02j184j039R28J746M58
$$ 1872 1156 -139 -1388 -839 1258 2122 769 -1544 -1012 883 1720 918 -266 -1305 -377 1369 1827
2724A827j089o01m69j96J443N34l44j564l27K05P58K018o11k176j088J150K016
$$ 1827 738 137 -332 -528 915 1449 1105 -459 -786 -581 177 2195 1584 -592 -1680 -530 1486
2741A486J080j391k708o95K274K862o81l044j185J253K596J063k174k331K93K132
$$ 1486 2566 1175 -1533 -2228 46 2908 2227 -817 -2002 -749 1847 2910 736 -1595 -1302 830
2757H30J071q82j866l74Q05J922n01j765J84R94j2j2m08o47O45P79k01r19J63
$$ 830 1901 1019 -847 -1221 -416 1506 1005 -760 -576 418 406 394 -14 -661 -16 763 562 -357 -194
2776a94L59j67L6M72l96k86M8n3k14J317l31j096q06J106J078P49j506j991j70
$$ -194 165 -2 34 506 110 -176 -128 -181 -395 922 591 -505 -1311 -205 873 1622 116 -1875 -2045
2795b045K636J635r88l005p92J594K750P73k466k730O72K789J535j242k191j108
$$ -2045 591 2226 1238 -1767 -2559 -965 1785 2558 92 -2638 -1966 823 2358 1116 -1075 -2183
2811b183J357K255J91j632j231r9J269R64p3j534j15M68N20J99L09m86n33l33
$$ -2183 -826 1429 1620 -12 -1243 -1342 -73 891 818 -716 -831 -363 157 356 665 179 -354 -687
2829f87L81Q63l7J8j348q8J010R80r09r18J33M32J142J40j790p30J034J604k68
$$ -687 -306 557 520 538 -810 -898 112 1092 183 -735 -602 -170 972 1112 -678 -1408 -374 1230 962
2848I62j200j019O62J703J074j981k137J57K629R14r65j953j288J783K361n8k239
$$ 962 -238 -1257 -595 1108 2182 201 -1936 -1779 850 1764 799 -1154 -2442 -659 1702 1644 -595
2865e95j191Q20J024J287m85k111m72J367P40K82j53j022q07M16R34R65l54q46
$$ -595 -1786 -966 58 1345 860 -1251 -1723 -356 384 666 513 -509 -1316 -900 34 999 645 -201
2883b01j301pJ825J600j478j548n03J063J441R61k108k104J136J990N44q07j835
$$ -201 -1502 -1509 316 1916 438 -1110 -1613 -550 891 1852 -256 -2360 -1224 766 1310 503 -1332
2900a332P9J238J419n36k117l65J566Q69j59r06j004P60J476J70j681l71N82P61
$$ -1332 -1253 -15 1404 868 -1249 -1614 -48 821 662 -244 -1248 -488 988 1158 -523 -894 -312 449
2918D49O55p59j301j31J233N60l40r2q31R8J8J337k97m08o05l23J96J452O26j438
$$ 449 1104 345 -956 -1087 146 706 366 274 -557 -459 -441 896 599 191 -414 -737 -541 911 1537 99
2938I9j314l69J375J656N58k012j956J258J996R31j352k104m70J906J937l18k381
$$ 99 -1215 -1584 -209 1447 2005 -7 -1963 -705 1291 2222 870 -1234 -1704 202 2139 1821 -560
2955e60p36P96J607Q18r79j669l95J708P64p89m83k68K29O87K58p02l07L19M03
$$ -560 -1296 -500 1107 1925 946 -723 -1118 590 1354 565 82 -186 43 730 988 286 -21 298 701
2974G01n54Q6M20l55j52N74n50L72j28o64l1N80O70m89m00m93R85O84J66j624
$$ 701 147 233 653 298 146 720 170 542 414 -250 -281 299 969 480 80 -413 572 1256 1422 -202
2994b02j140R49J912L41j225j608m57J745J911o88k200q25R12J711R05j097k097
$$ -202 -1342 -393 1519 1860 635 -973 -1430 315 2226 1538 -662 -1487 -575 1136 2041 944 -1153
3011a153n62K401Q56q16q62o61M23Q54P27q46r33J17k82P28P87O5j170l65K36
$$ -1153 -1715 686 1542 726 -136 -797 -374 480 1207 361 -572 -455 -737 -9 778 843 -327 -692 -456
3030d56R4P59P2j006q80J047P84mo98p37j47J002R10n85j482J18J030O51l69j008
$$ -456 -362 397 469 -537 -1417 -370 414 410 -288 -1025 -1172 -170 740 155 -1327 -1209 -179 472 103 -905
3050i05p30P07J825j13j775n62N06J307M03q42j548J13J723R92p23j383k06r4
$$ -905 -1635 -928 897 784 -991 -1553 -1047 260 663 -179 -1727 -1614 109 1101 378 -1005 -1211 -1305
3068a305J414Q87j347j145O93n6J006M75o98j007l15J134P59P7l00j524m46R97
$$ -1305 109 996 -351 -1496 -803 -859 147 622 -76 -1083 -1398 -264 495 572 272 -1252 -1698 -701
3086g01J575J35j696n27j08J220J608q21j771l54R38J505K47j578j019N6J913
$$ -701 874 1009 -687 -1214 -1322 -102 1506 685 -1086 -1440 -502 1003 1250 -328 -1347 -1291 622
3103F22O63p44j596L09L46J023J41j521N3Q59O06m20l04m11J2Q22L26o96o84K25
$$ 622 1285 541 -1055 -746 -400 623 764 -757 -704 155 761 341 37 -374 -362 460 786 90 -594 -369
3123c69N20j51Q80q29n22m6O63J90J81l90o46n75J243J131m95j194n43L9J169
$$ -369 151 0 880 51 -471 -517 146 336 517 127 -519 -1094 149 1280 785 -409 -952 -913 256
3142B56J236p58j789m64J798Q45J38j836r59J66J980R55j072j763k65J273J501
$$ 256 1492 734 -1055 -1519 279 1124 1262 -574 -1533 -1367 613 1568 496 -1267 -1532 -259 1242
3159A242P9j337j261M99J226j28N8n78r67L40J362j25n50l95L53q0L12J49o08
$$ 1242 1321 -16 -1277 -778 448 320 378 -200 -1167 -827 535 410 -140 -535 -182 -262 50 199 -409
3178d09j88K99K7K67M20m02n94K79P15j17k04q03J90O64J024n35j604K16Q95M40
$$ -409 -597 -298 -271 -4 416 14 -580 -301 414 297 93 -710 -520 144 1168 633 -971 -755 140 580
3198E80K19o88j351N05J420R42j134j150p7M95J188N93j240j574R55J009L98M0
$$ 580 799 111 -1240 -735 685 1627 493 -657 -734 -239 949 1542 302 -1272 -317 692 1090 1130
3216A130r58j176Q15J454k78m85m02n70J17J300K93q08r24R0N51J073m4j013q79
$$ 1130 172 -1004 -189 1265 987 502 100 -470 -353 947 1240 432 -492 -402 149 1222 1178 165 -714
3235g14L26R72J33k27p34m69R6J509K74j265n66J34R92L26k11j488j08R54J039
$$ -714 -388 584 717 490 -244 -713 -617 892 1166 -99 -665 -531 461 787 576 -912 -1020 -66 973
3254I73q69l60l15K0J370n6j092r80N93J073J06m8j236o30J019J253k76j160o
$$ 973 104 -256 -571 -551 819 763 -329 -1309 -716 357 463 415 -821 -1451 -432 821 545 -615 -621
3273f21j96M92J215j79j282o56M88N03Q46J98j251r31N34J411L15m96j187l27
$$ -621 -817 -325 890 711 -571 -1227 -739 -236 610 808 -443 -1374 -840 571 886 390 -797 -1124
3291a124K78J657N56j805n80n4J173J005j46j641n98J036J216m55l18q98j95J088
$$ -1124 -846 811 1367 -438 -1018 -1072 101 1106 960 -681 -1279 -243 973 518 200 -698 -893 195
3309A95Q20k82j172j33P44j64Q37o66q71L04Q33n2k80j10m58K79M86N29q96o43
$$ 195 1015 733 -439 -572 172 8 845 179 -692 -388 445 393 113 3 -455 -176 310 839 -57 -700
3329g00N96J5K11J31l35q72N80J054o5l45n21j025J048J165q9j314m37K96P36
$$ -700 -104 -89 122 253 -82 -954 -374 680 615 270 -251 -1276 -228 937 848 -466 -903 -607 129
3348A29J095m96j094r65J174J091L23j037j128J07J067J094l10j121n96L06N63
$$ 129 1224 728 -366 -1331 -157 934 1257 220 -908 -801 266 1360 1050 -71 -667 -361 202
3365B02Q92l70j133k88P47O94N7l19j056J33L88Q42k62o04l07j30R18L39k90p53
$$ 202 1094 724 -409 -697 50 744 801 482 -574 -441 -53 789 527 -77 -384 -514 404 743 453 -300
3385c00O4M47J77N7l65m54P3J039J30r37k31n1L25N51M71j638j86Q05R02m50n00
$$ -300 -236 211 388 445 80 -374 -301 738 868 -69 -300 -351 -26 525 996 -642 -828 -23 879 429 -71
3406g1m50n19Q33J362q97p29k59J25Q52Q31q02j388M10M25O03L29m12j524O16
$$ -71 -521 -1040 -207 1155 258 -471 -730 -605 247 1078 276 -1112 -702 -277 326 655 243 -1281 -665
3425f65R29M17j17r60k94K18Q15N64m24j290j93P79N96N00p40j199J02J146O72
$$ -665 264 681 564 -396 -690 -472 343 907 483 -807 -1000 -221 375 875 135 -1064 -962 184 856
3444H56l18m94m73p1Q52K45m97o02K04M78Q7L99q92k4K77O80j18p07l63J1Q19
$$ 856 538 44 -429 -500 352 597 100 -502 -298 180 267 666 -226 -250 27 707 589 -118 -481 -470 349
3465C49K99k04q89k43P80M91k11k24r17o7R95P67n69p95m03L43J078K49m92j179
$$ 349 648 444 -445 -688 92 583 372 148 -769 -836 159 926 357 -438 -841 -498 580 829 337 -842
3485h42J90P51O37J04p82r55K4J319N95p05o08m94K7J216Q38r72j161k48P66R56
$$ -842 -652 99 736 840 58 -897 -873 446 1041 336 -272 -766 -739 477 1315 343 -818 -1066 -300 656
3505F56j4p72p44M18R11P7m06n18l53L24O84O08j006p60N47J01M46J57n37o02
$$ 656 642 -130 -874 -456 455 532 126 -392 -745 -421 263 871 -135 -895 -348 -247 199 356 -181 -783
3525g83L59N95k7l83l94L4Q42L54m52r72PN18L38N40n90p06J10Q28M19l37p81
$$ -783 -424 171 144 -239 -633 -599 243 597 145 -827 -820 -302 36 576 -14 -720 -610 218 637 300 -481
3546d81k41L46Q93O69r98r40l5Q76M42J15q26p04L79Q13M72o07n31n08N91Q25
$$ -481 -722 -376 517 1186 188 -752 -787 89 531 646 -180 -884 -505 308 780 173 -358 -866 -275 550
3566E50K79p66o07M8J012L81j69j024l31mJ024Nr6m13n15L15J043j35n19l44k9
$$ 550 829 63 -544 -496 516 897 728 -296 -627 -631 393 398 302 -111 -626 -311 732 597 78 -266 -295
3587b95M81L35K06o61o97P27L99j41J12o41j84O30O52q55p36N09L31L60j17k60
$$ -295 186 521 727 66 -631 96 495 354 466 -175 -359 271 923 68 -668 -159 172 532 415 155
3607A55o25K89P05K06m44n60j55J67J072J24q49o78L35N89O23k55n04q40N56R93
$$ 155 -470 -181 524 730 286 -274 -429 -262 810 934 85 -593 -258 331 954 699 195 -645 -89 904
3627I04m7m04q17n21R95Q99o2n05p74Q3L98Q38M0p79r16O01O76L15j91q35o24
$$ 904 857 453 -364 -885 110 1009 947 442 -332 -249 149 987 1027 248 -668 -67 609 924 733 -102 -726
3648g26Q60N20k32l61k35K00L10L18M2j056L37M12K6M9l03k67p00J150L04n24
$$ -726 134 654 422 61 -174 26 336 654 696 -360 -23 389 415 464 161 -106 -806 344 648 124
3668A24n18K41K25M12L40p88o16J92O94r2k77n13k80N32O62J70r87j03K71L47
$$ 124 -394 -153 72 484 824 36 -580 -388 306 214 -63 -576 -856 -324 338 508 -479 -582 -311 36
3688C6P63l58j118n62R41P61n3k61q39l83J108Q53m49r83m93M71K65O74jj199
$$ 36 799 441 -677 -1239 -298 463 410 149 -690 -1073 35 888 439 -544 -1037 -566 -301 373 372 -827
3708h27k22L94Q53p7K47r86J9N22P88n59m53k73J01M63L54m58n23j08Q06J09M
$$ -827 -1049 -655 198 121 368 -618 -599 -77 711 152 -301 -574 -473 -10 344 -114 -637 -745 61 170 174
3729A74j85o49M94N23J69o21k77l31O48L83k54j21o19M59O04k37l83rl42M59R58
$$ 174 -11 -660 -166 357 526 -95 -372 -703 -55 328 74 -47 -666 -207 397 160 -223 -232 -574 -115 843
3750H43m46p05o34Q61M9O41k12j240J44N93N45L30r50o65kP04P69m07n87l63m5
$$ 843 397 -308 -942 -81 -32 609 397 -843 -699 -106 439 769 -181 -846 -848 -144 625 218 -369 -732 -777
3771g77O63J045q33q03k73N44O99L90o24r24N4P80K54l02m02o6k07Q63M72r74
$$ -777 -114 931 98 -705 -978 -434 265 655 31 -893 -839 -59 195 -107 -509 -575 -782 81 553 -421
3791d21M1k12J76N48K17n60p75O64P48k13n20j45j96q5P90R7m03l36L98N16l8
$$ -421 -380 -592 -416 132 349 -211 -986 -322 426 213 -307 -452 -648 -733 57 154 -249 -585 -187 329 291
3812B91j85o33k68Q19K5J18m21o0j03N93M55n03r76J44P68O69j30o72m03r9Q78
$$ 291 106 -527 -795 24 49 167 -254 -314 -417 176 631 128 -848 -704 64 733 603 -69 -472 -571 307
3833C07K14j33q19r6L89Q02Q20j318l27j47K83P60R6n28p66j76J046L78m5n29
$$ 307 521 388 -431 -527 -138 664 1484 166 -161 -308 -25 735 831 303 -463 -639 407 785 740 211
3853B11n29L0P50O99j161J33k45L43K6N50r16m89N52O26k26l97j89LK70Q04j89
$$ 211 -318 -288 462 1161 0 133 -112 231 257 807 -109 -598 -46 580 354 -43 -232 -229 41 845 656
3874F56n93m40N47K44j32N2p49m6R24r4J48n05j94J37N70J38j62r83K61J99O74
$$ 656 63 -377 170 414 282 334 -415 -461 463 369 517 12 -182 -45 525 663 501 -482 -221 -22 652
3895F52j31o01n00N9P47P37r39o3l35j14J168J57n94p43J52N23L64K7o20o76O88
$$ 652 521 -80 -580 -521 226 963 24 -39 -374 -488 680 837 243 -500 -348 175 539 566 -54 -730 -42
3916d2L72Jj02n54q2K66J59N99o80n04K51K74L34L39p95n98Q43k38O20k90l59
$$ -42 330 331 229 -325 -407 -141 18 617 -63 -567 -316 -42 292 631 -164 -762 81 -157 463 173 -186
3937a86l0J37N69j42q18K27L8L54K88o28j72J01N61k2j82p34J80J53Q15M91j205
$$ -186 -216 -79 490 348 -470 -243 -205 149 437 -191 -363 -262 299 277 95 -639 -459 -306 509 1000 -205
3958b05l42K04M30L51K92n48r48K24Q73m1O2o81k63K68P50K00j040j59O2O26J35
$$ -205 -547 -343 87 438 730 182 -766 -542 331 290 352 -329 -592 -324 426 626 -414 -573 -511 115 250
3979B50Q5o54j58N21J15L30k00p78j43L39P88M3q76R5n2J64N37P9p78k42L00M98
$$ 250 335 -319 -477 44 159 489 289 -489 -632 -293 495 538 -338 -243 -295 -131 406 485 -293 -535 -235 263
4001B63k03Q4r3l00L74L46j35r08%L33L62J89j26p42L60J17N3M9j12l45M84J43
$$ 263 60 144 51 -249 125 471 336 -572 -572 -239 123 312 186 -556 -196 -79 -26 23 -89 -434 50 193
4023A93K94m94k92J1P6M53O7p90j3M92L77K14k14p16j78M19Q12J79j049o9n6L33
$$ 193 487 -7 -299 -288 -212 241 308 -482 -495 -3 374 588 374 -342 -520 -101 711 890 -159 -228 -284 49
4045D9P06j14j135j63M07O05Q9m43o8k13L67O19o02J15n75k03M96O73j57r77J7
$$ 49 755 641 -494 -657 -250 355 444 1 -67 -280 87 706 104 219 -356 -559 -63 610 453 -524 -507
4066e07O95k26N40m71m14j61M91N38k52l05l7K38K01K44p23l41N21j8K82k20j14
$$ -507 188 -38 502 31 -383 -544 -53 485 233 -72 -109 129 330 574 -149 -490 31 13 295 75 -39
4087c9n13L07P72j43l85l70L92m6P38k75o53l50N12L64J90r8m01m55P51J08J0
$$ -39 -552 -245 527 384 -1 -371 21 -25 713 438 -215 -565 -53 311 501 403 2 -453 298 406 416
4108D16j69n68n1J27J017m80o50p2M60K38R1k84m70J02K86M83k05j5q49O4O95
$$ 416 247 -321 -372 -245 772 292 -358 -430 30 268 359 75 -395 -293 -7 476 271 256 -593 -529 166
4129A66O51n89o91K38l72Q40J03n5o81K42K24Nj00J5k87o5N98N1n71k09L07K13
$$ 166 817 228 -463 -225 -597 243 346 291 -390 -148 76 81 -19 -4 -291 -356 242 293 -278 -487 -180 33
4151C3K52l21n06nM71O38o32j09n04L20M02K40l71l95j75N14M74r6j50m91m2M65
$$ 33 285 -36 -542 -547 -76 562 -70 -179 -683 -363 39 279 -92 -487 -662 -148 326 230 80 -411 -453 12
4173A2L06J06n74m19J86N50L25p05k50p4L17L39M05m57p47J29P59L16k47k63n86
$$ 12 318 424 -150 -569 -383 167 492 -213 -463 -537 -220 119 524 67 -680 -551 208 524 277 14 -572
4194e72J78Q07M5j68n82l26N61O52k77m20m09J35P48j59k61J91n81J29R04j59
$$ -572 -394 413 458 290 -292 -618 -57 595 318 -102 -511 -376 372 213 -48 143 -438 -309 595 436
4214D36k25n28J59K50K35j72l06K7M24N4j95n5l34j67O70K2j58m09K52q7M35M9
$$ 436 211 -317 -158 92 327 155 -151 -124 300 354 159 104 -230 -397 273 295 137 -272 -20 -107 328 377
4236C77l66m63K38M59R7J75r05N1r2P63M68p16o46M67L43L00j21m07m26M39L92
$$ 377 11 -452 -214 245 342 517 -388 -337 -429 334 802 86 -560 -93 250 550 429 22 -404 35 427
4257D27J58k7n54l57K99O70j55k14m55L53J6N6K75k76m99M37p5K63P5o26J52J85
$$ 427 585 558 4 -353 -54 616 461 247 -208 145 161 217 492 216 -283 154 79 342 417 -209 -57 128
4279A28K74j2n88L32k79J58M02j04m46P1N67j62O8k42l92PO43N9m12L2O9K82k67
$$ 128 402 390 -198 134 -145 13 415 311 -135 -64 503 341 409 167 -225 -218 425 484 72 104 173 455 188
4302A88M34l53o45M02N58k3k69l87k95J57O27L92r48rR7K32L08K08q46o1jM76
$$ 188 622 269 -376 26 584 561 292 -95 -390 -233 394 786 -162 -171 -74 158 466 674 -172 -233 -234 242
4324B42K47k14l05m28K27L81L64o05j89m5k3O90r3l96l56L44J54M75l52n13J18
$$ 242 489 275 -30 -458 -231 150 514 -91 -280 -325 -348 342 249 -147 -503 -159 -5 470 118 -395 -277
4345b77J7M06p0m45J34J93n0L81k13l28J52j23J25J67km97m1L27O61q62l9M0J2
$$ -277 -260 146 76 -369 -235 -42 -92 289 76 -252 -100 -223 -98 69 67 -430 -471 -144 517 -345 -384 -344 -332
4368c32L85R7m37j94K62L16L23l93k31m58N58O04l15m83qk10M66L70k07n97l04
$$ -332 53 150 -287 -481 -219 97 420 27 -204 -662 -104 500 185 -298 -306 -516 -50 320 113 -484 -788
4389g88M85K13K43Qm92j68L63J85m6k25k93n6N84L84l82n64K20R1J16N44k81o12
$$ -788 -303 -90 153 161 -331 -499 -136 49 3 -222 -515 -571 13 397 15 -549 -329 -238 -122 422 141 -471
4411d71K34l3M37O4j00k94n5M9O23q02k27J23N55M6J45n79k21N1L52Q7l37l6j82
$$ -471 -237 -270 167 231 131 -163 -218 -169 454 -348 -575 -452 103 149 294 -285 -506 -455 -103 -16 -353 -389 -571
4434e71N00K29p3m46l54J58M35K31J73r40k59Q31K57L1n98P8q3L16L16l25l96
$$ -571 -71 158 85 -361 -715 -557 -122 109 282 -658 -917 -86 171 202 -396 -318 -401 -85 231 -94 -490
4455d90OL02L38m0Q8q10l9R85j15j38l8k37k39O00L12k71o50J44L16J27K76k99
$$ -490 -484 -182 156 116 204 -606 -645 340 225 87 49 -188 -427 173 485 214 -436 -292 24 151 427 128
4477A28m55j17O19k23o3L45m05K8M70J46n56J24j30J59N9jj15m75P13K14k31m09
$$ 128 -327 -444 175 -48 -111 234 -171 -143 327 473 -83 41 -89 70 129 128 13 -462 251 465 234 -175
4499a75J12R2J87l0Q3p02J53J74L13K2n5m19M2L91M00n56L7l90j3O63M9o2l17
$$ -175 -63 29 216 186 269 -433 -280 -106 207 229 174 -245 -203 188 588 32 69 -321 -334 329 378 316 -1
4522aj61R0L41K09o10l44K82M25N1P0j95k93J3L51M57o36K0n6k21N86M63n89n80
$$ -1 -162 -72 269 478 -132 -476 -194 231 282 352 157 -136 -123 228 685 49 69 13 -208 378 841 252 -328
4545c28L15M21k09M15o54j81L2L69J32k25k88L51j1J55j9m26L57k18o1L78k34
$$ -328 -13 408 199 614 -40 -221 -189 180 312 87 -201 150 139 294 275 -151 206 -12 -73 305 71
4566G1j78j28N63K28m44k87J15J52L43o6j29o10K26L04J96j2j35m70j27O12J63
$$ 71 -107 -235 328 556 112 -175 -60 92 435 369 240 -370 -144 160 356 344 209 -261 -388 224 387
4587C87m27j63k44L12M04J28k50o74O0N62j48R2J07m65r1O61J41m55J9n3j42O27
$$ 387 -40 -203 -447 -135 269 397 147 -527 -467 95 -53 39 146 -319 -410 251 392 -63 -44 -97 -239 388
4609C88k3l27q06P89L00N5n4m25m54P73P7j90J44k25j06l3J34K75n90J25N22m06
$$ 388 365 38 -768 21 321 376 322 -103 -557 216 293 103 247 22 -84 -117 17 292 -298 -173 349 -57
4631e7K02l48J41j85L29L5j57n9Q4j27O1O71l56n52o4M93l0K50m24j91MM51K37
$$ -57 145 -203 -62 -247 82 117 -40 -99 -15 -142 -81 590 234 -318 -382 111 81 331 -93 -284 -280 171 408
4654D08k92j34k30k9M80j14o65L79J26K52K38k87m00l81N79N09m22J44l05j37
$$ 408 116 -18 -248 -277 203 89 -576 -197 -71 181 419 132 -268 -649 -70 439 17 161 -144 -281
4674b81k78P65J38o72l14M33L71J33l63j90j21J5Q53j87n7l02j85N5M00l60L9
$$ -281 -559 206 344 -328 -642 -209 162 295 -68 -258 -379 -364 489 302 245 -57 -242 -187 213 -147 -108
4695a08j56K05K08m6l00l7L16L70k11j79n7j91k1L69K85p89P0J06N44l98O08n05
$$ -108 -264 -59 149 103 -197 -234 82 452 241 62 5 -186 -207 162 447 -342 -272 -166 378 -20 588 83
4717H3m38K98J52K67m01m26L01M56L30k96n27L02j96J0M30K28q74j47L34M65J43
$$ 83 -355 -57 95 362 -39 -465 -164 292 622 326 -201 101 -95 -85 345 573 -301 -448 -114 351 494
4738D94q69P7K9M07L94n39J4l17L21j56N77j97q43M54K94J31l12p1o0kJ56M76
$$ 494 -375 -298 -269 138 532 -7 7 -310 11 -145 432 235 -608 -154 140 271 -41 -112 -172 -174 -18 458
4760D58m36j31jM15n9k1J11o32m1O53Ll55L30m63P8L12J20j75Q3m64J57R4L89
$$ 458 22 -109 -110 305 246 225 336 -296 -337 316 319 -36 294 -169 -91 221 341 166 249 -215 -58 36 425
4783D25m52k79L36J69J21j19k02J12J32L84p5q68K58L5K23L64k04n38J9K76K69
$$ 425 -27 -306 30 199 320 201 -1 111 243 627 552 -316 -58 -23 200 564 360 -178 -159 117 386
4804C86j13J0k16n09L71Q4P8O8k76K76J77M4k24l85l28N70K42q2L5o52L76p9J75
$$ 386 273 283 67 -442 -71 13 91 159 -117 159 336 380 156 -229 -557 13 255 173 208 -444 -68 -147 28
4827B8K09q71L51L25J06J27k65l76M99J1m0r9j71k12K96L46k25p7n47M86o9P04
$$ 28 237 -634 -283 42 148 275 10 -366 133 144 104 5 -166 -378 -82 264 39 -38 -585 -99 -168 536
4849E36l50m56j41M17L72n89M4j50J7L93J42M5l56n98L03P77m14N11j226L62N63
$$ 536 186 -270 -411 6 378 -211 -167 -317 -300 93 235 280 -76 -674 -371 406 -8 503 -723 -361 202
4870B02m6o5j82j3R4K4K32j64k43k4O3J16J6L96p00l5L56L71O5j49o07K62J81
$$ 202 156 91 -91 -104 -10 14 246 82 -161 -185 -122 -6 10 406 -294 -329 27 398 463 314 -293 -31 150
4893A50M6k43r8K01K34l86K11k64P5L77k4K19k83j72l50N47k2j21l06L43j96j13
$$ 150 196 -47 -145 56 290 -96 115 -149 -74 303 279 498 215 43 -307 240 218 97 -209 134 -62 -175
4915a75L59o7k33r4L38j14J41Q0n01J18O66M0m15k23K02l02L53L54l06m68M67
$$ -175 184 117 -116 -210 128 14 155 235 -266 -148 518 558 143 -80 122 -180 173 527 221 -247 220
4936B20J28j78K43j78o45K25M68Q1j00q6j17l26P73j20l23l70Q3O20l43R5n38
$$ 220 348 170 413 235 -410 -185 283 364 264 178 61 -265 508 388 65 -305 -222 398 55 150 -388
4957c88J07J97P91m06j63k18K0K74P0l04j2J19j12L8q4L17j69o12M52O64l68j81
$$ -388 -281 -84 707 301 138 -80 -60 214 284 -20 -32 87 -25 13 -71 246 77 -535 -83 581 213 32
4979C2j34j47M89q1O2m31r3K0O95J47o49j95J06M43J65k36l03k7K6M63J73o03
$$ 32 -102 -249 240 159 221 -210 -303 -283 412 559 -90 -285 -179 264 429 193 -110 -137 -111 352 525 -78
5001g8l39L26M07J9n02k52l8N10L20q2o03K58j68K09K05j53l17k12M32j27K3M08
$$ -78 -417 -91 316 335 -167 -419 -457 53 373 291 -312 -54 -222 -13 192 39 -278 -490 -58 -185 -162 246
$$ [...]
8191F6
##END NTUPLES=NMR FID
##END=
