##TITLE=1H_CG-1104-01
 DMSO, 8 sc, 
 28.5.2019
##JCAMPDX= 6.0         $$ Bruker NMR JCAMP-DX V2.0
##DATA TYPE= NMR FID
##DATA CLASS= NTUPLES
##ORIGIN= UXNMR, Bruker Analytische Messtechnik GmbH
##OWNER= root
$$ XWIN-NMR		Version 3.5
$$ Tue May 28 15:45:48 2019 Russian Standard Time (UT+4h)  she@DPX200
##.OBSERVE FREQUENCY= 200.1315
##.OBSERVE NUCLEUS= ^1H
##.DELAY= (6, 6)
##.ACQUISITION MODE= SIMULTANEOUS
##.ACQUISITION SCHEME= undefined
##.AVERAGES= 8
##.DIGITISER RES= 18
##SPECTROMETER/DATA SYSTEM= spect
##.PULSE SEQUENCE= zg30
##.SOLVENT NAME= DMSO
##.SHIFT REFERENCE= (INTERNAL, DMSO, 0, 15.7039)
##AUDIT TRAIL= $$ (NUMBER, WHEN, WHO, WHERE, WHAT)
$$ ##TITLE= Audit trail, XWIN-NMR		Version 3.5
$$ ##JCAMPDX= 5.01
$$ ##ORIGIN= Bruker BioSpin GmbH
$$ ##OWNER= she
$$ F:/spectra/data/she/nmr/H-F/1/audita.txt
$$ ##AUDIT TRAIL=  $$ (NUMBER, WHEN, WHO, WHERE, WHAT)
(   1,<2019-05-28 15:44:57.07 +0400>,<she>,<DPX200>,
      <created by zg, POWCHK disabled, PULCHK disabled
       configuration hash MD5:
       00 E9 B6 7A A2 85 ED C7 34 08 36 98 17 FE 4E 26
       data hash MD5: 16K
       19 AF 36 5F 83 79 81 34 EF E3 AA E6 4F BA C8 70>)
$$ ##END=
$$ 
$$ hash MD5
$$ D5 E3 3F EB D5 6F 71 83 1F BF A8 2F 42 46 4F 95
##$RELAX= 
##$RELAX= 
##$RELAX= 
##$RELAX= 
##$RELAX= 
##$RELAX= 
$$ Bruker specific parameters
$$ --------------------------
##$DU= <F:/spectra>
##$EXPNO= 1
##$NAME= <H-F>
##$PROCNO= 1
##$TYPE= <nmr>
##$USER= <she>
##$AMP= (0..31)
100 100 100 100 100 100 100 100 100 100 100 100 100 100 100 100 100 100 
100 100 100 100 100 100 100 100 100 100 100 100 100 100 
##$AQSEQ= 0
##$AQ_mod= 1
##$AUNM= <au_zg>
##$AUTOPOS= <>
##$BF1= 200.13
##$BF2= 200.13
##$BF3= 200.13
##$BF4= 200.13
##$BF5= 200.13
##$BF6= 200.13
##$BF7= 200.13
##$BF8= 200.13
##$BYTORDA= 1
##$CFDGTYP= 0
##$CFRGTYP= 5
##$CHEMSTR= <none>
##$CNST= (0..31)
1 1 145 1 1 1 1 1 1 1 1 1 1 1 1 1 1 1 1 1 1 1 1 1 1 1 1 1 1 1 1 1 
##$CPDPRG= <>
##$CPDPRG1= <>
##$CPDPRG2= <>
##$CPDPRG3= <>
##$CPDPRG4= <mlev>
##$CPDPRG5= <mlev>
##$CPDPRG6= <mlev>
##$CPDPRG7= <mlev>
##$CPDPRG8= <mlev>
##$CPDPRGB= <>
##$CPDPRGT= <>
##$D= (0..31)
0 1.2 0 0 0 0 0 0 0 0 0 0.03 0 0 0 0 0 0 0 0 0 0 0 0 0 0 0 0 0 0 0 0 
##$DATE= 1559043896
##$DBL= (0..7)
120 120 120 120 120 120 120 120 
##$DBP= (0..7)
150 150 150 150 150 150 150 150 
##$DBP07= 0
##$DBPNAM0= <>
##$DBPNAM1= <>
##$DBPNAM2= <>
##$DBPNAM3= <>
##$DBPNAM4= <>
##$DBPNAM5= <>
##$DBPNAM6= <>
##$DBPNAM7= <>
##$DBPOAL= (0..7)
0.5 0.5 0.5 0.5 0.5 0.5 0.5 0.5 
##$DBPOFFS= (0..7)
0 0 0 0 0 0 0 0 
##$DE= 6
##$DECBNUC= <off>
##$DECIM= 24
##$DECNUC= <off>
##$DECSTAT= 4
##$DIGMOD= 1
##$DIGTYP= 9
##$DL= (0..7)
0 120 120 120 120 120 120 120 
##$DP= (0..7)
150 150 150 150 150 150 150 150 
##$DP07= 0
##$DPNAME0= <>
##$DPNAME1= <>
##$DPNAME2= <>
##$DPNAME3= <>
##$DPNAME4= <>
##$DPNAME5= <>
##$DPNAME6= <>
##$DPNAME7= <>
##$DPOAL= (0..7)
0.5 0.5 0.5 0.5 0.5 0.5 0.5 0.5 
##$DPOFFS= (0..7)
0 0 0 0 0 0 0 0 
##$DQDMODE= 0
##$DR= 18
##$DS= 0
##$DSLIST= <SSSSSSSSSSSSSSS>
##$DSPFIRM= 0
$$ [...]
##$SUBNAM2= <"">
##$SUBNAM3= <"">
##$SUBNAM4= <"">
##$SUBNAM5= <"">
##$SUBNAM6= <"">
##$SUBNAM7= <"">
##$SUBNAM8= <"">
##$SUBNAM9= <"">
##$SW= 24.9337058887773
##$SWIBOX= (0..15)
0 0 2 0 0 0 0 0 0 0 0 0 0 0 0 0 
##$SW_h= 4990.01996007984
##$TD= 16384
##$TD0= 1
##$TE= 0
##$TE2= 300
##$TE3= 300
##$TEG= 300
##$TL= (0..7)
0 120 120 120 120 120 120 120 
##$TP= (0..7)
150 150 150 150 150 150 150 150 
##$TP07= 0
##$TPNAME0= <>
##$TPNAME1= <>
##$TPNAME2= <>
##$TPNAME3= <>
##$TPNAME4= <>
##$TPNAME5= <>
##$TPNAME6= <>
##$TPNAME7= <>
##$TPOAL= (0..7)
0.5 0.5 0.5 0.5 0.5 0.5 0.5 0.5 
##$TPOFFS= (0..7)
0 0 0 0 0 0 0 0 
##$TUNHIN= 0
##$TUNHOUT= 0
##$TUNXOUT= 0
##$USERA1= <user>
##$USERA2= <user>
##$USERA3= <user>
##$USERA4= <user>
##$USERA5= <user>
##$V9= 5
##$VALIST= <valist>
##$VCLIST= <CCCCCCCCCCCCCCC>
##$VD= 0
##$VDLIST= <DDDDDDDDDDDDDDD>
##$VPLIST= <PPPPPPPPPPPPPPP>
##$VTLIST= <TTTTTTTTTTTTTTT>
##$WBST= 1024
##$WBSW= 4
##$XGAIN= (0..3)
0 0 0 0 
##$XL= 0
##$YL= 0
##$YMAX_a= 366151
##$YMIN_a= -609823
##$ZGOPTNS= <>
##$ZL1= 120
##$ZL2= 120
##$ZL3= 120
##$ZL4= 120
##$ABSF1= 10
##$ABSF2= 0
##$ABSG= 5
##$ABSL= 3
##$ALPHA= 0
##$AQORDER= 0
##$ASSFAC= 0
##$ASSFACI= 0
##$ASSFACX= 0
##$ASSWID= 0
##$AUNMP= <proc_1d>
##$AZFE= 0.1
##$AZFW= 0.1
##$BCFW= 1
##$BC_mod= 2
##$BYTORDP= 1
##$COROFFS= 0
##$CY= 11.3945322036743
##$DATMOD= 1
##$DC= 2
##$DFILT= <>
##$DTYPP= 0
##$F1P= 18.9103706918063
##$F2P= -1.10871071338519
##$FCOR= 0.5
##$FTSIZE= 0
##$FT_mod= 4
##$GAMMA= 1
##$GB= 0.15
##$INTBC= 1
##$INTSCL= 1
##$ISEN= 128
##$LB= 0.24
##$LEV0= 0
##$LPBIN= 0
##$MAXI= 10000
##$MC2= 0
##$MEAN= 0
##$ME_mod= 0
##$MI= 1.114404
##$NCOEF= 0
##$NC_proc= 0
##$NLEV= 6
##$NOISF1= 3.799351
##$NOISF2= 2.8
##$NSP= 1
##$NTH_PI= 0
##$NZP= 0
##$OFFSET= 15.70392
##$PC= 1
##$PHC0= -8862.956
##$PHC1= 19.40025
##$PH_mod= 1
##$PKNL= yes
##$PPARMOD= 0
##$PSCAL= 0
##$PSIGN= 0
##$REVERSE= no
##$SF= 200.130013532006
##$SI= 16384
##$SIGF1= 3
##$SIGF2= 2
##$SINO= 400
##$SIOLD= 16384
##$SREGLST= <1H.CDCl3>
##$SSB= 0
##$STSI= 0
##$STSR= 0
##$SW_p= 3612.71676300578
##$SYMM= 0
##$S_DEV= 0
##$TDeff= 0
##$TDoff= 0
##$TI= <>
##$TILT= no
##$TM1= 0
##$TM2= 0
##$TOPLEV= 0
##$USERP1= <user>
##$USERP2= <user>
##$USERP3= <user>
##$USERP4= <user>
##$USERP5= <user>
##$WDW= 1
##$XDIM= 8192
##$YMAX_p= 0
##$YMIN_p= 0
$$ End of Bruker specific parameters
$$ ---------------------------------
##NTUPLES= NMR FID
##VAR_NAME=  TIME,          FID/REAL,        FID/IMAG
##SYMBOL=    X,             R,               I
##VAR_TYPE=  INDEPENDENT,   DEPENDENT,       DEPENDENT
##VAR_FORM=  AFFN,          ASDF,            ASDF
##VAR_DIM=   8192,          8192,            8192
##UNITS=     SECONDS,       ARBITRARY UNITS, ARBITRARY UNITS
##FACTOR=    0.0002004,     1,               1
##FIRST=     0,             0,               0
##LAST=      1.6414764,     0,               0
##MIN=       0,             -609823,         0
##MAX=       1.6414764,     366151,          0
$$ Real data points
##PAGE= N=1
##DATA TABLE= (X++(R..R)), XYDATA
0@%%%qJ6j6J6k4L2m0N6p2Q8j05J29j58J90k29K70l16L73m38N09n87O78p80Q90
27D74j012J150j305J473j656J859k083K326k594K890l212L566l953M379m855N377
43B824n947O587p306Q106r015J0060j1261J2663j4332J6354j8867K2088k6382
56a4428L2443m1715N7831r3761L12526j01928n35384L36363L10110o8164k15302
67b1409Q6119k249j10773R6007L18456p8264m09044r7515L51396J12795k55836
78a0317q1436K40797J9144k37957P677K57411o9824l31668K9572L85089N4348
89B62836l44587j29441K32144R5437j37386j103J04044j48070j93512K28625L71460
100C40447j46888m79333n4213L91284J71163j92673j12207N4712n2601n4252K01898
$$ y = [0, 0, 0, 0, -8, 8, -8, 8, -16, 16, -24, 32, -40, 48, -57, 72, -86, 104, -125, 145, -171, 202, -236, 273, -314, 364, -416, 474, -538, 612, -693, 780, -876, 983, -1100, 1226, -1368, 1522, -1690, 1876, -2077, 2302, -2553, 2824, -3123, 3464, -3842, 4264, -4751, 5309, -5952, 6711, -7621, 8733, -10134, 11954, -14428, 18015, -23700, 34131, -59630, 252896, 150968, -384416, -48053, 262057, 193893, -21409, 64710, 62461, -48312, 47695, 366151, 287887, -121157, -218672, 132724, 245519, -10317, -91753, 149044, 168188, -69769, -62092, 195319, 125495, -206173, -176601, 208488, 262836, -81751, -211192, 20952, 116389, -20997, -22100, 81944, -66126, -259638, -31013, 340447, 193559, -285774, -339987, 51297, 222460, 29787, -82420, -27708, -80309, -134561, 67337]
111F7337J70050k43756l05968J64614L55435n0757k89708K0175K12488o3161j92306
122a55557J04638K07086j14617k16065J18649K31998j00464k35489N8759J95149
132I4087l8021j23728P1105O6046j51687n8722K50812J34152k98068k65724K20925
143i8823L33986p0828k58580j3838J10301l5575j7882J52983L7400k35328j25002
154b21186K25859J94663j46885j81379Q6400J12019r2975n9551J41275N8249j71504
165e5015p5445J77986Q9246j71978r8482J61933J05757j37090r5209J10904N9343
176G1950j10015j5791J49675K931k08207m8198K26682J20265j74632j53857P7272
187f1925R6632k6967O578O3636p0506j55602M5659K08949K2110j91650o7506J30756
$$ y = [67337, 237387, -6369, -312337, -147723, 207712, 156955, -132753, -112578, 99910, 36749, -155557, -50919, 156167, 41550, -174515, -55866, 176132, 75668, -159821, -101062, 94087, 56066, -67662, 3443, 69489, -82198, -140920, 109892, 244044, -54024, -319748, -98823, 235163, 164335, -94245, -108083, 2218, -33357, -51239, 101744, 139144, -96184, -221186, 4673, 199336, 52451, -128928, -42528, 69491, -23484, -83035, 58240, 116489, -55015, -130460, 47526, 136772, -35206, -133688, 28245, 134002, -3088, -98297, 12607, 71950, -38065, -53856, 95819, 98750, -109457, -157655, 69027, 189292, 14660, -139197, -61925, 34707, 7740, 14318, 77954, 7448, -148154, -102495, 106454, 128564, -63086, -130592, 164]
199A64M6395r6999N989J18974l0314j62235M842J72247L0633j45741l6076J18922
211B6801K6803j02557j6397R1935J0994o9997J6122N9544n6425p9517R0114J35980
223A33400o8244j71060J3018J53868K7119r4009p613N9570l9157p5583O3056J15373
235A09738l3487j21042o830P9152N547l6788L7623L9078p6799p8102P0421J05274
247I3785l6779r6148J1625O0737k4215m4415M5983N1683n0309o2900L5182M8820
259C3049l6474l0883N9635L4069q5554o8362P8809R9950l8759r6312k685N6033
271B516P363j6777J7344P350l5726j4169L4594J0697l3185J0477N7231j5415r6067
284f3767j7353J11703P1566p5906r4423K0298O9089J0115k2396K308M43k5689
$$ y = [164, 46559, -50440, -44451, 74523, 44209, -118026, -113184, 59063, 89696, -56045, -92121, 26801, 53604, -48953, -65350, 26585, 37579, -32418, -16296, 43248, -13177, -92694, -2580, 133400, 65156, -105904, -92886, 60982, 88101, -5908, -13521, 46049, 6892, -68691, -5635, 109738, 76251, -44791, -51621, 27531, 33078, -3710, 33913, 72991, -3808, -81910, -11489, 93785, 57006, -39142, -27517, 33220, 9005, -35410, 10573, 62256, 11947, -50953, -15771, 33049, -3425, -34308, 25327, 59396, -26158, -94520, -15711, 84239, 45480, -50832, -53517, 2516, 9879, -6898, 10446, 17796, -17930, -32099, 2495, 13192, -19993, -9516, 47715, 32300, -63767, -81120, 30583, 102149, 26243, -68180, -47882, 21207, 31322, 8926, 11234, 11677, -14012]
296a4012q892K7332J7112p560L692O555l5561m2116L6400Q2685L662q7090m7726
309f5519M9187N6826n934k9128q638l985p182J2195K1006o408j8655R047J8109
322B0921k2979l7380J9654O1507J1112o0317m8321K3668N3563K2573k0184l7911
334a4094k3545J5251L8812J4421k6723k1823J4858J3851k1819j7823L2891M3834
346D8091k1876o8481j8396N9243N7587j5295o0491l1178K7391M6068R676l2327
358A2k7484J3378K7465n973l0838o49M1521K3285l8296n3762M125N8291L7192
371D8267k4283n0857k0836K3974L7473J4519j7584k6966j0856Q285J3331R003
383C470M770l16j1847j9777o771J8992K9057N931k6313l0534l449K8526L0059
$$ y = [-14012, -22904, 4428, 21540, 13980, 17672, 24227, -11334, -53450, -17050, 65635, 69297, -17793, -65519, -16332, 40494, 34560, 5432, -3206, -7191, -14373, -2178, 18828, 12420, -6235, 2812, 20921, -2058, -39438, -19784, 41723, 52835, -7482, -55803, -32135, 21428, 44001, 23817, -14094, -37639, -22388, 16424, 30845, 4122, -17701, -2843, 11008, -10811, -28634, 4257, 48091, 26215, -42266, -60662, -1419, 56168, 40873, -19618, -50796, -23405, 22663, 32339, 12, -27472, -14094, 13371, 7398, -23440, -24089, 17432, 40717, 2421, -51341, -47216, 11075, 48267, 23984, -26873, -47709, -23735, 13738, 28257, 10673, -16293, -27149, -18864, -5533, 3470, 8240, 7924, -3923, -23700, -30471, -11479, 17578, 23509, -2804, -33338, -36787, -8261, 21798]
396B1798j413k9377k0819J0563K1587J539j4286j813J8128O930k5558k7663J6259
409b4125M9578J8522m1633n4100j03N5810M5823j7186n5244k4887K8263L7909
421A8627L755k0482j0981L961j223q807O842K5949J2322k6640l4113J779L4530
434E519K4667j1077k8678j3348J3559J9178J647j1702k862Q345m7j7765j0909
447b3473J9771K9844j028l4812k4795J1550K8690J7708l922k3758k7561k728L1934
460b580L1519o394l3569j7000R804J4167O286N223K292j3768j8801J575J9751
473a495J3705n36p327j4887j6181Q526L2262J3499k5168k2608J2204J7431j1701
486b276j1278K2700K2851k4783m0961N351M5065K1268j9194k8690j2604N627K4527
$$ y = [21798, 20385, -8992, -29811, -19248, 2339, 3878, -10408, -12221, 5907, 12837, -12721, -40384, -24125, 25453, 43975, 2342, -51758, -51861, 3949, 49772, 32586, -22658, -47545, -19282, 18627, 22382, 1900, -9081, -5120, -6343, -15150, -8308, 17641, 29963, 3323, -30790, -29011, 5519, 30186, 19109, -9569, -22917, -9358, 9820, 11467, -235, -3097, 5248, 5201, -12564, -23473, -3702, 26142, 25114, -9698, -34493, -22943, 5747, 23455, 19533, -4225, -31786, -34514, -2580, 28939, 22545, -11024, -28024, -18220, -4053, 2233, 7456, 9748, -4020, -22821, -21246, -1495, 12210, 11674, 4347, -10540, -26721, -18195, 14067, 27566, 2398, -20210, -8006, 9425, -2276, -13554, 9146, 31997, 7214, -33747, -28396, 16669, 37937, 18743, -9947, -22551, -16924, 7603]
499G603K5853j1163l8455j0338L1536J6456k1232r763K5812O751l9287k1007L9319
512B085L8803k2204l8778L686K0363k004l306J5775J230k6942r572K3802R974
525A2912j6634K743K5777j0947m7277j983N8183K7458m3341l8025J6222K0721
537E809m463J0218K1897k2373n0807P356O0108J4473m7530j7767L3619O109l6339
550a9690j36M7455Q686m7856k0324L0819J4533j5478P737J9151k6074l8460K5684
563a3953N0438j6925m9930J5631M8760k3037o0416K2181P7276j956p9225k4977
575e6133N3684L1296j8664o945M264k8465j7656M8309M3397m3448n6666L0461
587a6566N3662k6573m8076L4646N5071l5979o5456K4690O4867j1585m8842J4016
$$ y = [7603, 33456, 22293, -16162, -26500, 5036, 21492, 260, -9503, 16309, 23060, -16227, -37234, 2085, 40888, 18684, -20094, -16408, 3955, 1951, -1355, 14420, 15650, -11292, -20864, 2938, 12912, -3722, -979, 24798, 13851, -33426, -35409, 22774, 50232, 6891, -31134, -14912, 5809, 1346, 11564, 33461, 11088, -39719, -32363, 27745, 42218, -5312, -23079, 10540, 16649, -19690, -19826, 27629, 36315, -11541, -31865, -1046, 13487, -1991, 5746, 24897, -1177, -39637, -13953, 36485, 19560, -30370, -14739, 34021, 10984, -49432, -27251, 50025, 48069, -31156, -56133, -2449, 28847, 10183, 3238, 7502, -20963, -38619, 9690, 53087, 9639, -47027, -16566, 37096, 10523, -37553, -2907, 52164, 16185, -49271, -24581, 40286, 28701, -20141, -6125]
599f125L3165k9734l1865M3845M2979m3830m9507L5904M1572l8578l4909N1864
611A4781M2339n8494o1508M4368O5310k2715m4662J5020J2027l9097m26P2438
623C9381J7652q8466m6689P5756N8175n7470n1285M9563M1956n3614m2861N2714
635e188M5686m0444l6175L2051J4005m0224K088O3533O10p7325j2535P8286J9740
648D4108p3073j4833P8360J5877q7269k9357Q7743M7760o5292m6135M0238K1878
660B0005l3305R515N3100k1196p8792J0031Q9910Q204q0081j1363O6839O97o8909
673c5345Q422P9708l515q3973o467P3079N717n9903R055N8752k5660p3287K7225
686b6192Q5965j7311q6184Q903P7438j1410p4245J4756P5684j1883p2404N414
$$ y = [-6125, 27040, -2694, -34559, 9286, 52265, 8435, -41072, -5168, 36404, -2174, -37083, 14781, 57120, -1374, -62882, -18514, 46796, 24081, -20581, -5561, 6466, -32631, -33057, 39381, 57033, -31433, -78122, -2366, 55809, -1661, -52946, -3383, 38573, -15041, -57902, -5188, 40498, 54, -36121, -4070, 9935, -30289, -28201, 35332, 35942, -41383, -53918, 24368, 44108, -28965, -43798, 34562, 50439, -36830, -66187, 21556, 69316, 4024, -42111, -1873, 20005, -13300, -3785, 49315, 28119, -50673, -40642, 49268, 57472, -22609, -33972, 32867, 33564, -35345, -26923, 52785, 49270, -34703, -41170, 31909, 37626, -22277, -13222, 45530, 19870, -53417, -26192, 59773, 42462, -43722, -34819, 42619, 31209, -43036, -28280, 47404, 35521, -36883, -31469]
698c1469N7082j2611m1955L5586M4172n9194o6998O1080Q8052m2669q9926K6066
710c2784P4230k7194o2897L9190O8455m2991q0073K8953P6732j3198n3304J6851
722h030K9411m1601k5959O7275M2740p5476o1516O6177O7769n5145o2801N2816
734d340N9025n4083n9394N0094N7377m5087m6982M7468L6577n8092l5628O8650
746A5585M3386o6167m8221N6690M0827n3321k7143O5584K4859p9060l7121P7963
758A3861N0491n9597m4050M3920J9340m9748K809P6870o94r9075k3240R7775M4433
771G3095p6343m4382N6325K8028n3988j3734O1122J0416o4431j2505N9710M862
783B8175n7839N611O4731j0992p5384O188P6711k814p4040N216P4531r300q3921
$$ y = [-31469, 25613, 13002, -28953, 6633, 50805, -8389, -75387, -14307, 73745, 31076, -58850, -32784, 41446, 14252, -48645, -9455, 59000, 16009, -64064, -35111, 41621, 28423, -24881, -8030, 21381, -20220, -46179, 21096, 63836, -11640, -73156, -6979, 60790, 5645, -57156, -4340, 54685, 602, -58792, -8698, 48679, 3592, -43390, 4078, 40655, -17437, -53065, 15585, 58971, -7196, -55417, 1273, 42100, -11221, -38364, 27220, 52079, -26981, -64102, 13861, 64352, 4755, -39295, 4625, 23965, -25783, -22974, 53896, 53202, -45873, -69113, 28662, 73095, -3248, -47630, 8695, 36723, -17265, -30999, 30123, 40539, -23892, -36397, 23313, 28175, -29664, -24053, 40678, 29686, -45698, -39510, 37201, 34387, -39653, -34437, 40094, 30794, -53127]
796e3127O75Q7728J7037p3439k6870M4683J0667k6594K1856L5350m5410o2655
808g0099M1879Q3920k0041q0676L736O0749o561m7257K3566N0092l2357o0798
820e3847K9266O5344k1140n8533J9450N1328k4566m8103K9997M9944l0443m7888
832c9191L2015M5237l6670m7871L9611N6563l1253n7781J6672M3645j1260j8685
844h968K7557N089n6907j8767P6688M7698o6115o8353L8113O2191j7140l9150
856a8064J7956K1457l2707k1424M1205K9512l6559l0166K8518J9178k9726r275
868b0095L9508O910m8601j1147N1571J5362n2845j9220N4265K6990n1108l8293
880d6703L6716L8363j6207k1060Q393m791k3069J8258M8530p273o2767j5623N1670
$$ y = [-53127, -52452, 35276, 52313, -21126, -47996, -3313, 7354, -19240, 2616, 37966, -7444, -70099, -28220, 55700, 35659, -45017, -41281, 19468, 12907, -34350, -10784, 39308, 6951, -53847, -24581, 40763, 19623, -38910, -19460, 31868, 7302, -40801, -10804, 39140, 8697, -39191, -7176, 38061, 1391, -46480, -6869, 49694, 18441, -39340, -22668, 20977, 9717, -8968, 18589, 23678, -33229, -51996, 24692, 72390, 6275, -62078, -23965, 38226, 21086, -18064, -108, 21349, -11358, -32782, 8423, 37935, 1376, -28790, -272, 18906, -10820, -20095, 19413, 26323, -22278, -33425, 18146, 33508, -19337, -38557, 15708, 42698, -8410, -46703, -9987, 28376, 12169, -8891, -498, -5289, -28358, -10100, 38430, 31157, -31610, -47233, 4437]
893D437K8771k9131j8367J6891k309k4413J2250M0660n898m7045o557L9542J0280
906A9111k8139j346K5821q390l3211J0053L9986l982l9671j509L6392L989l2365
919a3261o689K7467R312j6852n451M710r128k382L0332J7394l9457m0793K6775
932a8023N3533k697m4602j0907K3769N679j1671Q807J6982j3584k7885M583K6001
945I985N354j1022j663p97j3774r64K5771J2892k6541k1966J8936K3407j3945
958E673k1569J2265K3059q204k3102l32J5017L203q99N214n107k1738l625K9621
972I476K0566k0152k8324J936J9076O181j925L91n546j3108j05J7615Q930j2143
986B868r138O251J029r235L673J9051J325k3481j1866J7976J6810r055j3747M132
$$ y = [4437, 33208, 4077, -14290, 2601, 292, -24121, -11871, 28789, 22891, -24154, -30711, 8831, 19111, -9028, -10374, 15447, 7057, -26154, -16101, 23885, 19903, -19768, -21277, 15115, 19104, -13261, -19950, 7517, 16829, -23, -5474, -764, -9892, -12274, 18058, 35452, -4005, -44798, -18023, 35510, 32813, -11789, -22696, 1073, 6752, -4919, 3888, 20870, 7286, -20599, -16016, 9985, 15339, 4317, 2654, 1857, -11917, -12881, 12890, 25782, -759, -22725, -3789, 19618, 5673, -15896, -3631, 19428, 11224, -11878, -12210, 2807, 6010, 5111, 10325, 5218, -16520, -20145, 9476, 30042, 9890, -18434, -16498, 2578, 8759, 6834, 7225, 1679, -11429, -11534, 6081, 15011, 2868, -6270, -19, 1010, -8225, -4552, 14499, 15824, -7657, -19523, -1547, 15263, 6208, -7539, -3407]
1000c407R842l693r386O58R383O843j841j0295j3758Q05K3238J8029j5828l0892
1014b0302k662K6768J6083j1088j5536K86M377q65M79Q269L733p473r783j149
1028h863N749P572M767l202j1693o972P917J2012l69p650k464K652k016l877L252
1043c185Q579K393p210p819j717L852P633Q101k356j5810j1484Q955K0281N845
1057A6058j3777j6269KJ2194R424j708q187m136J879L341n64r60M559M895o244
1072E07j2493r59J5447J0852p926j5708j790J1080P308m748n921K828M890l976
1086f09r015N83J2366J0024o973j8323p754J3945J9941J049j8675j3572N649J4036
1100B672N186m152n169k512j808j19L889N638J540m780n801j460J805O492N472
$$ y = [-3407, 6435, 2742, -6644, -5986, 3397, 10240, 8399, -1896, -15654, -14849, 8389, 26418, 10590, -20302, -22964, 3804, 19887, 8799, -6737, -6451, -2074, -2939, -2460, 5809, 9542, 2069, -7714, -8863, -3114, 4458, 9225, 6023, -5670, -12642, -4725, 7287, 6918, -732, -3196, -544, -2560, -6437, -3185, 5394, 7787, 577, -7242, -8959, -5107, 2526, 10627, 8271, -7539, -19023, -10068, 10213, 16058, 2281, -13988, -13986, -1792, 7632, 5924, -2263, -6399, -4520, -1179, -1743, -2703, 1856, 6751, 507, -11986, -12945, 2502, 13354, 5428, -10280, -12070, -990, 6318, 1570, -4351, -1523, 3367, -609, -9624, -9041, 3325, 13349, 6376, -11947, -19701, -5756, 14185, 15234, -3441, -17013, -11364, 2672, 7858, 3706, -1463, -3975, -5783, -5902, -2013, 3625, 5165, 385, -5416, -6876, -5071, 1421, 6893]
1115F893k380p911m551K655N543L596Q98k363n371l448K381N914L650q02k901
1130A803m438n869Q51J3338J2261q600k1854o167J7829J7899l056j6653q508M939
1144f225J0323M747m309o574p8N236k74o450j112J1620O650j2077j4259N487J6931
1159I636K327j2249m742O315J557n620M40Q782L581p346q762j780N377J0388Q223
1174A6127q292k0548n754K0538J9162q299j9595m137R269M725N57L536k72j0176
1188c159n922R272R356o046p191O358N497r957q912J0629J2673m933j1539N79
1202c295L883k592R92R558J518j2962o866R041O398m635J448Q606o732k1610K005
1217a5243L0385J2842k6580k4237J2161K2352O70j0241k462j241m711M566J2471
$$ y = [6893, 4513, -3398, -7949, -5294, 249, 3845, 4743, 2380, -2991, -6439, -4058, 1856, 5506, 4704, 1803, -2635, -8504, -7653, 5685, 17946, 9346, -12508, -18675, -846, 17053, 13997, -2656, -11164, -6225, 4098, 8845, 4536, -2038, -2116, 3120, 2846, -3604, -4716, 6904, 13554, 1477, -12782, -7295, 9636, 11963, -286, -5028, 1287, 2844, -2776, -2336, 6446, 10027, 2681, -6081, -7861, -2484, 7904, 16127, 7835, -12713, -18467, 2071, 21233, 12934, -6661, -10798, -1529, 3196, 3753, 7289, 7017, -3159, -9081, 191, 9547, 3501, -3690, 2668, 8165, -1792, -10704, -75, 12598, 7665, -3874, -3295, 588, -2004, -1012, 8546, 10064, -2898, -9764, -723, 5675, 1040, 2488, 11094, 4362, -17248, -15243, 15142, 27984, 1404, -22833, -10672, 11680, 12350, 2109, -353, -1594, -6305, -1739, 10732]
1230A0732j952j4280P45J3789k959j6382M557K1669j701k4588l132K1917N610
1243A4025j8237m201J7736K355j9506n121J7789P989j0587m749N336o695r071
1256a2937J5531K1904j3666l2120L63K9952R559j6954o093N958o848q073J5992
1269B568J9281j5502k7086Q203K5821l678k1526O242J9961r322k2960Q508K4397
1282A4907n428k0516M419J6469p703j5113J0111J6563j0388j4853J0718J0136
1294I322j7208q384K7547J6654l3428l0261K6447L8149j1839l2875J645J8526
1306D295m621p084J5421P753k4074j4931K2672J8946j7671j4662J6387Q291k2565
1319a1843p244K9905J2308l1623j8068K7668J9032k3647j6302K2614J3864k2349
$$ y = [10732, 8780, -5500, -4755, 9034, 6075, -10307, -5750, 15919, 14218, -10370, -13502, 8415, 14025, -4212, -8413, 9323, 11678, -7828, -12949, 4840, 12829, 2242, -2507, 2829, -3866, -12937, 2594, 24498, 10832, -21288, -20925, 9027, 18586, 1632, -4461, 1497, -5351, -13424, 2568, 21849, 6347, -20739, -12536, 13285, 9607, -11919, -5677, 14284, 4962, -17998, -9490, 14907, 9479, -11037, -6618, 9851, 2148, -12965, -2854, 13709, 3321, -11532, -814, 9322, -7886, -16270, 11277, 27931, -5497, -35758, -9311, 28838, 16999, -15876, -14231, 4295, -326, -7410, 8011, 15764, -8310, -23241, -569, 18377, 706, -13956, 2431, 10722, -11843, -19087, 10818, 23126, -8497, -26565, 1103, 20135, -3512, -19814, 2800, 16664, -5685]
1331e685j2833K0944J0429k0251n324K4421K195l1529o666L5752J5381l0098j8866
1344b2130J8809J1912j3598J772K0205q620l2349M032L8391N188l3493q327K6591
1357H383K537k6652M537L3068k573l8594m970L5584J0300k6860p813K0060N72
1370G579j9337O043K1638r714k3787J2881K6627j6128l2307J6005L8815r843m0457
1383b1985J852L4531M68k5110M880K1680j3103k5630J5351L1824j0079l0445M769
1396a0997K2025p276j5380J7901J7089k5882k7598K5478L4617j6356l2416Q775
1408a0020K3859j0331j7200J7657J6978k3119k0623K3255K3598k2074k4168K1679
1420e09K4145k1117k5769J7696K5081j3990j8550J3218J0885j9217q642K6601
$$ y = [-5685, -18518, 2426, 12855, -7396, -12720, 11701, 13896, -17633, -24299, 11453, 26834, -3264, -22130, -3321, 8591, -5007, -3235, 16970, 8350, -23999, -19967, 18424, 23612, -9881, -18208, 8383, 10920, -15732, -11195, 21873, 19300, -19294, -24264, 11320, 21620, -5240, -13053, 7007, 7579, -11758, -5715, 15923, 6209, -17578, -4697, 21930, 5802, -26505, -10500, 28315, 18472, -21985, -20133, 14398, 14866, -10244, -5364, 16316, 3213, -22417, -7066, 24758, 14679, -15766, -10997, 11028, 3752, -11628, 6273, 23362, -2520, -30118, -4640, 29977, 13621, -18795, -10020, 13839, 3508, -13692, 3965, 20943, -2176, -22799, 456, 24054, 1980, -22188, -509, 23636, 2519, -23250, -5554, 19527, 5537, -13013, 205, 11090, -8127, -16769, 9832]
1432I832J3304k8655j8432K4489J6713k0299j0670K4467P145l3540j2341L7519
1444I532K2698l1192k7773J9687K2140j2119j0547J4239K158k1671j158K7278
1456A3272M072k8309n182K8373M719l0013m951L1152P690k9816r394K6939O710
1469A5262k4694l391K6572K762k9195n305K7293O982k1678l350J8456m445k2271
1482a7002Q070L0665m722l4321m171K9078P334j8858j524J3968r368j8573J5056
1495d368K6950j1709l1704N189K9449k100k5859L943K3959m843k4637L374K3237
1508A0881k483j8624M700J5715r389j6440J1579J8917j0926j7850J0387J4985
1520A1452j5381j3761K1242K0916k2320k9719J4598L1827m264k3130j10J1711
$$ y = [9832, 23136, -5519, -23951, 538, 17251, -3048, -13718, 10749, 17894, -15646, -27987, 9532, 32230, 1038, -26735, -7048, 15092, 2973, -7574, 6665, 8823, -12848, -14006, 13272, 17344, -10965, -16147, 12226, 16945, -13068, -18019, 13133, 20823, -8993, -18387, 8552, 15262, -9432, -12823, 13749, 16511, -12684, -17989, 9304, 16286, -5392, -8742, 9714, 5269, -17002, -8932, 21733, 17011, -17310, -21481, 7597, 14931, -3927, -5451, 8517, -851, -19424, -4368, 22582, 10873, -20831, -15642, 13807, 11707, -14152, -10209, 13750, 8907, -15730, -12356, 10881, 8398, -10226, -5526, 10189, 800, -15640, -4061, 14856, 3930, -13920, -3533, 11452, -3929, -17690, 3552, 24468, 2148, -27571, -12973, 18854, 14590, -8540, -8650, 3061]
1532C061n590o311J5062R122j8904j5208J6379J7013j2791j3296J2677J0126j6475
1545e135j0157J8864J2738j7850j3485J5207J2160j5205j0391J6773J0846j6378
1557b013j1898J3998R950j2114o418J4833M259j9156p671K0166J2567j4213j3391
1570a1101P401O026n593L004J1741o297j9860J797K3112M786j9779o985J5520
1583C772M549j5064k877J7096N013j6380q135J1731O923p496j817P315l042r898
1597h310L614J1952k551j0785L583J0166o719j3603P567J9122l225k0277m016
1610a3482J5709O362q170j993M793l880p629O235J1477l573j1404N46Q264j121
1624B134o078M929P034o489r961M806J0035k041p323K943M927o377n734Q283Q682
$$ y = [3061, -2529, -8840, 6222, 15344, -3560, -18768, -2389, 14624, 1833, -11463, 1214, 11340, -5135, -15292, 3572, 16310, -1540, -15025, 182, 12342, -2863, -13254, 3519, 14365, -2013, -13911, 87, 10037, -2077, -8495, 6338, 10597, -8559, -16230, 3936, 16503, 2290, -11101, -3700, 2326, -3267, -263, 11478, 5181, -14679, -12882, 10230, 15016, -4763, -11748, 3772, 8321, -6743, -9620, 7476, 12489, -3891, -12026, -295, 6628, -868, -2685, 4630, 1588, -8310, -4696, 7256, 4705, -6080, -2497, 7669, 950, -12653, -5086, 14036, 10811, -9466, -13482, 2227, 8589, 419, -1574, 3219, -661, -8290, -2055, 9422, 5849, -5555, -5009, 3255, 2134, -3944, 985, 8019, 1530, -8431, -3625, 6410, 4369, -2954, -11, 4916, -1461, -7195, 1088, 9770]
1639I770o298r807L471P398k505n324M763O321o125r841K963J1092K002n654m063
1654a837j612q48N170Q427k064j2113l837J0120O494o182n685N162M675o445o279
1669f854O081Q286k450p693j069L439O76P96J769m97l970j409K683M81r50K644
1685A963L019m122q361Q65J1299N468p912q591J204M907K505P11M07l352m955
1700d945L09P059L175m211m089L71K048k4L8J708M64k283j246O0K11J186L067
1717B898P72m967m624K831O290J184m468k386J472P54k175J133N605P46o695n804
1733g434K847P937L775m100p599k400M754P082L26n596m076K604L388j591k295
1748b378K501M042k150o155j239M984M742j093m168j904L49J071K220J280m2k280
$$ y = [9770, 3472, -6335, -2864, 4534, 2029, -3295, 1468, 7789, 1664, -8177, -5214, 5878, 7880, 2226, -1837, -3449, -4297, 873, 9300, 7236, -4877, -8714, 1406, 7900, 1718, -3967, 1195, 5870, -575, -6854, -773, 7513, 5063, -2630, -3699, -260, 416, 1212, 2981, 2484, -1486, -2895, -212, 269, -681, 1963, 4982, 860, -7501, -6636, 4663, 10131, 2219, -6372, -5168, -261, 2244, 2955, 3362, 10, -4945, -4636, 2423, 5598, 1387, -2702, -2331, -283, -307, -269, 1439, 1903, -380, -1626, -1566, -1355, -169, 2898, 3670, -1297, -5921, -3090, 3200, 4384, -84, -2470, -998, -244, -2419, -1286, 4319, 5065, -1630, -7434, -4587, 3350, 7125, 3025, -4574, -6974, -2220, 4862, 5188, -408, -4484, -1880, 1508, -83, -2378, 123, 4165, 2015, -4140, -5379, -395, 4347, 3254, -914, -2818, -2469, -1398, 822, 2102, 2060, -220]
1764b20k826j007K135M311K129k286n970k355M335N647M80l844l036r07J147K641
1780C74L056o22m560l204K666M781J86l096j303J390O68j755l78J797K348l10
1796B038l063k841L56M861L610k929o259p84M916K608j612j910J553k13l950r71
1812d590N412N198k798p350k608M634N338J874l833n930j007N159M326j663m023
1827a861J42K718j124l333J664N400P54n496l158K654L442n95K15Q97k217l525
1843c423N58M980K120k459k259r74o40N65M580K393l991n415P21M737J110j086
1859A517O65m32m483k231O169N578m070o947J100N742n13l918Q76M345n91n309
1875b502j137L310K311N95ml151n391J736Q911K803q352n702M761N226k474l422
$$ y = [-220, -3046, -4053, -1918, 2393, 4522, 2236, -3734, -6089, -1754, 3893, 4373, 529, -2507, -3414, -2267, 374, 3430, 2808, -1752, -4956, -2290, 2491, 2677, -419, -1722, -332, 336, -1419, -1797, 0, 2348, 2038, -1025, -3866, -3510, 1351, 4961, 2032, -4227, -5011, -95, 2513, 901, -1009, 544, 331, -3619, -4590, 822, 6020, 3222, -4128, -6736, -2102, 3236, 5110, 1277, -4653, -5660, -501, 3825, 2162, -1861, -1719, 999, -125, -3458, -1794, 3606, 4360, -1136, -4294, -1640, 1802, 1207, 1422, 2319, 102, -3423, -2865, 2115, 4235, 1776, -483, -1457, -2097, -1532, 3048, 5441, 1450, -3965, -3244, 1493, 2603, 1517, 2182, 1750, -2733, -4964, 1205, 6783, 2713, -4234, -3134, 2608, 2095, -1823, -947, 3398, 2807, -2502, -3639, -329, 1982, 2577, 2573, -578, -5969, -4233, 4678, 7481, -871, -6573, -1812, 3414, 940, -2482]
1891b482M561K571o794n831O885P977k754p397J87L319m09N22L079o64n698m91
1907c419N284J775n847lP402K64r675k904R448N622n746m864L209L55m501K384
1923a216R439p51j2247m121J0099O453n088l996K145n08l779K719P856k006r172
1938d173k99P995J9o930K268P528l711r280K687J0430j600j0381J616J0308j497
1953D980j2025J65J2213K735r199m406M372J018j036N555K616j0051q631R245
1967b449J3160m588j2532J025Q899k133o320N865Q120q242j1947O537J3173k454
1981F114j1787J657P818k626o071M701N528n987n885P610O123r543p378J0340
1995F14J0216r128j1293N286R305l471m849P083J836j3407m568J6821J1158j3793
$$ y = [-2482, 2079, 4650, -2144, -7975, -1090, 6887, 4133, -3264, -3077, 242, -167, 355, 3434, 2770, -2928, -3419, 1865, 3640, -2207, -2210, 5192, 5456, -4219, -7123, 2325, 7947, 2201, -2663, 546, 901, -3600, -1216, 8223, 7472, -4775, -8896, 1203, 7656, 2568, -1428, 717, 209, -3570, -851, 7005, 4999, -4173, -4472, 3523, 3542, -3388, -1120, 6408, 2697, -6583, -3896, 6534, 4934, -5447, -3831, 6477, 4980, -7045, -6880, 5333, 8068, -1131, -5537, -1165, -147, -1183, 4372, 6988, -3063, -11694, -2449, 10711, 6123, -6409, -5384, 3515, 1382, -4938, 927, 9047, 805, -11142, -4605, 8568, 6114, -5673, -4016, 3802, 1176, -4895, -194, 5334, -653, -6538, 1072, 7195, -2348, -9726, 614, 10830, 1702, -9591, -4305, 5000, 1529, -3320, 3763, 5599, -7808, -12376, 4445, 15603, 1810]
2009A810j4780O952J2216k563n856M554R93r606k110J3435N731j3134p594J0238
2023B86O002q158l406R807J019j2551n81J5200J603j7038m168J7591P498j5525
2037b421j0298J0524R936o027m507M564k662q592N765J5680l213j9534k847J6754
2051C122N783j0207l009P288m021j0265P594J7274m763k0587j800J8435N198j2803
2065b761l390Q673j104q374M707J1146o361j3048N723J5332m789j4848J719J4308
2079F933m94j0230J850O690p149o460J3045J2130j4778j8379R722K1036k198j6333
2093d615p05Q487k683n285R513Q035j2787j2945R909J4450m821j1663M119N606
2107D615o612l970J2260M987j5430q728J5427J2094j3613j3590J0343J3362p446
$$ y = [1810, -12970, -6018, 6198, 3635, -2221, 2333, 3326, -6280, -8390, 5045, 10776, -2358, -9952, 286, 6288, -1870, -5276, 4531, 5550, -7001, -7582, 7618, 9221, -7817, -11985, 5606, 13104, -2421, -12719, -2195, 7741, 1714, -2793, 1771, -891, -9483, -3718, 11962, 8749, -10785, -13632, 3122, 8905, -1302, -4311, 2977, -1044, -11309, -3715, 13559, 8796, -11791, -13591, 4844, 10042, -2761, -6151, 2522, 1418, -6956, -2249, 8897, 2536, -10512, -4789, 10543, 5754, -9094, -7375, 6933, 6439, -3791, -1941, 4749, -2400, -8860, 4185, 16315, 1537, -16842, -7120, 13916, 11718, -4615, -5320, 3167, 484, -4801, 4712, 12747, -40, -12985, -3076, 11374, 6553, -5110, -991, 4615, -1997, -5967, 6293, 11280, -4150, -12878, 2549, 14643, 1030, -12560, -2217, 11145, 3699]
2120C699j1440N349P688n978m184R919K473j4028n209J4860R491j1713r781O553
2134b301N701n776J74J0416k200j6337k465J8981Q059j5224r679R377O766p773
2148b281j651R958o79j3090j321J4683L527j2802m657J0953L728r542k302Q354
2162B878M32p975K637R370n137j3180M917J6826j013j7598l324J3557L876q417
2176b151l80P620m117j0696M539J4111o66j4055l051R611K828n093K168M147p067
2191b252p591R122J1393o851j3387M356J2378k833j0436K587R883l029r608L707
2205b561Q318m035p980N030Q762n667r363L844Q840j930o276K683L254o105l248
2220f434R783O384r876r948O755R781l533o282L556L540p275l523R926O801r142
$$ y = [3699, -7741, -2392, 5296, -682, -4866, 5053, 7526, -6502, -11711, 3149, 12640, 927, -8854, -2301, 3400, -2376, -2202, 8214, 6014, -10323, -12788, 6193, 14252, -972, -10651, -1274, 5492, -2281, -3932, 6026, 5347, -7743, -9064, 5619, 9146, -3656, -8313, 2640, 6368, -3174, -5476, 2878, 3310, -4665, -2028, 7342, 2205, -10975, -6058, 10768, 9755, -7843, -11167, 2390, 6266, -2151, -2531, 5089, 972, -9724, -5185, 8926, 8260, -5795, -8846, 765, 3593, -1500, 668, 4815, -2252, -9843, -721, 10672, 3821, -9566, -5210, 7168, 4335, -6101, -3514, 6369, 3340, -6268, -2561, 5757, 1722, -6258, -1228, 7534, 1867, -7496, -3652, 5188, 3258, -3018, -335, 2919, -3186, -6434, 3349, 9733, -143, -10091, -3336, 6445, 2912, -3370, 186, 3726, -3549, -7072, 2854, 9655, 513]
2235E13r069N656Q339l766n213M244L394n617l421N698M303n881k444N982O22
2250C340p563j031J0001K264r472m060Q012M053p426k637P584L547q474n118O944
2265c6N748l909l921J819M45l254K095O510j759q184p57P272J302n650N33N582
2281C836j603p658O84R128J432p961k827N041J989l893L49M699j191o105lO743
2297B660K41m604l08L201j031l368K014M514j614m513Q61L478k071k766M300M582
2313E576n190p200L089Q078K81o473j235L746K6k699J347L562j005l745n72K032
2329c82P27O1K441j122n064j203O133M030m853m758K869L732j903l289K306L745
2345C470j898m021L39L211O02j071N7Mk537k75L538K096k404k641Q41P05p78P85
$$ y = [513, -8556, -2900, 5439, 1673, -3540, 704, 4098, -1519, -4940, 758, 5061, -820, -3264, 2718, 3340, -4223, -5254, 4747, 7011, -2461, -6521, 1491, 5544, -1882, -4519, 3065, 6612, -1862, -6980, -36, 5712, 1803, -2118, -299, 146, -3108, -1013, 5497, 3738, -4446, -5203, 2069, 3371, -2279, -1746, 3836, 2233, -5425, -4741, 4387, 5819, -2142, -4969, 72, 2061, -1832, -1483, 3216, 2025, -4080, -4083, 2660, 2901, -1703, -2011, 1190, 159, -3209, -1195, 3319, 1705, -2808, -1947, 1531, -540, -3306, 994, 5576, 386, -6814, -3725, 4353, 4634, -1839, -3074, 672, 698, -2001, -654, 2908, 1903, -1842, -2414, -382, 345, 406, 2847, 1725, -3339, -4542, 1591, 5621, 768, -3990, -1121, 2611, 708, -2581, -275, 3470, 1572, -2449, -2110, 1101, 1703, 632, 689, 693, -1844, -2119, 1419, 3515, 1111, -1530, -689, 16, -762, 23]
2363B3K901q39m593j250M179K980j996k813J002M67j631J54L514J237l865k844
2379c374J766L089L95j539j130k75J72J031Q26o08j004Q32J272k170k185K012
2395h90M533n80m745k096K726K984o80j281Ol42j492J4K634K051j233k867j769
2412c027J686K422J793j408l357j374K450L095r93j914m11J410n05j298P50K141
2428A460J81k372j046R09J576l28n37Q52k83j402p99J302J483R38j076k539p18
2445b399J292L357P94k651l059N12K796J222p70q06l0j387n12J927K534r96l030
2462a206p16J608J600l27n13k4k02o04n07K37R55J159K53k279j826Q08L906P82
2480C104k868k534J020J661o34J94J298K95k351k501J420L432J507k537k596p25
$$ y = [23, 2924, 2085, -2508, -3758, 421, 3401, 1405, -1408, -406, 61, -1570, -1416, 2098, 3335, -530, -3374, -1608, 1481, 1876, 337, -793, -1068, -896, 135, 961, 353, -651, 181, 1453, -717, -2902, -890, 3643, 3063, -1682, -3778, -1052, 1932, 1252, -29, -23, -365, -1857, -1843, 791, 2842, 1609, -1258, -3027, -1341, 1081, 2874, 1466, -1891, -3265, -815, 2280, 1287, -627, -1038, 372, -133, -1431, -681, 1460, 1641, -731, -1777, -868, 708, 380, -157, 695, 412, -990, -1789, -487, 996, 1934, 858, -1681, -2399, -1107, 2250, 3044, 393, -2666, -2154, 642, 1864, 1094, 288, 258, -1129, -1641, 286, 2820, 1824, -1206, -1922, -314, 1286, 959, 446, 422, 220, -384, -891, -654, 301, 1460, 1713, -566, -2392, -1584, 2322, 3104, 236, -2298, -1278, 383, -251, -57, 1241, 1536, -815, -3316, -1896, 1536, 3043, 506, -2090, -2815]
2496b815K361K563Nk010k063R44K131m54k012N75K798o82k782q08K598J890n24
2513A715j908l70M4P8J025J729j60k637j157J745J389K12j83j174j403l84J706
2530B67K326p36k114n08P38k72J61J745J174l010l421K323M516m12m000r38K545
2547C84R75j897m66J363J042j138q51r11j41J728K593m24m747j991M168L989k563
2564A113l565J313K348j498k190K579L029j669l972j99K833J543p57r7r45k277
2580b411M70L983Q52k904k376K457J818k976p47L265J356l407j852K509J627j794
2596a30l56K242L34m680q10N416K958m297m081K018K863k47q08J535j534k565
2612b142J128L766l38l503O40K609j293l961K292N690j168o381r10N626K140m445
$$ y = [-2815, -454, 2109, 2114, 104, -1959, -1015, 1116, 662, -1350, -775, 2023, 1341, -1441, -2249, 349, 2239, 1715, -193, -563, -519, -441, 584, 2313, 2153, -484, -1641, 104, 1493, 1705, 1522, 348, -1055, -1439, 267, 2593, 1857, -257, -765, -27, -299, -138, 1607, 2781, -229, -3650, -1327, 3189, 2777, -1223, -2161, 384, 1359, -538, -1004, 359, 1401, 263, -588, -1499, -1640, 88, 2681, 2257, -2490, -4481, -313, 3676, 1113, -2452, -1139, 1209, -289, -2479, 100, 3129, 1460, -2512, -2711, 122, 1665, 908, 811, -134, -2411, -1941, 2042, 2894, -10, -2386, 71, 1889, -1087, -1834, 1431, 2787, -620, -2472, 37, 1664, -130, -486, 1756, 2090, -2590, -3400, 2016, 4974, 677, -3404, -1386, 1477, 1230, 422, 1957, 423, -2142, -1014, 2752, 2414, -1089, -449, 2160, 867, -3094, -802, 4888, 3720, -2661, -3571, 2055, 4195, -250]
2628b50j771L797J041l837j028L230J082j681j42J181k696j785L924M630l897
2643A798o341J246N783K4m123R62L155k925m286L341N507j706o229K58M563k69
2659G58l373J351L206k341l798K213L858j857l430L043K256l685k741M308L375
2674C143l443m264L509L086l131k943M856L795n424n671M750O109k463m879J297
2689a673L388k196j613L907J786m530k759M173K903l800j486M682Q55n839j934
2704d136P074L346o967l377N250L419n611k199N726K809n617l537M360L044k575
2719A009j619K640n24m580R54O457j45o798j097O181Q92n652o5O418l23p218n95
2736d065O921J985o299j382M678O59n377L69O256j94o197j66N128r9m790J688
$$ y = [-250, -2021, 1776, 2817, -1020, -2048, 1182, 2264, 583, 441, 1622, -1074, -2859, 1065, 5695, 1798, -4543, -3297, 2486, 2510, -1613, -651, 2504, -421, -4707, -1366, 4141, 2435, -3794, -3536, 1027, 758, -2615, -1264, 1942, -399, -4197, -1984, 1874, 17, -3413, -370, 1886, -1799, -4540, -232, 3143, -300, -4564, -1055, 2031, -1100, -4043, 813, 4608, -816, -6487, -1737, 4372, 1909, -2970, -1673, 1715, -481, -2094, 1813, 3599, -931, -3690, 483, 3386, -414, -1900, 2782, 3637, -2202, -4136, 2938, 6284, -683, -4060, 1190, 4609, -1002, -3201, 2525, 5334, -283, -3820, 540, 3584, 1009, -610, 2030, 1506, -3074, -2120, 4337, 4192, -2606, -3703, 2478, 3370, -2282, -2347, 4071, 3748, -3470, -4065, 2856, 4841, -1458, -2840, 1838, 2497, -2880, -2511, 3745, 3551, -2646, -2812, 2316, 2217, -2573, -885]
2752h85N225k287o470J926O329o71n517M17M474k077m622L974O064m246q325K923
2768c768Q586p96p232J14N753j192m634J630M576k421l811K382L048l437k663
2783c865M812L845n814n503N782N677m275n657M798M773m877n582M608O706l166
2798B262o079Q80M088j117j258L557N94o418j962P546M383o371n155M271M175
2813C396l827k732M877J947n090k211N393K045n575k113N964K140o347l177O112
2828H02L878m833l189L743J738m074q18N287P56n471j519M492J345l274L31L803
2844B997k534o336K730R099l72r414k520P473M269n183l106L194J128k541K59
2859h57L146j187l539J860M088k345m748J774O035j555n332O04M819j273m500
$$ y = [-885, 4340, 2053, -4417, -2491, 3838, 3167, -2350, -1933, 2541, 464, -4158, -184, 5880, 1634, -6691, -3768, 4818, 4022, -3210, -3096, 2657, 1465, -3169, -1539, 3037, 616, -3195, -813, 2235, -1202, -3865, 947, 4792, -1022, -6525, -743, 4934, 659, -4998, -200, 4573, -304, -5886, -1278, 5428, 2262, -3817, -2937, 1151, 34, -1224, 2333, 2927, -3491, -5453, 2093, 6476, 105, -5050, -779, 3396, -431, -3163, 1714, 3661, -1429, -3640, 1753, 3798, -1777, -3890, 2074, 4214, -2133, -5310, 802, 4680, -153, -3342, 401, 2139, -1935, -2753, 2534, 3290, -2181, -3700, 792, 2137, -1137, -806, 2997, 463, -5873, -3143, 5956, 5584, -3830, -6350, 1123, 5392, 209, -2897, 297, 1425, -1116, -857, 2289, 1102, -2437, -577, 3511, 1166, -3582, -1808, 4227, 2672, -2660, -2056, 2763, 1490, -3010]
2874c010K217N571k677o580J398O191M41m411o19K518j804j493L662L831m375
2889H60o145K912N928p20l999j7J737p90j268L081J824m300l172M643L586l807
2905C53m915L909N141l200m853J872L935q47k867J474K125k657k308L020K610
2920B792k182j702Q48J033k209Q05M353m86o507j990O669M165m287m864J788L479
2936A705n59j437J459L89k524r20K636J786k746j116K251J90k266n48L263N48
2952B111l080n19L187j42l592J09M386N71m191j994L261J873j711l36P40j47l085
2969b559J021M156Q99m344k065K894J683r29o63P76j195j466J909K260j813k475
2985a911J646K233j084l353J375L608k51l813q25L076Q61j955l69J591J46j977
$$ y = [-3010, -793, 4778, 2101, -4479, -3081, 3110, 3551, -860, -1479, 1039, -765, -2258, 1404, 5235, 860, -5285, -2373, 3555, 2835, -1164, -1181, 556, -234, -1502, 1579, 3403, -897, -4069, 574, 4160, 353, -4562, -653, 4488, 1288, -3565, -1693, 2242, 1395, -1472, 2, 2127, -530, -2838, 182, 2792, 610, -1092, -244, 789, -1420, -615, 3738, 3252, -3255, -5245, 1424, 5589, 1302, -3562, -1774, 1705, 1146, -291, 1168, 1557, -967, -1887, 749, 2535, -211, -1327, 924, 1114, -1152, -1700, 1563, 2111, -969, -1488, 1699, 1557, -2035, -1926, 2460, 3031, -1160, -3154, 107, 1980, 269, -67, 673, 526, -2559, -1538, 2618, 3517, -827, -2892, 2, 1685, 756, 93, 869, -326, -1792, 117, 2377, 564, -1911, -265, 1968, 884, -2469, -1094, 2514, 2263, -1550, -2375, 701, 1562, -393, -762, 829, 975, -1002]
3001a002j57J799N53p07k87q01j070N87L367N83l354l218K384M348q88l385l67
3018a615K293l69j032K85J358l84j247l1R40r0l31R97N24j868o16J001J246m83
3036E78j061N76K49j277q75K635J262j905j363L30R42m47K13J428o4k595j382
3053b756K869K619j098k917o18J593J213j61j11j001K7Q29L00j038q48J249K197
3070B348j286l110J55L317J671k639k655J476J871j62j239J11R19o7r12p84O98
3087b88J141N92o33k436k28K176K223r84l062l4K030R08q91q81J73M40o83j11
3105e48P57M70o20j6M42p01p70J094J253j07j568j262P54J641Q21q77j116q06
3123a159N31J414N59r03q20N74M45j011k91J548J214j037l319L54K755K003k068
$$ y = [-1002, -1159, 640, 1193, 486, 199, -602, -1672, -1085, 2282, 2865, -489, -3707, -1323, 3025, 2137, -1248, -1615, 678, 309, -723, -438, 920, 536, -711, -742, 198, 108, -223, 774, 1298, -570, -1186, -185, 1061, 578, -483, 93, 342, -935, -1810, 825, 2087, 182, -1181, -851, 91, -356, -143, 1285, 1221, -1374, -2756, 113, 2732, 1634, -1283, -1901, -308, 905, 744, 633, -368, -341, 488, 788, -250, -1098, 151, 2348, 1062, -2048, -1893, 1424, 3095, 456, -2199, -723, 1148, 986, -253, -142, 777, 710, -202, -986, -288, 853, 1445, 812, -1624, -1852, 324, 2547, 1563, -1499, -1533, 497, 1405, 514, -367, -194, 246, -437, -548, 209, 679, 59, 43, 485, -216, -986, 108, 1361, 1254, -314, -1576, -822, 819, 1640, 763, -353, -1159, -628, 786, 1345, 442, -378, 196, 641, -370, -661, 887, 2101, 1064, -2255, -1901, 854, 2857, 789]
3140G89j942l80J940J161j072j038l91J538P83j741j229J061K154O70k758j969
3156b424J286K462J23j829p55N57O27j65K37M50p32n10k12L04J002M26o4j394
3174f11p84P87J425N16j423r94J06R00M78k98R1j75n16J28Q55pq69L8J114J37
3194H98j962q02J763K131p13j911j394J199J331J142r93j746l26J235J034m50
3210D36j214J010Q36j066j761J047K439Ok475j906J971K376n11j417n41M50M14
3227I4M41q79l07P03J169r5k348o29K343J509q47k748k90K051R74j160J51K98
3245D30p72r67Q19J727l08j707J30O26k07m0R45K83j705p18R99J759o75j215M06
3264a90k13o13M7J767N4k140l53K134Q38k319r90K473J498j980k613J020K328
$$ y = [789, -1153, -1533, 407, 1568, 496, -542, -933, 605, 1388, -353, -1582, -521, 1633, 2303, -455, -2424, -1138, 1324, 1447, -382, -1137, -580, 47, -118, 119, 569, -163, -673, -885, -581, 421, 847, 783, -611, -1395, -608, 817, 1333, -90, -1084, -978, -78, 400, 102, 193, 18, -498, -370, 485, 478, -391, -353, 761, 898, -1064, -1866, -103, 2028, 1315, -596, -1990, -791, 540, 1682, 689, -1057, -1383, -148, 886, 436, -778, 232, 1068, 2, -1759, -712, 1727, 1733, -742, -2648, -677, 1699, 1188, -229, -770, -320, 94, 535, -344, -651, 52, 1221, 1126, -1222, -1851, 492, 2001, 1154, -1594, -1884, 167, 1141, -19, 132, 430, -342, -1309, -490, 1237, 929, -778, -648, -22, -229, -269, 676, 959, -746, -1464, -465, 1294, 619, -596, -190, -403, -1016, -969, 798, 852, -1288, -1641, 493, 1331, -988, -1978, 495, 1993, 13, -2600, -1580, 748]
3281G48M72j400p77J74m59J217J274o33k102N88J702l30j758N59K850q76l652
3298b403j88L793K071k931k784J428J864l32l42N53n49j070O99J154n91j441Q84
3315a85J986r01k918O49L040J09k535m36J959l02j381N41K161j100k396N89K665
3332A545n15k204P28J496j175k167J145K723l71k450o03J722L35l20R68k03k179
3349a525r92L256J758k724k643K509K813k446k688K258K964j463l603N48K963
3364I85N18j695m28Q60j084J28K161m7k448n21L204L29l626r39L972K329l943
3381b45l238K410L040n46k082P91P39j970o28K963P21k539j250K328R32j951k91
3398h16K207Q0l059k98K783J352k530j516K384L77j995L59K792o84l237K84L638
$$ y = [748, 1220, -180, -957, -783, -1242, -25, 1249, 616, -1486, -898, 804, 474, -1284, -725, 2125, 1249, -2403, -2591, 1202, 3273, 342, -2442, -1014, 850, 518, 176, 729, 180, -890, -191, 963, 372, -1069, -185, 1801, 900, -2018, -1369, 1671, 1780, -755, -1191, 768, 466, -915, -374, 1787, 687, -1709, -1120, 1545, 1030, -1174, -446, 1050, -125, -2292, -1147, 1576, 1205, -1245, -1848, -126, 209, -111, 857, 654, -1525, -2517, 739, 2497, -227, -2870, -361, 2452, 6, -2682, -424, 2540, 1077, -2526, -1978, 985, 1503, -192, -620, 240, -844, -716, 1445, 1398, -1050, -1571, 1633, 1962, -1664, -2603, 1369, 3698, -245, -3483, -1073, 1967, 1421, -661, 130, 869, -1101, -1729, 1234, 1955, -584, -1834, 494, 1426, -525, -816, 1391, 1471, -1588, -1886, 897, 2249, -281, -1797, 587, 964, -1031, -672, 2120, 1436, -1801, -1517, 2121]
3415B121k45l413p68L695J222l362j799K836J707j356j320L57j4q20K037J859
3431B737k161l175J346L731r60l169Q20L024j504l768J290M150r5l814j070K815
3447A97J138j557j19J030j459r96J981J719k470k087K469K764k511l532K293L421
3463B281r84l191O69K144r33j360J901J462k411k269K060L064j766k596J728J304
3479A103j360j650K442J786k097k430J371K210j046j301J581N2k380L99K972R12
3495B564m345j337L921K383l599k872L009K878j922k985J363J714m75k64R55p81
3511B07k212R59L163m04l202l81L015L13l023n7L487K90l916j624M249K162k682
3528C44k066J077J246p84P9J762j370k408J370L061r07k913Q3L100k56k639k37
$$ y = [2121, 1876, -1537, -2305, 1390, 2612, -750, -2549, 287, 1994, 638, -682, -325, -339, -1159, 878, 2737, 576, -2599, -1253, 2478, 1518, -1651, -831, 2193, 689, -3079, -1789, 2361, 2266, -1548, -2618, 197, 1335, -222, -341, 689, -770, -1766, 215, 1934, -536, -2623, -154, 2610, 99, -3433, -1140, 2281, 1297, -1894, -1225, 919, -14, -1374, 527, 1989, -422, -2691, -631, 2433, 667, -1929, -201, 1103, -257, -1907, 535, 2321, 224, -2206, -835, 1375, 329, -972, 609, 661, -1719, -1320, 1652, 2564, -1781, -3118, 803, 3186, -413, -3285, -276, 2602, 680, -2305, -942, 772, 297, 33, 988, 207, -2005, -1046, 2117, 1713, -1489, -1870, 1145, 1458, -1565, -1622, 1865, 2155, -1761, -3385, 864, 3026, 344, -1722, -645, 601, -183, -104, 1658, 288, -2120, -750, 2311, 1404, -1509, -1426, 1674, 1418, -1221, -1458]
3545a458K289P74k236J12J661j048k052K022K627j658l296Q79L288k80k854P35
3561d95K164p78k480N87K795k69k105n80J452j88o42J878r8k837q59L098K562
3578C205k971k749J698L334j418l298J047K689K07k465q55J320M94p3O94k23j994
3595a358k74K653R06k356j172J915R12k221q21K442J788k603k162J235K436m19
3611I01j616O88J49r96m16K385L30k276o15J936N69j321j120J587J169j418q24
3628h88K53P50k68L70Q25r72k195J282K614p7k773r38K339J029j822r70J620Q92
3646A071j337j101P99J387l68o04m70n29N12J617P44k466j282J391K567j166k498
3663a733K05K535K84k099o50J464J253n93j070n09K37N01O59O25j343j256P31
$$ y = [-1458, 831, 1605, -631, -519, 1142, 94, -1958, 64, 2691, 1033, -2263, -1384, 1904, 1624, -1230, -495, 1669, 891, -1589, -1002, 1793, 1524, -581, -1161, 291, 103, -539, 1339, 1241, -1596, -2455, 643, 3205, 234, -2515, -817, 2517, 1099, -2199, -1152, 1537, 1744, -721, -1576, -256, 238, 165, 859, 636, -1358, -1632, 1021, 1927, -429, -1601, 314, 1226, -995, -1816, 626, 2414, -189, -2351, -1116, 1320, 901, -715, -27, 122, -874, -1290, 1095, 1425, -851, -1466, 470, 1039, -282, -1402, 185, 1354, -64, -888, -635, 115, -153, 217, 1042, 70, -2125, -843, 1771, 1694, -1079, -2017, 322, 1351, -471, -1441, 179, 1071, -266, -1367, -568, 819, 451, -153, -623, -1152, -640, 977, 1721, -745, -2027, -636, 1931, 765, -1733, -1528, 1007, 1291, -808, -1458, 6, 1259, 666, -404, -913, -676, -175, 484, 1109, -234, -1490, -759]
3680g59J525l67r92L64R93q41j034P40J325m3j314m98Q71j3k27Q60K43j144j238
3699a549J263J318o36j181J3J661n32q37q0M15Q22m23o87l32q3J023J186r83j836
3718a458n30K652J258j960j728J006J602n73j041R5J319M1j304m84O20J501K9
3735A045r40j037J99J119P89p25j529j55K061L35j314j089J204J316r20j362p8
3752a081J387P97m10r04l86o73J257Q15K07j661l85N97R04j38l16J50p0o73K93
3771b90N04j65lk3j95k41k82J043P77q26j493J21J724O67j214j042Q75R35m93
3790C79j090j15R62J192o87j248q22J324J561j35k028j033J423J380M46k364K05
3807f50Q46K56q26m38Q06J337l56j750K04Q42O31k77q20m47L66J153nj096m58
$$ y = [-759, 766, 399, -593, -229, 764, -77, -1111, -371, 954, 911, -403, -901, -30, -43, -270, 590, 833, -311, -1549, -286, 1032, 396, -785, -772, 889, 357, -480, -560, -145, 677, 254, -433, -765, -848, 175, 1361, 378, -1458, -1988, 664, 1922, -38, -1766, -760, 842, 269, -772, -677, 642, 683, -621, -1105, -485, 1016, 1045, 105, -932, -733, 386, 1175, 450, -1079, -1234, 827, 1162, -152, -1241, -37, 1279, 359, -1003, -1081, 306, 1103, 693, -211, -597, -1270, -13, 802, 1009, -652, -1037, -440, 464, 326, 10, 160, 90, -583, -290, 214, 49, 46, 23, -172, -413, -695, 348, 1125, 299, -1194, -1073, 651, 1318, 104, -938, -63, 872, 379, -711, -826, 136, 1328, 641, -607, -1429, -105, 1456, 1321, -707, -1740, -317, 1063, 1509, -855, -650, 196, 452, -374, -812, -6, 1331, 975, -775, -571, 271, 902, 625, -195, -642, -276, 877, 872, -224, -682]
3826f82O60P29p84o65M57Q02K20q51p55O46O41L5K09k69j673K40J165Q50j17j272
3846d14k42P83L92k36l90k94Q13r1j57m99J98N27L51q81j166N45J694M25j400
3865d2j252J111J607q51j055m5J239K46j130r37Q68J085N78j030j739l63K332
3882F22J126j337j967K62J553P99j196n36O67P27q25j97q9Q53J2k97m53k08K14
3901b70N74L48o02m21N9O74j13n35K18M34j20n95L56L30k65M61l78k26n31K74
3921c28J181O70j440j767J034J567N01j255j167J149L17k00k36j71j07O46m4r28
3939e78m31O97J666m32j961n56K023R85j084j705N60J354k91q10k01J166J26p47
3957b19n39o1M26J165r8j051j579J063J997J95j981j244J607J312r05o69L15P38
$$ y = [-682, -22, 707, -77, -742, -285, 517, 737, -114, -869, -223, 418, 453, 662, 393, -1280, -1040, 125, 975, 858, -414, -656, 127, 519, 283, -107, -401, 412, 321, 164, -335, -137, 390, 741, -140, -1306, -761, 933, 1358, -42, -1294, -183, 1424, 573, -482, -527, 712, 958, -172, -1109, -241, 844, 1422, 392, -1347, -1710, 622, 1748, 411, -1556, -1294, 259, 1058, -138, -674, -7, 720, -105, -302, -391, 462, 474, 177, -276, -484, -270, 304, 652, 50, -371, -312, 362, 249, -286, -68, 366, 246, -349, 7, 337, 72, 533, 155, -71, -602, -328, 853, 1523, 83, -1684, -650, 917, 1418, 163, -1004, 145, 462, 262, 26, -145, -252, 394, 350, -578, -1009, -312, 1354, 922, -1039, -1595, 428, 1413, 329, -1376, -816, 538, 247, -563, -764, 402, 528, -219, -758, -819, -393, 772, 674, -377, -1956, -893, 1104, 1299, -682, -1926, -319, 993, 88, -581, -266, 472]
3975D72n37m22N34K16o36J77R02l90j215K7J638P8r34r27Q17N56m98k54O54L91
3995F49j113k37R52l8k98O70K40j433p42Q89K700r14k906k90K421J132j251j573
4013a142N69N96M11q7k97o23P1J440l44j315o13J770J510j670j543O05J802m33
4031G07j497M20J727l77j989j14J430N92k84o08k77n82P54J351L37k299j154J779
4049h4K005j005j769J73J171n91k74J179q1j236l04J489N97j597j085J940O54
4066A182j300j585J511J419q02j080M30P49p48l38R31O12j271P5P40r18p06J127
4084B8K044j243l091M1L722J364l110k030J441K012l69j381M16j24j4K38N10j57
4102B97j177R30J373j368j608Q00K493p65k105Q2K041j51j670l11J902K3j294
$$ y = [472, -65, -487, 47, 263, -373, -196, 706, 316, -899, -872, 766, 844, -90, -1017, -200, 356, -142, -396, 258, 649, -464, -701, 251, 213, -85, 585, 825, -608, -1350, -461, 2239, 1325, -1581, -1871, 550, 1682, 431, -1142, -573, 23, 434, 347, 50, -573, -502, 938, 594, -721, -1334, 436, 1946, 276, -1267, -662, 1140, 707, -790, -370, 1357, 980, -1009, -1123, 307, 899, 615, 7, -270, -852, -98, 1253, 1590, -709, -1863, -84, 1921, 916, -853, -680, 491, -100, -374, 805, 724, -512, -816, 673, 1270, -327, -1412, 528, 1182, -118, -1703, -192, 1227, 425, -655, -225, 524, -224, -562, 369, 981, -290, -215, 525, -393, -1099, 28, 2072, 829, -2262, -2221, 1501, 2865, -245, -2275, -834, 1178, 809, -572, -156, -280, -294, -56, 454, 297, -880, 50, 1423, 55, -1553, -753, 1740, 975, -1130, -1048, 993, 842, -828, -1139, 763, 786, -508]
4119e08l61P38O00p19M90O66j503j154J493K071j158k233J50J701M16q11j07K77
4137D8o64m87J621P23j477j290J425J226j044j865J252K292r59k150L40K094j06
4154I79j482M0J071l50n50M68k65j83K4J203l47k348M11L112R69l218k339K187
4172f18K481o64j953nR61k90o59R38K16p25l78J002qj041MJ511j56j838J08J890
4192G76O34j693q35J002J073j386m74R28P43j015R2N90J4j534O20J912k05k237
4210i95o14K123J295j294j466L46Q43K09o7P32j475m07N46J159m81j245P89J175
4228A173n91j983N62K194L21k748l41J517Q11q9j337P28j27j70M30Jp56m02J571
4247G64P17j834j563J484K182p02k361L1J998M08j686J13P71J83q47N4R04l48
$$ y = [-508, -869, -131, 469, -250, 240, 906, -597, -1751, -258, 1813, 655, -1578, -1428, 273, 689, -122, -229, 48, -616, -1103, 518, 1241, -236, -1526, -101, 1125, 81, -1784, -532, 1760, 801, -1349, -1009, 1085, 979, -503, -463, 608, 258, -292, 176, -89, -272, -248, 955, 608, -1740, -1329, 1783, 2752, -466, -2805, -618, 1863, 1199, -754, -759, 202, -88, -747, 191, 407, -318, -696, 306, 298, -743, -739, 772, 616, -1222, -1114, 776, 1410, -283, -1118, -116, 957, -429, -903, 25, 768, -247, -155, 435, 449, -1085, -465, 1447, 1242, -995, -1609, 514, 1809, 515, -951, -605, 238, 447, 380, 1112, -363, -770, -224, 935, 454, -791, -2, 1173, 582, -1401, -839, 1355, 1676, -1072, -1413, 104, 915, 826, -511, 217, 90, -80, 350, 351, -405, -807, 764, 1481, -353, -1916, -432, 1750, 1048, -1313, -1282, 716, 1124, -562, -449, 322, 505, -342, -288, 616, 268]
4265B68k80L12J78j000q5J278O41r60j945Q63J590k32j240M90K27n38L43N80K65
4284G55j220m29J438O34j391p84J377J257j144j482J08J895j05p58o42M31J79
4301A19r5M02N3j128L78J112n38j340J69K152M4k257q12K120J488j018j916L14
4319g53Q94M07n7n01P7j47N34L04j149k56K53J355p13j417L10J858K2j168m68
4338f15K87O74n22k67O61N17j071Q7N49j45o34O93M45o46n57m1J570M5j125m45
4358e40J51O94J58Nl17j098N10R11O12j202p22N67J289o61j195J55J481N38j670
4377c34o92O78J047p2j123n0J86P03j46m12m26M50Q00m2j536l86J579J203r57
4396D70j768L09J496N23q30r61j4O48J27M32k89m79j44N01k81j31L61L42r4n16
$$ y = [268, -12, 300, 478, -522, -607, 671, 1312, 352, -1593, -730, 860, 628, -612, -122, 105, -433, -90, 490, 755, -465, -894, 544, 1178, -213, -997, 380, 1637, 493, -989, -881, 1014, 909, 151, -491, -60, 119, 24, 426, 479, -649, -271, 841, 303, -1037, -868, 1284, 1328, -929, -1741, 379, 1867, 849, -1067, -753, 141, 548, 491, -10, 67, -80, 454, 758, -391, -647, -394, 961, 248, -1169, -859, 999, 1021, -147, -615, -328, 346, -176, -443, 218, 735, -336, -249, 300, 155, -479, 214, 659, 13, -544, -585, 985, 1030, -95, -540, -389, 305, 463, 468, 151, -947, -437, 474, 1086, -116, -838, -271, 1018, 357, -838, -683, 798, 1336, -334, -1026, -348, 699, 627, -496, -546, -360, 343, 197, -215, -641, -191, 609, 567, -969, -1355, 224, 1427, 470, -1298, -989, 507, 1030, 200, -761, -775, -127, 0, 432, 143, -336, -480, 21, -260, -391, -30, 312, 218, -298]
4416b98l89O13M53M3n86m3J56p0J54J99j70m54L63L12q6m78j90J219L31r26j051
4437h98K24J634J03j112m45q8P52O48n76q62n8J199N55q18q26M74R50Q7j315m51
4457h23Q33J084m61r19l66O72P38o28n88k26Q68o5j70m04K41O11P49j323p63N24
4477d16J480J06j181r23O25R74J37m28n66N9K65M7n7k73j79L12Rl2k65J67N63
4498D24K48q04m13K82O96J15j35n29l06J30P35O9p22j10O85j5o06n80K20J519
4518I03n9j497k21P58Q63O9j046m91N91R72j64n74q25J72J047r4p85m05J207Q12
4538A233j080j048L72J030N75j287m20L66M40N54m64p67M08R3J17m44m75P00N52
4557D55j89q28k13P61M21k11m37l38K95l7N46J12p05j51K77O54k49m16q6J66P36
$$ y = [-298, -687, -74, 379, 422, -164, -207, -51, -121, 33, 232, 62, -392, -29, 283, 197, -281, -471, 748, 1079, 153, -898, -674, 960, 1063, -49, -494, -582, 170, 818, 242, -620, -678, 521, 1076, 258, -568, -94, 856, 943, -372, -823, 10, 1094, 633, -286, -652, 20, 758, 130, -458, -684, 184, 119, -51, -455, -214, 397, 1146, -177, -940, -416, 1064, 1170, -11, -934, -309, 665, 802, 374, -192, -133, 132, 179, 122, -151, -330, -18, -9, -41, -306, -139, 424, 672, -132, -545, -263, 433, 548, 413, -116, -422, -292, 443, 512, -210, -320, 365, 350, -256, -836, -616, 903, 844, -653, -874, -116, 747, 816, -230, -721, -130, 842, 678, 104, -721, -549, 498, 404, -381, -786, 421, 1233, 153, -895, -523, 507, 1082, -205, -625, -259, 181, 735, 271, -496, -88, 5, 122, -322, -797, -97, 455, 266, -562, -775, -14, 407, 196, -241, -579, -284, -321, 225, 337, -368, -519, -242, 412, 163, -253, -339, -173, 563]
4578E63p21k53K01N40K23m29n07j44N44M43j9j008k76J108K62l80j029K83J343
4597G44j47j455J62J176Q81j221j077K82P72N72k74r19l25N62Q05k72j115OJ084
4616B41M13r16q14O54J198q7j187m54R08L76k30o7n5k95r7N79K8p7l07N6O7j92
4638b58jN38L00n95l89l38Q49j63j96N63k24q28M91J171l33j147l51J324N08o46
4658B75j234J098M99j06p54m46M60Q34q3m37n56j42Q45P03p47r71M00J113m16
4677C35j062M24P62O10j246p32P43Q55K42j165k27L7O17K09q2p98r6P01N21o40
4697Hp39M04J080l57j207K00R94M16o76o96K99L5P4N33J24o03k45M10P68k95p08
4718a81k1M34K06q84K04M73J11k73m73L03o4L4N36J25j171l57J361O27j015j075
$$ y = [563, -158, -411, -210, 330, 553, 124, -383, -527, 17, 460, 441, -567, -843, 265, 527, 147, -882, -599, 744, 597, -858, -696, 480, 1361, 140, -937, -655, 117, 689, 415, -504, -829, -267, 538, 266, -849, -843, 241, 654, -262, -1076, -422, 776, 689, -498, -952, -44, 332, 102, 35, -20, -315, -412, 167, 195, 118, -189, -133, -66, -258, -259, 279, 579, -16, -405, -743, 106, -57, -253, 310, 86, -742, -251, 920, 587, -560, -911, 413, 921, 275, -959, 139, 638, 532, -222, -668, -208, 626, 543, 106, -450, -592, 253, 956, 209, -762, -362, 751, 335, -727, -303, 459, 1069, -177, -909, -166, 689, 931, -234, -461, -424, 193, 402, 320, -478, -574, 127, 648, 8, -731, -327, 753, 396, -811, -611, 383, 799, 123, -573, -274, -239, -165, 368, 492, -111, -356, 54, 822, 527, -181, -202, 232, 438, -446, -242, 231, 342, 69, -404, -101, -165, -131, 405, 530, -641, -998, 363, 990, -25, -1100]
4738a100J207O06k36j059J81J060M12j255m08M17N00K50J86j244o34R23J346k97
4756H55j401j92J228N01j302o33J146P70p66r75K22J181P3o58p0j03o8M74M50
4775G32l99p90J75Q20J66j059j17P93N91j362r3O01M10m11O1J51n96j90M71R08
4795H62l50j461L1J321K88r08m45R37J11m48l81M31O8OL28k95n47k36R96P50j350
4816b92r76J265J048p53j239K29J605K06j455o53J103N60n62m77l91L54N51M92
4834F15j11j416N3J351L32r06r82R40P34m20j101N44J004l04j106O59L88k70o8
4853f4K47J47l88o38R79L31j079j13M99M85p92l07K78J194o10m71J47M2l34O60
4873B13P48q64j062m5J787L89j237q50L63J113m73o96M75M25j79m47N61k61Q5
$$ y = [-1100, 107, 713, 477, -582, -401, 659, 1071, -184, -592, -175, 325, 575, 761, -483, -1117, -194, 1152, 855, -546, -738, 490, 991, -311, -944, 202, 972, 206, -769, -547, 634, 707, 49, -21, -124, -192, 282, 732, 333, -457, -282, 538, 704, -355, -472, 321, 912, -450, -543, 58, 468, 57, 118, 269, -327, -517, -46, 862, 512, -949, -918, 403, 691, -217, -662, 275, 386, -62, -443, -12, 56, 62, 390, 95, -452, -688, 308, 1058, -292, -1268, -3, 1045, 292, -947, -718, 887, 1093, -362, -1015, 88, 648, 86, -391, -782, -428, 123, 615, 504, -912, -859, 492, 824, -82, -1064, -124, 610, 190, -911, -367, 637, 333, -773, -114, 274, 4, -64, 183, 330, -58, -696, 283, 614, -465, -578, -79, 406, -386, -693, -415, 779, 169, -302, -155, -113, -447, 213, 961, 97, -965, -1010, 777, 1166, -71, -921, -558, 555, 82, -614, -139, 286, 107, -340, 221, -40, 45]
4892D5K96K34p40n63Q32R62n97j370O16J001q8j083n54J437O33j021q79M43O25
4911B29N29m22m85m83J00Q80L92n91q60M93P64l18o33Q2O57j11p00j3R32K37q64
4932a85P0K67r9m61O17J70L7r54K15R97l30n48j66R11j60m50k41N32l9k8j08j94
4954a47q35P01J003K23j351j000J119J240l98q28J9M55O48r24k46M32J53j89l68
4973b93J67j1N52J10k26j026N85P63j65n35l81Q75N80q05j008O08P69K6q10j91
4993d16O00J62n7Q9l27m88J47J108J88q71m04M78j3J09m15M6j64K54j36J15L33
5014C38l88K3M66l09m62P1Q27k15o29k56R74ll43m37N7M57m1m42k13N61L40K51
5036F27l79j102J84R16P45q06j103M31J073L83q59q63R92L61m14p65J93O43L3
$$ y = [45, 341, 575, -165, -728, 104, 1066, 469, -901, -285, 716, 628, -455, -1009, 428, 1061, 40, -839, -396, 229, 758, 336, -149, -632, -532, 348, 740, 149, -711, -218, 546, 228, -405, -323, 334, 223, -477, -490, 442, 679, -185, -115, 152, 53, -408, 209, 379, 416, -538, -323, 674, 344, -204, -370, 541, 381, -69, -310, 222, 183, 155, 47, -147, -982, -281, 722, 945, -406, -1406, -287, 953, 555, -273, -254, 201, 849, -75, -321, 111, 264, 75, -293, -126, -137, 415, 525, 299, -727, -142, 621, 456, -79, -460, 415, 995, 190, -818, -210, 559, 585, -225, -416, 184, 346, 289, 378, 51, -437, -290, 818, 1006, 135, -269, 209, 196, 305, -110, -64, -228, 26, -110, 5, 338, -50, -27, 439, 130, -332, -261, 566, 351, -278, -534, 440, 437, 94, -343, -286, 171, 130, -312, -525, 36, 376, 627, 248, -854, -670, 246, 991, 185, -918, -487, 586, 969, 110, -753, 239, 600, 186, -579, -386, 257, 290]
5055B90J12j057K50N25M20p8p71k47O63M87m54n25L78O08k15n61j77L97R9P5l21
5076a02J70j74O2O26j13o36j0N4O12l42l26p4J83K63J5m40J57k2M3L96q31j18
5098f07O40N18l88p42k5N79R97m93j109J1Q27M6m04o51O15O13j34p01m73R29P55
5119H03j49j084k22L19J115K31j370l26O72P57l46q28O4N60J73n74o7P4K37J67
5139B06k21k70K32Q3J87r1m35k11N37L83k95J58j11j39N9J50l2k15J19N75m81
5160A88n46J78P8R35l53p13m12O23O34l49n19R1L01M39m14k22k01L93L91m32m80
5181c90k99R57J70k74j098M51J168j03n30n97N22O28m51l21kM01L31r68M7Q0P68
5202D90K08m41o79J7N00N11p74n37M77J22O06o46l85M70R1p3K04m23Q9J98J45
$$ y = [290, 402, -655, -405, 120, 540, 462, -309, -556, 107, 594, 140, -385, -7, 601, 386, -175, -352, 45, 144, 219, -102, 68, -106, -44, 582, 469, -167, -177, -123, 489, 147, -179, -253, -70, 193, 208, -232, -75, -97, -54, 342, -489, -607, 33, 551, 163, -579, -604, -25, 972, 479, -630, -619, 208, 254, -150, -801, -186, 427, 293, -408, -881, 48, 803, 654, -430, -652, -333, 782, 1013, -357, -683, -11, 746, 400, -428, -364, 196, 369, -205, -272, -198, 39, 206, -15, -285, -53, 30, 217, 126, -309, -520, 17, 400, 105, 263, 152, 13, 72, 222, 190, -25, 94, 669, 188, -358, -180, -102, 833, 480, -233, -645, -22, 612, 263, -256, -165, 136, 575, 161, -61, -262, 131, 522, 90, -390, -689, 268, 438, 164, -934, -483, 685, 582, 52, -545, -23, 605, 154, -167, -169, 232, 563, -405, -358, -278, 490, 698, 257, -422, -405, 95, 606, -168, -705, -228, -106, 500, -146, -531, -61, 30, -43, 161, -262, -173, 25, 170]
5223A70j87q5m00K70O64j87l89r6L9M76j81k37l67N88J77L1m88k31M55L86n91
5244a83m21L45N37K61m49p22N03L91o6l31m03L04N97N7m10m69L35N55lm30q65
5265h67O62R95l31o35n27P54N87m78l92J0L78j28k12p4L62L38k32l34l43L77N68
5286D78N4n40l04J3N47l2j40l0l05L52J6l86K66Qj53L18m39rJ21K75L91l97l78
5309b74J08L11K24q4m93J77M3J20K8o55M51J53K46m51l75J48P59R7j037n26R73
5330e7Q28l84o53j76N42L93m73l19j85O36j96L6n76J0Q39q2k0q46K20R46J43r19
5352b93n33M90N28k24k93j50O31K44m06o4k17q9N82K0J15o18J46L74L51q69J45
5373a30K24J35l87J47K67k94P6K21J52m47q1J67L26k92o26M8J108L23j185m38
$$ y = [170, -17, -102, -502, -232, 432, 245, -144, -240, -201, 275, 94, -143, -510, 78, 255, 286, -202, -433, 22, 408, -183, -604, -259, 278, 539, 90, -632, -129, 262, 196, -135, -538, -234, 363, 420, 10, -459, -124, 431, 428, -2, -867, -205, 790, 459, -176, -703, 51, 638, 160, -232, -222, 156, 28, -184, -258, 104, 442, 210, -124, -467, -90, 478, 532, -8, -312, -299, 248, 216, 76, 46, -259, 93, 109, -277, -11, -3, -156, 162, -277, -286, -165, 110, 501, 104, -274, -166, 145, 369, 285, -208, -31, 12, 132, 160, -495, -44, 109, 355, -96, -471, -323, 436, 533, -504, -1030, -57, 771, 387, -266, -442, 100, 493, 20, -299, -484, 152, -44, -8, -584, -574, 265, 183, 163, -683, -463, 483, 626, -293, -826, -336, 192, -32, -325, -475, 156, 400, -6, -70, -287, -376, 206, 226, 341, -277, -131, 243, 594, -275, -130, 94, 229, -158, -11, 256, -38, 38, 259, 411, -36, -117, 50, 376, 84, -542, -494, 614, 937, -248, -686]
5393f86M27Q59k09j29p21L37O03j74p5o32K95M97j03o50r1L36Q25k98r99L45M63
5414B20K69n94j13K33L7J86r8k58J80J53K36l69l41o9O80K72o53o17M77R05l33
5435D03n19l85N38J23k67pK9j24m8Q00m14k97j03L10O8q5n27M30M50k57j48j47
5457a77J7q8L11K55l6q32P14J95n5q06O5J201l1j194L3L23P49n33n56O9N51j4
5479A61J73k20o31J88L75J08o72P7N36N76m65r27L24P35L56q17l30J1Q89o14r5
5500b62K27o2J14q0L0m33N20J58K83p70k54M33P15o37n85J88P87k66Q0k27j49
5521a90j86R1P16l94l87j27N61L63k77p34M37N15n0o51l15O47Q9j66P0jk12JL47
5544A47j5o94L32M83l1r29k5J319L00r30o46K71J113j88o38l09L91k38O40k39
$$ y = [-686, -259, 600, 391, 262, -459, -122, 481, 307, 232, -400, -105, 392, 289, -361, -452, -116, 709, 411, -588, -243, 220, 489, -105, -218, 15, 52, 238, 140, -118, 62, 215, 451, 82, -259, -328, 352, 624, -29, -646, -169, 736, 403, -116, -501, 37, 160, -107, -114, -85, -209, -257, 543, 129, -168, -271, 39, 107, 22, -505, -75, 375, 118, -30, -177, -160, -248, 63, 318, 282, -550, 164, 359, 304, -502, -437, 764, 733, -461, -428, -105, 644, 111, -445, -376, 175, 161, 334, 114, -517, -329, 46, 154, -518, -441, 95, 671, 206, -721, -397, 338, 694, -123, -453, -442, 447, -167, -262, -35, -97, 17, -63, -33, -466, 54, 212, 495, -275, -529, -96, 619, -18, -603, -415, 372, 106, 186, -41, -190, -376, -285, 431, 37, -350, -477, 84, 447, 170, -564, -127, 388, 338, -313, -628, 19, 108, -58, 12, 11, -201, -200, 147, 132, -562, -230, 253, 222, -707, -732, 587, 887, -43, -689, -418, 695, 507, -131, -440, -49, -287, 353, 114]
5564A14k06j20L16P16q53m08J83P77P4j156J80L48M17l00m01L02L95o84K4K32
5584e0J55k50J43J51M7l93K51L35j96l24k86Q91Q7p59nn8L9J52K73Q1m61j36K32
5607h1M14l28n18M22N42k3o52o3Q27K07q54j82J11N78k89m20L05k88N01J41%r55
5629f05R8P81N45j067n04N94Q24k89r23l05J147N27q34j96k38K73L49r7l58K82
5649DK5L18k5p70Q4N98L61q13k41J40L19o1J91J42l04j34J02M51l90j38J08M73
5671D40l86j71k16L53L48k18n62L84K16L07l74k11n19M37M37k86l32l04N34M95
5691C72j43o85P4P03J08n17n15N60L29O8m05l33j16L43O33m17j73j11L59M19o61
5712a08l20M89N73l12r81M33L70L91n54m96K49N10j79n9P8J9m65N25j23j23k54
$$ y = [114, -92, -212, 104, 820, -33, -441, -258, 519, 593, -563, -383, -35, 382, 82, -319, -17, 378, -306, -282, -50, 105, -145, -2, 149, 196, -197, 54, 389, 193, -131, -417, 474, 561, -198, -203, -261, -222, -70, 203, 284, -177, -313, -81, 333, 5, -513, -91, 451, 428, -224, -287, 540, 747, -107, -289, -178, 400, 111, -309, -4, -292, 209, 350, 350, -605, -507, 274, 819, -248, -752, -158, 666, 377, -546, -851, 296, 823, -11, -207, -445, -172, 177, 80, -278, 4, 29, 347, 322, -448, -364, 234, 595, -218, -459, -319, 0, -61, 130, 272, -32, -166, -64, 387, -3, -141, -33, 440, 54, -117, -333, 20, 368, 150, -412, -28, 188, 495, 121, -90, -609, -172, 265, -21, -353, -657, -123, 372, 229, -456, -382, 321, 429, -88, -603, -43, 286, 354, -51, -384, -500, -157, 476, 59, -114, -225, 134, 553, -108, -428, 61, 634, 322, -659, -226, 144, 535, -19, -515, -266, 244, 65, 6, 84, 103, -362, 163, 40, -83, -337]
5733c37K28M63k50l34j7J14L12j90j74m6l1K20K76l56l15j09P33M7m45LK47N16
5755E55n07l28J26M81L01o75p64N38M47J88m18j68j90O67K56l66n27J14N94q6
5775B38j63o00L32O17j17n16j89K69P62l97j71m18L73J66K4j24o12P25K70m06
5795F3k20J31J08K40j93k89P2L21J09m38j8l43L47K14j15k7l01N83p0j53m1k57
5817b77P98k39m15j79L1O3L87r8m83J72J60J95K52n55k60O14K9J03m57j90M36
5838H7L56p48k98M29O28k01j92q13O98P38o8m16q26P96J57Rm66j48L33K22q9n03
5860c15m0O85K17k73n07j22N86m2J91o27Q6K5M09j83K85m43K1N7k66k9K25Q1m5
5883b4k2j38q3M15n7j37R0l72K33K93J65k31m21K29M60l24m18J61M91j27n65m0
$$ y = [-337, -109, 354, 104, -230, -247, -133, 179, -11, -185, -231, -262, -42, 234, -122, -437, -546, 187, 234, -211, -208, 39, 555, 48, -280, -154, 327, 628, -47, -811, -273, 174, 362, -56, -224, -414, 253, 509, 143, -384, -270, 324, 238, 75, -525, -193, 424, 307, -209, -398, -129, 633, 236, 65, -353, 20, 186, 210, 86, -526, 199, 469, 63, -157, -26, 82, 322, 129, -160, -88, 233, 342, -96, -114, -457, -110, 104, -11, -38, -339, 244, 174, 21, -20, -277, 521, 282, -133, -312, -281, -218, 169, 71, -412, -240, -80, 115, 367, -188, -448, 166, 195, 298, -159, -349, 87, 443, -305, -603, -174, 454, 253, 61, -752, -54, 684, 616, 200, -626, 170, 327, 336, -130, -278, 55, 277, 188, -315, -355, 330, 547, 274, -233, -355, 231, 189, 380, -247, -161, -136, 273, 90, 375, -68, -47, 10, -256, -285, -60, 21, -24, -46, -184, -267, 148, 91, -46, 44, -328, -95, 198, 363, 132, -289, -60, 400, 76, -342, -181, 310, 183, -382, -422]
5905d22J46M61M84p46j55k78N58M25l16n46j90J097k67k23m36M63J72L3k68m54
5925d62M72N3j65j66j21J09P00N1o31k56M65K74j11k83k28P97j94k15n70M99L59
5946C77j86m34j94L50M8K66L43n30k60J89J82J11m50k3K42r6r6M4j3K90Q5j20
5968A25k02n3J95K15l58O0l87K80N00m60k8k58P48o2n41o8L11M69q9m98m65M68
5990i8P8L74o55k11K19O16K63q96k92P83K93m95l34K07M69N4j27q77M84K54J00
6011B09k6k32j11j19N73l86k2O3J32J73o18j55P11O8j34n24J12L67p1N20n08L7
6033E9o00O08N85l00q49O1M06L10q6j68j37K14J06j78j86K52l21K26Q8k37N6M82
6055C91J74m94q0j01N71j54l71k27K68N58j72m67L9K96J23j78o59O8K17N55m8
$$ y = [-422, -276, 185, 669, -77, -232, -510, 48, 473, 157, -389, -579, 518, 251, 28, -408, 55, 227, 260, -8, -462, 10, 63, -102, -268, -389, -280, 420, 471, -160, -416, 49, 323, 212, -71, -299, 498, 304, 89, -481, 18, 377, 191, -243, -437, -87, -39, 227, 570, 40, -220, -31, 151, 262, -188, -211, 31, -65, -161, -117, -130, 160, 245, 125, -77, -130, 65, 280, -78, -18, -405, -125, 375, -85, -113, -371, 377, 315, -226, -294, 17, 486, 397, -101, -566, -98, -20, 354, -301, -512, -293, 323, 586, -310, -602, 181, 474, -21, -355, -148, 321, 375, 248, -629, -145, 109, 209, 183, -49, -160, -279, 294, -92, -114, -51, 81, 254, -364, -519, 192, 260, 126, -398, -286, 81, 10, 530, 22, 59, -541, 67, 652, 352, -497, -436, -30, 280, 194, 26, -111, 103, 209, 31, -155, 97, -224, 2, 90, -147, -91, 391, 565, 71, -9, -110, 461, 307, -64, -291, -23, 535, 363, -104, -65, 231, 354, 176, -483, -415, -198, 357, 309]
6076C09o26j06O19L65n66j69n4K90K33m92J93M98m37j59j14Rk07O69rj29l31J62
6098e2K16Oj55l33N16P2O6k01l43K0K27k00LL7j70N10M5L8q29L13N82J14k81r37
6122g36P62L78m95j50K64K54j68K70l39o65Q12K59k21l78k86J55M04J06n06l79
6142f59M89N31l62n36K25O63n5l93j65K30J46R5p0m81K13J86M09n83j77K09J92
6163A07J83l41Q0J95J88m25M3j65K83Q5l47K66l45O4J44K80k37p01L86L65J48
6184B56n28J44J89K30o11J94j18o1K40N30m39m81K74N22O2l73l11L6O77l68m39
6205c75j27K21M25l31j44RQ54k02j53l32k71M61N62n19m17J27N09K62o87j87M96
6226A81N4o5m33M8M77K79n31O1k1k28J65J90k46k17M29N8K19o83Q8QL35p6j29
$$ y = [309, -317, -423, 196, 561, -5, -174, -228, 62, 295, -197, -4, 494, 57, -102, -216, -207, -414, 255, 246, 117, -214, -52, 164, 170, 15, -318, 198, 270, 336, 135, -208, -188, 39, -161, -158, -121, -291, 219, 264, 302, -527, -214, 368, 482, 201, -736, 26, 404, -91, -241, 23, 277, 109, 379, 40, -625, 187, 446, 225, -153, -439, -284, 120, 226, -280, -659, -170, 361, -1, -537, -312, 351, 296, -97, -262, -32, 114, 209, 139, -342, -129, 57, 466, -117, -294, -85, 107, 290, -51, 29, 224, 412, -13, 30, -135, 148, 233, -114, 152, -193, -129, 15, 295, 58, -643, -257, 108, 256, -272, -128, 61, 291, -320, -126, -244, -305, -65, 465, 26, -455, -181, 341, 403, 30, -281, -245, 432, 64, -375, -502, -281, 144, -187, -331, -322, 532, 330, 177, -155, -426, 35, 597, 78, -339, -212, 297, 559, -128, -315, 181, 235, 170, -263, -215, 262, 541, 10, 71, 50, -178, -13, 177, -69, -286, 143, 201, 420, -263, -175, -167, 168, 92, -37]
6249c7J32p7Q4J86m37N07l35l01M61j92r0m2K95K08m47k24J1L78J77n35J16p8
6271b40N00q2l81J11k38N31K89r06J23K66K96l59j41PN44P5k65m86L35M05l05
6292G9q6l24M26N2K06n44j3m7M58R3l75l35L62L37j3k46k53L42k6J37m15J94j87
6315a78M2J08Q0p2j88K00K03r9l81N89j88J28k30n5o9n6P2N9N8j08L57N7l03k91
6339b65N5N55L78j149m07Q74M42k68m64q3K72M23l05j80j96J29N14k9n72p0M26
6360H0K21k01o39M07L62k48k04k72N07L87j52k07p6l2L80o12J81p6L91J32j63
6381A66m51j15K99N15M2o13j43N7K74Pj81k8J69k11M6M3J22k46N27O6k03l55K64
6404E1RN9nm48K72L47m6n14J21M50j79j06k20m96M89M53l1m27j24O67J26k41n37
$$ y = [-37, 95, 18, 102, 288, -149, 358, 23, -278, 183, -9, -99, -141, 154, 362, -85, -309, -298, 80, 257, -278, -162, -240, 260, 178, -203, -92, -330, 201, 490, -416, -293, -27, 269, -90, -231, -224, 320, 395, 130, -356, -21, 384, 79, -7, -331, 95, 147, 353, -191, -204, -251, 207, 300, -75, -410, -48, 289, 276, 30, -223, 119, 93, 230, -185, 9, -178, -136, -28, 52, -20, -208, -8, 195, 96, -285, 304, 116, 244, 14, -41, -110, -166, -94, -35, 23, -85, 272, 329, 26, -265, -210, 345, 723, -426, -833, 41, 483, 215, -249, -332, -60, 363, 58, -122, -318, -189, 325, 296, -276, -346, 80, 301, 100, -539, -132, 230, -18, -222, -494, 13, 400, 248, 41, -35, -67, 313, -299, -118, -194, 197, 329, 166, -285, -400, -101, 414, 456, -157, -300, -243, 31, 38, -143, -171, -2, -213, -167, -124, -2, -248, 279, 345, 142, -213, 51, 60, 119, 114, -334, -62, 285, 239, -275, -154, 296, 117, 11, -209, -705, -216, 237, 206, -221, -345, 322, 448, 207, -330]
6427c30k96P30K43l19n73M13Q1K36m13j16K03L06l28n2OJ52m2M02n27o4J32M63
6449C07k61n00M87Q3J01j89j22L32j43j83J69k45K98j00M82n52j11OjK27M9k24
6471i0k26L27j0r0kjL6O7Q6l06j8J86N8J94m39n70J146j0l79k05LL52K65l96l09
6496c31J20K48R6m4n02M20P9L01m76n73L91J039m20k40m02M16K91m27j30pL18
6517A67J23m96j18L06Q8j43j17J18k11K56M20j67m00M3N10m02k60J83L1R3P0k10
6539a16J74K41k46K33k06k10j37j60Q57l10k31P1JM05j27j31j29j92J81L01m40
6560a71L8J85N7J88k98l69M09N01l54k21l54N82J29j90l04k06M77J87k65o5J25
6581H1K05j2n27K4N31J81l42l54MJ69M03m70k74J8L48J39Q0o2l0k6l38J24o4M3
$$ y = [-330, -626, 104, 347, 28, -545, -132, -51, 185, -228, -344, -141, 165, -163, -215, -209, -57, -99, 303, -224, -288, -156, 307, 46, -454, 33, 116, 217, 28, -94, 238, 95, -88, 81, -164, 134, 34, 516, -36, -147, -141, -142, 85, 134, -90, -316, 11, 1, -89, -91, -92, -56, 11, 97, -209, -227, -41, 17, 211, -228, -798, 348, 338, -41, -246, -243, 109, 374, -22, -331, -211, 37, 133, 89, -413, 7, 86, 387, -89, -662, -271, 768, 348, 108, -294, 122, 413, -14, -144, -151, 167, 290, -206, -324, -18, 70, -73, -190, -72, -283, -27, 393, 226, -174, -131, 379, -23, -283, -100, -69, 24, 94, -116, 58, 299, 53, 286, 80, -130, -267, -427, 430, 120, -111, -40, -39, 366, 239, 108, -21, -213, -32, 269, -171, -133, 52, 109, 297, -1, -370, 39, 540, 186, -35, -389, 193, 322, 132, -172, -378, 99, 286, 21, -44, 81, 286, 274, -253, -229, 302, 483, 141, -213, -209, -40, 363, -107, -381, -363, -15, 124, 204, 142, 112, 86, -252, -128, -192, -149]
6605a49K31P0j25l07L92k15J66j40j91K36k1Q7m1l3l6m5j8L90m1k88P3nM2n03
6629d71J38O83n3m07l82K08L85M79l74l85k21O07o7n50L91M1J71N8l05l49J80
6650b23P95j62p43L5K62N4K5k32J20L06k16j58K45k13K94k6j12l40J27K48l0J64
6672B20l89oO04m00k44J23M67oo71N63k81NO2l00L85k94L03m0K0j04j47L41n6
6695A55j62%K36k40m1L25J09n62J02K86j08O4l77j23M38J40n11P4k1O10l7l35
6717B2j96l83O63O9j53m48P12n7j89J15l09R3P35m61n57q2P62j52p1m97K87J90
6739I3L34l33l1k06M67l77K83j49k90L63k38J96l06n8N35j56o04L69j79L98j69
6760e8M87l71q2k6K73K5m05j7L66P6l45j64r2O13j7l50p4J45J48J81R4k70l95
$$ y = [-149, 82, 152, 27, -280, 112, -103, 63, -77, -268, -32, -53, 34, -7, -40, -76, -121, -139, 251, 210, -78, -5, -10, 32, -471, -333, 350, 297, -110, -492, -284, 101, 580, 206, -179, -400, 207, 140, -410, -19, 22, 193, 251, -54, -403, -223, 572, 410, -333, -298, -36, 18, 43, -189, -69, 237, 21, -137, 108, -105, 189, 163, 51, -289, -162, 86, 56, 220, -169, -175, 429, 29, -215, -92, 375, 369, -302, 261, -20, -15, 47, -253, 132, -162, 141, 101, 121, 17, -130, 211, 155, -7, -7, 229, -11, -52, 273, 382, -180, -78, 208, 100, 164, -213, -336, 102, 242, -269, -195, -216, 394, 357, 22, -174, -557, 106, 175, 22, -426, 286, 229, 40, 155, -154, -61, 674, 213, -344, -426, 336, 184, 113, -384, -97, 93, 427, 94, 63, -143, 324, -53, 230, 81, -209, 154, -84, 112, -194, -252, 283, 127, -477, -108, -287, 111, -58, 429, 58, -24, -50, 223, 248, -157, -174, 192, 268, -77, -241, -333, 280, 263, -87, -161, -16, 132, 313, 407, 137, -258]
6783b58L25K4j21O5q6M59j37m69k20P13J32m07j80J11R9K83m34k39J48K03M79
6804D90m13j51j24L53j98j9n38M65K34j26n74K33K71J08J10l61L10o3K65j75k35
6825a38K17k05J32j1J79k62K58K66m51j80n2M71rn0j08Kk95J81P7K50j70k94r2
6848b84P50n70j40L89MK67p30JK94M24j32k83k64M44J1L72n65m75M19K85J66l84
6870aN3l7M32m80k38k04Q80n04jn07N16O12m93L4j90j89M86L91p34j0M19j1J36
6893C60n63J14J36O9K9j46J22p0J98p8K00j32j01k00j4M25k43l3R3k48J77j68
6915g3m0K34M4Jj61j97N0N15n95k32L23N2K44m35K1K09L59p6n49j29L36N69l26
6938A44m51J02L31j1kl96K59J86J63k41l56n4M89J22j58j06L60l54jl27N1N69
$$ y = [-258, 67, 91, -30, 35, -51, 408, 271, -198, -418, 295, 427, 20, -160, -49, 50, 333, -101, -340, -192, 11, 490, 77, -74, -198, 155, -43, -62, -600, -135, 99, -27, -601, -368, -97, 11, 121, -240, 70, 7, 272, 97, -138, 79, -126, 6, -5, 174, -88, 170, 436, -15, -195, -247, 224, 215, 165, 57, 59, -236, -55, 22, 272, 102, -192, -284, 466, -104, -244, 145, 149, 416, -314, -313, -19, 405, 273, -10, -274, 170, 181, 553, -12, -487, -68, 217, 383, -1, 52, 15, 447, -33, -271, -475, 405, -99, -100, -607, -91, 521, 28, 62, -128, -317, 169, 560, -174, -184, 235, 224, 360, -203, -89, 47, 116, 145, -1, 121, 51, 249, 171, 371, 239, 138, -62, -76, 349, 106, 73, 166, -82, 95, -73, -113, 121, 165, 166, 5, -192, -142, 373, -222, -454, -131, -79, 165, -270, -249, -40, 319, 243, -306, -435, -99, 470, 144, -307, -205, 126, 115, 113, -283, -24, 162, 325, 84, -272, -326, 163, 285, 127, 21, 381, 27, 26, -301, -250, 319]
6960C19j89N0m69K37K34k2j60p2N5o0J79l11J06j44j7M06j52N5j41K58k76Q6k83
6983c11k5J32J70K73K26n77q9R3K50Pk50L35l8j31l45Q8pL44k67k0k5j31M82R3
7007B77m54N2L85Nr7l45R4O4L72j72m54K30M41j32n71J3J97K28Qj90j11k8K30
7030D2J14mn55K67L66k33k53L32K43j91j19P5p2O0R3l41j6k97K10N01k12K0m1
7053a1QR2J43j51Q0r1R3j91k9k21K24L6J13L18p62K63J57J40j90j40k45N28Q3
7076B47k31k22M42J73k99j00l14K65M15n30q3j4L72K06l31j15k20L08J24n1k9
7097A3j42L79q2q02L21K07L77l61r9O2j28N43J08l42J57J43k51j95K06k61n0M9
7119a48r9j63M04K07q4l04K52R6l47L13J74k2l63j58J29L32k87k11M03j35O1j11
$$ y = [319, 130, 180, -289, -52, 182, 160, 0, -72, -17, -77, 102, -209, -103, -247, -264, 142, -10, 45, -96, 162, -114, -28, -311, -336, -204, -34, 239, 465, -112, -201, -108, 142, 149, -101, 234, 196, 65, -280, -192, -199, 145, -122, -142, -167, -298, 184, 277, -177, -125, 260, 265, 168, -177, -83, -19, 353, 181, -273, -43, 398, 266, -305, -292, -95, 133, 141, -49, -160, -188, 42, 156, 152, -403, -136, 230, -3, -256, 76, 319, 128, 9, 84, 12, 72, 165, -176, -192, -489, -279, 222, 10, 30, -11, -3, 89, 232, 81, 161, 70, 163, -28, -57, -278, -54, -18, 95, 413, -349, -86, 71, 211, 21, -119, -364, 164, 247, 16, -206, 236, 409, 110, 10, -304, -39, 376, -154, -237, -251, 121, 327, -4, -119, -339, -31, 93, 42, 13, -129, 250, 168, -634, -313, -106, 271, -90, -189, -127, -255, 288, 396, 54, 211, 354, 103, -92, 114, -147, -197, -148, -247, -410, -6, 201, 117, -187, 65, 161, -186, 127, 301, 279, -84, -242, -113, 219, -68, -279, 124, -11, 50, -61]
7141f1p7J02J01k50Q3K18J01m03L25n00l7L76M72l95l66K66J82J11r7o13M69q4
7163g7K24K7m83J47J32J57pl55M48J52J29p08LK31M00n7m13m1J13L64k52l66L75
7186A43Q1k35oj72j10L58J5j73J23jr1L3J54N2k02J73K11m71Km0M08L6k60J01
7210A29l28m2J14L77l02o8j90N12J38n05J80M2K50n37J04M53mn53q2K9k45Q53
7232C25k28m7j67j68N69K38n23k43K09L28K34q11K67K34J43j81l78j2L33K30n24
7253a72K27j90o7M40P2k30k54J92p2k94L29J01J33k43Pk10N3M21J25n75Q0K11
7275H4l26N86l98r5J65k78J58K15j63j75L05K69J8l41m75K10L60Mj11j53J99M54
7297E12n41j90N2J11m9O5L55q95P93k91P8k20k22P74m37l49K20J16M93j46o08
$$ y = [-61, -138, -36, 65, -185, -102, 116, 217, -186, 139, -361, -398, -22, 450, 55, -311, -45, 137, 248, 151, -462, 7, -77, 147, 174, -309, -162, -30, 127, 120, -235, 213, 365, 494, -214, -211, 20, 420, 363, -50, -91, 22, 386, 134, -232, 143, 224, -11, -17, -189, -299, 59, 74, -99, 24, 23, -68, -35, 119, 171, -31, 142, 353, -118, -116, -156, 252, 288, 28, 129, -199, -241, -127, 250, -52, -120, -310, 202, 340, -165, 15, 57, 307, -230, -126, 327, 323, -230, -312, -283, -528, 325, 97, 50, -117, -285, 284, 522, -1, -244, -35, 293, 527, -284, -17, 217, 360, 179, -199, -211, 122, 352, -172, 55, -135, -202, 238, 310, 80, -174, 18, -54, -348, -19, 82, 215, -28, -21, -231, -178, 243, 368, -207, -127, 84, -242, 344, -54, -149, 16, -262, -104, 111, -52, -227, 78, 347, 365, 24, -451, -241, 119, 123, 12, -141, 58, 512, -29, -219, -167, -56, -105, -40, 315, -580, 213, -78, 0, -220, -442, 332, -105, -454, -234, -118, 375, 229, -379]
7318c79m3O44k6m73J83L29k64n6P1r7K25j80j05K33j75m6L69n3J40n07K14J46
7340A50j55k29O2K67j02k20K97J52n4k44L43k43j5p5m2N35m64k20JJ35N52k77
7362A54m82L50k8L07m52O1J66K17j79J48n07k9L67n0J89n18O1J57J16r5k85K83
7384d9O6j22L1K57K0J18n21j03j26L97K91k3k98l14M35J9k34M2j02J8M06J57m32
7407f7J55K85l67J9k76M96l66K50O9p5j61J89K14j10k81k21R7M93n4N6m07j86
7429b48J99P4p2j96K60K86m8k75k17Q4P49q57k90Q3N04k3k45n5k4N02j92k44j12
7452c57M06O3p9L2l39J41K65R8l02j33J23K39j17K1k55J25P6o6O6M43l50o0k07
7475a67k05M55j58M55l25N8k92J96L0O4j76rJ87l39K38k65L16J26n5o7k70r1K33
$$ y = [-379, -422, 222, 196, -277, -94, 235, -29, -85, -14, -111, 114, -66, -171, 62, -113, -159, 210, 157, 297, -210, 4, 150, -5, -234, -172, 95, -7, -227, 70, 222, 168, -76, 267, 24, 9, -66, -108, 427, -37, -257, -256, -121, 431, 154, -328, 22, -6, 301, -151, -90, 76, 293, 114, 262, -245, -274, 93, 43, 232, -286, -225, -68, 48, -47, -332, -49, 17, -105, -74, 183, 203, 321, -200, -303, -429, -32, 259, 236, -62, -376, 59, 78, -156, -114, -216, -198, 208, 365, -67, 88, 373, 6, 25, -251, 245, -121, 129, 198, 123, -38, 151, 365, 255, -26, -247, -150, 343, 289, 345, -62, -248, -49, 25, -47, -243, 17, 303, 255, -20, -237, -153, 596, -261, -551, -468, 36, 13, -232, -287, -311, 191, -1, -245, -357, 49, 112, 33, 65, -274, -133, 132, 230, -72, -205, -82, 157, 40, 61, -194, -69, 7, -59, 7, 450, 100, 40, -167, -372, 83, -75, 380, 55, 113, -179, 17, 47, 111, -65, -74, 113, -226, 12, -253, 63, 189, 134, 67, -203, -294, -61]
7498f1K73j75o1N7m4L99k32j25K70j92J48j17m6j15J66J14j17m61L2L83M74o60
7520i0k84L22K67k46l36L49j29L69k66j87J65K04j23J16m82K97j00L66j07m54
7540c49J12M48N9k11j50O9J63J08m14L72J04k95J01l23L77Qj36J6j50O6j72KJ78
7563a7j44R7p7K08j35O9K00Jk42q1M10k05n6j40n3M31n85j18P09j68Q2k34K02
7586A54L8P6r1k83L63l48K52L0l43R8K93o2m14j21K55J09N5n14K03K99K97m78
7608a32Q2j17M30mm76j62L34J95j87l17J03N57j76l1k25m0k1L49R5k94l47N54
7630A70P9l46m0n8N01l29o7j6K12j96r7M36j11m95L17Q4j9j47M5j9K94Ok33Q5
7654E6j05L39j03l09pj18P48l19k80L7K1N15l17l41r6J26M05n9k99l26M86M24
$$ y = [-61, 212, 37, -24, 33, -11, 388, 156, 31, 301, 109, 257, 140, 94, -21, 145, 259, 142, -319, -287, 96, 570, -90, -374, -52, 215, -31, -367, -18, -147, 222, -44, -231, -66, 138, 15, 131, -351, -54, -154, 212, 105, -349, -237, 211, 270, 59, -91, -22, 141, 249, -165, 207, 311, 16, 117, -206, 171, 179, 43, 59, -91, -25, -197, -195, -17, -161, -64, -141, 67, -68, 1, 201, 202, -40, -121, 289, 84, 28, -112, -165, 266, -319, -437, 272, 104, 186, -48, 154, 192, 268, 177, -106, 257, -91, 161, 191, -152, -54, 239, 177, -237, -358, -103, 6, 61, -453, -250, 49, 346, -132, -50, -167, 263, 259, -217, -379, -45, 150, -37, -354, -251, 306, 130, 99, -126, -166, -187, 162, 257, -37, -384, 170, 249, -97, -137, -195, 306, -23, -90, -106, 106, -90, -187, 249, 138, -357, -40, 44, 25, -122, -77, -96, 198, 204, -29, 56, -49, 290, 187, -122, -129, -247, 501, 182, -98, -61, -40, 475, 158, -183, -279, -153, 252, 193, -106, -432, 54, 478]
7676D78l28j05Q1J34j97J72j6Jl4j48j48k60M8O13j85J69m83K00ol14K73J33j22
7699d4K04j05K0LMk1j3j92k2L29k39K56k81lKL63k80k11l0M08j91P9J82k12l44
7724c38M15L24l55j82J55J02P7j65j88J12O1M4K29l65K67J1lk97k87K00M08k20
7746EQ5m95O10j06j0m17L25K7O4j09j34R7P1j8N2j0j07L0N19n08l10O98m35L99
7770C23k21l14K59K24l50J08l48K54j54L24l68L64rj16J4k83P1%R1J86k87j53
7792c85L42N5q8L9k6J99j22K83k64l30P4L85j5k37m45K82L31j68J37k86J49K49
7814A59p1j34Q1j06K89q0k50K9M52k85l64k40R1O97K48o66n6L77o2j80P9j35j71
7837b98L80nj58%O0K68k68j2K21J19j71j95J42j97K36M31m17j93m6J22l3K3M5
$$ y = [478, 150, 45, 126, 260, 63, 235, 219, 220, 186, 38, -110, -370, -322, 291, 106, 275, -208, -8, -14, -328, -55, 78, -44, 160, 55, 75, 78, 82, 61, 48, -144, -166, 163, -76, 180, -101, -104, -102, 261, -19, -230, -260, 148, -43, 36, 218, 6, -338, 77, 401, 46, -136, 19, 121, 198, 33, -155, -43, 18, 62, 291, -74, 193, 204, 201, -96, -383, -183, 225, 5, 90, -405, 205, 99, 89, -328, -3, 24, 88, -21, -155, -58, 13, -5, 47, 37, -70, -40, 479, -29, -339, 359, -76, 323, 102, -212, 47, 271, -79, 29, -319, -65, -219, 105, -263, 101, 92, -24, -10, -293, -222, -222, -131, 55, -232, -385, -43, 12, -76, -37, -63, 136, 14, 297, 33, -297, -223, 162, 147, -90, -535, -253, 78, -90, 47, -239, -90, 159, 88, -46, 35, -71, 218, 138, -112, -83, 369, 84, -280, -520, -429, 268, 516, -150, -206, 171, 109, -71, 8, -127, -298, 82, 77, -81, -81, -21, 247, -21, -33, 188, 307, 136, -59, 83, -114, 122, 553, 136, -57, -103, 19, -14, 9, 54]
7860E4n4K18k02j24K95l66J7L97J04o22j20M97k11K95o07jP6L44J25k88k66L41
7882i8K02j04J97l75J24L08n29P3q8M99nj39m93N45r9p1J45l42K01L33m79K96
7904A01j08n2L72q7l67p2J95R8J89k93p0K10K07j79j57k12M09J35k89j95j5J56
7926b4M8K5k43o3J26K58R9k6n0j08j08N67m62j97l6K39J76k51m0j14K31k2j27
7949a02K75k74J84n0l20J43L85J10j21j43k18L14M4k47j11o4L56l8k07p3L97J89
7971D29M6p46J06J3M47o1M9l35M2K37j30K2k03L48j55m36J20J58J16r8m2M8L6
7994A1J04R1k72pN7j38K1L5K03k9K46m51L44r6k22J07j73L56n08j15L66J90o5
8017E5l04N18o05O77k76M6q9j16L92j37k59j82L24K5J31m72L81K66k21l53l8J12
$$ y = [54, 0, 218, 16, -108, 187, -179, -162, 235, 339, -283, -403, 94, -117, 178, -429, -430, -354, -10, 115, -173, -439, -98, 104, 0, 197, -178, -54, 254, -275, -202, -290, 209, 204, 65, -428, 117, 18, -53, 92, -250, -49, 284, -195, 101, -7, -59, 313, 226, -141, -213, -18, 80, 269, -24, -94, 116, 323, 144, -13, -225, 184, 319, 30, -165, -180, -24, 24, 49, -194, -257, -131, 127, 226, 200, 150, 42, -66, 501, 39, -158, -194, 45, 221, -30, -70, -184, 47, 25, -102, 173, -101, 83, 33, -287, -144, 241, 351, 230, 87, -131, 183, 227, -20, -131, -195, 161, 123, -84, -157, 240, 429, 475, -271, -165, -152, 295, 234, 283, -52, -10, 227, 97, 119, -84, 264, 109, -327, -207, -49, 67, -31, -73, -25, 11, 115, 206, -66, -73, -16, -154, -133, -98, 105, 76, 322, -129, 215, 119, -103, 4, -169, 187, -321, -436, -70, 120, 55, -249, 269, -336, 341, 65, 111, 22, -94, 298, 161, -98, -280, 44, 69, 200, -272, 109, 375, 154, -199, -237, -125]
8039a25N78l42k32K8k02O50k60k66JN7K16j50j14M01n0N4k7l61P4K69j0m9j42
8062bk16K56K6l21J7J87J05J5k0l03N42l80P1j12K79j16K2N7R6j75o2R1m6j08
8086i7J42J16Q9q5j21k58Q9L18N5l28J00k43K10L18m25m20J80J99N29l94k84J20
8108a90K96l8ql43O9L82k07K59m25L65mj34j42M22l45K7K33k42M8K88k64K57l90
8131h6K16j46N2m8M8j3J76n5j41k45J96J60k5k32K34k2k75J60j32L14j80k5j36
8154b05J35K4J13j79J94O5j62J51j79O6L92p90J9J23N94k74k27j8M25L33n08k23
8176a31j5N90l88l8m27N09j56J58j80K46n8R0j90k39m3
$$ y = [-125, 453, 111, -121, -93, -295, 355, 95, -171, -170, -113, 103, -47, -161, 240, 190, 244, 217, -144, -70, 199, 189, 140, -2, -218, 38, 64, -257, -240, -53, 52, 67, 47, -256, 286, -94, -23, -135, 144, 28, 50, 107, 203, 28, -34, 57, 11, -97, 45, 161, 250, 165, 44, -214, -125, 193, 248, -80, 20, -223, -13, 305, -120, -540, -360, -161, 368, -26, -310, -190, 106, 68, 60, -283, -214, 168, -39, 220, -205, 160, 156, 22, -120, 302, -43, -16, 217, -25, 23, 311, 47, 304, -86, 130, -16, 36, -12, 36, 23, 199, 144, 3, -242, -46, 114, 89, -143, 91, 69, -206, -46, -178, 136, -44, -69, -205, -70, -46, 67, -112, 82, 147, -15, 136, -43, 23, 415, -375, -356, -233, 361, 87, -140, -158, 267, 600, 92, -131, -146, 444, 56, 18, -409, 100, -56, 102, -78, 168, 110, 200, 10, -229, -272]
8191b72
$$ Imaginary data points
##PAGE= N=2
##DATA TABLE= (X++(I..I)), XYDATA
0@%%%Lj1QqJ6j6K4l2M0m8N6p2Q8j04J20j41J70k01K32k67L08l55M06m62N26n98
29c18O74p58Q54r58J071j195J333j485J647j826K023k243K485k747L043l374L739
46A965m152M629n175N807o553P449q549R936j1747J4227j7845K3628l4360O0831
60D0091k40338m09576N08702M05125j56373l02653N3291O0625p7848Q0704K60281
71B22031q2811l59536j6666L82609Q5504l23829j16207K58470P3653k04772J4120
82f7434K50973n9526l16694L0442L50502Q066l58681p5434L15500J31683j87797
93B1600p9880Q1984r4251j38200K14456L00246j91083m34304M6498M44293J10312
104B81671l15151j71368J13789N0374j8590J49966J05728k48290k60348J98756
$$ y = [0, 0, 0, 0, 3, -8, 0, -8, 8, -8, 16, -16, 24, -24, 32, -40, 48, -56, 64, -77, 93, -108, 124, -143, 165, -190, 216, -246, 280, -318, 356, -402, 452, -506, 565, -630, 703, -782, 865, -961, 1062, -1181, 1304, -1443, 1600, -1774, 1965, -2187, 2442, -2733, 3074, -3479, 3970, -4579, 5357, -6390, 7837, -10008, 13620, -20740, 40091, -200247, -609823, -101121, 304004, 147631, -155022, -101731, -41106, -118954, -38250, 222031, 139220, -220316, -236982, 145627, 231131, -92698, -208905, 49565, 123218, -81554, -67434, 183539, 124013, -192681, -162239, 188263, 196329, -162352, -237786, 77714, 209397, 21600, -58280, 23704, -70547, -208747, 5709, 305955, 114872, -319432, -272934, 171359, 281671, -33480, -204848, -91059, -40685, -59275, 90691, 196419, -51871, -312219, -113463]
114a13463L37021j01677l21403L9197K60990l0515j98706P6234J86371j20916
124A3133k13894J25310K36757r9972k29182Q0699K14450n3458j70035M4122R5084
135D3014r6552m2443K09779Q7289k91182k07440K66213L10728j45423l07431K0829
146a52619J92361O695n3698Q5363O896k09159p8295K45693J73285j83758j95441
157a62677J07590J45016q7172q4224J14007N5272j55001o0705J80259Q4184j77960
168d1411r7597J65479J01309j49342j00023J27781Q4541j03500l6778J22897N10
179G3866j80839j7803K28334Q7938k06407j44088J26352J33839m3751m6946L3987
190D4482m7332j06905P0537J90991j3640k10368n4308J59824O3400j07375j9766
$$ y = [-113463, 223558, 121881, -199522, -160325, 100665, 70150, -128556, -52322, 134049, 13133, -200761, -75451, 161306, 61334, -167848, -87149, 127301, 73843, -96192, -52070, 43014, -53538, -95981, 113798, 201087, -90095, -297535, -31322, 279406, 133983, -173448, -152619, 39742, 46437, -7261, 78102, 84998, -124161, -202456, 43237, 216522, 32764, -162677, -55087, 89929, 2757, -81467, 32540, 87812, -67189, -127894, 52365, 136549, -41411, -139008, 26471, 127780, -21562, -121585, 6196, 90737, -12763, -49541, 73356, 73866, -106973, -124776, 103558, 191496, -14911, -158999, -32647, 101192, 57441, 10495, 44482, -2850, -109755, -39218, 151773, 138133, -72235, -126543, 33281, 96681, -10694, -30460]
201c0460J02463k4678j42936J9652J71450J2393j62687l8100J30774L2174j09618
212c9573k1266R7053J3003q3126m49O1318l4181o3697P8357J06545q6195j60029
224a32240M2885J70506J4102j23848k3325P2409j4861o0016N8003R6847n1713
235D8749j24397J2049J05510J4583n3487J4068L2156o0931n5672P9974R6696n4756
247E4542j05160K0577P8667j4349m8836L5974M5244n1430n9347M2421N8038l3647
259B2694l9679M4980K7501p5261m9411Q6653Q5790o2256j05454J4372P7493R592
271C7014l4611K474Q094k9591j1730L6445J3939l3339j105M1017j6883p7075L850
284f1501J09863M4474j00579q9554M7490Q6911R63m4424q134O950j4848k591L0601
$$ y = [-30460, 72003, 47325, -95611, -75959, 95491, 107884, -54803, -92903, 37871, 70045, -39573, -60839, 36214, 49217, -33909, -34358, 26960, -7221, -70918, 7439, 113984, 27789, -132240, -89355, 81151, 95253, -28595, -51920, 20489, 5628, -54388, 3615, 100462, 48749, -75648, -63599, 41911, 56494, 3007, 17075, 49231, -11700, -67372, 12602, 109298, 54542, -50618, -30041, 48626, 34277, -14559, 21415, 66659, 15229, -44118, -1697, 56341, 22694, -16985, 27995, 55496, -19765, -69176, 17477, 103267, 41011, -64443, -50071, 27422, 37014, 2403, 4877, 12971, -16620, -28350, 8095, 22034, -11305, -12410, 28607, 11724, -65351, -61501, 48362, 92836, -7743, -97297, -49807, 37104, 38067, -6357, -14491, -7541, -22389, -24980, 5621]
297E621J6054j7876r788K881k0262k0549M1406O5171j9452r1053k8198P2123N8690
310E4768k5491m5715n784J0532K205J1389J5789r035k1404N600J6418j6191k5382
323c2301K4569N0819p671o6327l1238M6268N5974J045m1243l5329l991K9906L5724
336B6205J331l4808k0940J8912J7814j6121j3248K8401K9194l1883n8518M326
348d9335P0003M0881m0511o4599j0483M6978M3466p467m1707k1220K2165K8382
360A6553q280k7876M190L6178R735m3589l9302K4424O0836J8188m4974m9618Q78
373d2657M1237L4409l550l0879k5187J637J9566J5868L296m701p947j1607j0098
386b0613M625K3167J9183q363l2057k0249J3159L3687J8915j5915l3683j2199
$$ y = [5621, 21675, 3799, -5989, -3108, -23370, -43919, -2513, 62658, 43206, -47847, -76045, -3922, 54768, 29277, -16438, -22222, -11690, -9485, 1904, 17693, 8658, -12746, -7146, 9272, -6919, -32301, -7732, 43087, 35416, -30911, -62149, -15881, 40093, 41138, -105, -35434, -39425, -9519, 26205, 27536, -7272, -28212, -9300, 8514, -7607, -20855, 7546, 36740, 4857, -53661, -49335, 20668, 61549, 21038, -43561, -54044, -7066, 36400, 28933, -12774, -33994, -11829, 16553, 8273, -19603, -15413, 20765, 30500, -13089, -52391, -27967, 32869, 51057, 6083, -43535, -42657, -1420, 32989, 29439, -1440, -26627, -24990, -5424, 10444, 13740, 9039, 1092, -10515, -20613, -15988, 7179, 26362, 17999, -14058, -34307, -21148, 12539, 31454, 15539, -18144, -30343]
398c0343K0973K3357k745j7845k379J4617K337k2491j5646K4305M0204j365m9990
411a7011l9029K3603O1416K5247l9818n5915n877M4938L5794j0440l1149j0610
423a8851J0699O387l739O865J8069K39k9548k3829J6353L8675J3474k4425l0014
436a9645j846K2844J9194m617j5441l751Q838Q58j2180l025K1316K0856j3120
449B0281l5349j2789K5674L0662M794j9468k5343j3571J3332L4184J8768k1926
461A9249l6739q163K2714J8503Q87m891n208j3033j1493R466K2306P128j1902
474H824j3982r975l740J4335K7048K228l1368k0587J7496K1660r549j3117J6877
487F150J5112k5970l2612J7999M6578R037l5133k8479K618J9559K3293J0896k0608
$$ y = [-30343, -9370, 13987, 11242, -6603, -8982, 5635, 7972, -14519, -30165, -5860, 34344, 32979, -17011, -56040, -32437, 28979, 54226, 14408, -41507, -47384, -2446, 33348, 22908, -8241, -18851, -8152, -1765, -5504, 1361, 19430, 19669, -9879, -33708, -17355, 21320, 34794, 10369, -19645, -21491, 1353, 20547, 15930, 489, -3262, 5576, 6434, -5746, -8771, 12545, 33401, 20281, -15068, -27857, -2183, 28479, 33273, 13805, -11538, -25109, -11777, 22407, 41175, 19249, -17490, -25653, -2939, 15564, 16451, 11560, 6352, -6681, -18174, -8708, 13598, 20726, 8824, -5158, -15133, -18873, -4538, 22510, 24738, -6630, -27217, -9721, 11939, 2390, -10727, 6150, 21262, -4708, -37320, -19321, 27257, 36294, 1161, -27318, -24700, -5141, 18152, 29048, 8440]
500H440l4376r30L6712J5832k5215j3970K1466O471l2719j2631M1935L0935l2830
513I120m1588J1133L1056l27j1072P504l20k2637n046K6335J1558j9296m736J8242
527I926r152l6474P613N5228J4874n3920l6174K9588L2647o575n388J0506j9794
540g095l6979J7535N8691N086n5587j9039L9044J3090l2688j351M2100L043m9924
553b4074j5272M0413K0386k1253m652J4955j9253k8472K8270M6401k1212n1801
565c5564J5047M7872j8979n3279K4805O9702j5029q1761j2478O9482L1921l5517
577F222k1992P367j1634p698M1422L0454m8312n2306L6206N7785k6791n0308L0935
590h650N0526l6950o1189L2471O7566j6578n7415J0895M0157k0098l0185L9065
$$ y = [8440, -25936, -26866, 9846, 25678, 463, -13507, 7959, 14430, -18289, -30920, 11015, 41950, 9120, -32468, -21335, 9721, 9394, -1678, 5826, 5506, -17131, -22177, 4158, 15716, -3580, -8316, 9926, 774, -35700, -28087, 27141, 42015, -11905, -48079, -18491, 14156, 7581, 2193, 12699, -7095, -44074, -26539, 32152, 37238, -18349, -37388, 1656, 14746, -17942, -19293, 22807, 25850, -24074, -39346, 1067, 21453, 200, -4452, 10503, -8750, -37222, -8952, 37449, 16237, -35564, -20517, 27355, 8376, -44903, -20098, 49604, 34575, -47186, -59664, 9818, 41739, 6222, -15770, -8403, -20037, -27735, 13687, 44141, -4171, -56477, -20271, 37514, 10723, -39585, -8650, 41876, 4926, -56263, -23792, 43774, 27196, -30219, -19324, 20833, 735, -29450, 9615]
602I615L7616m5180m8006M0195M7707l4743l6783M5063L7383n7267n1763N4826
614a337O6162l2775n7647J5419K8183k4186k683N6356N997q4216l2865Q4164N4565
627G5137o6204n6767N1456M5211n2275m1400N3859M4986m8126m3832L3745K4936
639B0726l4084m421N0899l590p2568p251P9489J7408p5839j7872P3778J3885q3005
652d2445k1230R0442L9045p8199n0102N1458L6562l3149m575M1175j8503o6185
664e5706J8191Q7690K75q6546j2096P3014P735o6131N870P4200p294q2929k028
677d5755Q0424Q558o5887M71N7884j8557o5075K9331Q0908k3148q7546J2093Q2004
690D5705r709p4383J3563P4634j4051p5492P545O6214o814m8483K2943L9659m9260
$$ y = [9615, 47231, 2051, -45955, -5760, 41947, 7204, -29579, 15484, 52867, -4400, -56163, -1337, 64825, 32050, -25597, -10178, 18005, -6181, -8864, 47492, 53489, -30727, -63592, 20572, 75137, 8933, -47834, 3622, 48833, -3442, -44842, 9017, 54003, 5877, -37955, -4210, 20726, -13358, -17779, 33120, 29530, -43038, -50289, 29200, 46608, -29231, -47103, 26675, 40560, -42445, -63675, 26767, 65812, -12387, -62489, -11031, 25531, -7618, -12193, 28982, 10479, -55706, -37515, 50175, 50450, -36096, -48192, 24822, 32557, -33574, -27704, 46496, 39202, -43727, -45755, 34669, 43227, -22660, -22189, 35695, 17138, -47937, -18606, 62302, 39154, -48392, -36299, 45705, 35996, -38387, -24824, 49810, 35759, -39733, -32188, 34026, 27212, -21271, 1672, 41331, -7929]
703g929n3860O3436P8960n3033r2233L2374Q2759k4394o6575L3003O3921m3757
715A2672p5003L7570Q1477j9820o6938J1896M0032k8104k4408N5787L2619p3970
727a6190n2887P2068O6761o0081o5805N2897O0054n3546n9021N2441N9414m7267
739H838n2502M4525M0887n2525l4514O4207L9344o8995m7760O2031M6256n3651
751c859l3562N8140K3683p2984k9858Q1151M5355o9866n0042N0122L3434m3080
763a1366o195O1914m712r0162r278J01888L5918q7576m7240O5503L6735n2565
775g136j9126N7254J1548o3918j2065O2647J0425n7527Q6O0459r793p0437R350
788b8233P7336m059p5659K986P2767p832p9555O790Q7173P737q3677k4847N9101
$$ y = [-7929, -61789, 1647, 80607, 27574, -64659, -32285, 50474, 26080, -40495, -7492, 56429, 12672, -62331, -24761, 56716, 36896, -30042, -18146, 21886, -6218, -30626, 25161, 57780, -16190, -69077, 2991, 69752, 9671, -56134, -3237, 56817, 3271, -55750, -3309, 56105, 8838, -43664, 861, 41748, -10777, -45291, 18916, 58260, -10735, -58495, 3536, 49792, -3859, -37421, 20719, 44402, -28582, -58440, 22711, 68066, -1800, -51842, -1720, 31714, -11366, -17561, 44353, 39641, -50521, -59799, 42089, 78007, -9569, -56809, 8694, 45429, -7136, -26262, 30992, 42540, -21378, -33443, 29204, 39629, -17898, -17812, 42647, 32854, -37583, -28233, 49103, 45044, -30615, -27629, 45138, 37306, -42249, -35459, 51714, 59451, -24226, -49073, 10028]
801A0028K1666l3427M494K7066l6677m8909M7010P5573l2287q5944R211P0855
813B8659k992n2081J4795M6117k9397n5797L1825O4030k5206o2808J9216N4717
825C1078k2150m8982K7889M9169l0765m8981L1001M6286l4673m5307L9397N2432
837D6394l6900n8900K4409N3077j1766l0829J6602R477m1988q393P0806L2735
849F4724p5060o0925N3597O8894k5421n1137J4935K8595k4892j8894L8934K5684
861C9034m0173l1100L1764K5408k7454j3173L4447O638m4328q822N0355J4018
873C6614n2048j7219N3770K2606n4196l3045M5698M0447k6365l2108R810Q058
885B022j3265J4366L5469j5484n8663l997O0145K4495m0503k6107K0591P877j8524
$$ y = [10028, 31694, -1733, 2761, 29827, -6850, -55759, -8749, 66824, 34537, -51407, -42196, 28659, 25667, -26414, -11619, 34498, 5101, -50696, -18871, 45159, 19953, -42855, -23639, 31078, 8928, -40054, -12165, 37004, 6239, -42742, -11741, 34545, -128, -45435, -6038, 46394, 9494, -49406, -24997, 28080, 16314, -14515, 2087, 11564, -30424, -38817, 31989, 64724, -10336, -71261, -17664, 51230, 25809, -25328, -10393, 18202, -6690, -25584, 13350, 39034, -1139, -32239, -475, 24933, -2521, -15694, 18753, 25391, -18937, -27759, 22596, 36614, -15434, -32653, 21117, 43723, -10473, -43518, 2180, 42627, 16262, -15846, -6036, 2022, -11243, 3123, 38592, 23108, -35555, -39552, 20593, 45088, 4585, -21522, -931, 6946, -11578]
898a1578R148L3002j0852m6077r66M5032R949l3249p119K5105m485k8493J0354
911a0229L7030p163m1001N32L8498L046l4537n025L0558P763k3034q430J0589
924a403o69j457K0153P652l7490k9078L5348M9852j4867n1614o067L3797J0958
937A5115j5646J508J3167j3811k2547J0327K8214K169j9526n481L588n210J565
950f568K1178O145k7843j7983K3187K3482j6435k1883J3070K1952j1352k3840
962a6890M242K0118L186q071l90m019j3828K827K7471J1783k6873k6541J1425
975a5560K5414M074j0508m685l367p018L854J6822M707j5792j0259Q191N335o259
989e051K414J4227k676k2725o782K1806J5514j3325j6271O005J1708m009r202
$$ y = [-11578, -2430, 30572, 19720, -26357, -27323, 17709, 27658, -5591, -12710, 12395, 7910, -20583, -10229, 26801, 19638, -21363, -20831, 17667, 20713, -13824, -18849, 11709, 19472, -3562, -11992, -1403, -2072, -3529, 16624, 24276, -13214, -42292, -6944, 42908, 28041, -23573, -29640, 4157, 15115, -531, 977, 14144, 333, -22214, -11887, 16327, 18496, -1030, -6511, -2923, -8133, -6568, 14610, 20755, -7088, -25071, -1884, 21598, 5163, -16720, -3650, 18302, 6950, -16890, -12648, 7470, 10656, 2585, 2195, -1824, -15652, -12825, 14646, 26429, -444, -26985, -15560, 9854, 13928, 3420, -1265, -4632, -11650, -7796, 9026, 13733, -2059, -12318, -4127, 1208, -5051, -2637, 11590, 8914, -13811, -20593, 1213, 16727, 3402, -12869, -6864, 4844, 835, -8367]
1002h367K470J0210K809o604r990o229Q246J9961P923k1789k5808O912L1137J0880
1016B1761j9516j7669M286J0207P80n81N164N21q959p556L528R171N411m06o790
1031f48r085k159J1263J0132l387j0597k421M755M29k104L299O869j340r002n775
1046i771L408P054O206J627p087j3112m245J4377J7618k084j8697j2626O904J5710
1060E282O189p249r905k366N375M136m37j555K272J853n889q610L388J4669O928
1075A4081j2611j4799K759J4504N620p667p002K643N400l226o466L290J1170M457
1089A2153j1014j5171j73J7900J5223p257k0658q889J2754J5416J127r575o499
1102d663n31K028K047M171L097j855o683l422J515N012N157J289n059p774j506
$$ y = [-8367, -5897, 4313, 7122, 518, -9472, -15701, -7455, 12506, 20429, -1360, -27168, -20256, 10881, 21761, 2245, -15424, -11138, -931, -151, -732, 4432, 4953, -4006, -11562, -8034, 1137, 6548, 6142, -648, -9733, -11892, -629, 9503, 6116, -4481, -6902, -2147, -1718, -3822, -523, 6346, 5006, -3996, -9771, -6363, 691, 6897, 8524, 1437, -11675, -15920, -1543, 16075, 13991, -4706, -17332, -10428, 5282, 11471, 4222, -5683, -8049, -2674, 1462, 1025, -530, 1742, 3595, -2294, -10904, -7516, 7153, 14081, 1470, -13329, -10570, 3934, 9554, 1887, -5115, -2472, 2928, -298, -6764, -3474, 7696, 12153, 1139, -14032, -14205, 3695, 18918, 11661, -8997, -17886, -5132, 10284, 11411, 1836, -4663, -5194, -3166, -1119, 3052, 6149, 4294, -2389, -5811, -4296, 716, 5873, 7162, 2103, -5671, -7177]
1117g177O147O555Q39l104l741l682n98M934N895J025m165m367k805j097M837
1132e04J0933M616j2522j8028J567K2036J3023j1003j8614l851J1356J0904L27
1145A0240p480o514J481N383Q94n308rR279K782j2840j0483R648J6597j346j5321
1160b997m408Q611L394n017K17O810N15q912o886L624Q501O782L75j1410j4845
1175a5646K046K1886J3246j4812k1733J261J5069N988l721o84j839p876k838J0936
1189A283Q138p507q455N463N542q295o531J1133J1388q735j2754J914Q228q26
1203a4o61O172n79j2285m754J2011P747o176l150N742n519j4799O646K6895M934
1218B2210l0116j9444J9584K4909m403j6729l379L662o06M359R127l717j3550
$$ y = [-7177, -1030, 5525, 6364, 3260, -481, -4163, -4761, 173, 6068, 7093, 2928, -1439, -4244, -5341, -504, 10429, 15045, 2523, -15505, -13938, 8098, 21121, 10118, -8496, -12347, -991, 9913, 10240, 2760, -3754, -2273, 3110, 4004, -1304, -1313, 7966, 10748, -2092, -12575, -2927, 13670, 12324, -2997, -7405, 1206, 4600, -417, -200, 6610, 7125, -1787, -8673, -5049, 3452, 10234, 10609, -801, -15646, -13600, 8286, 21532, 6720, -15013, -13752, 1317, 7305, 3584, 2900, 1061, -6815, -9653, 1283, 9421, 1914, -6541, -1078, 4464, -3831, -10362, 771, 12159, 3424, -9330, -7416, 812, -14, -675, 5497, 4918, -7367, -12121, -110, 7637, 1461, -1689, 4053, -1466, -16265, -9619, 17276, 22210, -7906, -27350, -7766, 17143, 12740, -3989, -7368, -3706, -4312, 47, 9174, 5457, -8093]
1231h093O31J4116j462j4412L832J9225l570k3272j245K4146M988j9936n476J8018
1245G490K544j8381l525J9572P102j4905p303P303m42n932J1742J5066j6239k8398
1259b4306P687L2737N764k4309r447J0144n1n683J2149J3796j7467k4054J1833
1272a1207K7263n251k3906M672J9680q051k1314R495K4125o842k2553L713J8390
1285H214n641j5574R383J6053j0755j6021J0228J2353j2830q520K2491J1201l1550
1298a0968k2828L0787L5695j9067l6466M804K5831q14j1804R541N948k0451j0923
1311b0715K4337J7975j9841j7591J5795J1700j8917p004K6747R175l1363j5606
1323b5308L0211J9160k5271j7608K2613J4872k2340j3485K1757J2120k0506q363
$$ y = [-8093, -7462, 6654, 5192, -9220, -5388, 13837, 10267, -13005, -14250, 9896, 14884, -5052, -10528, 7490, 10034, -8347, -11872, 7700, 14802, -103, -7406, -103, -545, -6477, 5265, 20331, 4092, -24306, -16619, 16118, 21882, -2427, -11874, -1730, -1781, -7464, 4685, 18481, 1014, -23040, -11207, 16056, 10805, -13101, -8429, 11251, 3200, -18114, -8619, 15506, 8664, -13889, -10176, 8214, 2573, -13001, -3618, 12435, 1680, -14341, -4113, 8240, -4590, -13110, 9381, 20582, -10968, -33796, -3009, 32686, 13619, -22847, -18043, 7788, 6974, -4830, 4711, 10659, -9792, -20715, 3622, 21597, 1756, -15835, -40, 11660, -7257, -14261, 12486, 21661, -9702, -25308, 4903, 24063, -1208, -18816, 3797, 18669, -3671, -17156, 4601, 16721, -3785, -12148]
1335a2148K2314L200k8145l475L4920J0599l4113j8438K4640J6783j5280m299
1347c442J5411o893k6389P716L6540R65l6668q098K9177O481k5314J792K9268
1360B0546m589l6967p86L8219Q490l1729r965K2767M562j8818L334J9501q052
1373F513k2387J1148K4648j4816k9216J6939L5751j3426m0740N763L8005j99k9388
1386a1405J750K2129r424k3004J5319K9079j2831l2858O902K6669m318j7967J2279
$$ y = [-12148, 10166, 13366, -14779, -18254, 16666, 27265, -6848, -25286, -646, 16137, 857, -3442, 11969, 5076, -21313, -13597, 22943, 23908, -12760, -20858, 8319, 14800, -10514, -8722, 20546, 15957, -21010, -21796, 16423, 24913, -6816, -16781, 5986, 10548, -8270, -4936, 14565, 6513, -15874, -4726, 19922, 5106, -24110, -7171, 28580, 15154, -25586, -19823, 18182, 17983, -11405, -9655, 12474, 3050, -19954, -4635, 24444, 11613, -21245, -14343, 12326, 8008, -9959, 2320]
$$ [...]
8191A01
##END NTUPLES=NMR FID
##END=
