##TITLE=1H_CG-1103-a
 CDCl3, 8 sc, 
 7.5.2019
##JCAMPDX= 6.0         $$ Bruker NMR JCAMP-DX V2.0
##DATA TYPE= NMR FID
##DATA CLASS= NTUPLES
##ORIGIN= UXNMR, Bruker Analytische Messtechnik GmbH
##OWNER= root
$$ XWIN-NMR		Version 3.5
$$ Tue May  7 12:20:55 2019 Russian Standard Time (UT+4h)  she@DPX200
##.OBSERVE FREQUENCY= 200.1315
##.OBSERVE NUCLEUS= ^1H
##.DELAY= (6, 6)
##.ACQUISITION MODE= SIMULTANEOUS
##.ACQUISITION SCHEME= undefined
##.AVERAGES= 8
##.DIGITISER RES= 18
##SPECTROMETER/DATA SYSTEM= spect
##.PULSE SEQUENCE= zg30
##.SOLVENT NAME= CDCl3
##.SHIFT REFERENCE= (INTERNAL, CDCl3, 0, 15.7039)
##AUDIT TRAIL= $$ (NUMBER, WHEN, WHO, WHERE, WHAT)
$$ ##TITLE= Audit trail, XWIN-NMR		Version 3.5
$$ ##JCAMPDX= 5.01
$$ ##ORIGIN= Bruker BioSpin GmbH
$$ ##OWNER= she
$$ F:/spectra/data/she/nmr/H-F/1/audita.txt
$$ ##AUDIT TRAIL=  $$ (NUMBER, WHEN, WHO, WHERE, WHAT)
(   1,<2019-05-07 12:19:31.25 +0400>,<she>,<DPX200>,
      <created by zg, POWCHK disabled, PULCHK disabled
       configuration hash MD5:
       00 E9 B6 7A A2 85 ED C7 34 08 36 98 17 FE 4E 26
       data hash MD5: 16K
       02 98 09 DD F1 4D 83 1F 0A 0D BE F1 E5 7D CE F6>)
$$ ##END=
$$ 
$$ hash MD5
$$ A3 F9 E9 CB 05 BE CF 62 55 3E 9E 79 EB 05 04 8F
##$RELAX= 
##$RELAX= 
##$RELAX= 
##$RELAX= 
##$RELAX= 
##$RELAX= 
$$ Bruker specific parameters
$$ --------------------------
##$DU= <F:/spectra>
##$EXPNO= 1
##$NAME= <H-F>
##$PROCNO= 1
##$TYPE= <nmr>
##$USER= <she>
##$AMP= (0..31)
100 100 100 100 100 100 100 100 100 100 100 100 100 100 100 100 100 100 
100 100 100 100 100 100 100 100 100 100 100 100 100 100 
##$AQSEQ= 0
##$AQ_mod= 1
##$AUNM= <au_zg>
##$AUTOPOS= <>
##$BF1= 200.13
##$BF2= 200.13
##$BF3= 200.13
##$BF4= 200.13
##$BF5= 200.13
##$BF6= 200.13
##$BF7= 200.13
##$BF8= 200.13
##$BYTORDA= 1
##$CFDGTYP= 0
##$CFRGTYP= 5
##$CHEMSTR= <none>
##$CNST= (0..31)
1 1 145 1 1 1 1 1 1 1 1 1 1 1 1 1 1 1 1 1 1 1 1 1 1 1 1 1 1 1 1 1 
##$CPDPRG= <>
##$CPDPRG1= <>
##$CPDPRG2= <>
##$CPDPRG3= <>
##$CPDPRG4= <mlev>
##$CPDPRG5= <mlev>
##$CPDPRG6= <mlev>
##$CPDPRG7= <mlev>
##$CPDPRG8= <mlev>
##$CPDPRGB= <>
##$CPDPRGT= <>
##$D= (0..31)
0 1.2 0 0 0 0 0 0 0 0 0 0.03 0 0 0 0 0 0 0 0 0 0 0 0 0 0 0 0 0 0 0 0 
##$DATE= 1557217170
##$DBL= (0..7)
120 120 120 120 120 120 120 120 
##$DBP= (0..7)
150 150 150 150 150 150 150 150 
##$DBP07= 0
##$DBPNAM0= <>
##$DBPNAM1= <>
##$DBPNAM2= <>
##$DBPNAM3= <>
##$DBPNAM4= <>
##$DBPNAM5= <>
##$DBPNAM6= <>
##$DBPNAM7= <>
##$DBPOAL= (0..7)
0.5 0.5 0.5 0.5 0.5 0.5 0.5 0.5 
##$DBPOFFS= (0..7)
0 0 0 0 0 0 0 0 
##$DE= 6
##$DECBNUC= <off>
##$DECIM= 24
##$DECNUC= <off>
##$DECSTAT= 4
##$DIGMOD= 1
##$DIGTYP= 9
##$DL= (0..7)
0 120 120 120 120 120 120 120 
##$DP= (0..7)
150 150 150 150 150 150 150 150 
##$DP07= 0
##$DPNAME0= <>
##$DPNAME1= <>
##$DPNAME2= <>
##$DPNAME3= <>
##$DPNAME4= <>
##$DPNAME5= <>
##$DPNAME6= <>
##$DPNAME7= <>
##$DPOAL= (0..7)
0.5 0.5 0.5 0.5 0.5 0.5 0.5 0.5 
##$DPOFFS= (0..7)
0 0 0 0 0 0 0 0 
##$DQDMODE= 0
##$DR= 18
##$DS= 0
##$DSLIST= <SSSSSSSSSSSSSSS>
##$DSPFIRM= 0
$$ [...]
##$SUBNAM2= <"">
##$SUBNAM3= <"">
##$SUBNAM4= <"">
##$SUBNAM5= <"">
##$SUBNAM6= <"">
##$SUBNAM7= <"">
##$SUBNAM8= <"">
##$SUBNAM9= <"">
##$SW= 24.9337058887773
##$SWIBOX= (0..15)
0 0 2 0 0 0 0 0 0 0 0 0 0 0 0 0 
##$SW_h= 4990.01996007984
##$TD= 16384
##$TD0= 1
##$TE= 0
##$TE2= 300
##$TE3= 300
##$TEG= 300
##$TL= (0..7)
0 120 120 120 120 120 120 120 
##$TP= (0..7)
150 150 150 150 150 150 150 150 
##$TP07= 0
##$TPNAME0= <>
##$TPNAME1= <>
##$TPNAME2= <>
##$TPNAME3= <>
##$TPNAME4= <>
##$TPNAME5= <>
##$TPNAME6= <>
##$TPNAME7= <>
##$TPOAL= (0..7)
0.5 0.5 0.5 0.5 0.5 0.5 0.5 0.5 
##$TPOFFS= (0..7)
0 0 0 0 0 0 0 0 
##$TUNHIN= 0
##$TUNHOUT= 0
##$TUNXOUT= 0
##$USERA1= <user>
##$USERA2= <user>
##$USERA3= <user>
##$USERA4= <user>
##$USERA5= <user>
##$V9= 5
##$VALIST= <valist>
##$VCLIST= <CCCCCCCCCCCCCCC>
##$VD= 0
##$VDLIST= <DDDDDDDDDDDDDDD>
##$VPLIST= <PPPPPPPPPPPPPPP>
##$VTLIST= <TTTTTTTTTTTTTTT>
##$WBST= 1024
##$WBSW= 4
##$XGAIN= (0..3)
0 0 0 0 
##$XL= 0
##$YL= 0
##$YMAX_a= 388233
##$YMIN_a= -628032
##$ZGOPTNS= <>
##$ZL1= 120
##$ZL2= 120
##$ZL3= 120
##$ZL4= 120
##$ABSF1= 10
##$ABSF2= 0
##$ABSG= 5
##$ABSL= 3
##$ALPHA= 0
##$AQORDER= 0
##$ASSFAC= 0
##$ASSFACI= 0
##$ASSFACX= 0
##$ASSWID= 0
##$AUNMP= <proc_1d>
##$AZFE= 0.1
##$AZFW= 0.1
##$BCFW= 1
##$BC_mod= 2
##$BYTORDP= 1
##$COROFFS= 0
##$CY= 11.3945322036743
##$DATMOD= 1
##$DC= 2
##$DFILT= <>
##$DTYPP= 0
##$F1P= 18.9103706918063
##$F2P= -1.10871071338519
##$FCOR= 0.5
##$FTSIZE= 0
##$FT_mod= 4
##$GAMMA= 1
##$GB= 0.15
##$INTBC= 1
##$INTSCL= 1
##$ISEN= 128
##$LB= 0.24
##$LEV0= 0
##$LPBIN= 0
##$MAXI= 10000
##$MC2= 0
##$MEAN= 0
##$ME_mod= 0
##$MI= 1.114404
##$NCOEF= 0
##$NC_proc= 0
##$NLEV= 6
##$NOISF1= 3.799351
##$NOISF2= 2.8
##$NSP= 1
##$NTH_PI= 0
##$NZP= 0
##$OFFSET= 15.70392
##$PC= 1
##$PHC0= -8856.841
##$PHC1= 18.00026
##$PH_mod= 1
##$PKNL= yes
##$PPARMOD= 0
##$PSCAL= 0
##$PSIGN= 0
##$REVERSE= no
##$SF= 200.130013532006
##$SI= 16384
##$SIGF1= 3
##$SIGF2= 2
##$SINO= 400
##$SIOLD= 16384
##$SREGLST= <1H.CDCl3>
##$SSB= 0
##$STSI= 0
##$STSR= 0
##$SW_p= 3612.71676300578
##$SYMM= 0
##$S_DEV= 0
##$TDeff= 0
##$TDoff= 0
##$TI= <>
##$TILT= no
##$TM1= 0
##$TM2= 0
##$TOPLEV= 0
##$USERP1= <user>
##$USERP2= <user>
##$USERP3= <user>
##$USERP4= <user>
##$USERP5= <user>
##$WDW= 1
##$XDIM= 8192
##$YMAX_p= 0
##$YMIN_p= 0
$$ End of Bruker specific parameters
$$ ---------------------------------
##NTUPLES= NMR FID
##VAR_NAME=  TIME,          FID/REAL,        FID/IMAG
##SYMBOL=    X,             R,               I
##VAR_TYPE=  INDEPENDENT,   DEPENDENT,       DEPENDENT
##VAR_FORM=  AFFN,          ASDF,            ASDF
##VAR_DIM=   8192,          8192,            8192
##UNITS=     SECONDS,       ARBITRARY UNITS, ARBITRARY UNITS
##FACTOR=    0.0002004,     1,               1
##FIRST=     0,             0,               0
##LAST=      1.6414764,     0,               0
##MIN=       0,             -628032,         0
##MAX=       1.6414764,     388233,          0
$$ Real data points
##PAGE= N=1
##DATA TABLE= (X++(R..R)), XYDATA
0@%%%qJ6j6J6k4L2m0N6p2Q8j04J28j60J92k25K66l18L74m33N04n88O75p73Q86
$$ 0 0 0 0 -8 8 -8 8 -16 16 -24 32 -40 48 -56 72 -88 104 -121 145 -173 201 -232 272 -316 359 -414 472
27D72j008J144j295J461j644J845k065K309k577K868l187L541l928M349m817N335
$$ 472 -536 608 -687 774 -870 975 -1090 1219 -1358 1510 -1677 1864 -2064 2285 -2532 2803
43B803n904O539p252Q050q955R990j1184J2583j4245J6259j8765K1982k6285L2372
$$ 2803 -3101 3438 -3814 4236 -4719 5271 -5913 6670 -7575 8684 -10081 11901 -14384 17988
57A7988m1717N8067r4922L21989k9667n79273J91902L26812Q5246k06414q685
$$ 17988 -23729 34338 -60584 261405 231738 -347535 -155633 171179 256425 50011 41326
68D1326Q5599m988j42142L0169J30525q384j71328O3318K82394N0559m00149l40154
$$ 41326 126925 121937 -20205 9964 140489 132105 -39223 24095 306489 357048 -43101 -383255
80c83255J55374M47496J68618k32927k81453r565J28661M4069p635N7092J4482
$$ -383255 -227881 219615 388233 155306 -126147 -135712 -7051 37018 29383 86475 100957
91A00957r4625m2336R5791K3944j69994j43564J43702L14750J05248k70532l39719
$$ 100957 6332 -36004 59787 83731 -86263 -229827 -86125 228625 333873 63341 -276378
102b76378j3396K85030K20642k7663j50467j06116j2806M7598M8018R810k0474
$$ -276378 -289774 -4744 215898 188235 37768 -68348 -81154 -33556 14462 24272 3798
113C798j7539L3054R5927L0302j64883k14872L7331K99702K29726r8932l15753
$$ 3798 -13741 19313 115240 145542 -19341 -234213 -196882 102820 332546 233614 -82139
124h2139j92987J22927K58943Q2158j23549r8097K4765L5642j6843k4629j3294
$$ -82139 -275126 -152199 106744 188902 65353 -32744 -7979 27663 10820 -13809 -27103
135b7103j6733J8623J06477J15897p2961k87720j71979K27500L75090L7540l05951
$$ -27103 -43836 -25213 81264 197161 124200 -163520 -335499 -107999 267091 304631 -1320
146a320k16260P9178J62383L0229n3384q250K7245j3764k2002L5771L76j34006
$$ -1320 -217580 -138402 23981 54210 826 -7424 19821 6057 -15945 19826 20202 -113804
158a13804q3707J93708K76117m2385l44795k10722J61553K91606P8850j46590
$$ -113804 -197511 -3803 272314 229929 -114866 -325588 -164035 127571 206421 59831
168E9831j25323Q979L1614j240L5205M1698n1447n7548R0649J34919o1247k35686
$$ 59831 -65492 -56513 -24899 -26139 9066 50764 -683 -58231 32418 167337 106090 -129596
180a29596j12358J90044K92512M5851k47204k23153L5948J71397R5109q991n0554
$$ -129596 -241954 -51910 240602 286453 39249 -183904 -147956 23441 118550 109559 59005
191E9005o0084k7483M1660N8839j7120r6884m8408J18228J81910j2401k44562
$$ 59005 -1079 -28562 13098 71937 54817 -42067 -90475 27753 209663 197262 -47300
202d7300j83394R7423K42218J18675q9172j78259r5841N7387J20279N1602m4489
$$ -47300 -230694 -133271 108947 227622 138450 -39809 -135650 -78263 42016 93618 49129
213D9129p7126k7793O5742Q4945l7758j50159p3416J14369J83167N4427j42540
$$ 49129 -27997 -55790 9952 94897 57139 -93020 -166436 -52067 131100 185527 42987
224D2987k05853m9133J58202J75345J2210j22436j14854r863Q9205P9273k9568
$$ 42987 -162866 -211999 -53797 121548 133758 11322 -103532 -113395 -24190 55083 25515
235B5515r1325k7234P5681R8214R863j26234j49193K1809J99896J47220p0850
$$ 25515 -65810 -93044 -17363 80851 90714 -35520 -184713 -162904 36992 184212 113362
246A13362j91534j06595O9515J54287P2416o6581j00511k5254N2988P1325J2193
$$ 113362 -78172 -184767 -115252 39035 111451 44870 -55641 -80895 -27907 43418 55611
257E5611q5481q8623M8698J54617O9950j06819j72353n4821J29315J82517L3328
$$ 55611 -29870 -118493 -69795 84822 154772 47953 -124400 -179221 -49906 132611 165939
268A65939j41457j39779N03J07363R4882o699r7547o8049N3958J05325K1482r1932
$$ 165939 24482 -115297 -114794 -7431 87451 80752 -16795 -84844 -30886 74439 95921 3989
280C989j10948l279J35195J35574l3347j69340j10247N5583J47087R1395n0255
$$ 3989 -106959 -110238 24957 160531 127184 -42156 -152403 -96820 50267 141662 91407
291I1407j34092o4545P1469J05013K0006p7756q9341Q522J19857Q7466p1566j50773
$$ 91407 -42685 -107230 -35761 69252 89258 11502 -77839 -69317 50540 138006 66440 -84333
303h4333m9014J02523J41855L8504j06316j39948j8910J09958J06993J848r2453
$$ -84333 -133347 -30824 111031 149535 43219 -96729 -115639 -5681 101312 103160 10707
314A0707r0545J7061J11308O2346p2306j12616j4978R7276J10086N27j28349j18668
$$ 10707 -79838 -62777 48531 110877 38571 -74045 -89023 8253 118339 118866 -9483 -128151
326a28151L4258J43221R0037m7901j28837p7422O0408J26429L9150q6441r8001
$$ -128151 -93893 49328 139365 91464 -37373 -114795 -54387 72042 111192 24751 -73250
337g3250j182R0703Q6668k5139j23863p4149P1901J29790M2996q3205j25119l9071
$$ -73250 -74432 16271 102939 77800 -46063 -120212 -48311 81479 124475 41270 -83849 -122920
349a22920R6588J25803Q282j08054r7957J2595J06162Q3060m4670j25646m4543
$$ -122920 -26332 99471 107753 -301 -98258 -85663 20499 103559 58889 -66757 -111300
360a11300R0837J08079M290r9151j00132Q685J17583R3093l8101j17696o9797
$$ -111300 -20463 87616 91906 -7245 -107377 -98692 18891 111984 73883 -43813 -113610
371a13610M4292J14501O0615o9368j17058j9899R2044Q9528o985r5731q4904L1653
$$ -113610 -69318 45183 105798 36430 -80628 -100527 -8483 81045 74060 -21671 -106575 -74922
383g4922J22204O4363p0004j17103l6814P8552J14582K3001j00427j03402J4389
$$ -74922 47282 111645 41641 -75462 -112276 -33724 80858 103859 3432 -99970 -85581
394h5581J03158P5485k8264j03295o5715N8428J15653L0012q4764r5972p693Q9331
$$ -85581 17577 93062 64798 -38497 -104212 -45784 69869 99881 15117 -80855 -88548 783
406G83R7078p450j11266q3485M0041J11365O2323n2284j16455m4574Q7788J11440
$$ 783 97861 90411 -20855 -104340 -64299 47066 109389 57105 -59350 -103924 -16136 95304
418I5304n3r9075q2058J8271J00816P7486m1334j15271n0321O7207J03754L1544
$$ 95304 95251 -3824 -85882 -67611 33205 110691 69357 -45914 -96235 -29028 74726 106270
430A06270p4725j04647j1498R9944Q8301k2530r7731o7396L3018J05892O0221
$$ 106270 31545 -73102 -84600 15344 103645 81115 -16616 -84012 -50994 54898 115119
441A15119o5409j12587k4148Q4655R4988N545r3053r1454K1141J09334O4278m8377
$$ 115119 49710 -62877 -87025 -2370 92618 98163 5110 -86344 -65203 44131 108409 60032
453F0032r9099m5755N7760J04151K7211q7416r3220P868Q8922P3800j6550r7713
$$ 60032 -39067 -84822 -27062 77089 104300 16884 -76336 -68468 20454 94254 77704 -20009
465b0009p1980M3105J07894M4044o4010r9156k9344P8670J01153j399j03848p6715
$$ -20009 -91989 -48884 59010 103054 39044 -60112 -89456 -10786 90367 88968 -14880 -91595
477i1595L2229R5939N7752m3652j05796m5481P3098J01028J0529q2542q5928o86
$$ -91595 -59366 36573 94325 50673 -55123 -100604 -27506 73522 84051 1509 -84419 -85105
489h5105R2118Q0940k9799j02820n4596M5845R3555M3002o1166j04176j9297Q9513
$$ -85105 7013 87953 58154 -44666 -99262 -53417 40138 83140 21974 -82202 -101499 -11986
501a1986Q6576j3349r1921p2446K6675J03121O0187n8190j03240l0175O8209R1942
$$ -11986 74590 61241 -30680 -103126 -76451 26670 86857 28667 -74573 -104748 -36539 55403
513E5403J7366q2447q8540J3710R4191O0185l2605q4707m9947M3763R6839L4485
$$ 55403 72769 -9678 -98218 -84508 9683 69868 37263 -47444 -97391 -53628 43211 77696
525G7696p1994r0943p730Q1131Q5987o764r9391p4756L9962J00381M4473n0121
$$ 77696 5702 -85241 -92971 -11840 74147 67383 -32008 -106764 -66802 33579 78052 27931
537B7931q8120l3723O5283R1162M397q4517p0125J9366Q5494O2246l5192j01218
$$ 27931 -60189 -93912 -28629 62533 66930 -17587 -87712 -68346 17148 79394 44202 -57016
549e7016m7465O3102R5136K4702o6803r0501j5652Q2553Q3483j5692q8370n6495
$$ -57016 -104481 -41379 53757 78459 11656 -78845 -94497 -11944 71539 55847 -32523 -89018
561h9018L1360Q4584M6714n3593r7053j8879Q1901Q4728m950q7730p9343J9719
$$ -89018 -57658 26926 73640 20047 -77006 -95885 -13984 70744 65794 -21936 -101279 -81560
573h1560J01807O3824m3429q9816l9073M4215Q2374L1052o1240p9063K697P7616
$$ -81560 20247 84071 40642 -49174 -88247 -44032 38342 69394 8154 -70909 -68212 9404
585I404O0948k0964q3575n7233M4654J03555M0786o7293r5296k3021P2989R4023
$$ 9404 70352 49388 -34187 -91420 -46766 56789 97575 30282 -65014 -88035 -15046 78977
597G8977Q074q7068p0246K7793P7342L6796l3464o7485k7550N1493P7880J0862
$$ 78977 87051 -17 -70263 -42470 34872 71668 38204 -29281 -56831 -5338 72542 83404
609H3404p2612q0204Q5R2463Q8512k6488j12757o0283N2935Q8020K7152m8232
$$ 83404 10792 -69412 -69327 23136 111648 85160 -27597 -87880 -34945 53075 80227 31995
621C1995o8901j5346N4198N7217p575o5128n6097J9289R1616O1193o1574j19346
$$ 31995 -36906 -52252 1946 59163 51588 -13540 -69637 -50348 41268 102461 40887 -78459
633g8459l0130Q8392R6400K991q1269p3607Q451O7326M3250j5946m8242l7400
$$ -78459 -108589 -20197 76203 79194 -2075 -75682 -67231 95 43345 27399 -20843 -58243
645e8243J5987O8518L8275o1071r4417l179J00573Q8895k6633j14584p0620N2262
$$ -58243 -42256 26262 64537 3466 -90951 -94130 6443 95338 68705 -45879 -116499 -64237
657f4237J00836L2509m4964n7709k4757K5512N5249K2522m5554n7005R170P3439
$$ -64237 36599 69108 24144 -33565 -58322 -32810 22439 44961 -593 -57598 -48428 25011
669B5011N5162m0221j04433m2777Q0530J07704J2530q0085q1959r858O4493O9875
$$ 25011 80173 39952 -64481 -107258 -26728 80976 93506 13421 -68538 -78396 -13903 55972
681E5972J315o0284m4847J4248N1324K9972l4713p0416j3598P5251P8249j5652
$$ 55972 57287 -2997 -47844 -33596 17728 47700 12987 -57429 -71027 4224 82473 66821
693F6821r6572p8858K4844J07289O9147m5722r4274l5341L8335N5271K0765k8924
$$ 66821 -29751 -108609 -83765 23524 92671 46949 -47325 -82666 -44331 10940 31705 2781
705B781m6447o689M3803M2568j4590p1542n5482M4233J16343M6075r2106j17915
$$ 2781 -43666 -50355 -6552 36016 21426 -50116 -105598 -61365 54978 101053 8947 -108968
717a08968p138R2768P9248n908o3524m4198J0397L3743K2066p78k9954l2156K5715
$$ -108968 -116106 -23338 55910 50002 -13522 -57720 -47323 -13580 8486 7708 -22246 -54402 -28687
730b8687P5608K0711q6311r3314K0543J19148Q2938m6957j14061m5468N4455O6272
$$ -28687 46921 67632 -18679 -111993 -91450 27698 110636 63679 -50382 -95850 -41395 24877
742B4877J6503j7162l0285k6834J1355M4373J3099n0761n3210K7027R5759M9323
$$ 24877 41380 24218 -6067 -32901 -21546 22827 35926 -14835 -68045 -41018 54741 104064
754A04064p7417j21255j5044J00790Q6663p245o5383n5701r037L5559M4408R453
$$ 104064 26647 -94608 -109652 -8862 77801 70556 5173 -50528 -59565 -24006 20402 29855
766B9855l2653l8095P402N5331K8377o3406q6578J3858J09610P3488m4538j09218
$$ 29855 -2798 -40893 -33491 21840 50217 -13189 -99767 -85909 23701 97189 52651 -56567
778e6567n8764M4116Q8925L9367l1607n2215k9322J0726M0098K4190k8855m3345
$$ -56567 -115331 -71215 17710 57077 25470 -26745 -56067 -45341 -5243 18947 -9908 -53253
790e3253J1185O3558L8910m4780r4633l5050Q1410J10998J2384q7765q1114k048
$$ -53253 -42068 21490 60400 15620 -79013 -114063 -32653 78345 90729 2964 -78150 -80198
802h0198N8126N8075R290l8497l5863L216L1414K2247k0310n1849j0452P1269
$$ -80198 -22072 36003 45293 6796 -29067 -25851 5563 27810 7500 -44349 -54801 16468
814A6468P4800k2196j01388o6643L6777R9195N8327l5782p8476l6155K2462M2781
$$ 16468 91268 69072 -32316 -98959 -62182 37013 95340 59558 -18918 -55073 -32611 10170
826A0170K8435r372m0410j5720M0205M1891k5831p4819l3208N9635R8904K3242
$$ 10170 38605 29233 -11177 -26897 13308 55199 29368 -45451 -78659 -19024 79880 103122
838A03122q6715r6009k335P2367O4255Q286m1029n1465j2452L3200L5060n812
$$ 103122 16407 -79602 -81937 -9570 54685 62971 21942 -29523 -41975 -8775 26285 20473
850B0473l8082k1138L8533O3952l016q8635o9265L7115R9853N6028l6008q5785
$$ 20473 -17609 -38747 -214 63738 60722 -27913 -97178 -60063 39790 95818 59810 -25975
862b5975n1513K7482O6673L6551j5970m3857k5221K2679M2352m497n4839k8312
$$ -25975 -77488 -50006 16667 53218 37248 -6609 -31830 -9151 33201 28704 -26135 -54447
874e4447M5020P1855J9457o1623q6507j7164P1737Q1066J1670n3899o4330j9063
$$ -54447 -9427 62428 81885 20262 -66245 -83409 -11672 69394 81064 27165 -37165 -56228
886e6228M2099N4621K379m4977k6043K6854M3767K699n6673n5740K0990Q4004
$$ -56228 -14129 40492 42871 -2106 -28149 -1295 42472 45171 -11502 -67242 -46252 37752
898C7752N2339l4625p9964n2263K1545P4663N2147k1237o1988l3770K0582M4613
$$ 37752 90091 55466 -24498 -76761 -55216 19447 71594 50357 -11631 -45401 -24819 19794
910A9794J4475l7425l8399K3424O1085J8633n1617o8439j6738N9051Q1655J7550
$$ 19794 34269 -3156 -41555 -18131 42954 61587 9970 -58469 -75207 -16156 65499 83049
922H3049o4288p5302j3580N0775O2508J0555m7507m2797J5415M3406J0136l5892
$$ 83049 18761 -56541 -70121 -19346 43162 53717 6210 -36587 -21172 22234 32370 -3522
934c522l9496O107N8370N1106k2354p6231m8712K4182P2390N5296j6707p3314
$$ -3522 -43018 -36911 21459 72565 50211 -26020 -74732 -50550 21840 77136 60429 -12885
946a2885m8177K5323N9197K3338k9870m2451J559M8635K8252l7355n8989r502
$$ -12885 -61062 -35739 23458 46796 16926 -25525 -23966 24669 52921 15566 -43423 -52925
958e2925M9283O0926J5546n1162p0976j8233N1750O5065J7419m5201n9383n396
$$ -52925 -3642 57284 72830 21668 -49308 -67541 -15791 49274 66693 21492 -37891 -43287
970d3287N2871L4861k9232m6043k46M5066L9526j2993o0656m5469K3287O7042
$$ -43287 9584 44445 15213 -30830 -31076 13990 53516 40523 -20133 -65602 -42315 24727
982B4727M5058j7224o7150n4677J9626P2144L6674l5258n3024p685L8717L3906
$$ 24727 69785 52561 -14589 -69266 -49640 22504 59178 23920 -29104 -36789 1928 35834
994C5834j7046n0127j7222L9712M9763J0061l8096n9687k5366M6403P5497J8901
$$ 35834 18788 -31339 -48561 -8849 40914 50975 12879 -46808 -72174 -25771 49726 68627
1006F8627n7496o6000m281N5583M6599j8286n2568j2311L7777L3817p488l9131
$$ 68627 11131 -54869 -59150 -3567 43032 24746 -27822 -40133 -2356 31461 23973 -15158
1018a5158l6286P022N4684M7005j5686o3933m7693J7512O7939M4225k9675o3085
$$ -15158 -51444 -44422 10262 57267 41581 -22352 -70045 -52533 15406 59631 29956 -33129
1030c3129j7991L6936L8835j35l5869l0850J6719N0024K1723l5858n5110j6609
$$ -33129 -51120 -14184 24651 24516 -11353 -42203 -25484 24540 46263 10405 -44705 -61314
1042f1314M2434O3819J6596n3555o1327k702N0421M5716k264m4844l5236J8616
$$ -61314 -18880 44939 61535 7980 -53347 -56049 -5628 40088 37824 -7020 -42256 -23640
1054b3640M7637J2034l5587l9284J508M4779M5460r530o0851m2780K0779N9535
$$ -23640 23997 36031 444 -38840 -37332 7447 52907 43377 -17474 -60254 -39475 20060
1066B0060L9665j9541o1633l3925L3253N6049J0002m0070l8051P180M4767K9319
$$ 20060 59725 40184 -21449 -55374 -22121 33928 43930 3860 -34191 -27011 17756 47075
1078D7075k6511n0876j4295L5097M6992J6103l4274n7156j7660M7247N6910K277
$$ 47075 20564 -30312 -44607 -9510 37482 53585 19311 -37845 -55505 -8258 48652 50929
1090E0929m9459m4500J0197N2449K7147l2297m6399j656L8094L4676k650m1093
$$ 50929 1470 -43030 -32833 19616 46763 14466 -31933 -33589 4505 39181 36531 -4562
1102d562m2349P421N4343M0359j7771n6662l5962K5758N8839J9836m1283m3836
$$ -4562 -46911 -39490 14853 55212 37441 -19221 -55183 -29425 29414 49250 7967 -35869
1114c5869K987L6821K8800q111l9652k9609K0051M9670K2716l1464n4636j9467
$$ -35869 -32882 3939 32739 24628 -15024 -44633 -24582 25088 47804 16340 -38296 -57763
1126e7763M3344N9506K994n5402m2550J3602M5734K8029j7794m4242j8326K9891
$$ -57763 -14419 45087 48081 -7321 -49871 -36269 9465 37494 19700 -24542 -42868 -12977
1138a2977M0911N942l4272m1585k532M7655M5792j4430n6907l1737K4789N1208
$$ -12977 27934 33876 -396 -41981 -44513 3142 48934 34504 -22403 -54140 -29351 21857
1150B1857K4045k9353n0084j0446L8422L9181k252l7972l4239R587M9546K9752
$$ 21857 45902 16549 -33535 -43981 -5559 33622 31370 -6602 -40841 -31254 18292 48044
1162D8044k8689n1390j4106L4957M6834R786m1053m4719L839M4642L2186j0367
$$ 48044 19355 -32035 -46141 -11184 35650 45436 4383 -40336 -36497 8145 40331 29964
1174B9964l9838k9040J7681M8091J9134l4511m3745l971L8701M1875k917m8644
$$ 29964 -9874 -38914 -21233 26858 45992 11481 -32264 -36235 2466 44341 41424 -7220
1186g220l7126J9392M9401K3754k3417m5456j8814L2216M6494L636l9979l5064
$$ -7220 -44346 -24954 24447 48201 24784 -20672 -39486 -7270 39224 42860 2881 -32183
1198c2183P211L9690L2592j4276m8575k3694K8857M6086J3316l1415m4711q118
$$ -32183 -24972 14718 47310 33034 -15541 -39235 -10378 35708 49024 17609 -27102 -35220
1210c5220M2289M2550q997m4821k9094J6190M4334K5185k7324m8607r415L8253
$$ -35220 7069 49619 40622 -4199 -33293 -17103 27231 52416 25092 -23515 -32930 5323
1222E323L9357o18l8856l6954P349M6301K9148k0281m2427k0090K2036M2761J5924
$$ 5323 44680 44062 5206 -31748 -24399 21902 51050 30769 -11658 -31748 -9712 33049 48973
1235D8973l4463m4328P03M1097L2973r478m3020l0925J9674M7696J7221l0131
$$ 48973 14510 -29818 -29115 11982 44955 35477 -7543 -38468 -18794 28902 46123 15992
1247A5992m1234j0492L1018M1160K513m2784l5687J3380M1953K3004j8618m3450
$$ 15992 -25242 -35734 -4716 36444 38957 -3827 -39514 -26134 15819 38823 20205 -23245
1259b3245j9078K9770M2793M969l4974l5589r52L6938L7075q839m6893k7621K3008
$$ -23245 -42323 -12553 30240 35209 235 -35354 -36306 632 37707 28868 -18025 -45646 -22638
1272b2638M3513J7041k7960m4394o952M0573L7351r366l9075k7093J1953M1710
$$ -22638 20875 37916 9956 -34438 -41390 -817 36534 27168 -11907 -39000 -27047 14663
1284A4663K6198k2279m5327j3364L0767L8709P854l4035l8465M111M2410K8237
$$ 14663 40861 18582 -26745 -40109 -9342 29367 37221 3186 -35279 -31168 11242 39479
1296C9479j5407l8127k1389J8960M3195J7221l2877m2575j839L8059L5543n413
$$ 39479 24072 -14055 -35444 -16484 26711 43932 11055 -31520 -33359 4700 40243 34830
1308C4830m2246l0825J7991M3708J6256k3617l5286j2226K4450L8234N835l6409
$$ 34830 -7416 -38241 -20250 23458 39714 16097 -19189 -31415 -6965 31269 37104 695
1320F95l3773P165L8406K7855j4560m4291k1901K8520M1967P400l0396l4777n509
$$ 695 -33078 -25913 12493 40348 25788 -18503 -40404 -11884 30083 37483 7087 -27690 -33199
1333c3199L3504L6543n741m0955k6315J6931L8877J9676k4621m3083p063L6998
$$ -33199 305 36848 31107 -9848 -36163 -19232 19645 39321 14700 -28383 -35446 1552
1345A552L5105n794l5142k8910O922L9023K8434j7114m0349j8232K1824L8565
$$ 1552 36657 30863 -4279 -33189 -26267 12756 41190 24076 -16273 -34505 -12681 25884
1357B5884J3839l0139m0424J891M0313K7768j3954l8013k1997J9246M2279J5097
$$ 25884 39723 9584 -30840 -28949 11364 39132 25178 -12835 -34832 -15586 26693 41790
1369D1790l0330l8618n508L0326L5243K099l6606l3045J1162L7588J8824j6999
$$ 41790 11460 -27158 -32666 -2340 32903 35002 -1604 -34649 -23487 14101 32925 15926
1381A5926l3857j5632K3381L7426M782l4729l3024L844L6950L1533j1348m5270
$$ 15926 -17931 -33563 -10182 27244 32026 -2703 -35727 -31883 5067 36600 25252 -20018
1393b0018k4922K4136M0120J0688k4318l3276p321K8791L0649m843l3148k2631
$$ -20018 -44940 -20804 19316 30004 5686 -27590 -34911 -6120 24529 19686 -13462 -36093
1405c6093J1885L6169K1518k2211m4315j0807L4541L7598J866l2522l2773J505
$$ -36093 -24208 11961 33479 11268 -33047 -43854 -9313 28285 30151 -2371 -35144 -33639
1417c3639L5702K8292j1403l2944j7734J5647L5105J4423k9889l8277L655M1156
$$ -33639 2063 30355 18952 -13992 -31726 -16079 19026 33449 3560 -34717 -31062 10094
1429A0094K9109j2913m0076k4252J8392M1185J6638k1628l1836j1605J7954L2844
$$ 10094 39203 26290 -13786 -38038 -19646 21539 38177 16549 -15287 -26892 -8938 23906
1441B3906R238k8069l1165O951L5984K0892j7527l9796j5545L1480M1467K005
$$ 23906 33144 5075 -26090 -19139 16845 37737 20210 -19586 -35131 -3651 37816 39821
1453C9821l5402l1531L29K9165L1461j245l3543k5263J1197L1022J5525j8162
$$ 39821 4419 -27112 -26783 2382 33843 32598 -945 -26208 -15011 16011 31536 13374
1465A3374l3228o141L3223L0353j0172l6816k3849J3013L6825K5436j6644m0632
$$ 13374 -19854 -25995 7228 37581 27409 -9407 -33256 -20243 16582 42018 25374 -15258
1477a5258j8213K0530L3517J3214k2016l3330k057L2741K3293j5608l3051j3300
$$ -15258 -33471 -12941 20576 33790 11774 -21556 -23613 9128 32421 16813 -16238 -29538
1489b9538K2100L6918R323l2248l7819j219L2997L1872J252l0996l1742M172L3430
$$ -29538 -7438 29480 38803 6555 -31264 -32483 514 32386 33638 2642 -29100 -24928 8502
1502H502K0440j3705k7394j1965J9722L1403R59l5927k8971J3698L8911K3243
$$ 8502 28942 15237 -12157 -24122 -4400 27003 27962 -7965 -36936 -23238 15673 38916
1514C8916j6281m1301k2557K1548L7916J2708k0211k8527r937J9145K7323r23
$$ 38916 22635 -18666 -41223 -19675 18241 30949 10738 -17789 -27726 -8581 18742 17819
1526A7819k9152j8145J5169L1230J2161k5049l8490o804L6130L5732j536l2209
$$ 17819 -11333 -29478 -14309 16921 29082 4033 -34457 -41261 -5131 30601 29065 -3144
1538c144l0455j641K9844K9753n288l0886j7232J4664K7357P036k5767k9247Q770
$$ -3144 -33599 -35240 -5396 24357 19069 -11817 -29049 -14385 12972 20008 -5759 -35006 -26236
1551b6236L8051K0877j8182l4972j9199J4575L7534K1922j7405l5677j5361J7914
$$ -26236 11815 32692 14510 -20462 -39661 -25086 12448 34370 16965 -18712 -34073 -16159
1563a6159L1204R570k5462k6653J0516L2649J1057k2976l0169n530K8244L5757
$$ -16159 15045 24615 -847 -27500 -16984 15665 26722 3746 -26423 -31953 -3709 32048
1575C2048K322l3287l3064l57K9402L2569J703l2930k5819J1309K8606R173j6761
$$ 32048 34370 1083 -31981 -32338 -2936 29633 31336 -1594 -27413 -16104 12502 21675 4914
1588D914k2212k68K5781K3352j0649l4374k0059J4530L5431K4902j4956m2630
$$ 4914 -17298 -17566 8215 31567 20918 -13456 -33515 -18985 16446 41348 26392 -16238
1600a6238k0705K2372L5224R271k0488k5304n62K4408J5852j4291k5200n495J9613
$$ -16238 -36943 -14571 20653 29924 9436 -15868 -16430 7978 23830 9539 -15661 -21156 -1543
1613a543K7852P131k7161l6574l300L3447L3357J017l0639l0773K435L1251J9450
$$ -1543 26309 33440 6279 -30295 -33595 -148 33209 34226 3587 -27186 -24751 6500 25950
1626B5950j3353k4949m779J8545K1099k581l0044k2248J4998L5634J8365j6188
$$ 25950 12597 -12352 -17131 1414 22513 19932 -10112 -32360 -17362 18272 36637 20449
1638B0449l7202k1731J7868L9094J4933k1205k9193p043J8987K2060k389k5531
$$ 20449 -16753 -38484 -20616 18478 33411 12206 -16987 -24030 -5043 17017 14628 -10903
1650a0903j2485J7609K5180M242k1762l0388o662L1186L5846L46l3378l1525L81
$$ -10903 -23388 -5779 19401 23643 1881 -28507 -35169 -3983 31863 32209 -1169 -32694 -32313
1663c2313L0776K7593p653k9816j2090J6672J9058j24j8620j8088O498K8244J8987
$$ -32313 -1537 26056 18403 -11413 -23503 -6831 12227 12103 -6517 -24605 -18107 10137 29124
1676B9124j3618l2552j9979J2938L7490K3531j9632l8698j1771K2903K5669K451
$$ 29124 15506 -17046 -37025 -24087 13403 36934 17302 -21396 -33167 -10264 15405 17856
1688A7856k0442j7615R127K3738P080j8989k3201l917K1858L1654O073l2254l4402
$$ 17856 -2586 -20201 -11074 12664 19744 755 -22446 -26363 -4505 27149 33222 968 -33434
1701c3434J199L2822K8208l562k9120k0666J0936K4890N844j5146j6277M3J9364
$$ -33434 -32235 587 28795 25233 -3887 -24553 -13617 11273 17117 1971 -14306 -14263 5101
1714E101K0925o034l2562k1141J5704L6561K0160j8065l8858j5647K4112L1050
$$ 5101 26026 19992 -12570 -33711 -18007 18554 38714 20649 -18209 -33856 -9744 21306
1726B1306L419j9471j7940J89J7287J4557r353k2277p079J7740K5336O878k4395
$$ 21306 24725 5254 -12686 -12497 4790 19347 9994 -12283 -19362 -1622 23714 30592 6197
1739F197l4003l134L3398L1315m627k9468k3765N188K6606J5916j2309k1858l307
$$ 6197 -27806 -30940 2458 33773 29146 -322 -24087 -18899 7707 23623 11314 -10544 -13851
1752a3851J5540J7273j283k3248k1123J0564L3131J6973j6817l2676j6499J7185
$$ -13851 1689 18962 17679 -5569 -26692 -16128 17003 33976 17159 -15517 -32016 -14831
1764a4831L3044J1843k1164k5230l155J7292J7559r28k1188j4531J3574K5441
$$ -14831 18213 30056 8892 -16338 -19493 -2201 15358 14430 -6758 -21289 -7715 17726
1776A7726N618k1438k7473l960K7616L1614k552l2414k4632O735K6221J8723p646
$$ 17726 23344 1906 -25567 -29527 -1911 29703 27151 -5263 -29895 -23160 3061 21784 14138
1789A4138k4439j1209J4241J8924J364j6619j7504J776K5689K1184j2282l2887
$$ 14138 -10301 -21510 -7269 11655 13019 -3600 -21104 -19328 6361 27545 15263 -17624
1801a7624j6612J6928L2177J4507j9157l1513o583K1810K1082o47j7451j5578
$$ -17624 -34236 -17308 14869 29376 10219 -21294 -27877 -6067 15015 14368 -3083 -18661
1813a8661M601K2523J1624j6062k4482n011K0654K7412L599k7754k8086M653K8583
$$ -18661 -14060 8463 20087 4025 -20457 -25468 -4814 22598 26197 -1557 -29643 -24990 3593
1826C593J9892o040k2880j6466Q156K3903Q814j5389j9681j166K0307K0644m547
$$ 3593 23485 17445 -5435 -21901 -13745 10158 18972 3583 -16098 -17264 3043 23687 19140
1839A9140k9905j9142J6471L1528J1692j7830k7690j0037J9329K5534K778j9282
$$ 19140 -10765 -29907 -13436 18092 29784 11954 -15736 -25773 -6444 19090 21868 2586
1851B586j7193J174J7594J6606o801k5488j0636J8645K5958L734k3181k6613J44
$$ 2586 -14607 -13433 4161 20767 13966 -11522 -22158 -3513 22445 26179 2998 -23615 -23471
1864b3471K8900K3403p531k6098j5966P069K3080J3674j2074k3811m635J8509
$$ -23471 5429 28832 21301 -4797 -20763 -13694 9386 23060 10986 -12825 -17460 1049
1876A049J8455j629k1550j9440Q098K8660J4627j5889k6543r818J4353K5942Q786
$$ 1049 19504 17875 -3675 -23115 -15017 13643 28270 12381 -14162 -23980 -9627 16315 25101
1889B5101j9057k3751j057J9592J7742l598k2136j5729J2680K6673O179k1012
$$ 25101 6044 -17707 -18764 828 18570 14972 -7164 -22893 -10213 16460 22639 1627
1901A627k2541j560K1673K3269k021k6106j9112P885K2451J3828p762k2878j1817
$$ 1627 -20914 -22474 -801 22468 20447 -5659 -24771 -16886 5565 19393 11631 -11247 -23064
1914b3064J5251K2865J656j9371j8788K373K3400J9142j0391k8431j2748J6756
$$ -23064 -7813 15052 16708 -2663 -21451 -19078 4322 23464 13073 -15358 -28106 -11350
1926a1350K5111P976j6967k5017l820K1855J9708l874j9925j4875O788K2296J2182
$$ -11350 13761 21737 4770 -20247 -24067 -2212 17496 13622 -6303 -21178 -14390 7906 20088
1939B0088j4357k4327m418J8754K1559J743k1077k2396L784K5196J6761q784k2681
$$ 20088 5731 -18596 -23014 -4260 17299 19042 -2035 -24431 -20647 4549 21310 12526 -10155
1952a0155j2229J0644K4383P888j8409k1935J848K0232J7985m735k3734j5797
$$ -10155 -22384 -11740 12643 20531 2122 -19813 -17965 2267 20252 15517 -8217 -24014
1964b4014J2582K4827Q375j4464k1038o815J5871K2645J939k0593j7769M810K0477
$$ -24014 -11432 13395 21770 7306 -13732 -20547 -4676 17969 19908 -685 -18454 -13644 6833
1977F833J5065q520k4329j1102J7916K3329K254j9088j9812j05K1959J9664o860
$$ 6833 21898 13378 -10951 -22053 -4137 19192 21446 2358 -17454 -17559 4400 24064 17204
1990A7204k4803j1990J1151K1394R355j4174k2780l391K0775J7965l208k0266
$$ 17204 -7599 -19589 -8438 12956 22311 8137 -14643 -18034 2741 20706 17498 -2768
2002b768j5922N435K3655J3961j3156k3461p290J5008K1253N016j9589k2145L689
$$ -2768 -18690 -13255 10400 24361 11205 -12256 -19546 -4538 16715 21731 2142 -20003 -16314
2015a6314K3483J3743q465k1416j1671J2049K3294O042j7944k0082m21J7713J7744
$$ -16314 7169 20912 12447 -8969 -20640 -8591 14703 20745 2801 -17281 -17702 11 17755
2028A7755j418k1344j7096R136K2140R791j1256k0887q495J6327K2205J81k1048
$$ 17755 16337 -5007 -22103 -12967 9173 18964 7708 -13179 -21674 -5347 16858 17039 -4009
2041d009j6480M406K0149J5302p968k4307j0601J5193K1199M158j5737j9552j819
$$ -4009 -20489 -16083 4066 19368 11400 -12907 -23508 -8315 12884 17042 1305 -18247 -20066
2054b0066K0304J8255o761k1312j1743R378K0147J0694j3535k2470m243J8158
$$ -20066 238 18493 11732 -9580 -21323 -11945 8202 18896 5361 -17109 -21352 -3194
2066c194J8452M60j8197j8918M194K3529J4101j2491k1110p690J4430K0545M030
$$ -3194 15258 15718 -2479 -21397 -17203 6326 20427 7936 -13174 -20864 -6434 14111 18141
2079A8141j8619j9121L074K0197J4289n778j9166j3541R711K2980Q091j4882j9604
$$ 18141 -478 -19599 -16525 3672 17961 12183 -6983 -20524 -10813 12167 20258 5376 -14228
2092a4228l360J6005J9104j9k0668j6073Q164K0471J0793r626k1451q757J5891
$$ -14228 -17588 -1583 17521 17502 -3166 -19239 -11075 9396 20189 10563 -10888 -19645 -3754
2105c754K2345R16j8805j6796K321J9092J5433o485k1570r894J1434J8568O905
$$ -3754 18591 19507 702 -16094 -13773 5319 20752 14267 -7303 -17197 -5763 12805 19710
2118A9710j2836j9810l627J9012J8363m673k0213j2878O485K0610J2471j2639
$$ 19710 6874 -12936 -16563 2449 20812 16139 -4074 -16952 -10467 10143 22614 9975
2130I975k2073n309J5769J8372J850j7136j8406L125K1983J2813j0756j9781p572
$$ 9975 -12098 -17407 -1638 16734 18584 1448 -16958 -13833 8150 20963 10207 -9574 -17146
2143a7146J1945J9902M738j7245j8217P97J7323J5238j750j8936j6433P693K2156
$$ -17146 -5201 14701 19439 2194 -16023 -15226 2097 17335 15585 -3351 -19784 -12091 10065
2156A0065R426j2931j9438m724J4913J9002q63k0092j4191O467J8649J1810q219
$$ 10065 19491 6560 -12878 -17602 -2689 16313 15450 -4642 -18833 -12366 6283 18093 9874
2169I874k1270r928J3925K0545L060j5464j6430j251J6628J5833m260j9221j0653
$$ 9874 -11396 -21324 -7399 13146 16206 742 -15688 -16939 -311 15522 11262 -7959 -18612
2182a8612Q719J7770Q292j1913k0729l760J8527J8021k595j8989j4674M431K0110
$$ -18612 -9893 7877 16169 4256 -16473 -20233 -1706 16315 13720 -5269 -19943 -15512 4598
2195D598J3169r888j9664o314J1558J7226L996j5292j7592L286K0039J1941q600
$$ 4598 17767 7879 -11785 -18099 -6541 10685 14681 -611 -18203 -14917 5122 17063 8463
2208H463j8233r933J0042K0549P819j4268j8620l192J4408J7491J340j8244j6263
$$ 8463 -9770 -19703 -9661 10888 18707 4439 -14181 -17373 -2965 14526 15866 -2378 -18641
2221a8641P891K0480P898j2280j7754m050J5395J8118r06j8172j4241L278J7114
$$ -18641 -10750 9730 17628 5348 -12406 -16456 -1061 17057 16151 -2021 -16262 -12984 4130
2234D130J4370l958j9722j2737J0466J8973N797j2544j5987j763J6424J4699n599
$$ 4130 18500 14542 -5180 -17917 -7451 11522 17319 4775 -11212 -12975 3449 18148 12549
2247A2549j8690r528Q512J8179J0143j0976k2051o345J6340J8738J085j5722j5681
$$ 12549 -6141 -15669 -7157 11022 21165 10189 -11862 -18207 -1867 16871 17956 2234 -13447
2260a3447J907J7752J1169q789j6469m701J0258J5748L870j5590j7922K065J8805
$$ -13447 -11540 6212 17381 8592 -7877 -12578 -2320 13428 17298 1708 -16214 -14149 4656
2273D656J4534m075j8877j4348O633K0622Q947j1649j6685l476J2895J4574j145
$$ 4656 19190 15115 -3762 -18110 -11477 9145 18092 6443 -10242 -13718 -823 13751 12606
2286A2606j7846j1689Q723J8182O913j0388j8832p352J3260J9913L677j5320j6241
$$ 12606 -5240 -16929 -8206 9976 16889 6501 -12331 -19683 -6423 13490 17167 1847 -14394
2299a4394k005J4600J5509k698j7985r732J0203J6061L221j2781j6279p78J7911
$$ -14394 -16399 -1799 13710 11012 -6973 -16705 -6502 9559 12780 -1 -16280 -17058 853
2312H53J6105m713j8451j3659M662J8494J3707p579j9981p053J1702J4486J618
$$ 853 16958 12245 -6206 -19865 -15203 3291 16998 9419 -10562 -17615 -5913 8573 10191
2325A0191j2031j2888L127J6753R093q648j6884p535R756K0042Q320j4878k0570
$$ 10191 -1840 -14728 -11601 5152 14245 5597 -11287 -18822 -9066 10976 19296 4418 -16152
2338a6152l251J6760J6035j56j5829j2980O678J6389M951j1212j2833j622J3186
$$ -16152 -19403 -2643 13392 13236 -2593 -15573 -8895 7494 12445 1233 -11600 -13222 -36
2351c6J5049n84j7969j5109M744J9004J3693n353j9548j1994R907J8065M361j1012
$$ -36 15013 14429 -3540 -18649 -13905 5099 18792 13439 -6109 -18103 -8196 9869 14230 3218
2365C218j2903j38J2984J2164n659j7959p970J1406J8217O359j2390k0087n399
$$ 3218 -9685 -9823 3161 15325 9666 -8293 -16263 -4857 13360 19719 7329 -12758 -18157
2378a8157J5964J7836R65j4290j3343O55J3623J0682o046j4591m076J0340J3672
$$ -18157 -2193 15643 16608 2318 -11025 -10370 3253 13935 7889 -6702 -10778 -438 13234
2391A3234J754j4967j6317K241K0556J3692n880j9027j2489O114J8421J0297j0182
$$ 13234 14988 21 -16296 -14055 6501 20193 14313 -4714 -17203 -11089 7332 17629 7447
2404G447j5876k481J0563J1255j078j3850j0383Q198J7078N672j1366j7465o126
$$ 7447 -8429 -10910 -347 10908 9830 -4020 -14403 -6205 10873 16545 5179 -12286 -18412
2417a8412J2183K0148M486j5807j6831p22J3804J2931j878j4996r095R371J4288
$$ -18412 -6229 13919 18405 2598 -14233 -14955 -1151 11780 9902 -5094 -14189 -4818 9470
2430I470J067j2957j2981J025J6414J5141n043j9857j2561O866J7487J1206o472
$$ 9470 10537 -2420 -15401 -14376 2038 17179 12136 -7721 -20282 -13416 4071 15277 8805
2443H805j7719p064R950J2860J087r927r943J608J4790R480r156j8378n554J2467
$$ 8805 -8914 -15978 -6028 6832 7919 -2008 -11951 -10343 4447 13927 4771 -13607 -19161 -6694
2457f694J9046N355j5131j9531j377J6302J3712r84j2687j0314L027J3720O052
$$ -6694 12352 17707 2576 -16955 -18332 -2030 11682 10698 -1989 -12303 -9276 4444 10496
2470A0496r238j2669p68J2614J3997j462j7997j4208O671J9475J0687o544j6464
$$ 10496 1258 -11411 -12179 435 14432 12970 -5027 -19235 -12564 6911 17598 11054 -5410
2483e410j0237P424J6238N604j0064j2292N0J2230J0771n373j7255p186J3049
$$ -5410 -15647 -8223 8015 13619 3555 -8737 -8687 3543 14314 8941 -8314 -15500 -2451
2496b451J7742K561j3398j6396l352J4741J6084O18j3260j2239J92J2460J0916
$$ -2451 15291 17852 4454 -11942 -15294 -553 15531 16149 2889 -9350 -9158 3302 14218
2509A4218n049j5846m039J2967J2742j417j4886j3559M499J8796J1430p767j7232
$$ 14218 9169 -6677 -10716 2251 14993 13576 -1310 -14869 -10370 8426 19856 12089 -5143
2522e143r473O434J6162Q651r144j5363k312J0767J0627k586j2596q573O935J6397
$$ -5143 -14616 -8182 7980 16631 7487 -7876 -10188 579 11206 8620 -3976 -12549 -5614 10783
2536A0783N058j2308j5987l518J1840J7171L631j5335j5525O67J3986J0646l119
$$ 10783 15841 3533 -12454 -15972 -4132 13039 16670 1335 -14190 -13523 463 11109 7990
2549G990j3593p368Q348J3567R88j3260j1110K264J4602J2509n083j8166j0671
$$ 7990 -5603 -12971 -4623 8944 9932 -3328 -14438 -12174 2428 14937 9854 -8312 -18983
2562a8983Q270J5500Q208o364j5357o641R548J3347L67j1231r426K916J4145Q836
$$ -18983 -10713 4787 12995 6631 -8726 -15367 -5819 7528 7895 -3336 -12762 -9846 4299 13135
2576A3135r929j7703l459J3553J5438K135j3552j5830O5J4275J2070k358j1922
$$ 13135 3206 -14497 -17956 -4403 11035 13170 -382 -16212 -16147 -1872 10198 7840 -4082
2589d082r172L232J3362P116j0016j3818J40J3855J1510k991j5338j2174O271
$$ -4082 -13254 -10022 3340 10456 440 -13378 -13238 617 12127 9136 -6202 -18376 -12105
2602a2105J7260R013p783j4415p689O933J5822M879j1667j2279J992J3026Q084
$$ -12105 5155 14168 6385 -8030 -15719 -8786 7036 11915 248 -12031 -10039 2987 11071
2615A1071n337j4366o318J1532J5003K490j1637j3214k869J1947J4976M76j3794
$$ 11071 5734 -8632 -14950 -3418 11585 14075 2438 -10776 -13645 -1698 13278 13754 -40
2628d0j1393L224J3542Q034n991j4608l587J2791J2581k833j3713r669L413J5623
$$ -40 -11433 -8209 5333 13367 7376 -7232 -10819 1972 14553 11720 -1993 -11662 -8249 7374
2642G374J0557p257j6228o766P822J4040N897r627j3939r59J2384R601l934j1676
$$ 7374 17931 10674 -5554 -12320 -4498 9542 15439 5812 -8127 -9086 3298 12899 8965 -2711
2656b711p820N587J4914O204j1653j4885k539J2062J3969J374j4543j3613L472
$$ -2711 -10531 -4944 9970 16174 4521 -10364 -12903 -841 13128 14502 -41 -13654 -10182
2669a0182J4661P737n963j2140n838P793J2986J681j2224j0910K069J1789J1175
$$ -10182 4479 12216 6253 -5887 -11725 -3932 9054 10735 -1489 -12399 -10330 1459 12634
2682A2634l179j5900j0101P866J4746O165q357j3345m746J0762J2882q84j2508
$$ 12634 9455 -6445 -16546 -8680 6066 12231 3874 -9471 -14217 -3455 9427 8543 -3965
2695c965r192M392J3381P187p771j4994m375J2416J3343O94j1552j2298k2J3623
$$ -3965 -13157 -8765 4616 11803 4032 -10962 -15337 -2921 10422 11116 -436 -12734 -12756 867
2709H67J0917m192j2713o816N563J2384N991r884j3800j33J3123J0758l029j3211
$$ 867 11784 7592 -5121 -11937 -6374 6010 12001 2117 -11683 -11816 1307 12065 9036 -4175
2723d175j0705N806J5694P630r458j3547l847R131J2959K384j2570j1193L448
$$ -4175 -14880 -9074 6620 14250 4792 -8755 -12602 -3471 9488 11872 -698 -11891 -8443
2736h443J2800O942m946j2562o562Q309J4422K983j1135j2306p80J1380J2908
$$ -8443 4357 11299 6353 -6209 -12771 -4462 9960 12943 1808 -10498 -11278 102 13010
2749A3010j349j4663r359O248J3496N242o750j3663l359J1445J2278j356j2410
$$ 13010 11661 -3002 -12361 -6113 7383 12625 5875 -7788 -11147 298 12576 11220 -1190
2762a190q981K611J3112R538n990j4809n504R202J2059L106r059j2449p25J3153
$$ -1190 -10171 -7560 5552 15090 9100 -5709 -11213 -2011 10048 13154 4095 -8354 -9079 4074
2776D074J0136m229j2312p623N527J3837N995r910j4232j293J1727J1470r76j2448
$$ 4074 14210 9981 -2331 -9954 -4427 9410 15405 5495 -8737 -10030 1697 13167 12191 -257
2790b57j0917M288J4115O411p510j1794m421P594J2369K400j1738j1474J913J1618
$$ -257 -11174 -6886 7229 13640 6130 -5664 -10085 -2491 9878 12278 540 -10934 -9021 2597
2804B597R645l582j3644q951P493J4730L609r838j2014j950J0494J1634j266j3768
$$ 2597 12242 8660 -4984 -13935 -6442 8288 11897 2059 -9955 -11905 -1411 10223 8957 -4811
2818d811q512N428J1731O802o616j3646m767J1264J1876j1j0826j0078J123J2131
$$ -4811 -13323 -7895 3836 10638 4022 -9624 -14391 -3127 8749 8738 -2088 -12166 -11043 1088
2832A088R586n016j3432n527P367J2023M266r061j3254q64J3161J0762l712j2510
$$ 1088 10674 5658 -7774 -13301 -5934 6089 10355 1294 -11960 -12824 337 11099 7387 -5123
2846e123q433N705J3754N848r170j2697j038Q963J0319J575j1272j0945L174J3732
$$ -5123 -13556 -7851 5903 11751 2581 -10116 -11154 -2191 8128 9703 -1569 -12514 -9340 4392
2860D392P266o063j2182o143Q206J3802K637j1466j1327J019J1687R252j895j3110
$$ 4392 11658 5595 -6587 -12730 -4524 9278 11915 449 -10878 -9859 1828 11080 9185 -3925
2874c925q997P249J3599L826q745j1757k077J0915J1743k121j2277p760L890J1184
$$ -3925 -12922 -5673 7926 11752 3007 -8750 -10827 88 11831 9710 -2567 -10327 -6437 4747
2888D747P403m971j3134n987R395J2187J473r634j1139J78J2712J0216n423j3053
$$ 4747 12150 7179 -5955 -11942 -2547 9640 11113 1479 -9660 -9482 3230 13446 8023 -5030
2902e030n551O646J1913M742q863j3433p40J1721J0144k213j1044r309L754J3318
$$ -5030 -10581 -3935 7978 12720 3857 -9576 -10316 1405 11549 9336 -1708 -11017 -7263 6055
2916F055O714q314j1758k566P969J1028J999j1093j1472K742J2607Q044m773j2509
$$ 6055 12769 4455 -7303 -9869 -1900 9128 11127 34 -11438 -8696 3911 11955 7182 -5327
2930e327p382P436J4145K840j0888j0632J3J0315R737k092j2247p965N929J1995
$$ -5327 -12709 -5273 8872 11712 824 -9808 -9795 520 10257 8165 -4082 -12047 -6118 5877
2944E877M558p039j1878m329J0394J2503n77j1437r508K491J0900Q806m116j3694
$$ 5877 10435 3396 -8482 -12811 -2417 10086 9509 -1928 -11436 -8945 1955 10761 6645 -7049
2958g049n742Q673J1479K383r214j1824J09J2900R620m959j2131o323N298J2022
$$ -7049 -12791 -4118 7361 9744 530 -11294 -11185 1715 11335 6376 -5755 -12078 -6780 5242
2972E242O064p981j2402k197R559J0059j91r701r674K644J2826O954o769j2023
$$ 5242 11306 3325 -9077 -11274 -1715 8344 8153 -1548 -11222 -8578 4248 11202 4433 -7590
2986g590m011P921J2478L122j2029j1586K051J2101Q634k927j2276p396O459J2810
$$ -7590 -11601 -3680 8798 11920 -109 -11695 -9644 2457 11091 8164 -4112 -11508 -5049 7761
3000G761K648q871r381r86R348J0519j644j2134q026M920J1608O727n376j3270
$$ 7761 10409 1538 -7843 -8829 519 11038 9394 -2740 -10766 -5846 5762 12489 7113 -6157
3014f157n630R633J2684P79j0364r429J286J0968Q515n174j2207m540Q111J0799
$$ -6157 -11787 -2154 10530 11309 945 -8484 -7198 3770 12285 7111 -5096 -9636 -1525 9274
3028I274K972q990j2474m99J2100R918k686j0825p807K675J1485P156o936j1514
$$ 9274 12246 3256 -9218 -9717 2383 12301 9615 -1210 -9017 -6342 5143 12299 5363 -6151
3042f151k144Q459R379O39j0477j0598L369J3765P017o701j2295n762O773J3540
$$ -6151 -8295 164 9543 10182 -295 -10893 -7524 6241 13258 6557 -5738 -11500 -4727 8813
3056H813L377j0439j0396M07R341P827j425j0666p108N960J1117L586q157j0882
$$ 8813 12190 1751 -8645 -8238 1103 8930 7505 -3161 -10269 -4309 6808 10394 2237 -8645
3070h645k297R434J2603k65j2941r002K534J1147P915m032j1959n549Q561J0214
$$ -8645 -10942 -1508 11095 10830 -2111 -11113 -8579 2568 10483 6451 -5508 -11057 -2496 7718
3084G718L54q927q601J184J1343Q827n939j2410n310O515J1417N339o945j2615
$$ 7718 8072 -855 -9456 -8272 3071 11898 5959 -6451 -11761 -5246 6171 11510 4565 -8050
3098h050l199R726R825j48q786q526K229J1714O137p753j1363k220R089J0937
$$ -8050 -11249 -1523 8302 8154 -632 -9158 -6929 4785 10922 3169 -8194 -10414 -1325 9612
3112I612J619j1512j1280K247J1542Q303k807j0621p050M629J1519L083p734q842
$$ 9612 11231 -281 -11561 -9314 2228 10531 7724 -2897 -9947 -5318 6201 9284 1550 -7292
3126g292k47R092Q581j619j2650p997O320J2828N411o885j2483m877Q769J1914
$$ -7292 -7539 1553 10134 8515 -4135 -12132 -5812 7016 12427 5542 -6941 -11818 -3049 8865
3140H865J585r926q150J088R053P561m729j1217l824R114J0435N74r565j0457
$$ 8865 10450 524 -7626 -6538 2515 10076 5347 -5870 -9694 -580 9855 10429 864 -9593
3154i593j59J1778J0325k795j1192p527K305J0315P199n459j1081k576Q933Q900
$$ -9593 -9752 2026 12351 9556 -1636 -9163 -6858 3457 10656 5197 -5884 -8460 473 9373
3168I373j118j0600q497M170J3700N931p783j1568m267O421J1291M628q121j0667
$$ 9373 8255 -2345 -10842 -6672 7028 12959 5176 -6392 -10659 -4238 7053 11681 3560 -7107
3182g107j059Q606P684r07r650o605N230J1786K541r420j0434p17J0430J0486
$$ -7107 -8166 440 8124 7217 -2433 -9038 -3808 7978 10519 1099 -9335 -10052 378 10864
3196A0864pj2302j0171L338J0866P151l471j0448n640O547J0291K6q945p337J796
$$ 10864 10857 -1445 -11616 -8278 2588 9739 6268 -4180 -9820 -3273 7018 7044 -1901 -9238 -7442
3211g442J0779P419n366j2531n778P329J1188M510o704j1847l696R148R793j92
$$ -7442 3337 10756 5390 -7141 -12919 -5590 5598 10108 3404 -8443 -12139 -2991 6802 6610
3225F610q970p138K775J0318N075p646j1768j66J0180R305k11j0567j0211J719
$$ 6610 -2360 -9498 -6723 3595 8670 1024 -10744 -10910 -730 8575 8364 -2203 -12414 -10695
3239a0695J2014Q018l133r502o403L254J0603M080p174r488J026R405P460k902
$$ -10695 1319 9337 6204 -3298 -9701 -6447 4156 8236 1062 -8426 -7400 2005 9465 6563
3253F563j1403p545O925J3117M344p900j0721l996P219J1391K108q672q527J641
$$ 6563 -4840 -12385 -5460 7657 12001 4101 -6620 -10616 -3397 7994 10102 1430 -7097 -5456
3267e456Q270N835l155j0814l664Q622J0715k32r984r175j60J0746J0546k182
$$ -5456 2814 8649 5494 -5320 -8984 -362 10353 10121 137 -9038 -9198 1548 12094 9912
3281I912j1579p446L006R985N960m589j0398k521R030Q048k713r797o639M329
$$ 9912 -1667 -9113 -6107 3878 9838 5249 -5149 -7670 1360 9408 6695 -3102 -9741 -5412
3295e412J1996N594p289j1566l320O129J0524M253p470j0784o28Q346P670j807
$$ -5412 6584 12178 4889 -6677 -9997 -3868 6656 10909 3439 -7345 -7973 373 8043 6236
3309F236q453n961M859J1356K607r554j0302P06J0109R260k57j1433r637L499
$$ 6236 -2217 -8178 -3319 8037 10644 1090 -9212 -8506 1603 10863 10606 -827 -10464 -6965
3323f965J1203N615l432r268n064O266R553Mq607o826K694R041O657m144j2025
$$ -6965 4238 9853 6421 -2847 -7911 -1645 7908 7912 -695 -7521 -4827 4214 10871 6727 -5298
3338e298n729P155J1346L747p166j1070l309Q997J0306j445r755n744L460Q803
$$ -5298 -11027 -3872 7474 11221 4055 -7015 -10324 -1327 8979 7534 -2221 -7965 -4505 4298
3352D298L865o214j0517j177R462R022q21r351r458R90J1349Q087m233j0044m795
$$ 4298 8163 1949 -8568 -9745 -283 8739 7918 -1433 -10891 -9901 1448 9535 5302 -4742 -9537
3367i537L832Q946M081o879r577J083R167O738l080j0073o768N303J3004M302
$$ -9537 -5705 3241 7322 443 -9134 -8051 1116 7854 4774 -5299 -12067 -6764 6240 10542
3381A0542q558j0307k022P370R567J621q814p587K686P882M772l165q780m643
$$ 10542 1984 -8323 -10345 -2975 6592 8213 -601 -8188 -5502 2380 7152 3987 -4793 -9436
3395i436P296J1156M49r424r033M20J0188R424k138j1788o235M826R157M489n088
$$ -9436 -2140 9016 9465 41 -8992 -8572 1616 11040 8902 -2886 -9121 -4295 4862 9351 4263
3410D263r223k617Q198Q338k106r168o226L745R920O010o009j1507l567P189R848
$$ 4263 -4960 -7577 621 8959 6853 -2315 -8541 -4796 5124 11134 5125 -6382 -9949 -2760 7088
3425G088K289o812j0015o16R362P004l108r244m862N466J0033K838q897r987M55
$$ 7088 9377 2565 -7450 -8066 1296 8300 5192 -4052 -8914 -3448 6585 9423 526 -9461 -9006
3440i006R427Q316j272r597q215L297J0501N154n111q956l399N766R463P10q825
$$ -9006 421 8737 7465 -2132 -10347 -7050 3451 8605 3494 -5462 -8861 -3095 6368 7078 -1747
3455a747p283K295R007O378l267j1116n675O033J1785K878p885r433j155Q566
$$ -1747 -9030 -6735 2272 8650 5383 -5733 -11408 -5375 6410 9288 1403 -8030 -9185 -619
3469f19Q961k207r872m966M332Q110L606m946r476k446Q210R221j42r147q265
$$ -619 8342 6135 -3737 -8703 -4371 3739 7345 2399 -7077 -9523 -1313 7908 7766 -1381 -9646
3484i646R52J0700P561m321j0966l494N715Q245K659o761r244P34R478O591l011
$$ -9646 -8694 2006 9567 5246 -5720 -9214 -3499 4746 7405 644 -8600 -7866 1612 8203 5192
3499E192r496n740M334J1255M052p581r552j286P530Q034O15q217p724K973Q707
$$ 5192 -4304 -10044 -5710 5545 9597 2016 -7536 -8822 -1292 6742 7357 -860 -8584 -5611 3096
3514C096N239m096r049m407O546J0596J340r177q710J709R061P770k839j0294
$$ 3096 8335 4239 -4810 -9217 -2671 7925 9265 88 -8622 -6913 2148 9918 7079 -3215
3528c215n633O065Q630K951n454q628j703P901Q346j821r026n630L107R116N357
$$ -3215 -8848 -2783 5847 8798 3344 -5284 -6987 914 9260 7439 -1587 -7217 -4110 5006 10363
3543A0363m630j0228l497P125R142J183p570q338O4R813O944m099j0015l599N398
$$ 10363 5733 -4495 -7992 -867 8275 9458 1888 -6450 -6386 3427 10371 6272 -3743 -7342 -1944
3558a944Q870K680p072r449j29Q657P068j271q655o939K975J0109M731o294q633
$$ -1944 6926 9606 2534 -6915 -7044 1613 8681 7410 -1245 -8184 -5209 4900 9631 3337 -5296
3573e296k158O061Q553P26q736q004K506R432N558l906r407n326N938J0557J774
$$ -5296 -7454 -1393 7160 7886 -850 -8854 -6348 3084 8642 4736 -4671 -9997 -4059 6498 8272
3588H272p918q469L11P752P313j631r804n087M763P921L429m914q939l263P995
$$ 8272 354 -8115 -7804 -52 7261 5630 -4174 -9261 -4498 3423 6852 1938 -7001 -10264 -2269
3603b269R251r04q287p474J974Q920O518m230j0071l648O954Q296J252o834q287
$$ -2269 6982 6078 -2209 -9683 -7709 1211 7729 3499 -6572 -10220 -3266 5030 6282 -552 -8839
3618h839oR298O892l402q372m841L706R457L985o491q752q92P456P040J19p858
$$ -8839 -8845 453 7345 3943 -4429 -9270 -5564 3893 7878 1387 -7365 -8257 -801 6239 6358 -1500
3634a500p298K630R927M993n152r003l064O076R684J149q820p516K193Q367N929
$$ -1500 -8798 -6168 3759 8752 3600 -5403 -8467 -2391 7293 8442 -378 -7894 -5701 2666 8595
3649H595k829q613n243N450R137J860o061q093j86O826Q333j229r460n957L524
$$ 8595 5766 -2847 -8090 -2640 6497 8357 2296 -5797 -5983 843 9176 7947 -1513 -7470 -3946
3664c946Q752M951m393r801l452P472Q620K93q041o818J021Q662O644m369r225
$$ -3946 4806 9757 5364 -4437 -7889 -417 8203 8496 455 -6363 -5342 3320 9964 5595 -3630
3679c630l620N614Q021K087o099q708j49Q325O784j967q077o011K610R365M786
$$ -3630 -7250 -1636 6385 8472 2373 -6335 -6484 1841 8625 6658 -1419 -7430 -4820 4545 9331
3694I331n952q988j544O524P891M24q247p796K745R587M379m229q446l990N649
$$ 9331 3379 -5609 -7153 -629 7262 7686 -561 -8357 -5612 3975 8354 4125 -4321 -8311 -2662
3709b662Q965J680p899p912J579O812O641j915q550n584M608Q570K711n402q121
$$ -2662 6303 7983 84 -7828 -6249 563 7204 5289 -3261 -8845 -4237 4333 7044 1642 -6479
3724f479k014O608R078j087r189n750K609P978N456m014r370l241P002P938M1
$$ -6479 -8493 -1885 7193 6106 -3083 -8833 -6224 1754 7210 3196 -6174 -9415 -2413 5525 5566
3739E566p019o746O48Q046O359l607q399m115M290Q027M116o058r357p23P730
$$ 5566 -1453 -8199 -7551 495 6854 3247 -5152 -9267 -4977 3050 7166 1108 -8249 -8972 -1242
3754a242P224q97p254o707K558R156M657n833q024j952O214P625J242p966p507
$$ -1242 5982 5085 -2169 -8876 -6318 2838 7495 1662 -6362 -8314 -2100 5525 6767 -1199 -8706
3769h706K363Q335N326l019q023m603M501Q767K250n994o971n02O474P319j035
$$ -8706 -6343 1992 7318 4299 -3724 -8327 -3826 4941 7191 1197 -5774 -6276 198 7517 6482
3784F482q680n985M367Q691L547m959q384l051P427Q260Lq246n896J677P649N287
$$ 6482 -2198 -8183 -3816 4875 8422 3463 -4921 -7972 -545 7715 7718 -528 -6424 -4747 2902 8189
3800H189l291q448l158N767P310J500o312p327p17Q535O881k713q103m960K964
$$ 8189 4898 -3550 -6708 -941 6369 7869 1557 -5770 -6487 2048 8929 6216 -1887 -6847 -3883
3815c883Q181N032n783r159j077P009P193j180p203o310K627Q894L869n166p538
$$ -3883 4298 9330 3547 -5612 -6689 320 7513 6333 -870 -7180 -4553 4341 8210 3044 -4494
3830d494k611M612P931K766p483p765L47P274N915j639p695n435M486Q807K079
$$ -4494 -7105 -2493 5438 8204 721 -7044 -6697 577 6492 4853 -2842 -8277 -3791 5016 7095
3845G095o307p253r71P139P381j082r003n725L068Q399M267l604q724l152O357
$$ 7095 788 -6465 -7436 -297 7084 6002 -3001 -8726 -5658 2741 7008 3404 -5320 -8472 -2115
3860b115P541l57o522n484J124P071N833l397q715l208M920Q017K567n488q884
$$ -2115 5426 5069 -1453 -6937 -5813 1258 7091 3694 -5021 -8229 -3309 4708 7275 1787 -7097
3875g097j081Q137O891j652p092n058K602Q076L761n566p903l09O395O165O1p177
$$ -7097 -8178 -41 6850 5198 -1894 -6952 -4350 3726 7487 1921 -5982 -6291 104 6269 6330 -847
3891h47o377J574Q784N179l676p274m332L770Q429K745o205p276K71O560N964
$$ -847 -7224 -5650 3134 8313 4637 -2637 -6969 -3199 5230 7975 1770 -5506 -5235 1325 7289
3906G289j768p930n131M637Q745K424n612p895j672O355P838m31p199n733J428
$$ 7289 5521 -2409 -7540 -2903 5842 8266 2654 -5241 -6913 -558 7280 6849 -350 -6083 -4655
3921d655O937M780k887p561l037N486P316O35o785o503M45P733P064k872q617
$$ -4655 2282 7062 4175 -3386 -6423 -937 6379 7014 229 -6274 -5829 1904 8968 6096 -2521
3936b521m316L371Q072L668m961q272q26P095N616j784o445m785L063P627L695
$$ -2521 -6837 -3466 4606 8274 3313 -4959 -5785 1310 6926 5142 -1303 -6088 -3025 4602 8297
3951H297n176p765j982N108P660J655o597p552O42P359N091j844p353m341L821
$$ 8297 3121 -4644 -6626 -1518 6142 7797 1200 -6352 -5710 1649 6740 4896 -2457 -6798 -2977
3966b977Q281J442o567o898M05O936N994j388q348n916L628Q042L740l957o979
$$ -2977 5304 6746 179 -6719 -6314 622 6616 5228 -3120 -9036 -5408 2634 6374 2417 -4562
3981d562l444N038P238jo238n225J626O534N001l487q241l327O071P405J716n607
$$ -4562 -8006 -2968 4270 4269 -1969 -7194 -5568 966 5967 2480 -5761 -9088 -3017 4388 6104 497
3997D97p662j421P780O926k157p221l522K571O492L134m505o832l04O099N808
$$ 497 -7165 -8586 -806 6120 3963 -3258 -6780 -4209 2283 5417 912 -5920 -6224 -125 5683
4012E683p98o423o101J771Q629M977l948p471l150L863P390K400n902o590J025
$$ 5683 4885 -1538 -7639 -5868 2761 7738 3790 -3681 -6831 -2968 4422 6822 920 -5670 -4645
4027d645O662M436k206p112m182M533Q488J676n732o968j385N802P556J12p162
$$ -4645 2017 6453 4247 -2865 -7047 -2514 5974 7650 1918 -5050 -6435 -633 6923 7035 -127
4042a27n820K364O101L904k522o877l036N562P070k46o920n519J071P317N934
$$ -127 -5947 -3583 2518 6422 3900 -2977 -6013 -451 6619 6373 -547 -6066 -4995 2322 8256
4057H256k843q574l997M560O918K715m180o996j485O448N654j770o484l465K277
$$ 8256 5413 -3161 -7158 -2598 4320 7035 2855 -4141 -5626 822 6476 4706 -1778 -5243 -2966
4072b966P134L689m927p996j327N596O607J341n989p608J227P663M530k888o610
$$ -2966 4168 7857 2930 -5066 -6393 -797 5810 7151 1162 -6446 -5219 2444 6974 4086 -2524
4087b524k886L418P110J474o523n652P09O558N264j564p303n563L529P601L236
$$ -2524 -5410 -1992 5118 6592 69 -5583 -4874 1684 6948 5384 -1919 -7482 -3953 3648 6884
4102F884m062o417k732M585O434M98o208n107J846O118M003k814q007k959N363
$$ 6884 2822 -3595 -6327 -1742 4692 5190 -1018 -6125 -4279 1839 5842 3028 -4979 -7938 -2575
4117b575P846J083o497o252n78O496O287j617p056l550K757N781K672l571p152
$$ -2575 5271 6354 -143 -6395 -6973 -477 5810 4193 -2863 -6413 -3656 2125 4797 1226 -5926
4132e926p76O141N832j053o345n510J681P740M959m027p374k312M242O337J968
$$ -5926 -6702 -561 5271 4218 -2127 -7637 -5956 1784 6743 2716 -4658 -6970 -2728 3609 5577
4147E577n256o283P65O677M148k667o049l379L446P253K200n604o238n49N447
$$ 5577 321 -5962 -5197 1480 5628 2961 -3088 -6467 -3021 4232 6432 828 -5410 -5959 -512
4162e12O270J34o688n275K204O298L530l055o183k685M959O697J81o512n364J946
$$ -512 5758 5892 -796 -6071 -3867 2431 5961 2906 -3277 -5962 -1003 5694 5875 -637 -6001 -4055
4178d055O386M943k347p586l872M493O615J637l885n701j460N544N566j559o034
$$ -4055 2331 7274 4927 -2659 -6531 -2038 4577 6214 2329 -3372 -4832 712 6278 4719 -1315
4193a315l757K349O369L803l908q025j586N774O301M19n524o253M52P331M451
$$ -1315 -5072 -2723 3646 7449 3541 -4484 -6070 -296 6005 6424 900 -5353 -4901 2430 6881
4208F881l404o083k008L420N706J955n614o076P36O171M577j600o219n102L102
$$ 6881 3477 -2606 -4614 -1194 4512 6467 853 -5223 -4487 1684 6261 4661 -1558 -6660 -3558
4223c558P169K852m216o082k057M957N944L30o092n231K320N977L229k812o670
$$ -3558 3611 6463 2247 -3835 -5892 -935 5009 5339 -753 -5984 -3664 2313 5542 2730 -3940
4238c940k949N227O668M74n815m992j07N620N333j411o605l492L058N708K327
$$ -3940 -6889 -1662 5006 5480 -335 -5327 -5434 186 5519 4108 -2497 -5989 -2931 2777 5104
4253E104l377o494j355N538O174j354n936m885J699O940M222l281p577k044M763
$$ 5104 1727 -4767 -6122 -584 5590 4236 -1700 -6585 -4886 2054 6276 2995 -4582 -6626 -1863
4268a863N717J059m534o197M74O683M065k718n702k983K648O619K777m969o814
$$ -1863 3854 4913 379 -5818 -5344 1339 5404 2686 -3016 -5999 -3351 3268 6045 1076 -5738
4283e738J47N197N042J2n569n375J967O861K806l554n614k090M570O162O23o535
$$ -5738 -5591 -394 4648 4660 -909 -6284 -4317 2544 5350 1796 -3818 -5908 -1338 4824 5447 -1088
4299a088m711J789N616M050j991o419l733M237O258J315m139m956j279N060N827
$$ -1088 -5799 -4010 1606 5656 3665 -2754 -6487 -2250 4008 5323 1184 -3772 -5051 9 5836
4314E836j107o493l799K717N815L012l040o750k206N929O048r65n106m492P94
$$ 5836 4729 -1764 -5563 -2846 2969 5981 2941 -3809 -6015 -86 5962 4997 -109 -4601 -3807
4329c807N952M412l175n807k516L649N485J408m387o209L36O188M610j721n516
$$ -3807 2145 6557 3382 -2425 -4941 -1292 4193 5601 1214 -4995 -4659 1529 6139 4418 -1098
4344a098m158K014O358L544m657n977p23M431N234Q0n464n655K548O400K148k756
$$ -1098 -5256 -3242 3116 6660 2003 -3974 -4697 -266 4968 5048 -416 -6071 -3523 2877 5025 2269
4360B269n506k429L921O217N82n441m749M81M823M576j086o101l790L516N546
$$ 2269 -3237 -5666 -1745 4472 5054 -387 -5136 -4655 168 4744 3658 -2443 -6233 -2717 2829
4375B829J876l777n698q93N127N688j110o391l788K459N085L982l003o777j767
$$ 2829 4705 928 -4770 -5663 -536 5152 4042 -2349 -6137 -3678 1407 5389 2386 -4391 -6158
4390f158N122M882K39m209n177L51N839M292k358n893k610L146N274K691m165
$$ -6158 -1036 3846 4085 -124 -5301 -4950 889 5181 2823 -3070 -5680 -2534 2740 5431 1266
4405A266o244m19N508M700n74n397m580K150O435L048m171n396j004L580N601
$$ 1266 -4978 -5397 111 4811 4237 -1160 -5740 -3590 2845 5893 1722 -3674 -4678 -1098 4503
4420D503N61n699m537J841M889L531j949n377l247L262O137J320m607m902k30
$$ 4503 5064 -635 -5172 -3331 1558 5089 3140 -2237 -5484 -2222 3915 5235 628 -4274 -4504
4435d504M943N193r28o422l693K973N850K167l063n962j677N237N291r74m922
$$ -4504 439 5632 4704 -1718 -5411 -2438 3412 5579 2516 -3446 -5123 114 5405 4431 -491
4450d91l767J194M968L628k254o165j618L578M782J119l651n555l86N738M745
$$ -491 -4258 -3064 1904 5532 3278 -2887 -4505 -927 3855 4974 1323 -4232 -4618 1120 5865
4465E865j834n498l218J731N992L196m627n733j6M110M505n0m579n067J732O195
$$ 5865 4031 -1467 -4685 -2954 3038 6234 1607 -4126 -4142 -32 4473 4423 -156 -5223 -3491 2704
4481B704K793l592m872j788L068N108J651m759n017O00M847L573r02n324l685
$$ 2704 5497 1905 -2967 -4755 -1687 3421 5072 313 -4704 -4104 743 4316 3414 -1910 -5595
4496e595K933O064J365m110m970n54M220M957m67n925l372K150N033K738k631
$$ -5595 -2662 3402 4767 657 -4313 -4867 -647 4310 3843 -2082 -5454 -3304 1729 4467 1836
4511A836n174k443M523M963q8m381l553l58M939M272j492o438k201K889N172J913
$$ 1836 -3338 -5781 -1258 3705 3617 -764 -4317 -4675 264 4536 3044 -3394 -5595 -2706 2466 4379
4527D379l587n720o74N649M267j375m802l386K162N144K871l951m781r99M035
$$ 4379 792 -4928 -5602 47 4314 2939 -1863 -5249 -3087 2057 4928 977 -3804 -4803 -768
4542g68M241O67m333m963J098N317L527k215m400l207K726N825J780m946m230
$$ -768 3473 4140 -193 -5156 -4058 1259 4786 2571 -1829 -5036 -2310 3515 5295 349 -3881
4557c881J61M383L839l27n282l780L239M800J962l243m693j606M371N012J12n369
$$ -3881 -3720 663 4502 4175 -1107 -4887 -1648 3152 5114 1871 -2822 -4428 -57 4955 5067 -302
4573c02l626J639M269L332j443n901k501L429N155R30m101m426k41N522M090k179
$$ -302 -3928 -2289 1980 5312 3869 -2032 -4533 -1104 4051 4981 880 -3546 -3787 1735 5825 3646
4589C646n457k137K268M621K286l446n354o11M670L845m80m530l425J169N047
$$ 3646 -1811 -3948 -1680 2941 5227 1781 -3573 -4184 486 4331 3851 -679 -4104 -2935 2112
4604B112K913l218m562j449L116M412J552m995m494O70M835L596j676m714l337
$$ 2112 5025 1807 -2755 -4204 -1088 3324 4876 -119 -4613 -3943 892 4488 2812 -1902 -5239
4619e239K628N704J406m396m352L27L818M013l84n362l077K053M751K295k584
$$ -5239 -2611 3093 4499 103 -4249 -3922 -104 3909 3525 -1837 -4914 -2861 1890 4185 1601
4634A601m739k061L621N500k80m519l529N59M199L874j764n491k093L462M440
$$ 1601 -3138 -5199 -1578 3922 3642 -877 -4406 -3847 352 4226 2462 -3029 -5122 -1660 2780
4649B780Q95l053m949o80N145M155j581m624k605J636M225K678k883m918o34L866
$$ 2780 3675 622 -4327 -5007 138 4293 2712 -1912 -4517 -2881 1344 4022 1139 -3779 -4413 -547
4665e47L119L59l507m226Q33N726K813k805m513k105K565N197J782m368m360P71
$$ -547 2572 2931 -576 -4802 -3969 1757 4570 1765 -2748 -4853 -2288 2909 4691 323 -4037 -3266
4681c266M171K794n90m518l010K449N076J338l525l845p60L511M236J99m846l564
$$ -3266 905 3699 3109 -1409 -4419 -1970 3106 4444 919 -2926 -3686 -175 4061 4260 -586 -4150
4697d150J569M463K893j499n096k240L529M573L31l735l718L00M473L917k283
$$ -4150 -2581 1882 4775 3276 -1820 -4060 -531 4042 4373 638 -3080 -2780 1693 5610 3327
4712C327n323j977K971M433J323k685n028j066M573L902j113l541l217J160M408
$$ 3327 -1996 -3973 -1002 3431 4754 2069 -2959 -4025 548 4450 3337 -204 -3421 -2261 2147
4727B147K846l112m918j021L698L946P77l930m780O13N245K977j969m360k462
$$ 2147 4993 1881 -3037 -4058 -360 3586 4363 433 -4347 -3734 1511 4488 2519 -1841 -4303
4742d303K158M673J225l850l549M03L771K880o92m184l203K028M784J804k540
$$ -4303 -2145 2528 3753 -97 -3646 -3243 528 3408 2716 -1468 -4671 -2643 2141 3945 1405
4757A405m376j799L156M595R15m763l486J231L733L051j834m675k004L676M376
$$ 1405 -2971 -4770 -1614 2981 3896 -867 -4353 -3122 611 3662 1828 -2847 -4851 -1175 3201
4772C201J17l457l552l65L924M218j497m545k303J881L807K084k033m872p39L936
$$ 3201 3318 -139 -3691 -4056 -132 4086 2589 -1956 -4259 -2378 1429 3513 1480 -3392 -4131 -195
4788a95L351k03l876l041Q36M754K921k832m770j060K805M069J262l693m446J194
$$ -195 3156 2953 -923 -3964 -3128 1626 4547 1715 -3055 -4115 -1310 2759 4021 328 -4118 -2924
4804b924L945K389j274l269k520J936M782Q38l147l708l75L313L851J72m358l601
$$ -2924 1021 3410 2136 -1133 -3653 -1717 3065 3903 756 -2952 -3327 -14 3837 4009 -349 -3950
4820c950J820M220K327j734m322k336L367M548m15l942k660P78L936K665j663
$$ -3950 -2130 2090 4417 2683 -1639 -3975 -608 3940 3525 -417 -3077 -2299 1637 4302 2639
4835B639m639j908L183L954Q94k540l769j152L454L912o85m354j785Q69L691K562
$$ 2639 -2000 -3908 -725 3229 4123 1583 -2186 -3338 116 4028 3343 -1011 -2796 -1927 1764 4326
4851D326k784m802k91L891L413r3l486l996O90M444K753k028l677j892K064L649
$$ 4326 1542 -3260 -3551 340 3753 3660 174 -3822 -3132 1312 4065 2037 -1640 -3532 -1468 2181
4867B181J274k972l836K81L878K226p48l810k488J659M207K105l014l524j421
$$ 2181 3455 483 -3353 -3072 806 3032 2284 -1526 -4014 -2355 1852 3957 943 -2581 -4002
4882d002K773M243M39m250l054J156M040J590j563l952j612L313L669k24l239
$$ -4002 -1229 3014 3453 -797 -3851 -2695 1345 2935 1372 -2580 -4192 -879 2790 2566 -673
4897f73k735j85L384L670j047m275k115J484L664K196k123m061j124L487L604
$$ -673 -3408 -3593 -209 3461 2414 -1861 -3976 -2492 1172 3368 1245 -2816 -3940 -453 3151
4912C151q12l735k501J188M248K232k269m724m16K709L520Q60l142l642J66L906
$$ 3151 2339 -1396 -3897 -2709 1539 3771 1502 -3222 -3638 -929 2591 3451 309 -3333 -3167 739
4928G39K422j332l188j807J698L675J570l001l917N12L127K903N7l796l421J534
$$ 739 3161 1829 -1359 -3166 -1468 2207 3777 776 -3141 -2629 498 3401 3458 -338 -3759 -2225
4944b225M365J657j924l596j102K531L828K0l909k499J530K928K092j176m055
$$ -2225 2140 3797 1873 -1723 -2825 -294 3534 3554 -355 -2854 -1324 1604 3696 2520 -1535
4959a535j784K832L399Q17k023l858o04L010L808o26m109k624J931L597J526k148
$$ -1535 -3319 -487 2912 3729 1706 -2152 -2756 254 4062 3436 -673 -3297 -1366 2231 3757 1609
4975A609m182o84M034K845q38l061k733K94M007K541k268l170j358J859L147J283
$$ 1609 -2573 -3257 777 3622 2784 -277 -3010 -2716 1291 3832 1564 -1606 -2964 -1105 2042 3325
4991C325k827l589M68L393K231j095l247k098R64M451J523k823l661l05K688L062
$$ 3325 498 -3091 -2623 770 3001 1906 -1341 -3439 -2475 1976 3499 676 -2985 -3290 -602 2460
5007B460K00l486l337J786L678J455k105k769j327K511L508K18l390k615O87K473
$$ 2460 2660 -826 -4163 -2377 1301 2756 651 -2118 -3445 -934 2574 2792 -598 -3213 -2526 -53
5023e3L088o90l920k570K110L703J186k169l483j084L586L292r79l614k081J587
$$ -53 3035 2345 -1575 -4145 -2035 1668 2854 685 -2798 -3882 -296 2996 2017 -1597 -3678 -2091
5039b091L622J113j708l662q09K838L241Q9k665l232J33L789K592j669l371j374
$$ -2091 1531 2644 936 -2726 -3535 -697 2544 2633 -32 -3264 -3131 658 3250 1581 -1790 -3164
5055c164J783L358J485l040l841P32L173K636o47l154k986J605M230J208k402
$$ -3164 -1381 1977 3462 422 -3419 -2687 486 3122 2475 -679 -3665 -2060 2170 3378 976
5070I76k670p62K094L458j78l189k567J359K948J902r99l132k175K178M295j70
$$ 976 -1694 -2456 -362 3096 2918 -271 -2838 -1479 1469 3371 2372 -760 -2935 -757 3538 3368
5086C368k232l247j47K763L081p22l766j894K324L112R49k104l614m11L477K552
$$ 3368 1136 -2111 -2258 505 3586 2864 -902 -2796 -472 2640 3589 1485 -2129 -2540 937 3489
5102C489r03k757k045O21K822K623j695l932p71J939L126M41k148l485R0L520
$$ 3489 2586 -171 -2216 -1595 1227 3850 2155 -1777 -2548 -609 2517 2958 810 -2675 -2585 935
5118I35K240j537l023j377J620K893J470k688l211k3L246J829j06k809k633J380
$$ 935 3175 1638 -1385 -2762 -1142 1751 3221 533 -2678 -2701 545 2374 2268 -541 -3174 -1794
5134a794L441R24k147k212j116J629L279O21l485k196M83L099K053j034l173k024
$$ -1794 1647 2571 424 -1788 -2904 -1275 2004 2625 -860 -3056 -2573 526 2579 1545 -1628 -3652
5150c652K351L574J37k512k797J36K635K566p70l364j300J320K437J620j206l517
$$ -3652 -1301 2273 2410 -102 -2899 -2763 -128 2438 1668 -1696 -2996 -1676 761 2381 1175 -2342
5166b342r53K586L043o19k281j855N8L286K387k030l474o05K225K517P16k654
$$ -2342 -3295 -709 2334 1715 -566 -2421 -2363 923 3310 1280 -2194 -2799 -574 1943 2659 5
5182Ek965N60L214K006j336k413j842J121L404J380k611k899O0K218K228O95k770
$$ 5 -2960 -2400 814 2820 1484 -929 -2771 -1650 1754 3134 523 -2376 -2316 -98 2130 2825 55
5199E5k983J267L249J352j344k925j569K001L789K10k870k453O73K901J945r52
$$ 55 -2928 -1661 1588 2940 1596 -1329 -2898 -897 2892 3102 232 -2221 -1548 1353 3298 2346
5215B346l427j575K333K744M40k048k579l52K823K573p21l098j627R82K365J909
$$ 2346 -1081 -2656 -323 2421 2861 813 -1766 -2118 705 3278 2557 -541 -2168 -1186 1179 3088
5231C088j370l368p43K606K450J54k500k640L11L270K266j815l188r24J526K770
$$ 3088 1718 -1650 -2393 213 2663 2817 317 -2323 -2012 1258 3524 1709 -1479 -2403 -877 1893
5247A893J142k468l011L90K779J508m60k193k122J155L076J050j951l045j35J806
$$ 1893 3035 567 -2444 -2054 725 2233 1773 -420 -2542 -1387 1689 2739 788 -2257 -2392 -586
5263e86K676N71l203k388R92K554J906j297k873j543K031L163j15k182k214J80
$$ -586 2090 2661 -542 -2930 -1938 616 2522 1225 -1648 -3191 -1160 2003 1888 -294 -2508 -2328
5279b328K220K363q74l110j318J697K470O65j290k920o18K196K870m12k837j583
$$ -2328 -108 2255 1381 -1729 -3047 -1350 1120 1785 495 -2425 -3043 -847 2023 1611 -1226 -2809
5295b809M97K923J798j510l166p81K307K358K50k310k326N32K950J882j690k482
$$ -2809 -2312 611 2409 899 -2267 -3048 -741 1617 1867 -443 -2769 -2237 713 2595 905 -1577
5311a577p56J187K461J182j982k803L84K064K011N3k656k079R29L035J512k034
$$ -1577 -2333 -1146 1315 2497 515 -2288 -1904 160 2171 2224 -432 -2511 -1582 1453 2965 931
5327I31k328q85J759L036K63k780k206J146K156J362q30k510j276J706K857K48
$$ 931 -1397 -2282 -523 2513 2776 -4 -2210 -1064 1092 2454 1624 -886 -2162 -456 2401 2649
5343B649k435j800p3K103K562n46l072j798J555K468J280j563k494j414K831K577
$$ 2649 214 -1586 -1659 444 3006 2460 -612 -2410 -855 1613 2893 1330 -1164 -2578 253 2830
5359B830q20k360j766M19K875J747j493k909o11K242J703M85j683k564M9K738
$$ 2830 2010 -350 -2116 -1697 1178 2925 1432 -1477 -2088 154 1857 2342 659 -1905 -1856 882
5375H82K012j352k242j374O86K741J368k342k609o0K147K358p4k952j810J081
$$ 882 2894 1542 -700 -2074 -1388 1353 2721 379 -2230 -2290 -143 2215 2141 -811 -2621 -1540
5391a540L089R01j720k323o50J474K493M22k800j778O35K045J609m95k807j668
$$ -1540 1549 2450 730 -1593 -2243 -769 1724 2146 -654 -2432 -1797 248 1857 1362 -1445 -3113
5407c113J544L027N65j914k598p4J748K987o45k988q75R25K122J260j333k722
$$ -3113 -1569 1458 2023 109 -2489 -2563 -815 2172 1527 -1461 -2336 -1411 711 1971 638 -2084
5423b084q42K575J731k08k021j433L09K321J992j390k668o37J336J942J251k026
$$ -2084 -2926 -351 1380 1172 -849 -2282 -1973 348 2340 950 -1718 -2355 -1019 923 2174 148
5439A48k525M20K181J735p72j632j918Q09L164J061k554k188M3K078K043K21k751
$$ 148 -2377 -1957 224 1959 1187 -445 -2363 -1554 1610 2671 117 -2071 -2028 50 2093 2314 -437
5456d37k039J209K568R56j297j818r04J329K641K12k496j460L20J652K231k38
$$ -437 -2476 -1267 1301 2257 960 -858 -1762 -433 2208 2420 -76 -1536 -1216 436 2667 2429
5472B429l269j610K035K575N27j432k540m90K180K160m88k559j154Q72K054J529
$$ 2429 -840 -2450 -415 2160 2687 1255 -1285 -1775 405 2565 2077 -482 -1636 -764 1290 2819
5488B819j250k995m23K389J755P9k137j972m8K550J736j239k041j217J458K249
$$ 2819 1569 -1426 -1849 540 2295 2374 237 -1735 -1783 767 2503 1264 -777 -1994 -536 1713
5504A713O89k060k412N62K542J286j118k083j712J238K913Q92j994j872n52J448
$$ 1713 2402 342 -2070 -1508 1034 2320 1202 -881 -2593 -1355 1558 2450 456 -1416 -1968 -520
5520e20J815O62k386j789Q53J729R52p23j965j033J719K314L19k399j863K89J778
$$ -520 1295 1957 -429 -2218 -1365 364 1316 593 -1372 -2405 -686 1628 1947 -452 -2315 -2026 -248
5537b48K154l85k915j095J162K048Q65j618j770p66K387K067j090j920r16O9K249
$$ -248 1906 1521 -1394 -2489 -1327 721 1586 -32 -1802 -2568 -181 1886 796 -1124 -2040 -1971 278
5554B78J968j584k502r43J993K016M19j554k261N4K426J654j358j822n98J081
$$ 278 2246 662 -1840 -2783 -790 1226 1645 91 -2170 -2116 310 1964 606 -1216 -1814 -733
5570g33K210M91k153k035K59K420J443j76k221j697Q28K653Q22j671j221n36Q16
$$ -733 1477 1968 -185 -2220 -1961 459 1902 1726 -495 -2192 -1364 1289 2111 440 -781 -1317 -501
5587e01K322K28k180j856J095K110J155q01k561j202J556K978k46j541j703k51
$$ -501 1821 2049 -131 -1987 -892 1218 2373 1572 -989 -2191 -635 2343 2097 556 -1147 -1398
5603a398J591J988n42k375p35J395J378P12j148k312j78J994K355j091j534j949
$$ -1398 193 2181 1639 -736 -1471 -76 1302 2014 866 -1446 -1624 370 2725 1634 100 -1849
5619a849O72K081J821j115k680n9J225J369M73j511k240P09K266J102j209k055
$$ -1849 -1177 904 2725 1610 -1070 -1129 96 1465 1938 427 -1813 -1104 1162 2264 1055 -1000
5635a000q95J159K154P59j623j878k24J377J543O50k204j823Q33K320P55j646
$$ -1000 -1895 -736 1418 2177 554 -1324 -1548 -171 1372 2022 -182 -2005 -1172 1148 1903 257
5651B57j699j018J899K401j43k618j384J039J452J333n56k407j083J411K130N9
$$ 257 -1442 -2460 -561 1840 1697 -921 -2305 -1266 186 1519 963 -1444 -2527 -1116 1014 1073
5667A073j582j345P4J448K012j279j906j078J373J650R51r80k259q60K081J813
$$ 1073 -509 -1854 -1780 -332 1680 401 -1505 -2583 -1210 440 1391 411 -1848 -2708 -627 1186
5683A186j02j293j831k67K425J472j325k112n5J465J339O82j897j917P29K140
$$ 1186 1084 -209 -2040 -2307 118 1590 265 -1847 -1902 -437 902 1584 -313 -2230 -1501 639
5699F39J166o56j876j371R28K100R17j428j806j41J412J601K80k344j636J587
$$ 639 1805 1149 -727 -2098 -1170 930 1847 419 -1387 -1528 -116 1485 1765 -579 -2215 -628
5715f28K046Q25j509j783r43J650K451K93k337j224P03J139J430o81j993r37J237
$$ -628 1418 2243 734 -1049 -1992 -342 2109 2402 65 -1159 -456 683 2113 1432 -561 -1498 -261
5732b61K131J86j457j961J23J950J806o83k151j050N63J794J683j550k347m18
$$ -261 1870 2056 599 -1362 -1239 711 2517 1834 -317 -1367 -804 990 2673 1123 -1224 -1642
5748a642K036J281k64j331j653J101J758J122j395k227l32J373J746M00j100k645
$$ -1642 394 1675 1411 80 -1573 -472 1286 2408 1013 -1214 -1546 -173 1573 1973 873 -1772
5764a772K20K123J200k83j500j784R58K366L49j712j602l30J844J785j84k609
$$ -1772 -1552 571 1771 1488 -12 -1796 -838 1528 1877 165 -1437 -1767 77 1862 1678 -931
5780i31j276J257J703P83o67k076j463K094J934k10j543j141L54J042J673o21
$$ -931 -2207 -950 753 1536 869 -1207 -2670 -576 1358 1148 -395 -1536 -1182 -140 1533 912
5796I12k161j129J595J907L68j602j789m88K146J578n32j579j000M93K083O28
$$ 912 -1249 -2378 -783 1124 1492 -110 -1899 -2387 -241 1337 805 -774 -1774 -1281 802 1430
5812A430j287k004K5J574J281j30j093j810J31K298J548j115k093n33O73K566
$$ 1430 143 -1861 -1836 -262 1019 889 -204 -2014 -1883 415 1963 848 -1245 -1778 -1105 1461
5828A461M36j932j820O96J543J253p35j626j051R19K248N61j319j835j33J044
$$ 1461 1897 -35 -1855 -1159 384 1637 902 -724 -1775 -856 1392 1953 634 -1201 -1334 -290
5844b90K362k52k142j262N81J886O86l84j811q13J566J963k39j679j121j34J980
$$ -290 2072 1820 -322 -1584 -1003 883 1569 1185 -626 -1439 127 2090 1851 172 -949 -1083 897
5861H97J573m82k830q06J387J820O08j316j926k06J740J514m50j717q67K14J906
$$ 897 2470 1988 -842 -1648 -261 1559 2167 851 -1075 -1281 459 1973 1523 -194 -1061 -847 1059
5878A059J393j357j914m59J074J813J52j448j764K06K035J201j056j470j167J419
$$ 1059 2452 1095 -819 -1278 -204 1609 1761 313 -1451 -1245 790 1991 935 -535 -1702 -283
5894b83J861M45k037j634L56J483J337k69j815j280P60K095L02j055j661j65J348
$$ -283 1578 2023 -14 -1648 -1292 191 1528 1259 -556 -1836 -1076 1019 1321 266 -1395 -1560 -212
5911b12J679k33j868j115L20J624J294p57k264p56J837J845m51j219j706m9J975
$$ -212 1467 1234 -634 -1749 -1429 195 1489 732 -1532 -2288 -451 1394 943 -276 -1982 -2031 -56
5928e6J854r84k278j52O22J997L09j247k159R1J907J064K9j560j555K36K205J453
$$ -56 1798 814 -1464 -1616 -994 1003 1312 65 -2094 -2003 -96 968 997 -563 -2118 -1882 323 1776
5946A776j709j873j18J137J938K19j886j646O84K222M75n00j680r63J015K350
$$ 1776 67 -1806 -1924 -787 1151 1370 -516 -2162 -1478 744 1219 719 -961 -1924 -909 1441
5962A441j40j249j406J12J218J587k00j931j332J049K238L64p63j991m24J372
$$ 1441 1301 52 -1354 -1242 -24 1563 1363 -568 -1900 -851 1387 1751 988 -1003 -1427 -55
5978e5K137n29j499j308L71J963J112r44k148o98J825J439J40j150j692r8J909
$$ -55 2082 1553 54 -1254 -883 1080 2192 1248 -900 -1598 227 1666 1806 656 -1036 -1134 775
5995G75J317q04j711q39P95J610Q83j084k484M94J648J189k14j565j603Q57J902
$$ 775 2092 1288 -423 -1262 -467 1143 2026 942 -1542 -1048 600 1789 1575 10 -1593 -736 1166
6012A166J249j804j525o28J313J980L04k001j819P58J794Q12n04j660j049Q50
$$ 1166 2415 611 -914 -1542 -229 1751 2055 54 -1765 -1007 787 1599 1095 -565 -1614 -764
6028g64J976K99j682j137m77J359J779J5k192j006P13K059J96p94j783q05J926
$$ -764 1212 1511 -171 -1308 -1785 -426 1353 1368 -824 -1830 -1117 942 1138 344 -1439 -2244 -318
6045c18J500m15j214r55j95J764J442r28k169m99J199J509M09j432j524j08J798
$$ -318 1182 767 -447 -1402 -1597 167 1609 681 -1488 -1987 -788 721 1130 -302 -1826 -1934 -136
6062a36J685q37k105j70O10J481J428j495k418J15J961R33j53j168j728N60K189
$$ -136 1549 712 -1393 -1563 -953 528 1956 461 -1957 -1842 119 1052 899 -269 -1997 -1437 752
6079G52R05j274j626k08N97K031L99j889j350N68J299J096K14k407j106J531K026
$$ 752 1657 383 -1243 -1451 -854 1177 1576 -313 -1663 -1095 204 1300 1514 -893 -1999 -468 1558
6096A558k30j150j490JJ487J701k76k185j049R89J914N91r56j633o08J645J653
$$ 1558 1328 178 -1312 -1311 176 1877 1601 -584 -1633 -644 1270 1861 905 -728 -1336 309 1962
6113A962m43j379j029L11J497J110p70j923o46J199J773M65j376j896J12K029
$$ 1962 1519 140 -889 -578 919 2029 1259 -664 -1310 -111 1662 2127 751 -1145 -1033 996
6129I96J040p47j623j122Q99J645J187j815j674J20J793J168k53j725j674O76
$$ 996 2036 1289 -334 -1456 -557 1088 2275 460 -1214 -1094 699 1867 1614 -111 -1785 -1109
6145a109K220O63r90j467p51J274J513J43j831r88K02J415R93l01j789r98J164
$$ -1109 1111 1774 784 -683 -1434 -160 1353 1496 -335 -1323 -1121 294 1287 986 -803 -1801 -637
6162f37J965P5j595j139l82J390J671n19j956n72P84J256P83p54k163J52J253
$$ -637 1328 1403 -192 -1331 -1713 -323 1348 829 -1127 -1699 -915 341 1124 370 -1793 -1641 -388
6179c88J358k41j380j368j6K079J612j279j931k77J008J184J021j353k019J25
$$ -388 970 729 -651 -2019 -2035 44 1656 377 -1554 -1831 -823 361 1382 29 -1990 -1865
6195a865J883J329q40j449r25P48J745R29j628j326j16Q54J585K02j738j205N09
$$ -1865 18 1347 507 -942 -1867 -1119 626 1555 -73 -1399 -1515 -661 924 1126 -612 -1817 -1308
6212a308J905Q48q40j563o49J005K055L58k019j124J50J788J249o69j792j333
$$ -1308 597 1445 605 -958 -1607 -602 1453 1811 -208 -1332 -1182 606 1855 1186 -606 -1939
6228a939J613J886K42j266j408m43J374J861m74j491q88K27J645R89n49k315k69
$$ -1939 -326 1560 1802 536 -872 -1315 59 1920 1446 -45 -933 -706 939 1928 1379 -936 -1205
6245a205J612J434j01j277j653J82J992J399j335j519l92P32J554O75j472j668
$$ -1205 407 1841 1740 463 -1190 -1008 984 2383 1048 -471 -863 -131 1423 2098 626 -1042
6261a042M3J698O56q0j324j399L64K171R05j338j821k89J167J552Q00k232j622
$$ -1042 -999 699 1355 1275 -49 -1448 -1084 1087 1992 654 -1167 -1456 -289 1263 2063 -169 -1791
6278a791Q61J677J120r34j943o47J141K161l50j717j140P5J468J700m93j875j300
$$ -1791 -930 747 1867 933 -1010 -1657 -516 1645 1295 -422 -1562 -1487 -19 1681 1188 -687 -1987
6295a987Q47K130L29r02k038m37J788J577l73k041m53J19K116P98j145k297p5
$$ -1987 -1140 990 1319 417 -1621 -2058 -270 1307 934 -1107 -1560 -1441 675 1473 328 -1969 -2044
6312b044J247J293O41j279k010P9J774J226o66j383q84O06K047O56j775j546k9
$$ -2044 -797 496 1137 -142 -2152 -2073 -299 927 261 -1122 -2006 -1400 647 1303 -472 -2018 -2047
6329b047J673J395k30j182k127P97K014R64j149j526j05P75J827J2j431j267N71
$$ -2047 -374 1021 791 -391 -2518 -1721 293 1257 108 -1418 -1523 -748 1079 1091 -340 -1607 -1036
6346a036J599Q31r61j734o69J397J924K11j255j605l12J709J876o41j949j065
$$ -1036 563 1394 433 -1301 -1970 -573 1351 1562 307 -1298 -1610 99 1975 1334 -615 -1680
6362a680J186J407O38r31j948j11J972J598p62j287j090J58J763J751j321j916
$$ -1680 -494 913 1551 620 -1328 -1439 533 2131 1369 82 -1008 -850 913 2664 1343 -573
6378e73n37J302J074P19j326k164Q33J524R79p31j557r93Q89J883J063j628j895
$$ -573 -1110 192 1266 1985 659 -1505 -672 852 1831 1100 -457 -1450 -561 1322 2385 757 -1138
6395a138m87J515J855j70j581j514P86J823O04j067j313n56J297J650k81j733
$$ -1138 -1625 -110 1745 1575 -6 -1520 -734 1089 1693 626 -687 -1243 54 1704 1423 -310
6411c10j337N22J366J443k34k242r90O95K434Oj218j329l55J627J590q11j919
$$ -310 -1647 -1125 241 1684 1450 -792 -1782 -1087 1347 1353 135 -1194 -1549 78 1668 857 -1062
6428a062m54P50J619P55j289j933l30J500J708k71r42j692o9K253J143q96k091
$$ -1062 -1516 -766 853 1608 319 -1614 -1944 -444 1264 993 51 -1641 -1710 543 1686 790 -1301
6445a301k48Q30J491N53j461j484l3K045Q61l79j394j378O17K292P35j591j633
$$ -1301 -1549 -719 772 1325 -136 -1620 -1653 392 1253 874 -520 -1898 -1281 1011 1746 155 -1478
6462a478p1J381J326j25j648j142J145J658J98n98j609j037J222K239J57j431
$$ -1478 -1549 -168 1158 1033 -615 -1757 -612 1046 1244 646 -963 -2000 -778 1461 1618 187
6478A87j812L19J567J615l83k257q89J193J750J02j193j368l96K058J386n69j552
$$ 187 -1625 -1306 261 1876 1493 -764 -1653 -460 1290 1392 199 -1169 -1565 493 1879 1310 -242
6495b42j113O27J595J300q35k270m54J302J327O85j673j342R2J727J483r91j505
$$ -242 -1355 -728 867 2167 1332 -938 -1392 -90 1237 1922 249 -1093 -1001 726 2209 1218 -287
6512b87j104J066J965L79j344j750l45J847J282j74j248j837J029J714L94j000
$$ -287 -1391 -325 1640 2019 675 -1075 -1420 427 1709 1535 287 -1550 -521 1193 1587 587
6528E87j392m17J183J688J00j458j999O05J692J208o15j924j036J056K389K55
$$ 587 -805 -1222 -39 1649 1749 291 -1708 -1103 589 1797 1182 -742 -1778 -722 1667 1922
6544A922j626j899K89J078K111q48j962r75J277J555j8l49k174l35J325J841J0
$$ 1922 296 -1603 -1314 -236 1875 1027 -935 -1910 -633 922 904 555 -1619 -1954 -629 1212 1222
6561A222j913j214L09J978J265j227j872n04J206J616o5j090j926K42K157J279
$$ 1222 -691 -1905 -1596 382 1647 420 -1452 -1956 -750 866 801 -289 -2215 -1973 184 1463
6577A463j055j689p40O00K302Q15j861j700L86J271J394k33j515j236P19K034
$$ 1463 408 -1281 -2021 -1421 881 1696 -165 -1865 -1479 -208 1186 953 -562 -1798 -1079 955
6593I55O76j136j822r10J534K059L27k077j752O86J886J223p66j709r70J239J746
$$ 955 1631 495 -1327 -2237 -703 1356 1683 -394 -2146 -1460 426 1649 883 -826 -1796 -557 1189
6610A189J75j102j499j66J475J684p36j787r20P05J668R67o55k020o12J492J528
$$ 1189 1364 262 -1237 -1403 72 1756 1020 -767 -1687 -982 686 1653 998 -1022 -1634 -142 1386
6627A386K23j362j533L29J888R06o85j835n11R46J215R61j423j865L5J982J169
$$ 1386 1609 247 -1286 -957 931 1837 1152 -683 -1194 -248 967 1928 505 -1360 -1325 657 1826
6644A826n45j619j301P40J959J094j552j617J39J112J433P8j391k063Q88J998
$$ 1826 1281 -338 -1639 -899 1060 2154 602 -1015 -876 236 1669 1747 356 -1707 -819 1179
6660A179Q80q95j666j157J412J931J27j432j596K74J429J161k27k163p99J029
$$ 1179 2059 1164 -502 -1659 -247 1684 1811 379 -1217 -943 486 1647 1420 -743 -1542 -513
6676e13J684M49j319j400q07J632K121n66j931j078M46J933Q40j159j811n27J674
$$ -513 1171 1620 301 -1099 -1906 -274 1847 1281 -650 -1728 -1282 651 1491 332 -1479 -2006 -332
6693c32J814o7j668j794O70J856Q42m98k122n99R60J436Q52j339j720l8J632J511
$$ -332 1482 1415 -253 -2047 -1377 479 1321 823 -1299 -1898 -938 498 1350 11 -1709 -1747 -115 1396
6711A396n51j316j568Q07J715Q54j132j949p8J328J406M93j749j496J98J879Q62
$$ 1396 845 -471 -2039 -1232 483 1337 205 -1744 -1822 -494 912 1405 -344 -1840 -1642 237 1099
6728A099m11j657p55P72K374k52j336j210k37J784J508n43k019q64P00J919O42
$$ 1099 688 -969 -1724 -952 1422 1170 -166 -1376 -1613 171 1679 1136 -883 -1747 -1047 872 1514
6745A514r62j930l43J651K006k61k034j165N30K164O34p05k096m21J385J421L91
$$ 1514 552 -1378 -1721 -70 1936 1675 -359 -1524 -994 1170 1804 1099 -997 -1418 -33 1388 1779
6762A779j332j760J58J828J325q46j755p32Q12K118M43j139j798k85J657J551
$$ 1779 447 -1313 -1155 673 1998 1152 -603 -1335 -523 1595 2038 899 -899 -1184 473 2024
6778B024k53j560j813Q75J899J141j545j368n56J021K166j18j715j389J84J732
$$ 2024 1771 211 -1602 -727 1172 2313 768 -600 -1156 -135 2031 1913 198 -1191 -1007 725
6794G25J164m73j713j344J460J700J71r64j766j65J441J555L7k197j255P93J836
$$ 725 1889 1416 -297 -1641 -181 1519 1690 726 -1040 -1205 236 1791 1828 -369 -1624 -831 1005
6811A005Q53j005k098n94J741J452P3j646r05kJ538J305o88j969m94O99J758M79
$$ 1005 1858 853 -1245 -1839 -98 1354 1427 -219 -1124 -1126 412 1717 1029 -940 -1434 -735 1023 1502
6829A502j048j772o83K323J261l58k148q85P00J673J175j363j936k90J210K180
$$ 1502 454 -1318 -2001 322 1583 1225 -923 -1808 -1108 565 1740 377 -1559 -1849 -639 1541
6845A541l01j723j804J016J647Q96p00j800m93J048J806K20j429j578J20J284
$$ 1541 1240 -483 -2287 -1271 376 1272 572 -1228 -1721 -673 1133 1353 -76 -1654 -1534 -250
6861b50J613k03j485j636J049K141L43j431j406p42J629K035n45k033r39L35K249
$$ -250 1363 1160 -325 -1961 -912 1229 1572 141 -1265 -2007 -378 1657 1112 -921 -1860 -1525 724
6878G24N33n31j998n31J504J559M5j180j803L20J930J294r49j468j154J101J932
$$ 724 1257 726 -1272 -1803 -299 1260 1305 125 -1678 -1358 572 1866 917 -551 -1705 -604 1328
6895A328O23j456k008R0J754J167o1j468j579P72J720J077r11j844n85J508J310
$$ 1328 1951 495 -1513 -1423 331 1498 1437 -31 -1610 -838 882 1959 1048 -796 -1381 127 1437
6912A437O75j458j758J38J919J132p07j840r57R46K301J26j380j585j29J398J511
$$ 1437 2112 654 -1104 -966 953 2085 1378 -462 -1419 -473 1828 1954 574 -1011 -1140 258 1769
6929A769j82j943j387J094J719Q02r43j911q03J673J951j55j788j371q6J858J441
$$ 1769 1587 -356 -1743 -649 1070 1872 929 -982 -1785 -112 1839 1684 -104 -1475 -1561 297 1738
6946A738q78j609j344J459J865M00j275j970j01J722J672q48j647j172P20J929
$$ 1738 860 -749 -2093 -634 1231 1631 356 -1614 -1715 7 1679 831 -816 -1988 -1268 661
6962F61R48j080k252P3J396J818q29j151j365M07J863R89p34j811o55J057J671
$$ 661 1609 529 -1723 -1650 -254 1564 735 -416 -1781 -1374 489 1478 744 -1067 -1722 -665 1006
6979A006O93j476j814K0J809J414k54j891j630J335K153J82j036j300n21J644
$$ 1006 1699 223 -1591 -1571 238 1652 1398 -493 -2123 -788 1365 1547 511 -789 -1310 334
6995C34J437l33j927j052O34J879Q65j172j393q97J324J826o2j467j522J31J638
$$ 334 1771 1438 -489 -1541 -907 972 1837 665 -728 -1625 -301 1525 1463 -4 -1526 -1395 243
7012B43J710q08j935q58J242J427P06j298j570k02J816J354j38j977j016M03J882
$$ 243 1953 1145 -790 -1648 -406 1021 1727 429 -1141 -1343 473 1827 1689 -288 -1304 -901 981
7029I81J025j038j876m47J187J624L34j403j853N30J678J369j082j396r99R27
$$ 981 2006 968 -908 -1355 -168 1456 1790 387 -1466 -936 742 2111 1029 -367 -1366 -439
7045d39J935L88j606j361J38J315J519l30j599j303O40K012M99j085j529m18J058
$$ -439 1496 1884 278 -1083 -945 370 1889 1559 -40 -1343 -703 1309 1808 723 -806 -1224 -166
7062a66J842J79j490j945O60J402J337l84k571n78J336J847L34j758j301l29K152
$$ -166 1676 1855 365 -1580 -920 482 1819 1435 -1136 -1714 -378 1469 1803 45 -1256 -1585 567
7079E67J077r93j652p08P81J529Q71j384j670n80J737J852n81j461j234N04J768
$$ 567 1644 651 -1001 -1709 -928 601 1472 88 -1582 -2162 -425 1427 846 -615 -1849 -1345 423
7096D23P02r11j290n89R57J589N11j944j424O6K012J133n44j687r10Q63K086N14
$$ 423 1125 214 -1076 -1665 -708 881 1392 -552 -1976 -1910 102 1235 691 -996 -1906 -1043 1043 1557
7114A557j536j396p7J291J280r7j742j204Q59K021N59j028j239j042J368J866
$$ 1557 21 -1375 -1452 -161 1119 1022 -720 -1924 -1065 956 1515 487 -752 -1794 -426 1440
7130A440l4j838j096P0J680J571q45j776r34J442J364M81j217j672j35J737J770
$$ 1440 1406 -432 -1528 -1458 222 1793 948 -828 -1762 -320 1044 1525 308 -1364 -1499 238 2008
7147B008r46j446j297Q77J590J124j310j916j31J448J581k29j521j373K26K076
$$ 2008 1062 -384 -1681 -804 786 1910 600 -1316 -1447 1 1582 1353 -168 -1541 -1315 761
7163G61R58q34j821m99J062J863K42j638j735N79J413J104k71j677j362J317J465
$$ 761 1719 885 -936 -1435 -373 1490 1732 94 -1641 -1062 351 1455 1184 -493 -1855 -538 927
7180I27Q33r90j774m26J156K000n1j794j709P96J643J209j027k054p04J778J444
$$ 927 1760 770 -1004 -1430 -274 1726 1675 -119 -1828 -1032 611 1820 793 -1261 -1965 -187 1257
7197A257K60j788j255L4J588J340o52j559j018J053J609L03n41k288j11J613J782
$$ 1257 1517 -271 -1526 -1492 96 1436 784 -775 -1793 -740 869 1172 631 -1657 -1768 -155 1627
7214A627l53j803j150L60J988J013q55k353o5J350J510J06j678j634P44J906J088
$$ 1627 1274 -529 -1679 -1319 669 1682 827 -1526 -1591 -241 1269 1375 -303 -1937 -1193 713 1801
7231A801j163j709p14P24K029P54j791j749L25J571R97J87k005j322R15K003R16
$$ 1801 638 -1071 -1785 -1061 968 1722 -69 -1818 -1493 78 1075 1262 -743 -2065 -1150 853 1769
7248A769j312j642o56J581J746P6j894j458O65J605J194l56k124o96J119J844
$$ 1769 457 -1185 -1841 -260 1486 1562 -332 -1790 -1125 480 1674 1318 -806 -1502 -383 1461
7264A461J25j274j407r3J641J485p27j841r34Q95J658R82r17k126l73J622J488
$$ 1461 1586 312 -1095 -1188 453 1938 1211 -630 -1564 -669 989 1971 1054 -1072 -1445 177 1665
7281A665Rj860j162N14J661J353j202k114K16P92J492N84j492j852L19J566J052
$$ 1665 1674 -186 -1348 -834 827 2180 978 -1136 -920 -128 1364 1948 456 -1396 -1077 489 1541
7298A541q1j432j533R44J883M92j069j749k67J346J638Q5k006j374N83J938N85
$$ 1541 1460 28 -1505 -561 1322 1814 745 -1004 -1271 75 1713 1798 -208 -1582 -999 939 1524
7315A524q41j873m02J020J953J52j762j147J47J315J452o13j888o66J251J502
$$ 1524 683 -1190 -1592 -572 1381 1533 -229 -1376 -1229 86 1538 925 -963 -1629 -378 1124
7331A124J17r36j775m71J669J859m87j696j319O13J837R29j114j779%R01J499
$$ 1124 1241 305 -1470 -1941 -272 1587 1100 -596 -1915 -1302 535 1464 350 -1429 -1429 -528 971
7348I71J31j408j496L21J692J304o76j895q67R43J660R74j647j488j12J622J293
$$ 971 1102 -306 -1802 -1481 211 1515 839 -1056 -1923 -980 680 1654 7 -1481 -1593 29 1322
7365A322k93j349j260L58J895R07j382j423o15J535J670k96j292j329K80J556
$$ 1322 1029 -320 -1580 -1222 673 1580 198 -1225 -1840 -305 1365 1069 -223 -1552 -1272 284
7381B84J263o99j503r07J077J504N66j565j213k79J583J758n22j907p65N51J410
$$ 284 1547 848 -655 -1562 -485 1019 1585 20 -1193 -1472 111 1869 1347 -560 -1325 -774 636
7398F36J189j276j445q55J911J514k41j604j320O48J673J115j308j708l24J070
$$ 636 1825 549 -896 -1751 160 1674 1433 -171 -1491 -843 830 1945 637 -1071 -1395 -325
7414c25J734K61j265j661j10J800J210n74j354j116N79J797O66j023k067LJ670
$$ -325 1409 1670 405 -1256 -1366 434 1644 1070 -284 -1400 -821 976 1642 619 -1448 -1445 225
7431B25J085k5j600j453O08K245O57j143j378q64J072J372N50j382j796N91J616
$$ 225 1310 1285 -315 -1768 -1160 1085 1742 599 -779 -1643 -571 801 1351 -31 -1827 -1236 380
7448C80Q49k15j785j134J056J770P63j525j507m69J490J550j22j821j240R80J334
$$ 380 1229 1014 -771 -1905 -849 921 1684 159 -1348 -1817 -327 1223 1101 -720 -1960 -980 354
7465C54J166j001j861n65J452J649j24j169j486LJ874J017p06j886o34J160J506
$$ 354 1520 519 -1342 -1907 -455 1194 1070 -99 -1585 -1582 292 1309 603 -1283 -1917 -757 749
7482G49O42j202j776k97J767J571n00j694j025O80J763P92j179j879K4J160J388
$$ 749 1391 189 -1587 -1884 -117 1454 954 -740 -1765 -1085 678 1470 291 -1588 -1564 -404 984
7499I84J55j492j476N71J799M06l94j554q21J268J585M46j338j485j11J395J379
$$ 984 1139 -353 -1829 -1258 541 947 553 -1001 -1822 -554 1031 1477 139 -1346 -1457 -62 1317
7516A317j46k145q17J282J571J52r55j862J37J508J632m11j431j215Q94J068J224
$$ 1317 1171 -974 -1791 -509 1062 1214 259 -1603 -1466 42 1674 1263 -168 -1383 -489 579 1803
7533A803r12j845k65J126J475L83j415j573mJ524J639m03j863p92M88J834Q91
$$ 1803 891 -954 -1219 -93 1382 1765 350 -1223 -1227 297 1936 1533 -330 -1122 -634 1200 2091
7550B091j599j700j36J880Q29j53j488j018J55J956R18j213j218o53J037J587
$$ 2091 492 -1208 -1344 536 1365 1212 -276 -1294 -1139 817 1735 522 -696 -1349 -312 1275
7566A275J70j320j858O41J347J376o40j545j319J138J539P55j469j523j64J408
$$ 1275 1445 125 -1733 -1092 255 1631 991 -554 -1873 -735 804 1559 90 -1433 -1597 -189
7582a89J386K2j861j173J000J519O19r94j380o45J379J320N77j733j214P5J497
$$ -189 1197 1219 -642 -1815 -815 704 1323 329 -1051 -1696 -317 1003 1580 -153 -1367 -1292 205
7599B05J305n95j971p82J244J595L05j278j424k98J612J593o32j293j266Q49J735
$$ 205 1510 915 -1056 -1838 -594 1001 1306 28 -1396 -1694 -82 1511 879 -414 -1680 -831 904
7616I04P26j133j793Q2J108J070L65j222j736O91J078J481j084j591n66J010J646
$$ 904 1630 497 -1296 -1214 -106 964 1329 107 -1629 -938 140 1621 537 -1054 -1620 -610 1036
7633A036M32j758j224M01J273J140k18j788r38Q49J963K57j254j283j57J052J492
$$ 1036 1468 -290 -1514 -1113 160 1300 1082 -706 -1644 -795 1168 1425 171 -1112 -1269 -217 1275
7650A275L97j924j385P26J544P74l23j953p48J319J526N36j496j483L3J535J540
$$ 1275 1672 -252 -1637 -911 633 1407 1084 -869 -1617 -298 1228 1764 268 -1215 -1182 353 1893
7667A893o58j861n89O79J511O11o26j924r2J720J075n08j167j091K38J457J451
$$ 1893 1235 -626 -1215 -536 975 1586 960 -964 -1056 664 1739 1231 64 -1027 -789 668 2119
7684B119j266j551q05J423J301M25j600j395J36J819J131p92j652r11O21J943
$$ 2119 853 -698 -1503 -80 1221 1646 46 -1349 -1213 606 1737 945 -707 -1618 -997 946
7700I46N28j265j579k55J500J483k14j732r86M82J228J123r61j139q70J287J627
$$ 946 1474 209 -1370 -1625 -125 1358 1144 -588 -1574 -1092 136 1259 298 -841 -1711 -424 1203
7717A203M0j624j457M34J783P50m33k065o77J400J355M12j365j310M8J404J255
$$ 1203 1243 -381 -1838 -1404 379 1129 696 -1369 -2046 -646 709 1121 -244 -1554 -1506 -102 1153
7734A153n13j614j257R32J610P14o50j679m82J485J145L68j495j450L52J365J307
$$ 1153 640 -974 -2231 -1299 311 1025 375 -1304 -1786 -301 844 1212 -283 -1733 -1381 -16 1291
7751A291p88j401l96O77J732M85j581j520L95J240J184m77j487j047J158J586
$$ 1291 503 -898 -1294 -617 1115 1600 19 -1501 -1106 134 1318 841 -646 -1693 -535 1051
7767A051L84r87j608m21J234J555k93j223j383Q15J428R85q06j602q12J280J758
$$ 1051 1435 448 -1160 -1581 -347 1208 915 -308 -1691 -876 552 1537 731 -871 -1683 -403 1355
7784A355K71j415j120j47J167J591m79j847n56N61J613O93j050j662j01J622J211
$$ 1355 1626 211 -909 -1056 111 1702 1223 -624 -1180 -619 994 1687 637 -1025 -1126 496 1707
7801A707m58j163j141L36J693R24q30j813o13J435J564L92j618j246o5J605R65
$$ 1707 1249 86 -1055 -719 974 1898 1068 -745 -1358 77 1641 2033 415 -831 -896 709 1674
7818A674m55j539m02O12J590M21j373j553J34J077J179j46j480j193O80J796M51
$$ 1674 1219 -320 -722 -110 1480 1901 528 -1025 -891 186 1365 1219 -261 -1454 -774 1022 1473
7835A473n78j807o79J275J631K61j601j456L38J325J061l78j770o46J334J393
$$ 1473 895 -912 -1591 -316 1315 1576 -25 -1481 -1143 182 1243 865 -905 -1551 -217 1176
7851A176K87j440j217k03J470J179l72j256j001N28J374P52n87k202l91J474J176
$$ 1176 1463 23 -1194 -1397 73 1252 880 -376 -1377 -849 525 1277 690 -1512 -1903 -429 747
7868G47L84j615j230M16J657J221j207j536m59J128J294M95j541r92M0J120J174
$$ 747 1131 -484 -1714 -1298 359 1580 373 -1163 -1622 -494 800 1295 -246 -1238 -1198 -78 1096
7885A096l62j165j207L82K076M45j198j211j06O56J873P9j697j442O57J798P84
$$ 1096 734 -431 -1638 -1256 820 1265 67 -1144 -1250 -594 1279 1358 -339 -1781 -1124 674 1458
7902A458o85j608o76J361J470l4j675r34L53J310R40l35j481p43Q99J317M61j097
$$ 1458 773 -835 -1511 -150 1320 1286 -389 -1323 -970 340 1280 945 -536 -1279 -380 937 1398 301
7920C01j268l43J305J157J87j583j240P15J495J181j280j418n41Q57J691J4j087
$$ 301 -967 -1310 -5 1152 1339 -244 -1484 -769 726 1907 627 -791 -1332 -475 1216 1230 143
7937A43j287L32J257J186o36j455q80Q09J381N66j067j372Q9J316J056k33j440
$$ 143 -1144 -812 445 1631 995 -460 -1340 -531 850 1416 349 -1023 -934 382 1438 1205 -235
7954b35j037L71J639P09q79j215p06R62J545K90j610j362M76J549O79n97j305
$$ -235 -1272 -901 738 1447 568 -647 -1353 -391 1154 1444 -166 -1528 -1052 497 1176 579 -726
7971g26q95J139J395L27q89j269l78J116J090K04j528j095O76J182P69n41j713
$$ -726 -1621 -482 913 1240 351 -918 -1296 -180 910 1114 -414 -1509 -833 349 1118 577 -1136
7988a136p39J444J725l67j345j081K56J356J215q48j440q81J229J501K89r64j543
$$ -1136 -1875 -431 1294 927 -418 -1499 -1243 113 1328 480 -960 -1841 -612 889 1178 214 -1329
8005a329k72K018N20l17j141q95Q6K052N54j066j605j31J607Q37K87j233j461
$$ -1329 -1601 417 937 620 -521 -1416 -1330 722 1276 210 -1395 -1526 81 918 1205 -28 -1489
8022a489L04J694P43m34j626o16J066J380K00j186j056j68J426J087n0j658j084
$$ -1489 -1185 509 1252 818 -808 -1424 -358 1022 1222 36 -1020 -1188 238 1325 1275 -383 -1467
8039a467J099J258O26r08j649l30J279J610J53j639j385N64J377J148j114j295
$$ -1467 -368 890 1516 608 -1041 -1371 -92 1518 1671 32 -1353 -789 588 1736 622 -673
8055f73o08J490R68K57j312q81K46J361P83r47j022m33M40J321P14q41j780k68
$$ -673 -1281 209 1177 1434 122 -759 -513 848 1631 684 -338 -771 -331 990 1704 863 -917 -1185
8073a185J276J509m77j158j047M14J565J078p64k263L01P45J577P3j579j351O12
$$ -1185 91 1600 1123 -35 -1082 -668 897 1975 1211 -1052 -751 -6 1571 1644 65 -1286 -674
8090f74J062J127o12j504n14O17J585N01j382j190J69Q62J288Lj811j081J038
$$ -674 388 1515 903 -601 -1115 -498 1087 1588 206 -984 -815 47 1335 1338 -473 -1554 -516
8107e16J386K41o05j674j16J214J086J2j381j227L76J456R26m52j445p20J049
$$ -516 870 1111 506 -1168 -1284 -70 1016 1028 -353 -1580 -1204 252 1178 726 -719 -1439 -390
8124c90J153L81j304j250j37J282J327o95j207m94K89J700N46q74j638k62J383
$$ -390 763 1144 -160 -1410 -1547 -265 1062 367 -840 -1334 -1045 655 1201 327 -1311 -1573 -190
8141a90J558l31j162j179K79J620Q78r00j363k85Q15J163N47j607j015M65J052
$$ -190 1368 1037 -125 -1304 -1025 595 1473 573 -790 -1075 -260 903 1450 -157 -1172 -707 345
8158C45J196m43j638r92Q19K052k75p34j116k29J249J391m83j285j197P05J263
$$ 345 1541 1098 -540 -1532 -713 1339 1064 330 -786 -1015 234 1625 1142 -143 -1340 -635 628
8175F28O62n13j309q03J123J482j58q19j093J46J116Q64l83j438o86Q80
$$ 628 1290 777 -532 -1335 -212 1270 1112 293 -800 -654 462 1326 943 -495 -1181 -301
8191c01
$$ Imaginary data points
##PAGE= N=2
##DATA TABLE= (X++(I..I)), XYDATA
0@%%%%%%qJ6j6J6k4L2m0M8n6P2q3R2j13J36j54J78k11K43k76L20l67M14m69N31
$$ 0 0 0 0 0 0 0 -8 8 -8 8 -16 16 -24 24 -32 40 -43 49 -64 72 -82 96 -115 128 -148 172 -195 219 -250 281
30B81n96O68p49Q38r36J043j156J284j426J577j749J941k144K373k634K920l244
$$ 281 -315 353 -396 442 -494 549 -607 677 -749 828 -921 1020 -1124 1249 -1385 1535 -1709
47a709L617m041M537n125N830o699P798r239J1219j4127J8823k7650M9897k05781
$$ -1709 1908 -2133 2404 -2721 3109 -3590 4208 -5031 6188 -7939 10884 -16766 33131 -172650
61a72650m55382L47287M44947J1425k74723m4911J18387O919j16259L0841J34662
$$ -172650 -628032 -280745 164202 175627 -99096 -144007 -25620 -18701 -134960 -104119 30543
72C0543p418j47720M1296K06342l6201l72827j87872L16587M42763K0359l62733
$$ 30543 23125 -124595 -83299 123043 86842 -285985 -473857 -157270 285493 305852 -56881
83e6881k63864R8045K22998N9781m9793P987j10q6063l5742R1922L0378j25579
$$ -56881 -320745 -222700 298 60079 10286 18273 18163 -67900 -103642 -11720 18658 -106921
95a06921o0050J88230K43479l6095l28660k44622J45497L56277J49624j58170
$$ -106921 -166971 21259 264738 228643 -100017 -344639 -199142 157135 306759 148589
105A48589k14037o6783O2588R2014N0869p167k9522j0353K6691M7540j8973j44738
$$ 148589 -65448 -132231 -69643 22371 73240 66073 36551 26198 52889 100429 81456 -63282
117f3282j15160J31509K89063R7785k31783l11938n9341K42032K63069j774k01302
$$ -63282 -178442 -46933 242130 339915 108132 -203806 -263147 -21115 241954 240180 38878
128C8878j12242N8459O3749j7521k5548O961J4154K8378O2960K9763j18688k15146
$$ 38878 -73364 -14905 48844 31323 5775 12736 26890 55268 118228 147991 29303 -185843
140a85843l2330K94747L00225j04244l75598j55481J92937K12608j106r9885k6108
$$ -185843 -218173 76574 376799 272555 -103043 -258524 -65587 147021 145915 46030 19922
151A9922L0963o880k8395J8314Q811p6399k1554J83360J78495j45583l40959q8612
$$ 19922 50885 44005 15610 33924 42735 -33664 -55218 128142 306637 161054 -179905 -268517
163b68517K79462K85649k7801k35077j30278O2690Q3936Q778J1557K4068m4158
$$ -268517 10945 296594 268793 33716 -96562 -33872 50064 58842 70399 94467 50309
174E0309m9231O9151Q4725r3843j93377j1191K39629K17805q5604l04760j60705
$$ 50309 1078 70229 154954 61111 -132266 -143457 96172 313977 228373 -76387 -237092
185b37092J45027K23085N1178r0809q9858m4661L634N3278M4561l1527p6997p692
$$ -237092 -92065 131020 182198 91389 1531 -43130 -39496 13782 58343 26816 -50181 -57873
197e7873J14931J09666q7479k36770q9566J93184K40281J5886j86424j78387j7052
$$ -57873 57058 166724 79245 -157525 -247091 -53907 186374 202260 15836 -162551 -179603
208a79603J27862J28336O840q7311p4114L937P0987N4353n9277j21515q257J51256
$$ -179603 -51741 76595 83435 -3876 -77990 -74053 -3066 51287 -7990 -129505 -137762 13494
220A3494J38059m0674j87933j47145N4946K08824J33819p5102j68319q0474N5992
$$ 13494 151553 110879 -77054 -224199 -169253 39571 173390 98288 -70031 -150505 -94513
231i4513J13963N5710n7543q8068L902Q9045O2601m2589j23834p9138R2669J96497
$$ -94513 19450 75160 17617 -70451 -66549 22496 85097 42508 -81326 -160464 -67795 128702
243A28702O7669j53587j92529k4786J45749J53594J1460j18992j00423J5215Q1982
$$ 128702 196371 42784 -149745 -174531 -28782 124812 136272 17280 -83143 -67928 14054
254A4054N3734k0995q1297m8095P7438J29995L370j49171j32247L3517J72504
$$ 14054 67788 46793 -34504 -82599 -5161 124834 128204 -20967 -153214 -119697 52807
265E2807J35130n2525j83134j03518P3616J39564N9255n8022j05338l5899P9409
$$ 52807 187937 135412 -47722 -151240 -77624 61940 121195 63173 -42165 -78064 1345
$$ [...]
##END NTUPLES=NMR FID
##END=
