##TITLE=1H_CG-1103-5
 CDCl3, 8 sc, 
 8.5.2019
##JCAMPDX= 6.0         $$ Bruker NMR JCAMP-DX V2.0
##DATA TYPE= NMR FID
##DATA CLASS= NTUPLES
##ORIGIN= UXNMR, Bruker Analytische Messtechnik GmbH
##OWNER= root
$$ XWIN-NMR		Version 3.5
$$ Wed May  8 12:11:00 2019 Russian Standard Time (UT+4h)  she@DPX200
##.OBSERVE FREQUENCY= 200.1315
##.OBSERVE NUCLEUS= ^1H
##.DELAY= (6, 6)
##.ACQUISITION MODE= SIMULTANEOUS
##.ACQUISITION SCHEME= undefined
##.AVERAGES= 8
##.DIGITISER RES= 18
##SPECTROMETER/DATA SYSTEM= spect
##.PULSE SEQUENCE= zg30
##.SOLVENT NAME= CDCl3
##.SHIFT REFERENCE= (INTERNAL, CDCl3, 0, 15.7039)
##AUDIT TRAIL= $$ (NUMBER, WHEN, WHO, WHERE, WHAT)
$$ ##TITLE= Audit trail, XWIN-NMR		Version 3.5
$$ ##JCAMPDX= 5.01
$$ ##ORIGIN= Bruker BioSpin GmbH
$$ ##OWNER= she
$$ F:/spectra/data/she/nmr/H-F/1/audita.txt
$$ ##AUDIT TRAIL=  $$ (NUMBER, WHEN, WHO, WHERE, WHAT)
(   1,<2019-05-08 12:09:04.12 +0400>,<she>,<DPX200>,
      <created by zg, POWCHK disabled, PULCHK disabled
       configuration hash MD5:
       00 E9 B6 7A A2 85 ED C7 34 08 36 98 17 FE 4E 26
       data hash MD5: 16K
       5B F5 8D 1F 16 BF 91 E6 3A 6E E0 B1 3A D0 0B BB>)
$$ ##END=
$$ 
$$ hash MD5
$$ FF 06 B8 3C 0A 38 4A 70 CD A5 64 2C 57 E7 31 7A
##$RELAX= 
##$RELAX= 
##$RELAX= 
##$RELAX= 
##$RELAX= 
##$RELAX= 
$$ Bruker specific parameters
$$ --------------------------
##$DU= <F:/spectra>
##$EXPNO= 1
##$NAME= <H-F>
##$PROCNO= 1
##$TYPE= <nmr>
##$USER= <she>
##$AMP= (0..31)
100 100 100 100 100 100 100 100 100 100 100 100 100 100 100 100 100 100 
100 100 100 100 100 100 100 100 100 100 100 100 100 100 
##$AQSEQ= 0
##$AQ_mod= 1
##$AUNM= <au_zg>
##$AUTOPOS= <>
##$BF1= 200.13
##$BF2= 200.13
##$BF3= 200.13
##$BF4= 200.13
##$BF5= 200.13
##$BF6= 200.13
##$BF7= 200.13
##$BF8= 200.13
##$BYTORDA= 1
##$CFDGTYP= 0
##$CFRGTYP= 5
##$CHEMSTR= <none>
##$CNST= (0..31)
1 1 145 1 1 1 1 1 1 1 1 1 1 1 1 1 1 1 1 1 1 1 1 1 1 1 1 1 1 1 1 1 
##$CPDPRG= <>
##$CPDPRG1= <>
##$CPDPRG2= <>
##$CPDPRG3= <>
##$CPDPRG4= <mlev>
##$CPDPRG5= <mlev>
##$CPDPRG6= <mlev>
##$CPDPRG7= <mlev>
##$CPDPRG8= <mlev>
##$CPDPRGB= <>
##$CPDPRGT= <>
##$D= (0..31)
0 1.2 0 0 0 0 0 0 0 0 0 0.03 0 0 0 0 0 0 0 0 0 0 0 0 0 0 0 0 0 0 0 0 
##$DATE= 1557302943
##$DBL= (0..7)
120 120 120 120 120 120 120 120 
##$DBP= (0..7)
150 150 150 150 150 150 150 150 
##$DBP07= 0
##$DBPNAM0= <>
##$DBPNAM1= <>
##$DBPNAM2= <>
##$DBPNAM3= <>
##$DBPNAM4= <>
##$DBPNAM5= <>
##$DBPNAM6= <>
##$DBPNAM7= <>
##$DBPOAL= (0..7)
0.5 0.5 0.5 0.5 0.5 0.5 0.5 0.5 
##$DBPOFFS= (0..7)
0 0 0 0 0 0 0 0 
##$DE= 6
##$DECBNUC= <off>
##$DECIM= 24
##$DECNUC= <off>
##$DECSTAT= 4
##$DIGMOD= 1
##$DIGTYP= 9
##$DL= (0..7)
0 120 120 120 120 120 120 120 
##$DP= (0..7)
150 150 150 150 150 150 150 150 
##$DP07= 0
##$DPNAME0= <>
##$DPNAME1= <>
##$DPNAME2= <>
##$DPNAME3= <>
##$DPNAME4= <>
##$DPNAME5= <>
##$DPNAME6= <>
##$DPNAME7= <>
##$DPOAL= (0..7)
0.5 0.5 0.5 0.5 0.5 0.5 0.5 0.5 
##$DPOFFS= (0..7)
0 0 0 0 0 0 0 0 
##$DQDMODE= 0
##$DR= 18
##$DS= 0
##$DSLIST= <SSSSSSSSSSSSSSS>
##$DSPFIRM= 0
$$ [...]
##$SUBNAM2= <"">
##$SUBNAM3= <"">
##$SUBNAM4= <"">
##$SUBNAM5= <"">
##$SUBNAM6= <"">
##$SUBNAM7= <"">
##$SUBNAM8= <"">
##$SUBNAM9= <"">
##$SW= 24.9337058887773
##$SWIBOX= (0..15)
0 0 2 0 0 0 0 0 0 0 0 0 0 0 0 0 
##$SW_h= 4990.01996007984
##$TD= 16384
##$TD0= 1
##$TE= 0
##$TE2= 300
##$TE3= 300
##$TEG= 300
##$TL= (0..7)
0 120 120 120 120 120 120 120 
##$TP= (0..7)
150 150 150 150 150 150 150 150 
##$TP07= 0
##$TPNAME0= <>
##$TPNAME1= <>
##$TPNAME2= <>
##$TPNAME3= <>
##$TPNAME4= <>
##$TPNAME5= <>
##$TPNAME6= <>
##$TPNAME7= <>
##$TPOAL= (0..7)
0.5 0.5 0.5 0.5 0.5 0.5 0.5 0.5 
##$TPOFFS= (0..7)
0 0 0 0 0 0 0 0 
##$TUNHIN= 0
##$TUNHOUT= 0
##$TUNXOUT= 0
##$USERA1= <user>
##$USERA2= <user>
##$USERA3= <user>
##$USERA4= <user>
##$USERA5= <user>
##$V9= 5
##$VALIST= <valist>
##$VCLIST= <CCCCCCCCCCCCCCC>
##$VD= 0
##$VDLIST= <DDDDDDDDDDDDDDD>
##$VPLIST= <PPPPPPPPPPPPPPP>
##$VTLIST= <TTTTTTTTTTTTTTT>
##$WBST= 1024
##$WBSW= 4
##$XGAIN= (0..3)
0 0 0 0 
##$XL= 0
##$YL= 0
##$YMAX_a= 391025
##$YMIN_a= -235305
##$ZGOPTNS= <>
##$ZL1= 120
##$ZL2= 120
##$ZL3= 120
##$ZL4= 120
##$ABSF1= 10
##$ABSF2= 0
##$ABSG= 5
##$ABSL= 3
##$ALPHA= 0
##$AQORDER= 0
##$ASSFAC= 0
##$ASSFACI= 0
##$ASSFACX= 0
##$ASSWID= 0
##$AUNMP= <proc_1d>
##$AZFE= 0.1
##$AZFW= 0.1
##$BCFW= 1
##$BC_mod= 2
##$BYTORDP= 1
##$COROFFS= 0
##$CY= 11.3945322036743
##$DATMOD= 1
##$DC= 2
##$DFILT= <>
##$DTYPP= 0
##$F1P= 18.9103706918063
##$F2P= -1.10871071338519
##$FCOR= 0.5
##$FTSIZE= 0
##$FT_mod= 4
##$GAMMA= 1
##$GB= 0.15
##$INTBC= 1
##$INTSCL= 1
##$ISEN= 128
##$LB= 0.24
##$LEV0= 0
##$LPBIN= 0
##$MAXI= 10000
##$MC2= 0
##$MEAN= 0
##$ME_mod= 0
##$MI= 1.114404
##$NCOEF= 0
##$NC_proc= 0
##$NLEV= 6
##$NOISF1= 3.799351
##$NOISF2= 2.8
##$NSP= 1
##$NTH_PI= 0
##$NZP= 0
##$OFFSET= 15.70392
##$PC= 1
##$PHC0= -9015.331
##$PHC1= 15.80026
##$PH_mod= 1
##$PKNL= yes
##$PPARMOD= 0
##$PSCAL= 0
##$PSIGN= 0
##$REVERSE= no
##$SF= 200.130013532006
##$SI= 16384
##$SIGF1= 3
##$SIGF2= 2
##$SINO= 400
##$SIOLD= 16384
##$SREGLST= <1H.CDCl3>
##$SSB= 0
##$STSI= 0
##$STSR= 0
##$SW_p= 3612.71676300578
##$SYMM= 0
##$S_DEV= 0
##$TDeff= 0
##$TDoff= 0
##$TI= <>
##$TILT= no
##$TM1= 0
##$TM2= 0
##$TOPLEV= 0
##$USERP1= <user>
##$USERP2= <user>
##$USERP3= <user>
##$USERP4= <user>
##$USERP5= <user>
##$WDW= 1
##$XDIM= 8192
##$YMAX_p= 0
##$YMIN_p= 0
$$ End of Bruker specific parameters
$$ ---------------------------------
##NTUPLES= NMR FID
##VAR_NAME=  TIME,          FID/REAL,        FID/IMAG
##SYMBOL=    X,             R,               I
##VAR_TYPE=  INDEPENDENT,   DEPENDENT,       DEPENDENT
##VAR_FORM=  AFFN,          ASDF,            ASDF
##VAR_DIM=   8192,          8192,            8192
##UNITS=     SECONDS,       ARBITRARY UNITS, ARBITRARY UNITS
##FACTOR=    0.0002004,     1,               1
##FIRST=     0,             0,               0
##LAST=      1.6414764,     0,               0
##MIN=       0,             -235305,         0
##MAX=       1.6414764,     391025,          0
$$ Real data points
##PAGE= N=1
##DATA TABLE= (X++(R..R)), XYDATA
$$ [...]
2752B31J237k149k214K647K580k430j998K528R94l208l13M101L46m488r45L917
$$ 231 1468 -681 -2895 -248 2332 -98 -2096 432 1426 -1782 -2095 2006 2352 -2136 -3081 836
2768H36J465k766q63J358o75r01K711J119l992j711M401J659m459r15M513p8m721
$$ 836 2301 -465 -1328 30 -645 -1546 1165 2284 -1708 -3419 982 2641 -1818 -2733 1780 1702 -3019
2785c019O55M825q73m285Q48L203r24j796J917K61l121L84M659q1n503l67N454
$$ -3019 -2364 2461 1588 -2697 -1849 1354 430 -1366 551 812 -2309 -1925 2734 2653 -2850 -3217 2237
2802B237K30m633O96M241k060m010L067L907l186l243K890J722k706M93L398k526
$$ 2237 2467 -2166 -1470 2771 711 -3299 -232 3675 489 -2754 136 1858 -848 -355 3043 517
2818E17m812L304O322k666o670J515N391j246l416K421J903m365j591N436J819
$$ 517 -4295 -991 5331 2665 -4005 -2490 2901 1655 -1761 660 2563 -1802 -3393 2043 3862
2833C862n217j358M052o52l303L511L458n643m851O131N931m860n502L101L172
$$ 3862 -1355 -2713 1339 687 -2616 895 4353 -1290 -6141 -10 5921 1061 -4441 -1340 1832
2848A832k474k23L509j719n084J910N834j539n000J958L299l635k147N974K191
$$ 1832 -642 -865 2644 925 -4159 -2249 3585 2046 -2954 -996 2303 -1332 -3479 2495 4686
2863D686p509k832P486L167n979k127M045l53k975L158L308n024m174N355M292
$$ 4686 -2823 -5655 1831 4998 -981 -3108 937 584 -2391 767 4075 -949 -5123 232 4524
2878D524m840l352M747J775n588m00O439Np081J00O622k70n240J208K996l090
$$ 4524 -316 -3668 1079 2854 -2734 -3134 3305 3310 -3771 -3671 2951 2681 -2559 -1351 1645 -1445
2894a445j226N558O58p536r99P824J332o914n83N704j096n036K661N142l404n462
$$ -1445 -2671 2887 3545 -3991 -4990 2834 4166 -2748 -3331 2373 1277 -3759 -1098 4044 640 -4822
2910d822L603M832l149l022L226K19m546K199O999k856q790K036Q450j162o126
$$ -4822 -1219 3613 464 -2558 668 887 -3659 -1460 5539 2683 -6107 -4071 4379 3217 -2909
2925b909J968L493m020k366O078K533o433k791N322K058l950M17L426l476m525
$$ -2909 -941 2552 -1468 -3834 2244 4777 -1656 -4447 875 2933 -1017 -600 2826 -650 -5175
2940e175N494O701n440p671L646O227k491k773L529l68n762J369P307r35o925
$$ -5175 319 7020 1580 -6091 -2445 3782 1291 -1482 2047 1679 -4083 -2714 4593 3658 -3267
2955c267Q45N136k053l375M183K763o303l535P276M745o405m812M195K687k898
$$ -3267 -2422 2714 661 -2714 1469 4232 -2071 -5606 1670 6415 10 -4802 -607 2080 -818
2970h18P64L499l605n244M551N871m173n131M416L310n397j866O431J140p222
$$ -818 -54 3445 -160 -5404 -853 5018 845 -4286 130 3440 -1957 -3823 2608 3748 -3474
2985c474j059P224J314o127j199L846k04j936L178J308n695k073O753K701o557
$$ -3474 -4533 2691 4005 -2122 -3321 525 321 -1615 1563 2871 -2824 -4897 1856 4557 -2000
3000b000k021O119N70o116J096O296k372o535L055O549k666n497J836K953k171
$$ -2000 -4021 2098 2668 -3448 -2352 3944 1572 -4963 -1908 4641 1975 -3522 -1686 1267 -904
3015i04Q6M355j458o866O68P547O85o233m79M297j516l125L896L237n676l743
$$ -904 -818 3537 2079 -4787 -4119 3428 4113 -2120 -2599 1698 182 -2943 953 4190 -1486 -5229
3031e229O002L967m978k713L591k21l761L386N921m275q091K452P842l55m881
$$ -5229 773 4740 -238 -2951 640 419 -3342 44 5965 1690 -6401 -3949 3893 3538 -1343
3046a343K62J678k403j78M865K75o016p37N653N75m413R22L250l756l300O218
$$ -1343 -1081 597 -1806 -1984 2881 3156 -2860 -3597 2056 2631 -1782 -860 2390 -1366 -4666 1552
3062A552N178o601o743M394N925j931k586J614q77l116K190M682k147m927K021
$$ 1552 6730 129 -6614 -2220 3705 1774 -812 802 -75 -3191 -1001 3681 1534 -3393 -1372
3077a372M197k470k955L458J861n252j375O966K286p501l292N621K684l039j24
$$ -1372 2825 355 -2600 858 2719 -2533 -3908 3058 5344 -2157 -5449 172 2856 -183 -307
3092c07K015k777k696M323L307m219l388L985K825l693j903L569L31l937J126
$$ -307 1708 -1069 -3765 558 3865 -354 -3742 243 3068 -625 -2528 1041 1372 -2565 -1439
3107a439N192j327o014L85M864j99k325K156N59m981o07O507J575o342j983N242
$$ -1439 3753 2426 -3588 -3203 1661 1462 -863 1293 1852 -3129 -3736 2771 4346 -1996 -3979 1263
3123A263J715m121l92K894j257k631K832L365k952l953J888K556j577L20L227
$$ 1263 2978 -1143 -1535 1359 102 -2529 303 3668 716 -3237 -1349 1207 -370 -50 3177
3138C177k092n851J505P112l1o314k79M280n53k846J956J889l155j479L685J738
$$ 3177 1085 -4766 -3261 3851 3820 -2494 -2773 1507 954 -1892 64 1953 -1202 -2681 1004 2742
3154B742l476j535K281j75j885K622L407l776n548K722N969j121m302R36J999
$$ 2742 -734 -2269 12 -163 -2048 574 3981 205 -5343 -2621 3348 2227 -2075 -1139 860
3169H60k130n46L291L0m028M51M096o42l551R81K372k012j579L791K454m699l793
$$ 860 -1270 -1816 1475 1505 -2523 -2072 2024 1382 -2169 -1188 1184 -828 -2407 1384 3838 -861 -4654
3186d654L549L988j619k298J119N6j910J468K991k212l394K656L685k645l285
$$ -4654 -1105 2883 1264 -1034 85 141 -1769 -301 2690 478 -2916 -260 3425 780 -2505
3201b505K286K102k479m95L660K33m655j260L837J906j756q08L28j519l83L240
$$ -2505 -219 1883 -596 -1091 2569 2802 -1853 -3113 724 2630 874 66 394 -1125 -1508 1732
3217A732J208m091k077M237K425l606k534K559J063k110R01K819j803l928R70
$$ 1732 2940 -1151 -3228 1009 3434 -172 -2706 -147 916 -1194 -293 2526 723 -3205 -2235
3232b235L272Nj256O85p23k419Q07L918p4m262o79L931J158l243r50K048M9j130
$$ -2235 1037 1042 -214 471 -252 -2671 -1864 2054 1980 -2282 -2961 970 2128 -1115 -2065 -17 32 -1098
3250a098J584J161k479j510K143J150j555M78J990j697l039J651L542r30l168
$$ -1098 486 1647 -832 -2342 -199 951 -604 -126 1864 167 -2872 -1221 2321 1391 -1777
3265a777O41K520n22k020M98J274o51k79J332l10k130K69K247o22k061J546K172
$$ -1777 -1136 1384 862 -1158 -660 614 -37 -316 1016 706 -1424 -1155 1092 470 -1591 -45 2127
3282B127k101k808J796K677j152j696R40O73j077j30R42k79q30J057J151j523
$$ 2127 26 -2782 -986 1691 539 -1157 -217 456 -621 -751 191 -88 -918 139 1290 -233
3298b33j646J545J654j404j290K034J317k413j787K081J757r09r13M57m09m77
$$ -233 -1879 -334 1320 -84 -1374 660 1977 -436 -2223 -142 1615 706 -207 250 -159 -636
3314f36J362O64j777o76J950R31j852j201J342Q13r24k15J184O7j800p11J338
$$ -636 726 1390 -387 -1063 887 1818 -34 -1235 107 920 -4 -219 965 1032 -768 -1479 -141
3331a41R67k86k14p37j218N82K287k53k653k80K551M07j973n79J042L25n54L23
$$ -141 826 540 326 -411 -1629 -1047 1240 987 -1666 -1946 605 1012 -961 -1540 -498 -173 -727 -404
3349d04M83n12p92J51N99K75K77J58p75j160Q32J862k76j928R4J911J94j476m69
$$ -404 79 -433 -1225 -1074 -475 -200 77 235 -540 -1700 -868 994 718 -1210 -1116 795 989 -487 -956
3368i56P97O48K49j00q54m29Q75O15n20n64O40N89p31p49O45Q98m48j171L89J154
$$ -956 -159 489 738 638 -216 -645 230 845 325 -239 401 990 259 -490 155 1053 605 -566 -177 977
3388I77j8j246n49N82P91N37n12j492m23J556R75j110j082N00P64j86o63o1M42
$$ 977 959 -287 -836 -254 537 1074 562 -930 -1353 203 1178 68 -1014 -514 250 64 -599 -660 -218
3407b18K38m14j73M18L04n93n44M18R33L42p74j171J39J527O47j248r70P41J012
$$ -218 20 -394 -567 -149 155 -438 -982 -564 369 711 -63 -1234 -1095 432 1079 -169 -1139 -398 614
3426F14J0q33o36L98J153J07r51m15L51K60M5R4M9j83k14l08LQ27N08j103j045
$$ 614 624 -209 -845 -447 706 813 -138 -553 -202 58 103 197 246 63 -151 -459 -456 371 879 -224 -1269
3447a269P13J407P1j536r95Q82J607J23j458r52O59P88K69k96m31k73L56K51l89
$$ -1269 -556 851 922 -614 -1609 -727 880 1003 -455 -1407 -748 40 309 13 -418 -691 -335 -84 -473
3466d73L09N80m67j064M19J398N2j235o22P81J072M1q27p70L62R89J83n81o58
$$ -473 -164 416 -51 -1115 -696 702 754 -481 -1103 -322 750 791 -36 -806 -444 545 728 147 -511
3485e11L49Q63j52j067J04J322o4j235j68R30L08m83l06mR3M71k0p04k11P35L40
$$ -511 -162 701 549 -518 -414 908 844 -391 -559 371 679 196 -110 -114 -21 450 430 -274 -485 250 590
3506E90p11n51P17P10p25j008L68J407O4j328o73P86P28K21m00j044k17J422Q38
$$ 590 -121 -672 45 755 30 -978 -610 797 861 -467 -1140 -354 374 595 195 -849 -1066 356 1194
3525A194j266j132P90J002l98l49L01m3o53o9R29O55n97j041l52P72J179L55j239
$$ 1194 -72 -1204 -414 588 190 -159 142 99 -554 -623 306 961 364 -677 -1029 -257 922 1277 38
3544C8j810M77K502R77k220j863J027J661K80n95o85q26J49J251P04o88q38k93
$$ 38 -1772 -1295 1207 2184 -36 -1899 -872 789 1069 474 -211 -1037 -888 363 1067 379 -459 -752
3562g52qO93J115k8j776j323J266K395J27k362j507J272J720L34p69j518o02J391
$$ -752 -760 -67 1048 1020 -756 -2079 -813 1582 1709 -653 -2160 -888 832 1166 397 -1121 -1723 -332
3580c32J678m64j936j05J143J01k32N18k8j282m59J486J318p71j679m66J173J317
$$ -332 1346 882 -1054 -1159 -16 85 -147 371 343 -939 -1398 88 1406 635 -1044 -1510 -337 980
3598I80K13j216j536J64K069J278j647j814O55J539pn89J23k01o82N07J061j82
$$ 980 1193 -23 -1559 -1395 674 1952 305 -1509 -854 685 678 89 212 11 -671 -164 897 715
3616G15p17q5j96q1R24J062j020j777J73K131P78j664j076P64Q42l93j95L97l68
$$ 715 -2 -87 -283 -364 560 1622 602 -1175 -1002 1129 1907 243 -833 -69 773 380 185 582 214
3635B14l42L46J95n35M15Q09j006j499J132K003n69k114j85J279M22l51o8k18
$$ 214 -128 218 413 -122 293 1102 96 -1403 -271 1732 1163 -951 -1136 143 565 214 146 -72
3653g2m85r2P00L88m21k30K7n99k51J538J007j990j960J539K488n74k020k38N66
$$ -72 -557 -649 51 439 18 -212 -185 -784 -1035 503 1510 -480 -2440 -901 1587 1013 -1007 -1245 -679
3672f79M43P64L51j379j104R00J440k37j024K82K56p08N0J467K02j956q00J857
$$ -679 -236 528 879 -500 -1604 -704 736 499 -525 -243 13 -695 -645 822 1024 -932 -1732 125
3690A25J518j149j527J32M47O66J128l57k546n79K784J541j971j718Q38J079j42
$$ 125 1643 494 -1033 -901 -454 212 1340 983 -1563 -2142 642 2183 212 -1506 -668 411 269
3707B69L1K13p46j045P91J689L2j412q52R2M88J436J302j818l279O75M110R21
$$ 269 300 513 -233 -1278 -487 1202 1234 -178 -1030 -938 -450 986 2288 470 -2809 -2134 1976 2897
3725B897l201j653J476J072j1K47k67j344m24J510J238p36r50k26l24J16J707
$$ 2897 -304 -1957 -481 591 580 827 560 -784 -1208 302 1540 804 -146 -372 -696 -580 1127
3742A127J137j941k676J083L097Mk242m63R35m1m2Q85m62j331K85J671m82j329
$$ 1127 2264 323 -2353 -1270 1827 1831 -411 -874 61 20 -22 863 401 -930 -645 1026 544 -785
3760g85M91R70r31j019J355J334j197j640O89J358m93p26O86J71q79R1R49n68
$$ -785 -294 676 -255 -1274 81 1415 218 -1422 -733 625 132 -594 92 263 -616 -525 424 -144
3778a44r25J360J022j776j461J789J684j549j316R83J035n92n89L98r4l17O72
$$ -144 -1069 291 1313 -463 -1924 -135 1549 0 -1316 -333 702 110 -479 -81 -175 -492 180
3795A80O66j060p74J038Q97j401p36J799R62k146j123K034R52j755o39J579M76
$$ 180 846 -214 -988 50 947 -454 -1190 609 1571 -575 -1698 336 1288 -467 -1106 473 949
3812I49j163m08K38j00O39J161o18k281p9K451R90j999j223J188P53q22J36J011
$$ 949 -214 -622 -384 -484 155 1316 698 -1583 -1662 789 1779 -220 -1443 -255 498 -324 -188 823
3830H23r76j622J022K135k40j701l53n6k7J620J718j979l233O17L549R28k265
$$ 823 -153 -1775 -753 1382 1142 -559 -912 -968 -995 625 2343 364 -2869 -2252 1297 2225 -40
3847d0j472O88O97L20O40k2j821p88J886J548j099j200L19j84m65J685J619j978
$$ -40 -1512 -824 -127 193 833 811 -1010 -1798 88 1636 537 -663 -344 -528 -993 692 2311 333
3865C33k812J139L038j08j846m79O08J46M25N75r26j317R29J936n12k069J76J739
$$ 333 -2479 -1340 1698 1590 -256 -735 -127 19 444 1019 93 -1224 -295 1641 1129 -940 -764 975
3883I75l50j333Q35J324j440j384J430J386j301j112Q17N94l06K10Mj396l41K213
$$ 975 625 -708 127 1451 11 -1373 57 1443 142 -970 -153 441 135 345 349 -1047 -1388 825
3901H25J374k326k218J388K126n39j426M95M65q61j77J284J53j464k7J288l52
$$ 825 2199 -127 -2345 -957 1169 630 -796 -301 164 -697 -874 410 563 -901 -928 360 8
3918Hp63R14L49j686l52K395O78k293j113J800J033j332m41J075J95q83k2M34
$$ 8 -755 159 508 -1178 -1530 865 1543 -750 -1863 -63 970 -362 -803 272 467 -416 -438 -4
3936dm50j56J453L43k259r30K505J187j930j070J467L16j180L49J413q41j669
$$ -4 -454 -610 843 1186 -1073 -2003 502 1689 -241 -1311 156 472 -708 -359 1054 213 -1456
3953a456O22J521n7o80j91n72n84J342K162j057l099k62L065J096j905j081Q92
$$ -1456 -834 687 630 -50 -241 -813 -1397 -55 2107 1050 -2049 -2311 754 1850 -55 -1136 -244
3970b44O1k33J160K62j870o38J923R03j291l27O60o71p29J565J622j681k334R26
$$ -244 -183 -416 744 1006 -864 -1502 421 1324 33 -294 366 -305 -1034 531 2153 472 -1862 -936
3988i36K531l0j932l57R41K78O6L59q95j402J246K228r50k439L25J885m52q85
$$ -936 1595 1565 -367 -724 217 495 561 920 25 -1377 -131 2097 1147 -1292 -967 918 466 -419
4006d19R13L82j627n40J851R09j534j245O80Q40R6L65m96j596n12K470J836k234
$$ -419 494 876 -751 -1291 560 1469 -65 -1310 -630 210 306 671 175 -1421 -1933 537 2373 139
4024A39k640J159K251l54j016L32n7q66N00J420m64j405K73R39k33k49P80l23
$$ 139 -2501 -1342 909 555 -461 -129 -186 -1052 -552 868 404 -1001 -728 211 -22 -271 509 186
4042A86j352P3K134N77k128j194J685J216r48q01M35J82r9N52M6j425j63J897
$$ 186 -1166 -1093 1041 1618 -510 -1704 -19 1197 249 -552 -117 65 -34 518 564 -861 -1024 873
4060H73N21j864p58J398M70r57k5R25l98j106L59J286n5j171l90N10N09L50J61
$$ 873 1394 -470 -1228 170 640 -317 -342 583 185 -921 -562 724 669 -502 -892 -382 127 477 638
4079F38r92j439J000K362k38k464n10J781P57q57k25J71l70JQ50R6p34m03N59
$$ 638 -354 -1793 -793 1569 1331 -1133 -1643 138 895 38 -187 -16 -386 -385 465 561 -173 -576 -17
4098a7L70k07K08J49q10p12J230J343q21j812K58J621L68j093n30J55L90P31N6
$$ -17 353 146 354 503 -307 -1019 211 1554 733 -1079 -821 800 1168 75 -455 -300 90 821 877
4117H77j214p51J047J283n15j173j1N23J2m8L19J72q10n07O19J120l01j175k74
$$ 877 -337 -1088 -41 1242 727 -446 -457 66 78 30 349 521 -289 -796 -177 943 642 -533 -807
4136h07M40P50O22o26j571k38J863J141j212j508J58J139M87l28n14k59K60K96
$$ -807 -367 383 1005 379 -1192 -1430 433 1574 362 -1146 -988 151 638 310 -204 -463 -203 93
4154I3J20q2k00l36J17M07K08L2m80p65K95J328L52j330j095P82J376Q7j155r07
$$ 93 213 131 -69 -405 -288 119 327 359 -121 -886 -591 737 1089 -241 -1336 -554 822 909 -246 -1153
4174a153M86J221M63r98r76K29P43O12r5q76m23L49M51J00J52mq08l93Q18J166
$$ -1153 -667 554 1017 19 -957 -728 15 627 532 -344 -767 -418 33 133 285 281 -527 -920 -102 1064
4194A064m04j397n20J097J338k62j293q56O65J239M66q52j223o7J459O16r77o87
$$ 1064 660 -737 -1257 -160 1178 916 -377 -1233 -568 671 1137 285 -938 -1005 454 1070 93 -594
4212e94N13K66k62L28M05o09p59M31R18K04o80o28j43O70R20qj260r76R16J652
$$ -594 -81 185 -77 251 656 47 -712 -281 637 841 161 -467 -610 60 980 972 -288 -1264 -348 1304
4232A304r7j877n19J467O91o03m70m9l01L09Q63n3j004k42O40Q9q8M49k9r53n91
$$ 1304 1207 -670 -1189 278 969 366 -104 -153 -454 -145 718 665 -339 -581 59 148 60 509 480 -473 -1064
4253a064J255J142r17j680K07J639L88r82o53Q2K26Q18M92j064j276R44J430o39
$$ -1064 191 1333 416 -1264 -1057 582 970 -12 -665 -583 -357 461 953 -111 -1387 -443 987 348
4271C48j297M79Q42n08l64O36K46r99k91J016O98o75p79P8J77M76P07k16j575
$$ 348 -949 -470 372 -136 -500 136 382 -617 -908 108 806 131 -648 -570 -393 83 790 574 -1001
4290a001n08K062J299j778j678J081J397k74n42Qm92k25J018Q23q44j132M34P53
$$ -1001 -1509 553 1852 74 -1604 -523 874 600 58 66 -426 -651 367 1190 346 -786 -352 401
4308D01j49j36N17l13j367L37K020K46k185r83J710J149o34q32j23l78M88J405
$$ 401 252 116 633 320 -1047 -710 1310 1556 -629 -1612 98 1247 613 -219 -342 -720 -232 1173
4326A173j37k001m91J915P58j265o37P14l8n99O10R60p36j571L93J698K50j205
$$ 1173 1036 -965 -1456 459 1217 -48 -685 29 -9 -608 2 962 226 -1345 -952 746 996 -209
4344b09m38R2j42J060J170j234k293O60K697J98k235m72J090L36k37L92mj140
$$ -209 -647 -555 -697 363 1533 299 -1994 -1334 1363 1561 -674 -1146 -56 280 43 435 431 -709
4362g09k84J391N85j003n91N08M5m70Q70R52j472j664J370K136q78k051M43J349
$$ -709 -993 398 983 -20 -611 -103 -58 -528 342 1294 -178 -1842 -472 1664 786 -1265 -822 527
4380E27j80m37K37m30o07R77J024r18j498Q19J449n54j196N71R18q31o59J169
$$ 527 347 -90 147 -283 -890 87 1111 193 -1305 -486 963 409 -787 -216 702 -129 -788 381
4398C81P56j431q71J301R46q88n35L14k67j39J452L19k105j066K206J560j515
$$ 381 1137 -294 -1165 136 1082 194 -341 -27 -294 -433 1019 1338 -767 -1833 373 1933 418
4415D18j624Q34R89k97l63M99l44r07N75J309m08j364J98Q68m63k80J085Oj941
$$ 418 -1206 -372 617 320 -43 456 112 -795 -220 1089 681 -683 -485 383 -80 -360 725 731 -1210
4434a210j33K378N18k189r70J581Q28n63m21j27m77K95J458M5j835q72J722J284
$$ -1210 -1343 1035 1553 -636 -1606 -25 803 240 -181 -308 -785 -490 968 1013 -822 -1694 28 1312
4452A312j194r30P68J3r24P06J620r33k033M42J966K09j153k96l13k92J207J769
$$ 1312 118 -812 -44 -31 -955 -249 1371 438 -1595 -1153 813 1022 -131 -427 -740 -1032 175 1944
4470A944j132k808K20K752R02j913j084Q78L62l60O59N79j414r36J353J326r20
$$ 1944 812 -1996 -1776 976 1878 -35 -1119 -241 121 -239 420 999 -415 -1351 2 1328 408
4487D08r47M76j77m55J201J262j595k163J229K489n68j991l8J223J56m37K18j88
$$ 408 -539 -63 -240 -695 506 1768 173 -1990 -761 1728 1160 -831 -869 354 510 73 291 103
4505A03q68M31J608m45j925L9J874r2j301M56R26j192r12J707J088j656j286J205
$$ 103 -765 -334 1274 829 -1096 -1057 817 725 -576 -120 806 -386 -1298 409 1497 -159 -1445 -240
4523b40J121n58m10nn41k30J521R98j831j911J369K267o63j796L25R30n92k50
$$ -240 881 323 -87 -92 -633 -863 658 1656 -175 -2086 -717 1550 887 -909 -584 346 -246 -496
4541d96J225o5j574J72J525j69j108K80O65q22k05J506K47k082p07K178J211j703
$$ -496 729 664 -910 -738 787 618 -490 -210 455 -367 -572 934 1181 -901 -1608 570 1781 78
4559G8j462J127J131n98m16J84n05l00J475Q05j949j352J672J375j148o47R18
$$ 78 -1384 -257 874 276 -140 44 -461 -761 714 1519 -430 -1782 -110 1265 117 -530 388
4576C88k74j250P18J787m78k173q7J767O31q32m26l37n43Q33J954l62k817o85
$$ 388 114 -1136 -418 1369 891 -1282 -1369 398 1029 197 -229 -566 -1109 -276 1678 1316 -1501 -2186
4594b186K609J290j454r05O23k56l93J167Q29j447j218J205J055o60n03L71k55
$$ -2186 423 1713 259 -646 -23 -279 -672 495 1324 -123 -1341 -136 919 259 -244 127 -128
4611a28p28J080J422j186k251N34K578J01j940l80J049Q5k96M72k19j167N24J684
$$ -128 -856 224 1646 460 -1791 -1257 1321 1422 -518 -898 151 236 -60 412 193 -974 -450 1234
4629A234n21j755J46J366j33p63O42M96j313p88J490J380j144j505M90J031j8
$$ 1234 713 -1042 -896 470 337 -426 216 712 -601 -1389 101 1481 337 -1168 -678 353 335
4646C35j67Q2p85n89J617J285j567k032J106J776k96j064L80K07p77J23J142o1
$$ 335 168 250 -535 -1124 493 1778 211 -1821 -715 1061 765 -299 81 288 -489 -366 776 715
4664G15j082o4P89L5n28K32L03q45q3J352M26j854r19J819J168j309j079P61N19
$$ 715 -367 -431 358 393 -135 97 400 -445 -528 824 1250 -604 -1523 296 1464 155 -924 -163 356
4683C56l11J61Nq86o2J429M38j534q61Q83R06m00k55N04m91j100N65J534J02j622
$$ 356 45 206 211 -675 -737 692 1130 -404 -1265 -382 524 124 -131 373 -118 -1218 -653 881 983 -639
4703f39n46J021N50J8r0p61r38R95K015l84k353n83J668J057o40l91j18m20k8
$$ -639 -1185 -164 386 404 314 -447 -1385 -390 1625 1241 -1112 -1695 -27 1030 390 -1 -119 -539 -567
4722e67Q75O36p87q81L93O23m3j21K2n32n35J241J158j156j861N36J811K59j068
$$ -567 308 944 157 -724 -331 292 249 128 150 -382 -917 324 1482 326 -1535 -999 812 1071 3
4741Cn21Q3J51N80L97q00p93N24J098j55r72k11M99O9j0N61J42j155q46J183J326
$$ 3 -518 -435 -284 296 693 -107 -900 -376 722 567 -405 -616 -117 -48 -58 503 645 -510 -1356 -173 1153
4762A153l91j223l03L93N61P38l38j455k60J497R58r35j316L09P94L42j14j27
$$ 1153 762 -461 -764 -371 190 928 590 -865 -1125 372 1330 395 -921 -612 182 524 410 283
4780B83l25m45J14P95K96n87n10K17J58K41K51l45q80K21J323K47j372p53P87
$$ 283 -42 -487 -373 422 718 131 -379 -162 -4 237 488 143 -737 -516 807 1054 -318 -1071 -284
4799b84R71m9o47n42K08N45L45l15o45p1O91L98m33n97K05K16n1J97N36m90j120
$$ -284 687 638 -9 -551 -343 202 547 232 -413 -484 207 605 172 -425 -220 -4 -55 142 678 188 -932
4820i32J55J175N77o81q90k17N97R75N7j144q01P16J177Q7j143o89L90R87J46
$$ -932 -777 398 975 294 -596 -813 -216 759 816 -328 -1129 -413 764 851 -292 -981 -591 396 542
4839E42l43l56l05o6M22O26k28n24l42J58N20M10k47r48k67J101Q02o24j143j99
$$ 542 199 -157 -462 -528 -106 520 292 -232 -574 -416 104 514 267 -681 -948 153 955 331 -812 -1011
4859a011R58R49l17j040l79N62P27M1m88n38K02N21K86k67m01j00l6L39N17K9
$$ -1011 -53 896 579 -461 -840 -278 449 490 2 -536 -334 187 473 206 -195 -295 -331 8 525 554
4879E54q43n54M46R47M38p71j075P9J062P55o82r63j12Q18P60k10r44m59O43P03
$$ 554 -289 -843 -397 550 988 217 -858 -779 283 1038 356 -607 -719 99 859 649 -295 -754 -111 592
4899E92r7l46l08k08J80N09K07j72n37l98M33Q07J21r92n82M94J047K06q38r93
$$ 592 495 149 -159 -367 -187 322 529 357 -180 -578 -145 662 783 -209 -791 -297 750 956 118 -875
4919h75J22J310O25q27j111J05Q16N00j93o31l31L38L74J43j62m53k85J60P17
$$ -875 -753 557 1182 355 -756 -651 165 665 472 -159 -490 -152 222 365 203 -250 -535 -375 342
4938C42L16n23p30k98O58J104Oj285r63Q08J322J17j081q64L07J024M96o01q26
$$ 342 658 135 -595 -893 -235 869 875 -410 -1373 -565 757 874 -207 -1071 -764 260 756 155 -671
4957f71j78O77N56J46n70m70k8L33M21L41l39q47l10J018R29m74j132l27P47R59
$$ -671 -849 -172 384 530 -40 -510 -538 -205 216 557 218 -629 -939 79 1008 534 -598 -925 -178 781
4977G81o3r02p64L94J224J97p59p91J87P29L44m04k97j3J9K4M63J04n78m47L62
$$ 781 718 -184 -948 -554 670 867 108 -683 -496 233 577 173 -124 -137 -118 -94 369 473 -105 -552 -190
4998a90N77R3j97o17l24O46Q79k03j209k81Q27Q44l46r25j54N10N71j93l37k40
$$ -190 387 480 283 -334 -658 -12 867 664 -545 -826 1 845 499 -426 -580 -70 501 308 -29 -269
5018b69l1M97L46l86m12P5K78j01J73L15m07p14K59R51J94q41o76M28Q05K95n97
$$ -269 -300 197 543 157 -255 -180 98 -3 170 485 78 -636 -377 574 768 -73 -749 -321 484 779 182
5039A82p31q2P53P66k64j062m46R82P37m37p28O8J10N0L90K65n43o94K85P23K08
$$ 182 -549 -631 122 888 624 -438 -884 98 835 398 -330 -262 -152 -102 288 553 10 -684 -399 324 532
5060E32k01o58n04L99J059L49r95j267M36J507N24j204j023L67R05L76j09o24
$$ 532 331 -327 -831 -432 627 976 -19 -1286 -850 657 1181 -23 -1046 -679 226 602 493 -131
5078a31p49J91J188L47p34n52JJ70M28O42j27j281n54J009J353j76j442p66P34
$$ -131 -880 -689 499 846 112 -440 -439 -269 159 801 674 -607 -1161 -152 1201 1025 -417 -1183 -449
5097d49J065L27n73j008l95R62J216m22j278k92Q65J80LJ81k11q31k9J082M59
$$ -449 616 943 370 -638 -1033 -71 1145 723 -555 -847 18 198 201 382 171 -660 -689 393 852
5116H52o49p03p2N21N33J29o35p36J15J099N97j033j050O13J124j96p54O1R6l5
$$ 852 203 -500 -572 -51 482 611 -24 -760 -645 454 1051 18 -1032 -419 705 509 -245 -184 -88 -123
5136a23L09K41m58l60K52L92j47j78K35j76l75K44Q47j75r35l23Q48P16n93o94
$$ -123 186 427 -31 -391 -139 253 106 -72 163 -13 -388 -144 703 528 -407 -730 118 834 241 -453
5156d53K33L30J64J18k36p16K34R13j1r31j55P78K11o27j04M21k7k84J96K67j68
$$ -453 -220 110 274 392 156 -560 -326 587 576 -355 -510 268 479 -148 -252 169 142 -142 54 321 153
5177A53n62J79N02Q8k19k82k63QP87N42q53j216M91J417K49j082o44J30N59O70
$$ 153 -409 -230 272 360 141 -141 -404 -396 391 933 80 -1136 -645 772 1021 -61 -705 -575 -16 654
5197F54J27r20r11M15J111L83o19o89k00J60N46Q00q8j351q51J007J623j47j428
$$ 654 781 -139 -1050 -635 476 859 240 -449 -649 -489 57 857 769 -582 -1433 -426 1197 1050 -378
5216c78p45M09Q58Q79k89j448p00J245J250l49j046l43K92L99M36L9m52p96L7
$$ -378 -1123 -714 144 1023 734 -714 -1414 -169 1081 732 -314 -657 -365 34 470 509 57 -739 -702
5235g02R85O22n53r03j41N34O81K97o81j149P9J581O50j216j127M01Q87M27l06
$$ -702 283 905 352 -551 -692 -158 523 820 139 -1010 -931 650 1300 84 -1043 -642 245 672 366
5254C66n25n02J97P26M16m40n93k13L60N86K23j74p57o90O88J282R8j399p55P63
$$ 366 -159 -661 -464 262 678 238 -355 -568 -208 378 601 427 -330 -1020 -332 950 1048 -351 -1106 -343
5274c43Q68J86m92o39k14N54P39k06o00k05L12K40l5Mm9j59l25K55M51J49m83
$$ -343 525 711 219 -420 -634 -80 659 453 -147 -352 -40 200 165 169 120 -39 -364 -109 342 491 8
5295Hl40K25L01j08l5J1q3O2J56l19k33N43M57m86p67J79O69M26m39p21j56P10
$$ 8 -332 -107 194 86 51 62 -21 41 197 -122 -355 188 645 159 -608 -429 240 666 227 -494 -650 60
5317F0M77r6n44n01J37O23L34k53l87k49l9K10P45K68q87q13L52J038M61p71r61
$$ 60 537 441 -103 -604 -467 156 490 237 -150 -399 -438 -228 517 785 -102 -915 -563 475 936 165 -796
5338g96K0R64P05n41q99j59N50P06M8o76n93K81N23J58m7k35m60pN88N02l16q09
$$ -796 -776 188 893 352 -547 -706 -156 550 598 -78 -671 -390 133 291 244 9 -451 -458 130 632 316 -493
5360d93k84O54Q86n4r99p94M82J133M54o35j249k56J205J022m78j076l77M65O39
$$ -493 -777 -123 763 709 -290 -1084 -602 531 985 350 -899 -1155 50 1072 594 -482 -859 -394 245
5379B45N06l54q84l58M82Q48M39n47r34n22P15J253K80j048j269J71J457P85q05
$$ 245 751 397 -487 -845 -363 485 924 377 -557 -1079 -364 889 1169 121 -1148 -977 480 1265 460
5398D60j122k6P43M07J0l60o00m6O95M21k83l37j65k21K55N64J72n93n84L21O74
$$ 460 -662 -688 55 462 472 112 -488 -534 161 582 299 -38 -203 -424 -169 395 567 -26 -610 -289 385
5419C85J64p06k68M32L25j19l70j47P3M96L45o28o67L48P92k5o17j46L54L0J0
$$ 385 549 -157 -425 7 332 213 -157 -304 -231 265 610 -18 -685 -337 455 430 -187 -333 21 51 61
5440F1P2m5l28j7K67L65n0n03k27M1L84M72O1r19m70O70R83m08q78rM85K61p0
$$ 61 133 88 -240 -257 10 375 325 -178 -405 -364 20 492 553 -366 -836 -166 817 409 -469 -478 7 268 198
5463A98k06k73J6M05K93m26l50J79K18K9j11J33r9k32k0N32K36p88m77O75P29
$$ 198 -8 -281 -265 140 433 7 -343 -164 54 83 -28 105 6 -226 -246 286 522 -266 -743 -68 661
5484F61j67o77m34j1P24P43k36j282l72R95Q65l47o83l93J99N32L21P1n96o26
$$ 661 494 -183 -617 -628 96 839 603 -679 -1051 -56 809 462 -221 -614 -415 117 438 509 -87 -713
5504g13J32Q72N47m75p54m23L28Q89P33p19j412o3J353O93o70p43j54M12N35O4
$$ -713 -581 291 838 363 -391 -814 -486 403 1136 417 -995 -1058 295 988 318 -425 -579 -167 368 432
5524D32k82n29q3N49L69j63l96j06N1J17L52K08m98n33K75P80lp82k71M44M59
$$ 432 150 -379 -462 87 456 293 -103 -209 -158 -41 311 519 21 -512 -237 543 540 -242 -513 -69 390
5545C90R6m39n65M2Q35M68n99p76L4O54L78k50l42r7j2R1L66J72m92n24J91O83
$$ 390 486 47 -518 -476 359 827 228 -548 -514 140 518 268 -74 -171 -183 -92 274 446 -46 -570 -379 304
5567C04K51l30n36l32L77R16K20r48p60L80R29Q7n39m36J37M54J10j39k13k14
$$ 304 555 225 -311 -643 -266 650 870 -78 -838 -458 471 558 19 -417 -280 174 284 145 -68 -282
5587b82J64L18O9k84j68R0jQ7L17o5n55j34N41M46m12n53L2M61N18k49p30k81
$$ -282 -118 200 269 -15 -183 -93 -94 -7 310 245 -310 -444 97 543 131 -422 -390 71 589 340 -390 -671
5609f71N43O97p2o00n94K94P07J45m49k99O2K0K16L91j81n32k51M10M70K17m33
$$ -671 -128 569 497 -103 -697 -403 304 449 0 -299 -237 -217 -1 390 209 -323 -574 -164 306 523 90
5630I0p43l1P96O64l72q85k43O25O46p8p23k20L78L36J8j67k31k0J70J94p4j38
$$ 90 -653 -684 112 776 404 -481 -724 -99 547 469 -254 -474 -96 240 258 91 -140 -160 10 204 130 -8
5652hp4m1J1L09J44l17l81J44M16K36l79n26J76P13J94o65m49J93N31L18k68o02
$$ -8 -82 -123 -112 197 341 24 -357 -213 203 439 60 -466 -290 423 617 -48 -497 -304 227 545 277 -325
5674c25k08M51M54j50k63k54N3K68K45P9l04l62q6M67N15k03p04l89N94P34k5
$$ -325 -533 -82 372 222 -41 -295 -242 26 271 350 46 -316 -402 65 580 377 -327 -716 -122 612 587
5695E87o24n91J51Q14M06n81o69M5N80L33k04m56j74K25L46J99j47l59m08K94
$$ 587 -37 -628 -477 337 743 162 -507 -462 118 451 247 -209 -383 -158 188 387 240 -119 -527 -233
5715b33N84J75l37o04q8L84O61K8q57o62O51R13op84n41K11P21L73l14n81k92
$$ -233 351 526 189 -415 -503 -119 542 570 -287 -949 -298 615 609 -175 -716 -505 216 589 275 -306 -598
5736e98L85M90J89k96n01j28L06L78K34k15p41k91Q27Q15m27r65j27N10N90J39
$$ -598 -213 277 466 170 -331 -459 -153 225 459 244 -497 -788 39 854 427 -538 -665 -155 435 574
5756E74n34o69J59O31M20l54o40M5L93K27m4j13o6k37n6M70L86n20o00K03N21
$$ 574 40 -629 -470 161 581 227 -413 -368 25 252 208 95 29 -208 -264 206 592 72 -528 -325 196
5777A96J56r3l14m15K46O55O2o76m03N80M41k38m33R4K56L4k21Q5L0j20j4L29
$$ 196 352 259 -55 -470 -224 431 493 -183 -586 -6 435 197 -236 -142 114 148 -73 12 42 -78 -92 237
5799B37j38k92K43J23k46j54M31lm98L3O65lo61k16N33M04k20l31k57J69L67M08
$$ 237 99 -193 50 173 -73 -227 204 201 -297 -264 401 398 -263 -479 54 458 238 -93 -350 -181 186 594
5821E94k97p92j32Q32N54o02o38L50K36j75K81K72n41o33M27Q07r7m98l11rK07
$$ 594 297 -495 -627 205 759 157 -481 -131 105 -70 211 483 -58 -691 -264 543 446 -52 -363 -372 -165
5842a65N74K85o84q48K79J271J91j158n60N20N23M5M1k15p99M1J060M35q49n83
$$ -165 409 694 10 -838 -559 712 903 -255 -815 -295 228 273 314 99 -700 -659 401 836 -13 -596
5862e96L40K60J2L90L2q96n03R75J048n15j233k09Q48N58r2k06o29m46O94J154
$$ -596 -256 4 16 406 438 -458 -961 14 1062 547 -686 -895 -47 511 419 213 -416 -862 -168 986
5882I86k57j351j78Q80L25l20J81j19p90lJ123N03r81q68M24O48K02j6k41o68
$$ 986 729 -622 -800 80 405 85 266 147 -643 -646 477 980 -1 -869 -445 203 405 389 148 -520
5902e20k35J058P98r08j163N38J035l06n78L42J15o03J24Q31K4r09o8P25j26k68
$$ -520 -755 303 1101 193 -970 -432 603 297 -281 61 176 -427 -303 528 552 -357 -425 300 174 -94
5922i4L17J42p25j96R85K24r04l93Q61M22q58k48P26J60o50J24M59m51l75P78
$$ -94 223 365 -360 -556 429 653 -251 -644 217 639 -219 -467 259 419 -231 -107 352 -99 -474 304
5942C04L59j091k86J130L03r83j99P83j24n72L10N62m02p07M55P50l61n20K86
$$ 304 663 -428 -714 416 719 -264 -463 320 196 -376 -66 496 94 -613 -158 592 231 -289 -3
5961cJ83m38N0Q97l21j230K42J493j59j291r9Q34O2k28L01p2q74R7J096K39j108
$$ -3 180 -258 -208 689 368 -862 -620 873 714 -577 -676 158 220 -8 293 221 -653 -556 540 779 -329
5982c29l57P58Q7l12L98M01r93q16J172J352q29j598K38J159K2n7J74p65q38R43
$$ -329 -686 72 159 -153 245 646 -347 -1163 9 1361 532 -1066 -828 331 353 296 470 -295 -1133 -190
6002a90J395n41j451M3R24O2j94M00j89j054j23J512O28j271j006O70O82p2J43
$$ -190 1205 664 -787 -744 180 242 48 448 259 -795 -918 594 1222 -49 -1055 -385 297 225 368
6021C68J11j109n11J423J082j194j217P25P60l06k62M90l63p70N27J091m51r72
$$ 368 479 -630 -1141 282 1364 170 -1047 -322 438 132 -130 360 -3 -773 -246 845 394 -578
6039e78R7Q01j84l13M36J39r88j86J431M01j534l90J099M60q29p7M37k99k81P03
$$ -578 -481 320 136 -177 259 398 -590 -776 655 1056 -478 -868 231 691 -138 -215 222 -77 -358 345
6059C45L32r81m60R77M65q78j41P86k37q46L58R97k64j088K00R42j07p15K69L72
$$ 345 677 -304 -764 213 678 -200 -341 445 208 -638 -280 717 453 -635 -435 507 400 -315 -46 326
6079C26n92j09Q30l9j029K48R02k30r58M05R71m65q44K86O96k86m00M13Q7o45
$$ 326 -266 -375 455 416 -613 -365 537 307 -651 -246 725 260 -584 -298 398 112 -288 125 212 -433
6099d33K4R76L1j032o6Q31j06n96M47N67r60o42J104Q58q12r16L94L75K1K03K82
$$ -433 -409 567 598 -434 -500 331 225 -371 76 643 -317 -959 145 1003 191 -725 -331 44 65 268 550
6120E50r25p12R15J165m32j205R9P28j36j95N38J7j049j45J375L58j158m83N86
$$ 550 -375 -1087 -172 993 561 -644 -545 183 47 -148 390 407 -642 -787 588 946 -212 -695 -109
6139a09R2k6N69o3j104l30J328P41j097q21N31O66k72j85K79k25n78N29Q40m94
$$ -109 -17 -43 526 463 -641 -971 357 1098 1 -820 -289 377 105 -80 199 -26 -604 -75 765 271
6159B71r56K78O94j15k47L26j40q92L88J271q0j367k47R34M16l25k65j06k30Q8
$$ 271 -685 -407 287 172 -75 251 111 -781 -393 878 798 -569 -816 118 534 209 -56 -162 -392 -304
6179c04P91J65r97n14Q46O44l92l68L29k70n29N91R13n63j078K81Q09Ll21P9j73
$$ -304 487 652 -345 -859 -13 631 239 -129 200 -70 -599 -8 905 342 -736 -455 354 357 36 115 -58
6200e8l81L99P41l37q98L6Q47Q7o68K9N58k88m02K64M83l83l63M18K58o09kN79
$$ -58 -439 -40 701 364 -534 -498 349 436 -232 -203 355 67 -335 -71 412 29 -334 84 342 -267 -269 310
6222C10q0n43K56M13m65l41N86L89n44n68M11O41k25m29j2J20l3K66L66n21o77
$$ 310 230 -313 -57 356 -109 -450 136 525 -19 -587 -176 465 240 -189 -201 -81 -114 152 518 -3 -680
6243f80M31P17j39o93K55K67l68kN59M4p34j87O33K52l72j95Q8oNM52l5o29l13
$$ -680 -249 468 329 -364 -109 158 -210 -212 347 391 -343 -530 103 355 -17 -212 -124 -130 -125 327 292 -337 -650
6266f50P16N69n84o10M03M49k10j21R7j76k01L73M26m60m80K62L56Jo5J30l16
$$ -650 66 635 51 -559 -156 293 83 -38 59 -117 -318 55 481 21 -459 -197 159 160 95 225 -91
6287i1m52L70P69k2r06l38N79N58j26l93j48j17J68O53M2p78l88N99L88j77j91
$$ -91 -543 -173 596 574 -332 -670 -91 467 341 -52 -200 -317 -149 504 546 -232 -620 -21 367 190 -1
6308aP8k86j24M39M07k39n97p8N44J77r6k16j85k0L08L70k97n99K9O94M8m76j68
$$ -1 77 -209 -333 106 513 274 -323 -401 143 320 224 8 -177 -197 111 481 184 -415 -386 308 356 -120 -288
6331b88L65nn2R9m3j84q7L40N9j50j89N5J01O4J05m1l91j10L97N00k48p46J0N02
$$ -288 77 72 20 119 76 -108 -195 145 204 54 -135 -80 21 85 190 149 -242 -352 45 545 297 -449 -439 63
6355F3K85j47j67k92j02N17K67l47l86P0K82O9L8p5j66k15J50L60J14l30l95P0
$$ 63 348 201 34 -258 -360 157 424 77 -309 -239 43 112 150 75 -91 -306 -156 204 318 -12 -407 -337
6377c37M66J17k22j40j26N1M17J27m73k38L05L66j22l66Q5J9J07M0j31N4o9l3
$$ -337 129 246 24 -116 -242 -191 226 353 -120 -358 -53 313 191 -175 -90 -71 36 76 -55 -1 -70 -103
6399a03J36J30j54j13l1P0J64K7p0l61P2L94K54l64l92R8L55J77j68k42j12J69
$$ -103 33 163 9 -104 -135 -65 99 126 56 -305 -233 161 415 51 -341 -243 112 289 121 -121 -233 -64
6421f4K82l1j12j61o3J73Q0J7j44k9l4K4K49K3j96l07K05K94J1k75r4N4K03J71
$$ -64 218 187 75 -86 -149 24 104 121 -23 -52 -86 -62 187 210 14 -293 -88 206 217 -58 -152 -98 105 276
6445B76k87j89J15K31Q5j81j90m6L55L8j59j52J42pm6J58J1k14j94K50K11lj58
$$ 276 -11 -200 -85 146 231 50 -140 -186 169 207 48 -104 38 31 -15 143 154 -60 -254 -4 207 204 46
6468D6k31pK07L04o5l88k90K65N65j4n44k79L44L05L4l6k59k92J11M34P8l20j77
$$ 46 -185 -192 15 319 254 -134 -424 -159 406 392 -152 -431 -87 218 252 216 -43 -335 -224 210 288 -32 -209
6491b09Q0J5K55K24k07n16p9N09M61k25o98k0L78K81n2j65k23j54M29L77l08m57
$$ -209 -129 -114 141 365 158 -358 -437 72 533 308 -390 -410 -32 249 197 32 -191 -345 84 461 153 -304
6513c04M7L62L1j84K04j16m44J59M61J33m51k80K49K79J31j46j51l05J53M52J47
$$ -304 -257 105 136 -48 156 40 -404 -245 216 349 -102 -382 -133 146 277 131 -20 -325 -172 280 427
6534D27m81l59L22M63k68j94K02p2l05L01K83k05l18K0K98n7K2J5o3l67K71L57
$$ 427 -54 -413 -91 372 104 -90 112 40 -265 36 319 114 -204 -184 114 57 79 94 31 -336 -65 292
6556B92k0m70j52N24J45l59j30K09M0j96K38Q3k92r9L72J2m43Q1M18r5l83J34
$$ 292 272 -198 -350 174 319 -40 -170 39 79 -117 121 204 -88 -187 185 197 -246 -165 253 158 -225 -91
6578i1L22j42k13J24K02j63k36J94K04j16k34J43R4j51J12L40m20m58L95O12k46
$$ -91 231 89 -124 0 202 39 -197 -3 201 85 -149 -6 88 -63 49 389 -31 -489 -94 518 272
6599B72n94N8L45qQ3K1k22k92K09N02m9m33j10J78N5RJ79K9n61k34O78N66n87
$$ 272 -322 -264 81 73 156 177 -45 -337 -128 374 325 -108 -218 -40 15 24 203 232 -329 -563 115 681 94
6622I4o18K16L95K3J22J2n70k08P12M31n42m69J62L42m5O7L2j44m62J84O50O2
$$ 94 -524 -308 87 110 232 244 -326 -534 178 609 67 -402 -240 102 57 124 156 12 -450 -266 384 446
6644D46o20l23L97K12J5J31k09n48J72P75J31p94k85N36K86k90M1nl14n4M06L01
$$ 446 -174 -497 -100 112 127 258 49 -499 -327 448 579 -215 -500 36 322 32 73 68 -246 -300 106 407
6666D07l94m04K02K77O6j26J11j97l56K73O82k62o94J1N78J27k77n6Ok65J92N12
$$ 407 13 -391 -189 88 154 28 139 -58 -414 -141 541 279 -415 -404 174 301 24 -32 -26 -291 -99 413
6688D13j65n07j0M09k0k06O1K10l54q2L01K92k38m08K33K38j23q6K45j48k74K05
$$ 413 248 -259 -269 140 120 -86 -25 185 -169 -251 50 342 104 -304 -71 167 44 -42 203 55 -219 -14
6710a4L77l43l01L04K58l78j52L80K02l62k46K37K26j10l1N8j81j92L12K52k07
$$ -14 363 20 -281 23 281 -97 -249 131 333 -29 -275 -38 188 78 47 105 -76 -268 44 296 89
6731H9l19J62J44k19P6M12j26o15L7O68Q8m32k04J27J0J66K51k44l80j05N85J96
$$ 89 -230 -68 76 -143 -67 345 219 -396 -359 309 397 -35 -239 -112 -102 64 315 71 -309 -414 171 367
6753C67m19j94J43J58j40J48J62l10l42L11M65j64l40RQ9OK29J24m05l78L34O22
$$ 367 -52 -246 -103 55 -85 63 225 -85 -427 -116 349 185 -155 -146 -57 -51 178 302 -103 -481 -147 475
6775D75k03n27o0L49R7J8k7j56k60J77M33J06n02k46K88J55j2J05j19m24p8O25
$$ 475 272 -255 -315 34 131 149 122 -34 -294 -117 316 422 -80 -326 -38 117 105 210 91 -333 -411 214
6797B14M08n31n13K18K21J56J25j62m51q0M72L40k16m73J6L16j1L6J69k03l69
$$ 214 622 91 -422 -204 17 173 298 136 -315 -395 77 417 201 -272 -256 60 49 85 254 51 -318
6818c18K0N38J26m80j02J02M1P9K07q6m78J28M96n0l43NK51K7k82J5L08j05k34
$$ -318 -298 240 366 -114 -216 -114 -73 6 213 127 -351 -223 273 223 -120 -115 136 163 -119 -104 204 99 -135
6841a35P8J20n0j05J42J18k15j30K10J54k51Q6J26k32j70K60K81j78l35Q3J41
$$ -135 -57 63 13 -92 50 168 -47 -177 33 187 -64 22 148 -84 -254 6 287 109 -226 -143 -2
6862bK8M0lj29j72K05K55r2l77L9M01n7k86J15J83k66jK38R3k92p8K96Rk33N8
$$ -2 26 66 63 -66 -238 -33 222 130 -247 -208 193 136 -150 -35 148 -118 -119 119 212 -80 -158 138 147 -86 -28
6887b8M5m3o4K63J51m79j72M41L05l65k38k4K32J7J04M4k44k89K99M53k83k97
$$ -28 17 -26 -90 173 324 -155 -327 114 419 54 -184 -208 24 41 145 189 -55 -344 -45 408 125 -172
6909a72J02O9j87L05K06k47n03J28N54J85l80l09N1J14R7K55j25m82j11M80L22
$$ -172 -70 -1 -188 117 323 76 -427 -299 255 440 60 -249 -198 -84 13 268 143 -339 -450 30 352
6930C52l54k06J20J7j14J85K50k53l77K06M15j71j35K0l1q9K15J92k56k50J49
$$ 352 -2 -208 -88 -71 -185 0 250 -3 -380 -174 241 70 -65 -45 -76 -165 50 242 -14 -264 -115
6951a15L18m7l47K9L13pk41KK45j88m0K98K3l53l3L10L5k53O0J85k67j06L97O1
$$ -115 203 156 -191 -162 151 144 -97 -95 150 -38 -78 220 243 -110 -143 167 202 -51 9 194 -73 -179 218 279
6975B79l14l40L37K82j19j47KNq0K01J94k39m00K11L23r7j86J27N3k21n3M10n0
$$ 279 -35 -375 -38 244 125 -22 -20 -15 -95 106 300 61 -339 -128 195 98 -88 39 92 -129 -182 228 178
6998A78k82PJ43j2n5l7R6p9K7L0P5j87q0L29L4l34j14L62J67k94j19J14J7q4L33
$$ 178 -104 -97 46 34 -21 -58 38 -41 -14 16 91 -96 -176 153 187 -147 -261 101 268 -26 -145 -31 -14 -98 235
7023B35J6l48j66K83P8r6Kj8p5j35K47K89j99m40m5M49J96k25j56ln3O6L15rm82
$$ 235 251 -97 -263 20 98 2 4 -14 -89 -224 23 312 113 -327 -372 77 273 48 -108 -111 -164 -98 217 208 -274
7048b74m6L83J51l03j5J99j65r3J41K32j98k04J54J28J2j55o0J34m4R8J6j27j91
$$ -274 -320 63 214 -89 -104 95 -70 -163 -22 210 12 -192 -38 90 102 -53 -113 21 -23 75 91 -36 -227
7071b27K13L18k09m13J25L67k8r4L6j06j36J37K91j44k16OQ0J10m5j0o6j36J0
$$ -227 -14 304 95 -318 -193 174 146 52 88 -18 -154 -17 274 130 -86 -80 0 110 65 55 -11 -147 -137
7094a37L03J82l30l47K34K12K3j12m6p7n6K31K07k65k15J16J08J8q0J02m7j08
$$ -137 166 348 18 -329 -95 117 140 28 -18 -95 -151 80 287 22 -193 -77 31 49 -31 71 24 -84
7116h4M3J74K4k28j29K08J12q0j06N1l5Q5J57j12k11p4L48J03k63q4J40N8J6n5
$$ -84 -41 133 157 -71 -200 8 120 40 -66 -15 -50 35 192 80 -131 -205 143 246 -17 -101 39 97 113 58
7140E8p4p2rJ63N4J0k07m2L8K19L8p2j70q4M5L27J9l18j27Q0K44k4L3j70j42R5
$$ 58 -16 -88 -97 66 120 130 -77 -119 -81 138 176 104 -66 -150 -105 222 241 -77 -204 -124 120 96 129 -41 -183 -88
7166h8J98q9k8n4n0J03Q2p9J3k5m6o0J92N4j69j10J93O1j11%M1rK8K4j05l7Q6
$$ -88 110 21 -7 -61 -111 -8 74 -5 8 -17 -63 -123 69 123 -46 -156 37 98 -13 -13 28 19 47 71 -34 -71 15
7193A5J30j7j19j41J54J76Kk55k2N4P1q5J97j29j42K4J64P8j07j12k6mK08J03
$$ 15 145 128 9 -132 22 198 200 -55 -77 -23 48 -37 160 31 -111 -87 77 155 48 -64 -90 -94 114 217
7217B17j34k20q8K82K06j37k80O3K23k9p0K5l3k30J94K97k62j60O6J14n9J7N8
$$ 217 83 -137 -225 57 263 126 -154 -91 132 103 33 58 25 -205 -11 286 24 -136 -70 44 -15 2 60
7240F0o2j59J02K39M9k35k24K26J98j20j56L0j9O6K98n5k88k29K79K69k87lP0
$$ 60 -2 -161 -59 180 229 -6 -230 -4 194 74 -82 -52 -71 -5 293 238 -50 -279 0 269 -18 -21 49
7263D9p4j49L29J07j87l22Q9L47Nj41r5M9r0P8K52j05l67p1M93R7l63j58K73p9
$$ 49 -25 -174 155 262 75 -247 -158 189 194 53 -42 7 -83 -5 247 142 -225 -296 197 294 -69 -227 46 -33
7287c3o5J97R3k70j52K55J77k70q5K10k5j95K07J98k89k39K42L49j39m09J27K96
$$ -33 -98 99 192 -78 -230 25 202 -68 -153 57 32 -163 44 242 -47 -286 -44 305 166 -243 -116 180
7309A80j64j83K80J6k93J11K95j62l32J56L41j56l40K80J87k82r9K90J53m35m8
$$ 180 16 -167 113 129 -164 -53 242 80 -252 -96 245 89 -251 29 216 -66 -165 125 278 -157 -205
7330b05L22J27l30q0K52ok25K46K14m25k64M56L66m62k77L63K15l91j6K96j36
$$ -205 117 244 -86 -166 86 80 -145 101 315 -110 -374 82 448 -14 -291 72 287 -104 -120 176 40
7351D0k99K61L37k02m01J45L36k33j91L58L7m44K1N40R0n96j50O15ll85J55J57
$$ 40 -259 2 339 137 -264 -119 217 -16 -207 151 188 -256 -235 305 395 -201 -351 264 261 -124 31 188
7373A88l27r5M94K37o69k33N22K26l48m5K57j68k83K19M51k68n04J53N08j91l12
$$ 188 -139 -234 260 497 -172 -405 117 343 -5 -50 207 39 -244 -25 426 158 -346 -193 315 124 -188
7394a88K16J43m40O4O95k41o92J48O16j15m74J15L26k53j55L65K25o16o4M16K14
$$ -188 28 171 -269 -205 490 249 -443 -295 321 206 -268 -153 173 -80 -235 130 355 -261 -325 91 305
7415C05m39j29M20j70k66K53M52l89n96M83N27l96m38L46K61m52M4M37j08n19
$$ 305 -134 -263 157 -13 -279 -26 426 37 -559 -76 451 55 -383 -37 224 -228 -184 253 145 -374
7435c74J70N33k26m07K20L47k71l35M39K52m69k84M84K70n29p6N08n1m50J78M59
$$ -374 -204 329 103 -304 -84 263 -8 -343 96 348 -121 -405 79 349 -180 -256 252 201 -249 -71 388
7456C88l55l41M12L52o26k47O40K51o05j59N26m6l53J20L89k88l78L00M70l94
$$ 388 33 -308 104 456 -170 -417 223 474 -131 -290 236 190 -163 -43 346 58 -320 -20 450 56
7476E6l99L41K89m20j32O21j6p28R6O99n1o07K2N80k58l31L05K23n06j43O78P6
$$ 56 -343 -2 287 -133 -265 356 340 -388 -292 407 356 -251 -229 351 93 -238 67 290 -216 -359 319 395
7498C95o23r4N20L1m86P5N47k81n84M14O03m85m66M20L47k96k20L88j09m52K77
$$ 395 -228 -322 198 229 -257 -182 365 84 -500 -86 517 32 -434 -14 333 37 -183 205 96 -356 -79
7519g9N29l30o04K60N09j71l97K31K49l63k11O20J76o82k62O25J92m91M4M02l15
$$ -79 450 120 -484 -224 285 114 -283 -52 197 -166 -377 243 419 -263 -525 100 292 -199 -155 247 -68
7540f8m21O45L75o14m96N31M08m04k30L42j5l36J40M74j22n85J69M94j67m24L22
$$ -68 -489 156 531 -83 -579 -48 360 -44 -274 68 53 -283 -143 331 209 -376 -207 287 120 -304 18
7561A8K75l91k28N90J52o36j26N90Q0n62Q9M87k32k40K07K15l51j82M47J47m63
$$ 18 293 -98 -326 264 416 -220 -346 244 324 -238 -149 338 106 -134 73 288 -63 -245 202 349 -114
7582a14k65O10J22m87l7L58l1m56J49N80l43n43L55L82l38j60L52k1m64P9O12
$$ -114 -379 231 353 -134 -171 187 156 -300 -151 429 86 -457 -102 280 -58 -218 134 113 -351 -272 340
7603C40j28o12P5N52k5m38O6L30k02k20L17K20m68j89N60J14o02N2N11j23m60
$$ 340 212 -400 -325 227 202 -236 -170 160 -42 -262 55 275 -193 -382 178 292 -310 -258 253 130 -330
7624c30K47M39l45l79L85M05m19l28L25K65k85l5L38k23l75K87M94k44o59K05
$$ -330 -83 356 11 -368 17 422 3 -325 0 265 -20 -55 283 60 -315 -28 466 222 -437 -232
7644b32N31j19l58K50J12m76J1N81P9n86r7L30J07k24J31J03l21k60N38L43m51
$$ -232 299 180 -178 72 184 -292 -281 300 379 -207 -304 26 133 -91 40 143 -178 -438 100 443 -8
7665hl60K76K91k08j32K52l8l55J63N12k60m55K13M33l47j76L69R4m28l5M58L2
$$ -8 -368 -92 199 -9 -141 111 73 -282 -119 393 133 -322 -109 324 -23 -199 170 264 -164 -199 259 291
7687B91m46j06N25J5k69n2J63j8j88K11P0l29k10N62J17m79j09L68J18m03J56
$$ 291 -155 -261 264 279 10 -42 121 103 -85 126 196 -133 -343 219 336 -143 -252 116 234 -169 -13
7708a3J87k08k62K15L48k06k88J46J58j79l5K97j60l06J17L66J02n50K9L84Nl11
$$ -13 174 -34 -296 -81 267 61 -227 -81 77 -102 -137 160 0 -306 -189 177 279 -271 -242 142 147 -164
7730a64J96J63k51j38M05L3l72J8K82k0k86R0K60j36k26K12K18j80l02K21L10
$$ -164 32 195 -56 -194 211 244 -128 -110 172 152 -134 -44 216 80 -146 66 284 104 -198 23 333
7751C33j99k27N1J78n5m0K26k70k53J44N06k71m24K09K34j45l3K07l5l44O4L06
$$ 333 134 -93 -42 136 81 41 267 -3 -256 -112 394 123 -301 -92 142 -3 -36 171 136 -208 -144 162
7773A62j9j98j03J21P7r7J75J11l52j79L61K29k92k98K37J97j19r8J40j4k12J71
$$ 162 143 -55 -158 -37 40 -57 118 229 -123 -302 59 288 -4 -302 -65 132 13 -85 55 41 -171 0
7795@J57j32j48J11Q2r0oO3Q9j83jJ90M4k84o1K59J62k29j37J34n5J24J20q5k93
$$ 0 157 25 -123 -12 70 -20 -26 37 126 -57 -58 132 176 -108 -169 90 252 23 -114 20 -35 89 209 124 -169
7820a69J5K91J23k97j14J64O1q3Q7L0j11j74J30J82Oj86k8N0J5nK99k47k77Q4
$$ -169 -154 137 260 -37 -151 13 74 -9 78 108 -3 -177 -47 135 141 -45 -73 -23 -8 -13 286 39 -238 -154
7844a54L20K4k34o3J67J3onj6p5lJ24L6j31m9J02j1l4O7M4m1j60J40J57j40k45
$$ -154 166 190 -44 -107 60 73 67 62 46 -29 -32 92 128 -3 -52 50 39 5 72 116 75 -85 55 212 72 -173
7870a73J11K66p8k7j47l8j3K93l4k47MJ15J34m9p8p3K4j6J2Q4j9m1j32Q8J73j4
$$ -173 -62 204 126 99 -48 -86 -99 194 160 -87 -83 32 166 117 39 -34 -10 -26 -14 70 51 10 -122 -34 139 125
7896A25r3r2m7R1K31n5k87o1K24Q8k4j00q9J09R7j0q2p4RN3j8QJ0ojJ3l2K2L2
$$ 125 32 -60 -107 -16 215 160 -127 -188 36 124 100 0 -89 20 117 107 25 -49 -40 13 -5 3 13 7 6 19 -13 9 41
7925D1q2n7J60P5j17q8L6J01N0j89p8J42N1J35j77l3l2jJ27M4j82k4J46J7j22
$$ 41 -41 -98 62 137 20 -68 -32 69 119 -70 -148 -6 45 180 3 -30 -62 -63 64 108 -74 -98 48 65 -57
7950e7J15o6q5j7J24J44j14j33j8P3J34j5j09m0m7J00J56j33j27kK70K4k20m5
$$ -57 58 -8 -93 -110 14 158 44 -89 -107 -34 100 85 -24 -64 -111 -11 145 12 -115 -117 153 177 -43 -88
7974h8R1L6n1O5K6j53nQ7N5K1r6Jj21J60P2L9j88j51J23K78J7l72n0J81J83j05
$$ -88 3 39 -12 53 79 -74 -79 8 63 84 -12 -11 -132 28 100 139 -49 -200 -77 201 218 -154 -204 -23 160 55
8000E5N4j54j16J51J70m3k18K1O6J4L9K6K2j83r5K43J43j72j68l7J62J30l8l1
$$ 55 109 -45 -161 -10 160 117 -101 -80 -14 0 39 65 87 -96 -191 52 195 23 -145 -182 -20 110 72 41
8024D1j27j60K90K39k11l00J35J39o8j2Q9l6j36O0J80j7j32J0pJ3nP4l2j29l1
$$ 41 -86 -246 44 283 72 -228 -93 46 -22 -34 55 19 -117 -57 123 106 -26 -16 -23 -10 -15 59 27 -102 -133
8049a33K92L8k97j14K02K36k31r2J45l9j05J47j9j57M5J47k4r6RJ04J6k14R9J42
$$ -133 159 197 -100 -214 -12 224 -7 -99 46 7 -98 49 30 -127 -82 65 41 -55 -46 58 74 -140 -41 101
8073A01k5j92OK66j23j27N7L4J7l4J29q6j83J75J96j91k59J23K98j54j71P6O7
$$ 101 76 -116 -110 156 33 -94 -37 -3 14 -20 109 23 -160 15 211 20 -239 -116 182 28 -143 -67 0
8096@Rk5M9L7j95K4Q9J08k11J7J08j47J1K36J34l57j76K06K77j21k34OO3R0Q4
$$ 0 9 -16 33 70 -125 -101 -12 96 -115 -98 10 -137 -126 110 244 -113 -289 -83 194 73 -161 -155 -92 -2 82
8121H2j6k13o7K06J37l1k37O8R0j02L1J95J9l15o4L19J06j14k22O9M9J14J03r6
$$ 82 66 -147 -214 -8 129 98 -139 -71 19 -83 -52 143 162 -153 -217 102 208 94 -128 -59 -10 104 207 111
8145A11l62J2M04J30k39k02N7J15J8n7J13j22j05L0K67o0j35m2LK0J06K19k32
$$ 111 -251 -239 165 295 56 -146 -89 26 44 -13 100 -22 -127 -97 170 110 -25 -67 -64 -44 62 281 49
8168D9l06Q7M31Pm26j00J64J70m4LJ1j69QJ99J8k04J6P2Q9k13J33J84j79
$$ 49 -257 -170 261 268 -158 -258 -94 76 32 35 46 -123 -115 84 102 -102 -86 -14 75 -138 -5 179 0
8191@
$$ Imaginary data points
##PAGE= N=2
##DATA TABLE= (X++(I..I)), XYDATA
0@%%%%%%%%%%%%%%%mQqJ0j3J4j5J6j5J8k3K4k4K6l0L4l6L8m4M9n0N4o1O6p0P6
$$ 0 0 0 0 0 0 0 0 0 0 0 0 0 0 0 0 -4 4 -4 6 -7 7 -8 8 -7 11 -12 12 -12 14 -16 18 -18 20 -24 25 -25 29 -32 34 -36 40
41D0q6R7j06J17j33J53j76K02k38K86l49M35n59P48j044J553k530M748j1608O7415
$$ 40 -46 51 -55 62 -71 82 -94 108 -130 156 -193 242 -317 431 -613 940 -1590 3158 -8450 58965
61E8965L32060k14669l75285J16708K37830r6068j13366J64877O9775k19206j01664
$$ 58965 391025 176356 -198929 -82221 155609 59541 -53825 111052 180827 -38379 -140043
72a40043J90802J06420j32100r4153M8036M1976L8732O1720o9017j65421L8113
$$ -140043 50759 157179 25079 -69074 -21038 20938 59670 121390 52373 -113048 -74935
83g4935K09645J2383j65795Q697J12324r8154j29703J54050J61052j68216j71443
$$ -74935 134710 147093 -18702 -10005 102319 4165 -125538 28512 189564 21348 -150095
94a50095J56464J33944j82988j23506J92519J22745j65071r2593J29728K5200
$$ -150095 6369 140313 -42675 -166181 26338 149083 -15988 -108581 21147 46347
104D6347j29510L4729J54280n5021j57499O2304J34644p8438j05457R2833O5593
$$ 46347 -83163 -48434 105846 50825 -106674 -44370 90274 11836 -93621 -788 64805
115F4805j09659j2183J49591k3292k02663P836K13318K9746j51091j5280P6049
$$ 64805 -44854 -57037 92554 69262 -133401 -125565 87753 117499 -33592 -48872 27177
126B7177n5594n0494J21778O7408j35804o7914J22586L1808j24880Q844J36647
$$ 27177 -28417 -78911 42867 110275 -25529 -93443 29143 60951 -63929 -55085 81562
137H1562m1662j45585P1068J51366r6975j61380R9416J49717r3801j09523J08577
$$ 81562 39900 -105685 -34617 116749 19774 -141606 -42190 107527 13726 -95797 12780
148A2780P2516j37076o6604J33031N8389r3647m931P5343o9218j10706R6149J52392
$$ 12780 85296 -51780 -118384 14647 73036 -20611 -25542 49801 -19417 -130123 -33974 118418
160A18418o0716j31801L0230O1447n0778K475J09229j8281j49647J2323J62336
$$ 118418 57702 -74099 -43869 17578 -33200 -30725 78504 60223 -89424 -77101 85235
171H5235K221j39203r58R3612k6581l9761J00408L6794j66693q7794J66915J37252
$$ 85235 87456 -51747 -52705 40907 14326 -25435 74973 111767 -54926 -142720 24195 161447
183A61447r2034j06805K6620J4404l1161O2848Q2714p9653j16095O1644J04882
$$ 161447 69413 -37392 -10772 3632 -27529 35319 118033 38380 -77715 -16071 88811
194H8811n4664p5300N9499L5581q0000J271J11848k7210j55984J2145J65270J2633
$$ 88811 34147 -41153 18346 53927 -26073 -24802 87046 59836 -96148 -84003 81267 93900
206I3900j33223j5174P9862k4632n5858O4671N2670q8005n3561R6932M8681j03272
$$ 93900 -39323 -54497 25365 733 -55125 9546 62216 -25789 -79350 17582 66263 -37009
218c7009n1491R0884M7747n7288j3002L3846m2491m4651Q0047P4946p3038p8333
$$ -37009 -88500 2384 50131 -7157 -20159 13687 -28804 -73455 6592 81538 8500 -69833
230f9833M9997M6793m0158K230N8163l8662q7846N5700J20822m3653j34736J2872
$$ -69833 -19836 26957 -13201 -10971 47192 8530 -79316 -23616 97206 53553 -81183 -68311
242f8311J12421Q965n8258J0683J4368o0763j3169R5001L7570q6413m5013N5162
$$ -68311 44110 53075 -5183 5500 19868 -40895 -54064 40937 78507 -7906 -52919 2243
254B243J7265l8214K2098M2060n0632n4050O2495O1718o2331o2461N0901M9002
$$ 2243 19508 -18706 3392 45452 -5180 -59230 3265 64983 2652 -59809 -8908 40094
266D0094l8958k1276M0178n482n3723J6971O2305k0451n7678L1869N4697m6616
$$ 40094 1136 -20140 20038 14556 -39167 -22196 40109 19658 -38020 -6151 48546 1930
278A930o1163M7628O2589l4471m1449L0837R813m7530O807O7372j202o7014o485
$$ 1930 -59233 -11605 50984 16513 -24936 5901 15714 -31816 -25009 42363 41161 -25853 -32338
291c2338M6422j93k2608K0976Q727m6955q670O8794K3022p4635m2694N5724M6254
$$ -32338 14084 13891 -8717 12259 20986 -25969 -34639 34155 57177 -17458 -60152 -4428 41826
304D1826k3940k0524N972k0285j6913M5827L9803m4402m9291K9604L6763k1755
$$ 41826 17886 -2638 3334 -16951 -33864 11963 51766 7364 -41927 -12323 24440 2685
316B685j4476K4812o224l6287J8903N1222j9299o3503M980N9605J1737l5900j3559
$$ 2685 -11791 13021 6797 -29490 -10587 40635 21336 -42167 -37187 22418 34155 -1745 -15304
329a5304N179o627J2273L5955j0031n7432m575O2082J9511m9956k4866K6806J3037
$$ -15304 -10125 -16752 -4479 31476 21445 -35987 -40562 21520 41031 -8925 -33791 -6985 6052
342F052o042J4344M117m0159k2562M3550M2671k1084m0626n977J2830J3601K2365
$$ 6052 10 14354 18471 -21688 -44250 -700 41971 20887 -19739 -25716 -12886 715 23080
355B3080N305m1511l6524L5088N9244r788n8377j5781L3250K2965O89m991k0948
$$ 23080 28385 -13126 -49650 -14562 44682 34894 -23483 -39264 -6014 16951 17640 12649 -8299
368h299k4718J6043M3041L918l7029j7564J4977J2129M403P416q339k7344l093
$$ -8299 -33017 -16974 26067 29985 -7044 -24608 -9631 2498 6901 14317 5978 -21366 -24459
381b4459L5910K1065k8791l3994R583L1959J0424j3583j8534j1879R055K9875
$$ -24459 11451 32516 3725 -30269 -20686 11273 21697 8114 -10420 -22299 -13244 16631
393A6631J0622l1391k7662J8768L1600k431k1017p262K524M016J2079R777j3103
$$ 16631 27253 -4138 -31800 -13032 18568 16137 -4880 -12142 -9618 -5602 6477 16254 3151
406C151k3726m42K5230J7590j0626k3547j0601J1407K2682J2041j6773l1513l858
$$ 3151 -20575 -21017 4213 21803 11177 -12370 -22971 -11564 11118 23159 6386 -25127 -28985
419b8985L4163K5798j9039l4946m341K5395K0746m137k0543j4644N785J8256J0910
$$ -28985 5178 30976 11937 -23009 -27350 -1955 18791 14654 -5889 -20533 -14748 3508 14418
432A4418o193j7055j1155Q488K0386P458j4466j8077k616J4665J9515K677k3247
$$ 14418 8225 -8830 -19985 -11497 8889 16347 1881 -16196 -18812 -4147 15368 18045 -5202
445e202k3141J1014L3921J0999k6477k7251O614K8291J3730j2923k0407p177J1756
$$ -5202 -28343 -17329 16592 27591 1114 -26137 -19523 8768 22498 9575 -10832 -18009 -6253
458f253K0084O096j8056j9134O155J8769N604n280o015j0718o439J7430K3206
$$ -6253 13831 19927 1871 -17263 -11108 7661 13265 7985 1970 -8748 -15187 2243 25449
471B5449r840l2153o342K5652J8831p843j8728j1007M514J9673J5020j4574k9793
$$ 25449 15609 -16544 -22886 2766 21597 13754 -4974 -15981 -11467 8206 23226 8652 -21141
484b1141l42L1815J4079k2257j7721Q827Q766j244O404L631j8185j2721K0164
$$ -21141 -21483 10332 24411 2154 -15567 -6740 2026 782 7186 10817 -7368 -20089 75
497G5K0190j2627j8971K229P418K348R839M351k3302k0443K4328L6347j2513m1420
$$ 75 20265 7638 -11333 -9104 -1686 662 10501 14852 -8450 -28893 -4565 31782 19269 -22151
511b2151l735L1197J2235j2495o982m631r209J0942K6507o320l5795m169L1395
$$ -22151 -25886 5311 17546 5051 -1931 -6562 -15771 -4829 21678 15358 -20437 -24606 6789
524F789R690j7128l389L229j4545j434L2001J3480l6807k9007K4699L3119n245
$$ 6789 16479 -649 -4038 -809 -15354 -16788 15213 28693 -8114 -37121 -12422 20697 15452
537A5452k0320p580m072M467K7338J2927l7585l4567L0121M5934j1610l6929j792
$$ 15452 -4868 -12448 -16520 -12053 15285 28212 -9373 -43940 -13819 32115 20505 -16424 -18216
550a8216J2609k102J0624K2462j5903m0827M391M3170J1188k5469j2219K816k690
$$ -18216 -5607 -7709 2915 25377 9474 -31353 -26962 16208 27396 1927 -10292 -7476 -10166
563a0166J2310K9312q174m9604q750N4843K9057l8616l2722J6054J6629j360J2338
$$ -10166 2144 31456 23282 -26322 -35072 19771 48828 10212 -22510 -6456 10173 8813 21151
576B1151P040l3198k3362L6795L5740k5852l2875J3442J5909j1144M345K0442
$$ 21151 28191 -5007 -28369 8426 44166 18314 -14561 -1119 14790 3646 7991 28433
588B8433j8726l8354J6693M9717m187m7634j0368K6869Q277m437P850j0016l2541
$$ 28433 9707 -28647 -11954 37763 33576 -14058 -24426 2443 10720 6283 14133 4117 -28424
601b8424O912M7422K233m9875j0892L8381Q165k4060M661J4692k3085j6791L4997
$$ -28424 -21512 25910 28143 -21732 -32624 5757 13922 -10138 -5477 9215 -13870 -30661 4336
614D336K5092l2780k7651K2330J7943j3780J105J7093j7252k6517K6767L7578
$$ 4336 29428 -3352 -31003 -8673 9270 -4510 -3405 13688 -3564 -30081 -3314 34264
626C4264k7274m2677K4105M1768j8419l1188J7108J6414k1637k817K9972m605
$$ 34264 6990 -35687 -11582 30186 11767 -19421 -2313 14101 -7536 -10353 19619 15014
638A5014l4936R123L5151j3979l3668J7971L0526j9878k3334K2869J2962l2531
$$ 15014 -19922 -10799 24352 10373 -23295 -5324 25202 5324 -18010 4859 17821 -14710
650a4710q104M3437J2196m5234j8418L3720J4080j7875L454R101k5559j1072M3103
$$ -14710 -22814 20623 32819 -12415 -30833 2887 16967 -908 2546 11647 -13912 -24984 18119
663A8119K0146m9066k8624M3017K9620k8203j5094J8131q537k2191K8630L8817
$$ 18119 38265 -10801 -39425 3592 33212 5009 -10085 8046 -491 -22682 5948 44765
675D4765k9708m9154J8353M2939q919k1789J4764K421l1127P460M9799n115o0092
$$ 44765 15057 -34097 -15744 27195 18276 -3513 11251 13672 -17455 -9995 39804 34689 -25403
688b5403m255N7175J3360l9052j1441J3881o880K310L2625k340n0904r462M9817
$$ -25403 -29658 27517 40877 1825 -9616 4265 -2615 -305 32320 29980 -20924 -30386 19431
701A9431J5431l7561r621K2526j0377j9003L1307K5671m7393m2323M4664N1147
$$ 19431 34862 -2699 -12320 10206 -171 -19174 12133 37804 -9589 -51912 -7248 43899
713D3899l0009m3895J3051J5182j4814J4579L3531l0037n7897K3530O7406p896
$$ 43899 13890 -30005 -16954 -1772 -16586 -2007 31524 1487 -56410 -32880 34526 26630
725B6630n7036j912L3536k815j0410K1400J721l9616o888M6044J8293l1652j4794
$$ 26630 -30406 -32318 1218 -1597 -12007 9393 11114 -28502 -35390 10654 28947 -2705 -17499
738a7499J2406n022j076L5022R383n2908k2682N6797L1845m8220k7445M0559J5783
$$ -17499 -5093 -10115 -11191 23831 33214 -19694 -42376 14421 46266 -1954 -29399 11160 26943
751B6943l5771N3L7356j2487m1923J8176M4137j7651l9683J6167K8974j9860j9442
$$ 26943 -8828 -8775 28581 16094 -25829 -7653 36484 18833 -20850 -4683 24291 4431 -15011
764a5011K4567J0741k8166l037K9575p390l3946J3385L5702j5077l0054J6524
$$ -15011 9556 20297 -7869 -10906 18669 11279 -22667 -9282 26420 11343 -18711 -2187
776b187J5091k7141j900M4520j817n8979l586O2168R931n4277r911M1571K543
$$ -2187 12904 -14237 -16137 28383 26566 -32413 -35999 26169 36100 -18177 -28088 13483 16026
789A6026k9421J1263K3743k4848k4665L2289K7470k9402k2827K3154Q069k2113
$$ 16026 -13395 -2132 21611 -3237 -27902 4387 31857 2455 -20372 2782 10851 -11262
801a1262J0428K9543k3181l9691K6354M4687k3910m2539J8940L2188j5794j7090
$$ -11262 -834 28709 5528 -34163 -7809 36878 12968 -29571 -10631 21557 5763 -11327
813a1327J6395q95k4949J3012L6394j7079m5006J2678M2266j0256l1258J4687
$$ -11327 5068 4173 -20776 -7764 28630 11551 -33455 -20777 21489 11233 -20025 -5338
825e338J7463k8932j1089M4653J4063n3170k3161M6631K6403k8440j4937J1010
$$ -5338 12125 -16807 -27896 16757 30820 -22350 -45511 1120 27523 -917 -15854 -4844
837d844r990o995L5676J9036m5720l4733L7124L8619j8129k2079Q651m537j5915
$$ -4844 -14834 -21829 13847 32883 -12837 -47570 -10446 28173 10044 -12035 -3384 -7921 -23836
850b3836K6184L6775k8214n1243J6665M8506m982k7275R873N547k9252L723N1490
$$ -23836 2348 39123 10909 -40334 -23669 24837 19855 -7420 2453 8000 -21252 -17529 33961
863C3961L882n9267j6606M9526K1193k9671j1012J3332q475r031K5737J3367l3537
$$ 33961 37843 -21424 -38030 11496 32689 3018 -7994 5338 -3137 -12168 13569 26936 -6601
876f601j8819L1170J6470k7024p912K5546m307k9182J3106L3270j8774l6817J9479
$$ -6601 -25420 5750 22220 -4804 -12716 12830 8523 -20659 -7553 25717 6943 -29874 -10395
889a0395L5369j7901k9154J5392J6768j6470k619K2195q992l1413J4301L9190
$$ -10395 24974 7073 -22081 -6689 10079 -6391 -9010 13185 4193 -27220 -12919 26271
901B6271j2981m1205Q885L5501p211k3959J2521J3878k3225r836L2572J2070l3196
$$ 26271 13290 -27915 -19030 16471 9260 -14699 -2178 11700 -11525 -21361 11211 23281 -9915
914i915j2694K6280N650j8173Q246J5781k2316j8916L0726K3492l2134k5417K8144
$$ -9915 -22609 3671 9321 -8852 -606 15175 -7141 -26057 4669 28161 -3973 -29390 -1246
927a246K1990k2614j3023J9151J108k0953Q756K5083j4252k8094J6756K7591j8899
$$ -1246 20744 -1870 -14893 4258 5366 -15587 -6831 18252 4000 -24094 -7338 20253 1354
940A354k5337K0147K1020k0131j3132K1242L173k6541L322L2530k195l1749j428
$$ 1354 -23983 -3836 17184 -2947 -16079 5163 8336 -18205 -14883 17647 15452 -16297 -17725
953a7725K1133n66o545J2575k393k8825J083M1209Q481m2647j7841L2645J8505
$$ -17725 3408 2842 -3703 8872 6479 -22346 -21263 19946 28427 -14220 -32061 584 19089
966A9089j7342n287Q996j4956j4172K8360K7716k5599l3734J2685K3582m299l161
$$ 19089 1747 -3540 5456 -9500 -23672 4688 32404 6805 -26929 -14244 9338 5039 1878
979A878R763j3339k4604J7105L7946r044m0794k730L1009Q815j3288k801k301
$$ 1878 11641 -1698 -26302 -9197 28749 19705 -21089 -23819 7190 16005 2717 -84 -2385
992b385j3325O686K9308j40l4569p846K8371P605j8635J448J3194j3523j3711
$$ -2385 -15710 -9024 20284 20144 -14425 -22271 6100 13705 -4930 -3482 9712 -3811 -17522
1005a7522K3010J8070k6378k3487K2221K4748j2221j6965L642J196m693J3900
$$ -17522 5488 23558 -2820 -26307 -4086 20662 8441 -8524 -4882 -3686 -8379 5521
1017E521J5261j9881k6883J5483L1332p442k6492K078J5238l206k916J1076m918
$$ 5521 20782 901 -25982 -10499 20833 13391 -13101 -11023 4215 1009 -1907 9169 4251
1030D251k1810L884K7156K765k1659n469Q681k250P48J6641K32k7753q839K9436
$$ 4251 -17559 -13675 13481 16246 -5413 -10882 -2201 -4451 -3703 12938 13170 -14583 -23422 6014
1044F014J6963k2978j8861J3583J3539o337k353M816r294r973J6159J6929j5103
$$ 6014 22977 -1 -18862 -5279 8260 1923 -430 4386 -4908 -14881 1278 18207 3104
1057C104j9148J0775J4565q789o950J0874J346j4404J699J7107k068j8763J14
$$ 3104 -16044 -5269 9296 507 -6443 4431 5777 -8627 -6928 10179 8111 -10652 -10538
1070a0538J7375L671j0931m303J186j951N959J3313n670k2877o73K5538P441k0477
$$ -10538 6837 10508 -423 -4726 -3540 -5491 468 13781 8111 -14766 -15439 10099 17540 -2937
1084b937r775J1769N516l987L958J961j3235o628J6093J2832j0169j2935J822
$$ -2937 -12712 -943 4573 586 4544 6505 -6730 -13358 2735 15567 5398 -7537 -5715
1097e715M371R64O754M975j2719j4818J0481K1400k969k0854m517J3107O994j870
$$ -5715 -1344 -380 6374 11349 -1370 -16188 -5707 15693 12724 -8130 -12647 460 7454 5584
1111E584k358o876p529Q436J5958l514j7519k231J2330L234n352P85J949o724
$$ 5584 3226 -3650 -11179 -2743 13215 9701 -7818 -10049 2281 5515 163 948 2897 -3827
1125c827k991J0739P560j0384j2271N214J3483K607p792p293k713M844J2123L840
$$ -3827 -6818 3921 11481 1097 -11174 -5960 7523 10130 2338 -4955 -7668 -2824 9299 13139
1139A3139j4252j2510R133J5454j190j1385l909L020L591M222J766o242p966J833
$$ 13139 -1113 -13623 -4490 10964 9774 -1611 -5520 -2500 1091 5313 7079 837 -7129 -5296
1153e296R566M641m757p111k918K255O684O433l426j2763m696J2441J1981o110
$$ -5296 4270 8911 4154 -2957 -5875 -3620 3064 9497 6071 -6692 -11388 1053 13034 6924
1167F924j4082k291R916Q095j586q142n734L132Q041K988m281n380j481L324M640
$$ 6924 -7158 -9449 467 8562 6976 -1166 -6900 -3768 4273 7261 2980 -2400 -3881 -557 4083
1182D083J261l052l834j547K437O218K572p113q679L112J1715M006q844r872J233
$$ 4083 5344 2292 -1542 -3089 -652 5566 8138 1025 -7654 -4542 7173 11179 2335 -7537 -6304
1197f304R699O411l919r306m261N572R352J156r491p013N201P568j117l639R9
$$ -6304 3395 9806 5887 -3419 -7680 -2108 7244 8400 -1091 -8104 -2903 4665 3548 -91 8
1212Hk436m048N085R529k991j2401k735R076O414j710n179n370j417P576R602
$$ 8 -2428 -6476 -1391 8138 5147 -7254 -9989 -913 5501 3791 -1388 -6758 -8175 -599 9003
1227I003m251j4873k253J4898P783j0101q285M708L893j778L272L758p709p027
$$ 9003 4752 -10121 -12374 2524 10307 206 -8079 -3371 522 -1256 2016 5774 -1935 -8962
1241h962Q172R301m826o260K476M83k972O164Q288q624j4133O515J8094q64j6258
$$ -8962 -790 8511 3685 -2575 -99 384 -2588 3576 11864 3240 -10893 -4378 13716 12852 -3406
1256c406l386J0035L383k578J820k074r390K389J4912k83j6360j624J3401n9j0077
$$ -3406 -6792 3243 6626 4048 5868 3794 -5596 -3207 11705 11422 -4938 -6562 6839 6780 -3297
1271c297M360P630j0161q996J3201J1240j3134j3031R091J0428n195m318L651
$$ -3297 1063 8693 -1468 -10464 2737 13977 843 -12188 -3097 7331 2136 -2182 1469
1284A469m252p013J0799J3074j3368j8931J1497K0691p501j6715N353Q859p344
$$ 1469 -2783 -9796 1003 14077 709 -18222 -6725 13966 6465 -10250 -4897 3962 -3382
1297c382j004J3521k527j8938J506J9931Q63j4847N93P923p105m050J6446N645
$$ -3382 -4386 9135 6608 -12330 -10824 9107 9970 -4877 -4284 3639 -3466 -7516 8930 14575
1311A4575k3280j1251K4283J5670j9334j5121J1952P259p767M230R016j4426j4793
$$ 14575 -8705 -19956 4327 19997 663 -14458 -2506 4753 -3014 1216 10232 -4194 -18987
1324a8987J7821J8676j6134j7456J3167J0644j3675k884J7230k668k2323M210
$$ -18987 -1166 17510 1376 -16080 -2913 7731 -5944 -8828 8402 5734 -16589 -12379
1336a2379K5873k641k5135L11J9110r13r538Q105K239j8942l67K8752L881l1376
$$ -12379 13494 10853 -14282 -13971 5139 4226 -5312 2793 5032 -13910 -14277 14475 18356 -13020
1350a3020o779K8290O268k1237k1J5776q970j3077J8349J5410k2366j8321K0323
$$ -13020 -19799 8491 14759 -6478 -6499 9277 307 -12770 5579 20989 -1377 -19698 625
1363F25J7179j5050q290J3841l235j9518J0906K7958j1828l2746Q503L0448o247
$$ 625 17804 2754 -5536 8305 5070 -14448 -3542 24416 12588 -20158 -11655 18793 12546
1376A2546k3007P097J2576j2647m045K0307j105k7405J200K8417j825k4911N321
$$ 12546 -10461 -3364 9212 -3435 -7480 12827 11722 -15683 -14483 13934 12109 -12802 -7481
1389g481J9866j2764j8225J8927J7728k2838j7351K4572J5199k5151j2480K3280
$$ -7481 12385 -379 -18604 323 18051 -4787 -22138 2434 17633 -7518 -19998 3282
1401C282O899k0035K602J9130j3621k1851K1386K5746k3267k6330K2366K2752
$$ 3282 10181 -9854 -7252 11878 -1743 -23594 -2208 23538 271 -26059 -3693 19059
1413A9059k0293j5331J9526O119k0623L176K5662p918k9881P577K8250o712j9372
$$ 19059 -1234 -16565 2961 9080 -11543 -8367 17295 9377 -20504 -12927 15323 8611 -10761
1426a0761J1928J0501k2798p458L2439R179l5836j0408L3491P726k8651k080K2634
$$ -10761 1167 11668 -11130 -18588 13851 23030 -12806 -23214 10277 18003 -10648 -12728 9906
1439I906o933j7955J7601J7005k6466j9712K8645K0350k6260j5516K4595P321
$$ 9906 2973 -14982 2619 19624 -6842 -26554 2091 22441 -3819 -19335 5260 12581
1451A2581k6286p16K8598m006k8981Q533K8912j1700k7339J2028K1023j2227q637
$$ 12581 -13705 -14421 14177 10171 -18810 -10277 18635 6935 -20404 -8376 12647 420 -8217
1464h217J8515k322k9595N894L8205k883l7691J346L1002m466k3228J1609J7280
$$ -8217 10298 7976 -21619 -15725 22480 19597 -18094 -16748 14254 9788 -13440 -1831 15449
1477A5449k0102j4058K8362J4820l2136j6860K8348J3040k1503m72K0277j4246
$$ 15449 -4653 -18711 9651 24471 -7665 -24525 3823 16863 -4640 -5112 15165 919
1489I19k7238K0666L4031j8727l2778J4896K3951j5330j3760J8092M524k2017
$$ 919 -26319 -5653 28378 9651 -23127 -8231 15720 390 -13370 4722 9246 -12771
1501a2771L193K6642q097l0575Q866K9357r859k3396J5313J8198k3424j6942K8205
$$ -12771 -9578 17064 8967 -21608 -12742 16615 6756 -16640 -1327 16871 -6553 -23495 4710
1514D710J6089k8531j1584K8763N986k9414j965K6615k566k0198J2304J6473k3025
$$ 4710 20799 -7732 -19316 9447 15433 -13981 -15946 10669 8103 -12095 209 16682 -6343
1527f343j8981K8180K2367k5590j9718K1705J2040k0808l618K1990l645k3408
$$ -6343 -25324 2856 25223 -367 -20085 1620 13660 -7148 -10766 11224 7579 -15829
1539a5829J0164K5722j3807k6641J3484K1266j4061j0596K1319K763l2087l192
$$ -15829 -5665 20057 6250 -20391 -6907 14359 298 -10298 11021 13784 -18303 -21495
1551b1495L6402O526l1540m828K4074k375j9940R318J7158j4500j3377K0340J0442
$$ -21495 14907 21433 -10107 -14935 9139 6764 -13176 -3858 13300 -1200 -14577 5763 16205
1564A6205k6010j0351K7449Q793k5099k233K4207n709k6451J0039K7159j1668
$$ 16205 -9805 -20156 7293 16086 -9013 -11246 12961 7252 -19199 -9160 17999 6331
1576F331k3636J4632J9406j7591j6111J7293J0025j5925P93J9930r295k8422R367
$$ 6331 -17305 -2673 16733 -858 -16969 324 10349 -5576 -4783 15147 5852 -22570 -13203
1589a3203L2412m576k6926M266J7948j0692j2416J8040J0484k2475q720K4630
$$ -13203 19209 14633 -12293 -8027 9921 -771 -13187 4853 15337 -7138 -15858 8772
1601H772O817k4229m567J9716j389j4575J2574J5310k1766k1740K1496K4607j4744
$$ 8772 15589 -8640 -13207 6509 5120 -9455 3119 18429 -3337 -25077 -3581 21026 6282
1614F282j8122J1468P452j5012o80J9535k147k0669N598K0531r777k1118J2076
$$ 6282 -11840 -372 7080 -7932 -8612 10923 8776 -11893 -6295 14236 4459 -16659 -4583
1627d583J9460j3268j4426J7051J0115k2006r127K2974Q252j9997l475J7472j986
$$ -4583 14877 1609 -12817 4234 14349 -7657 -16784 6190 14442 -5555 -9030 8442 6456
1640F456j6947M923J3956p602q321J4656O035k2916r813K4639J3146j9251r150
$$ 6456 -10491 -5568 8388 786 -7535 7121 13156 -9760 -19573 5066 18212 -1039 -10189
1653a0189J4789J94j5831O583J8576r223j8582J0922J6495j2595j3566J2744Q407
$$ -10189 4600 4794 -11037 -4454 14122 4899 -13683 -2761 13734 1139 -12427 317 8724
1666H724j3644j283J8385k169k4353o42K4381M267j7577j816J1038n031r374R961
$$ 8724 -4920 -6203 12182 10013 -14340 -14982 9399 13666 -3911 -5727 5311 280 -9094 867
1680H67Q814j1718n279J4463J371j8735p37J9847O91j6451L051J3492q998j4172
$$ 867 9681 -2037 -7316 7147 8518 -10217 -10954 8893 9584 -6867 -3816 9676 678 -13494
1694a3494J2044J5354j1552j3733J0698J0530j0396p283R200J854r160O022J3866
$$ -13494 -1450 13904 2352 -11381 -683 9847 -549 -7832 1368 3222 -5938 84 13950
1707A3950j0372k1408P076K2841p18j5115O00M978p867r16J5343K355j7017l951
$$ 13950 3578 -17830 -10754 12087 11369 -3746 -3146 1832 -6035 -6951 8392 10747 -6270 -10221
1721a0221J4390K623j0568J057P120o821n904J3879R301j7365j5289J3849J6802
$$ -10221 4169 6792 -3776 -2719 4401 -2420 -8324 5555 14856 -2509 -17798 -3949 12853
1734A2853o808j0386M277J364q033L545J2085m052j2278N063J0516p497r545Q644
$$ 12853 6045 -4341 -64 1300 -6733 -3188 8897 4845 -7433 -2370 8146 649 -8896 -252
1748b52Q266q534m786R979J606j2932j960J3987L690j1255l089P640j64n423L884
$$ -252 8014 -520 -5306 4673 6279 -6653 -8613 5374 9064 -2191 -5280 2360 2196 -3227 657
1763F57L817p840k576J2716L891j5927p483J3658Q646p647l756M491l715o822
$$ 657 4474 -3366 -5942 6774 10665 -5262 -12745 913 9559 1912 -1844 2647 -1068 -7890
1777g890P129J0331n282r956K764O145l287j942N601o49q822J872J2372j069j4446
$$ -7890 -761 9570 4288 -5668 -2904 3241 -46 -1988 3613 2964 -5858 -3986 8386 7317 -7129
1792g129j775J2561L509p504j017L323l970k576O796K831o799j103O835j292q546
$$ -7129 -8904 3657 7166 -338 -1355 1968 -2002 -4578 2218 5049 -1750 -2853 3982 2690 -5856
1807e856J810R083q75p499J623N849m191o223N466P643m510p151K714M458k209
$$ -5856 -4046 5037 4162 -3337 -1714 4135 -56 -6279 -813 6830 2320 -4831 -2117 2341 132
1822A32p28K792l178m637O280Q005o576j1086L084J0150R57m774j037p17l071
$$ 132 -596 2196 -982 -5619 661 8666 2090 -8996 -5912 4238 5195 421 -616 -1333 -4404
1837d404J825O656Q52o453k822L413J466q57K138O16n986k358Q549N374q485q056
$$ -4404 -2579 4077 4929 -1524 -4346 -933 533 -324 1814 2430 -3556 -5914 2635 8009 -476 -8532
1853h532N612P890j457m189m44m55q47L119K853l160l346K637K909k542k535K388
$$ -8532 -2920 4970 3513 -676 -1120 -1575 -2422 697 3550 390 -2956 -319 2590 48 -2487 -99
1869i9K169k075j067L023J51m785j091N437K915l434l231o7J029K571K704k918
$$ -99 2070 -5 -1072 1951 2102 -2683 -3774 1663 4578 1144 -2087 -2154 -1125 1446 4150 1232
1885A232o011J260P502J631o601m128L299M248L46j837j149j358r48K031L344
$$ 1232 -4779 -3519 3983 5614 -987 -5115 -1816 2432 2778 941 -208 -1566 -2514 -483 2861
1900B861R0l316k225N89K037K411N15l798l667L038N781n84n868k365L554M080
$$ 2861 2951 -365 -2590 -2001 36 2447 2962 -836 -4503 -1465 4316 3732 -2136 -4501 -947 3133
1916C133J1l436k828J081L332J095j776j874J90J307Q15p31q18L54P7n06R04J602
$$ 3133 3144 -292 -3120 -2039 1293 2388 612 -1262 -1072 235 1050 319 -499 -145 -68 -574 330 1932
1934A932j322l339m8M165K696k605m945p56M754L835k293m678j049K844L238L38
$$ 1932 610 -2729 -2777 1388 4084 1479 -3466 -4222 532 4367 2074 -2604 -3653 -809 2429 2767
1950B767l223l414J480M180P91l006j167N79l66L48K567R32l248l138J564M160
$$ 2767 -456 -3870 -2390 1790 2581 -425 -1592 -1013 -1379 -1031 1536 2468 -780 -3918 -2354 1806
1966A806J286k835l083j53K791L196k98m710l073M367N544k494n897O50M263J54
$$ 1806 3092 257 -2826 -2979 -188 3008 2710 -2000 -5073 -706 4838 2344 -3553 -2903 1360 1514
1982A514j999P73M23k083k2K779L03k143n00R92j46J37J867m46l822p91N169K807
$$ 1514 -485 288 711 -1372 -1394 1385 1688 -455 -955 37 -109 28 1895 1449 -2373 -3164 2005 4812
2000D812m939m439L379M463j367k725K2k35R9L144P58m986j944N295K721m581
$$ 4812 -127 -4566 -1187 3276 1909 -816 -794 -1029 -930 2214 2972 -2014 -3958 1337 4058 -523
2016e23k503L786J221l632rM304m21n113r4N240J012m095j330J904L9O53K741
$$ -523 -3026 760 1981 -1651 -1660 2644 2223 -2890 -2984 2256 3268 -827 -2157 -253 -214 439 3180
2033C180j954o214J220Q700O98q398k486N819K352k615k13O52k763m77M643J689
$$ 3180 1226 -4988 -3768 4932 5630 -2768 -5254 565 2917 302 89 741 -2022 -2499 2144 3833
2049C833m796k510L265J608j990J380K205m383m919N805P917m361r083J542P172
$$ 3833 -963 -3473 -208 1400 -590 790 2995 -1388 -6307 -502 7415 3054 -6029 -4487 2685
2064B685J91k808K55j591k830M037O079m046q042K379P446q93m800J412K238l959
$$ 2685 2876 68 323 -1268 -4098 -61 6018 1972 -6070 -3691 3755 2862 -1938 -526 1712 -2247
2080b247j675O539L284p110m837N059M673k213j704M45k946q94P168L338q976
$$ -2247 -3922 2617 5901 -1209 -6046 -987 3686 1473 -231 214 -2732 -3626 3542 6880 -2096
2095b096o009P721O823m875m621L042P62l703K201N515k480o570J477N529j195
$$ -2096 -8105 -384 6439 1564 -3057 -15 747 -2956 -755 4760 2280 -4290 -2813 2716 1521
2110A521l101K653Q23n513j2Q429Q79r908k316Q797K908o287j205L915j915k837
$$ 1521 -1580 1073 1896 -3617 -3629 4800 5679 -4229 -6545 2252 5160 -1127 -2332 1583 -332 -3169
2126c169M329K743n228k183N500P26o119P54O980j349p629J495P566j551o881
$$ -3169 1160 3903 -1325 -3508 1992 2718 -3401 -2647 4333 2984 -4645 -3150 4416 2865 -4016
2141d016J715N672k313l933L524K174n016p84N879n37n859K486O040m764o806
$$ -4016 -2301 3371 1058 -2875 649 2823 -2193 -2977 2902 2365 -3494 -1008 5032 268 -6538
2156f538N655P733m975p270L761N373l275k817L498M58m232J585N570k923o805
$$ -6538 -883 6850 1875 -5395 -1634 3739 464 -2353 1145 1603 -2629 -1044 4526 1603 -5202
2171e202L106O902l216n144M457L404p277k825R029L917q644m220O078K667l358
$$ -5202 -2096 4806 1590 -3554 903 4307 -2970 -5795 3234 7151 -1493 -5713 365 3032 -326
2186c26O81J763m634k001P739L941q811o004P039O102m275k999L464j534n722
$$ -326 355 2118 -2516 -4517 3222 7163 -1648 -7652 -613 5489 1214 -1785 1679 145 -5577
2201e577L791Q798k890r223R35O088j069j504M074j926q496K345J2038kj2605
$$ -5577 -1786 7012 4122 -5101 -4166 1922 853 -651 3423 1497 -6999 -4654 7384 7382 -5223
2216e223k994R238L532m101l02J304m908k216P767M934p003n344M412K633l719
$$ -5223 -8217 1021 4553 452 150 1454 -3454 -5670 2097 7031 28 -5316 -904 1729 -1990
2231a990J846N333n109q097N995J0386m756j0184K241P230j003k241K432j706
$$ -1990 -144 5189 80 -8017 -2022 8364 3608 -6576 -4335 2895 1892 -349 2083 377
2245C77n745K824Q256j962q282J419O864k628n324M486M895o572m861P958N365
$$ 377 -5368 -2544 5712 3750 -4532 -3113 3751 1123 -4201 285 5180 -1392 -6253 1705 7070
2260G070q007n719O243M264l624j22K505m796l855P474O062p365o571O109M971
$$ 7070 -937 -6656 -413 3851 227 105 2610 -2186 -6041 1433 7495 130 -6441 -332 4639
2275D639n428k633O032N00p072N37Q190o35q026K86N909j326l061M868J589q694
$$ 4639 -789 -3422 2610 3110 -3962 -3425 4765 4130 -3896 -3610 2299 973 -2088 2780 4369 -4325
2291d325k688J0150L991q505l098O234J17n568K731O244l958o326L810N168l904
$$ -4325 -7013 3137 7128 -1377 -4475 1759 1876 -3692 -961 5283 1325 -5001 -1191 3977 73
2306G3k785M978L38p352Q57J0234N7j1635j916R644K520o026K45L560m450l792
$$ 73 -2712 2266 2604 -4748 -3891 6343 6400 -5235 -7151 2493 5013 -1013 -768 2792 -1658 -5450
2322e450O446M834n432l775L583J78l407M069N378o494q467O463J0503m388j0157
$$ -5450 996 5830 398 -3377 206 384 -3023 1046 6424 -70 -8537 -2074 8429 4041 -6116
2337f116J972O940j388k828L972N7p387j52Q957Q93p730j49N575k484m325N578
$$ -6116 -4144 2796 1408 -1420 2552 2609 -4778 -4930 4027 4920 -2810 -2959 2616 132 -4193 1385
2353A385M121p713m731Q568N705p824n998N383M373k909n13K401l704m227N919
$$ 1385 5506 -2207 -6938 1630 7335 -489 -6487 -1104 3269 360 -153 2248 -1456 -5683 236
2368B36O779n752p752M540O422l725l514M383J91o549J923Q978j270r629m70O870
$$ 236 7015 1263 -6489 -1949 4473 748 -2766 1617 1808 -4741 -2818 6160 4890 -4739 -5209 1661
2384A661N49k425K892L0p813j381J0679M636r765o462O771N361m242j977L698
$$ 1661 2210 -215 2677 2707 -5106 -6487 4192 8828 -937 -7399 -628 4733 491 -1486 2212
2399B212j706m857L720O306l375o022K412K926k876R82N793k627r338J528J0297
$$ 2212 506 -4351 -631 5675 2300 -3722 -1310 1616 -1260 -278 5515 2888 -6450 -4922 5375
2414E375N36q498q34N956q83m644K964M525l996m420M181L266m109j344M854j022
$$ 5375 5911 -2587 -3421 2535 1652 -2992 -28 4497 501 -3919 262 3528 -581 -1925 2929 1907
2430A907o506K550Q085k206q450J299O564j495l844L187K273n106k217N539K164
$$ 1907 -4599 -2049 6036 3830 -4620 -3321 3243 1748 -2096 1091 3364 -1742 -3959 1580 3744
2445C744m604r87M003j410m331L325N573m478o615M447P055l739o126K894L915
$$ 3744 -860 -1847 2156 746 -3585 -260 5313 835 -5780 -1333 5722 1983 -4143 -1249 2666
2460B666k961j245L995p87m982J812N340k488n235L185M905l505m301L840L248
$$ 2666 -295 -1540 2455 1668 -3314 -1502 3838 1350 -3885 -700 4205 700 -3601 239 3487
2475C487m659k604N928K954o166l635M681K920k294j81J177l637j859O371L801
$$ 3487 -1172 -3776 2152 5106 -1060 -4695 -14 2906 612 431 1608 -2029 -3888 2483 6284
2490F284o927n272N614M852l457k557K731n55m135K328O289j292o667q30M256
$$ 6284 -643 -5915 -301 4551 1094 -1463 1268 713 -3422 -1094 5195 3903 -2764 -3594 662
2505F62R62p13K006q64o088l60Q470K745p961l961N406L126l172k91K303k510
$$ 662 1624 911 2917 2053 -4035 -4395 4075 6820 -1141 -5102 304 3430 258 -33 2270 -240
2521b40l034L481M011k613l311J527P61k173J558M349k001o432O78O715M62n544
$$ -240 -3274 207 4218 1605 -1706 -179 582 -1591 -33 4316 2315 -4117 -3439 3276 3738 -1806
2537a806m73M170p40l042J886K255k845j493L330N72l404M73L776j594m363K012
$$ -1806 -2279 1891 1151 -1891 -5 2250 -595 -2088 1242 1814 -1590 -1117 2659 1065 -3298 -1286
2553a286M915j580m447J129L545j360k687K045K330j996j686J734K68k089J595
$$ -1286 3629 2049 -2398 -1269 2276 916 -1771 274 2604 608 -1078 656 924 -1165 430
2568D30L261k447m373K564M565k275m102K397L190k225k454K231J745k126j160
$$ 430 3691 1244 -3129 -565 4000 1725 -2377 20 3210 985 -1469 762 2507 381 -779
2583g79J694M82j158P97Q51k344j849L336L079l037l696K160K687k043j563K731
$$ -779 915 1397 239 1036 1887 -457 -2306 1030 4109 1072 -2624 -464 2223 180 -1383 1348
2599A348R89l033j124K198O27q91O03P5k334k15L547R79l798k092L149K552j969
$$ 1348 2337 -696 -1820 378 1005 114 717 792 -1542 -1757 1790 2769 -1029 -3121 28 2580 611
2616F11j996J380O92j764r1K667M53k399p74O89O3Q85J893j058l468M3L796R83
$$ 611 -1385 -5 687 -1077 -1168 1499 1952 -447 -1221 -532 -469 416 2309 1251 -2217 -2174 1622 2605
2634B605k939j397J683J207p83n33L91p7n98J51P90N7k91J66o85j256J028K549
$$ 2605 -334 -1731 -48 1159 376 -157 234 157 -441 -290 500 557 266 432 -253 -1509 -481 2068
2652B068m35l124l81K662O33j942n08J461O75r53q79Q2J126P70o24j177j9J075
$$ 2068 1633 -1491 -1872 790 1423 -519 -1027 434 1109 156 -723 -641 485 1255 631 -546 -565 510
2670E10R44n05j450k51J678R56j321q09Q57M94q89k05J255P91r92j597j71J705
$$ 510 1454 949 -501 -752 926 1882 561 -248 609 1103 214 9 1264 2055 1063 -534 -705 1000
2688A000J411p51j721o29R20J494K77j771j574J458K152r68k252M63J552o11j026
$$ 1000 2411 1660 -61 -690 230 1724 2001 230 -1344 114 2266 1298 -954 -491 1061 450 -576
2705e76Q34Q75j112j213M91J126K63o56o07n28K13J526N34k316j708K441K897
$$ -576 258 1133 21 -1192 -701 425 688 32 -575 -1103 -890 636 1170 -1146 -2854 -413 2484
2722B484k048l389J141K769m99j270P03o6j421O78K115n96j916O55J170j032o18
$$ 2484 436 -2953 -1812 957 458 -812 -109 -175 -1596 -918 1197 601 -1315 -660 510 -522 -1140
2739a140K203P36l398j529L895K968l273l493J873K622p08n94Q69j561j744K490
$$ -1140 1063 1799 -1599 -3128 767 3735 462 -3031 -1158 1464 756 162 1031 -530 -2274 216
2755B16K570k538k340K376J376k747n44L526L29m330p77M325J359l428j329K021
$$ 216 2786 248 -2092 284 1660 -1087 -1631 1895 2224 -2106 -2883 1442 2801 -627 -1956 65
2771F5J48r45J680R50l432j457M328J732m335j414M490L85m564M50M835q02m576
$$ 65 213 -732 948 1898 -1534 -2991 1337 3069 -1266 -2680 1810 2195 -2369 -1919 2916 2114 -2462
2788b462P68L842q20k525J368R48k295M7M004l24n234r6N544M18n068P5M389j377
$$ -2462 -1694 2148 1328 -1197 171 1119 -1176 -1129 2875 2551 -2683 -2779 2765 3183 -1885 -1810 2579 1202
2806A202m006K606L960l160l822L071K582k755o72K933j658m126L125N639l067
$$ 1202 -2804 -198 3762 602 -3220 -149 2433 -322 -994 1939 281 -3845 -720 4919 1852
2821A852o744K012O120j205m366J691K397l364j670N049J776n531j668M645M51
$$ 1852 -4892 -2880 3240 2035 -2331 -640 1757 -1607 -3277 1772 3548 -1983 -3651 994 1445
2836A445l509J976L247m666m120O140N528n585n998L902M531k503j714K821r80
$$ 1445 -2064 -88 3159 -1507 -5627 513 6041 456 -5542 -1640 2891 388 -1326 1495 515
2851E15m285K042N639j695n580J540M208k647k625M887K024o939k438P716L036
$$ 515 -3770 -1728 3911 2216 -3364 -1824 2384 -263 -2888 1999 4023 -2916 -5354 2362 5398
2866E398o874k807M932J104l364J775K923m280l668N326M341n119l882M740K421
$$ 5398 -1476 -4283 649 1753 -1611 164 3087 -1193 -4861 465 4806 -313 -4195 545 2966
2881B966n057j015O022J99o932J44O959j12o107O90M125j994k067M389P76o681
$$ 2966 -2091 -3106 2916 3115 -3817 -3673 3286 3174 -2933 -2243 1882 -112 -2179 2210 2986 -3695
2897c695p18P859J257p408j049O252k69n238K002N075l152n416L676N295l376
$$ -3695 -4413 3446 4703 -2705 -3754 2498 2229 -3009 -1007 4068 916 -4500 -824 4471 1095
2912A095m050L048J699l742J124N723k793q041K575R008j552p427J356M742k891
$$ 1095 -2955 93 1792 -1950 -826 4897 2104 -5937 -3362 5646 4094 -3333 -1977 2765 -126
2927a26k762N094K422o482k754O084K610m661r73L490j966l786M781N465n709
$$ -126 -2888 2206 4628 -1854 -4608 1476 4086 -575 -1548 1942 -24 -3810 971 6436 727
2942G27p392M570P184k840m508K673R80m623J150O777j309p429Q60O080j219m245
$$ 727 -6665 -2095 5089 2249 -2259 414 1394 -3229 -2079 4698 3389 -4040 -3180 2900 1681 -2564
2958b564L019K909n376k967O966M118o971n005N242M057l302j109K983k354m420
$$ -2564 455 3364 -2012 -4979 1987 6105 -866 -5871 -629 3428 126 -983 2000 -354 -4774
2973d774M259N837m380n750M232M195m741k540O049J333o867r50P323J075o677
$$ -4774 -515 5322 942 -4808 -576 3619 -1122 -3662 2387 3720 -3147 -4097 3226 4301 -2376
2988b376j333N025P53k868J615J385m487j650O440K604o748k472O263J336n995
$$ -2376 -3709 1316 2069 -799 816 2201 -2286 -3936 2504 5108 -1640 -4112 2151 3487 -2508
3003b508K72O163j760o383K841O613l049o183K241M404j800j366L086j041n715
$$ -2508 -2236 3927 2167 -4216 -1375 5238 2189 -3994 -1753 2651 851 -515 2571 1530 -4185
3018d185J265P475J88p175p78N206l79l566K746L004m916l398N924M001n594l617
$$ -4185 -2920 4555 4743 -2432 -3210 1996 1617 -1949 797 3801 -1115 -4513 1411 5412 -182 -3799
3034c799M263J390l431K032M544m074p243L578Q353j211o603m5L193j192o32L713
$$ -3799 464 1854 -1577 455 4999 925 -6318 -2740 5613 4402 -2201 -2246 947 -245 -877 2836
3050B836Q4n635n54O039Q26n175J4L675k247k962N193L978o717o108N739O597
$$ 2836 2920 -2715 -3269 2770 3596 -1579 -1565 2110 -137 -3099 2094 6072 -645 -6753 -1014 5583
3066E583l010m360J378P40k216J779M054k310m990K018M659k189l575K774K466
$$ 5583 2573 -1787 -409 331 -1885 -106 3948 1638 -3352 -1334 3325 1136 -2439 335 2801
3081B801m250j454O119J742p490k896O656L359m234j587K335j541k214L798L055
$$ 2801 -1449 -2903 3216 4958 -2532 -5428 1228 4587 353 -1234 1101 -440 -2654 1144 4199
3096D199m336l445M140L094l822k402L569J199l570M37M508j405n886R69N688
$$ 4199 -137 -3582 558 3652 -170 -2572 997 2196 -1374 -937 3571 2166 -3720 -2751 2937
3111B937l0l660R96J138l559l73N951J103o611j877N793J871m595j071L402m04
$$ 2937 2907 -753 243 1381 -2178 -2551 3400 4503 -2108 -3985 1808 3679 -916 -1987 1415 1011
3127A011k574K044K895l053l902K545L535j462j234K066j328m679K004O865p57
$$ 1011 -1563 481 3376 323 -3579 -1034 2501 1039 -195 1871 543 -4136 -2132 4733 3976
3142C976o946k89N215j0l501J310K313k582j677L524J626l733j765K896R06j918
$$ 3976 -2970 -3259 1956 1946 -1555 -245 2068 -514 -2191 1333 2959 -774 -2539 357 1263 -655
3158f55J397K476l421m584L458O061j806n316R03L049j429j198K816K86l714J96
$$ -655 742 3218 -203 -4787 -1329 4732 2926 -2390 -1487 1562 133 -1065 1751 2037 -1677 -1481
3174a481M086m37l924P36K947j341j846L114J621m410l098M415M088k528l373
$$ -1481 2605 2168 -1756 -1020 1927 586 -1260 1854 3475 -935 -4033 382 4470 1942 -1431
3189a431J165J090j419R05K502j882l380K527L523k709l638K446K745k239j195
$$ -1431 -266 824 -595 310 2812 930 -2450 77 3600 891 -2747 -301 2444 205 -990
3204i90K944J00m418n43M414J663k805j624P98k88j54K379O11l719j576M193K289
$$ -990 1954 2054 -2364 -2907 1507 3170 365 -1259 -461 -749 -903 1476 2087 -1632 -3208 985 3274
3221C274m079k627L186J824k149OK289j611l406J583L842l85k263J25L9j428R85
$$ 3274 -805 -3432 -246 1578 -571 -565 1724 113 -3293 -1710 2132 1747 -516 -391 -352 -1780 -795
3238g95L302n03m134l15M172Q85l605j006K633N93j404O75J066k106j434K447
$$ -795 2507 2004 -2130 -2445 1727 2612 -993 -1999 634 1227 -177 498 1564 -542 -1976 471
3254D71J557j810m25J583j104k546J764L460j358l465O98K889o79k314N68J704
$$ 471 2028 218 -207 1376 272 -2274 -510 2950 1592 -1873 -1175 1714 1035 -1279 -711 993
3270I93n59p65R90j20j803L25K153l07k116J001K076k011k463K038K826j391k189
$$ 993 434 -331 659 539 -1264 -939 1214 907 -1209 -208 1868 -143 -2606 -568 2258 867 -1322
3287a322R65J243j075l69J052qr50Q07Q61j416j300J568J805j422j479J634J179
$$ -1322 -357 886 -189 -558 494 486 -464 343 1204 -212 -1512 56 1861 439 -1040 594 1773
3304A773k226j650K316J938j476j441N76J34m19J039M71j641o42J915P51k168
$$ 1773 -453 -2103 213 2151 675 -766 -190 -56 -475 564 1035 -606 -1248 667 1418 -750
3320g50j089J596J101j015o39R86N8j603m03J686J041q46q16m47m17Q31J886m91
$$ -750 -1839 -243 858 -157 -796 190 248 -1355 -1758 -72 969 123 -693 -1140 -1557 -726 1160 669
3338F69k562N6K646L93k309n42J683N30o47m5M74m11o74M14P96J73j58o6o38n86
$$ 669 -1893 -1837 809 1202 -1107 -1649 34 564 -83 -128 346 -65 -739 -325 471 644 486 420 -218 -804
3358h04R20J591n34j969K13J925Q3j810l36J210N69k26m38p04k13R05N93p61o92
$$ -804 116 1707 1173 -796 -583 1342 1425 -385 -721 489 1058 832 394 -310 -523 382 975 214 -478
3377d78N62M84o92p26P58P90n43j115L37J170l02j301k15R85P35l3q91j027J12
$$ -478 84 568 -124 -850 -92 698 155 -960 -623 547 245 -1056 -1271 -286 449 416 -475 -1502 -1390
3396a390J615P29j276j076P71R76l64o63j9O81J40l61k32M30K45n25m04O79P76
$$ -1390 225 954 -322 -1398 -627 349 -15 -678 -697 -16 124 -237 -469 -39 206 -319 -723 -44 732
3415G32q5r21p97N34J418K80j426p37Q94J014l55r84l81O87R69j71j186k80N89
$$ 732 647 -274 -1071 -537 881 1161 -265 -1002 -108 906 551 -433 -814 -127 842 671 -515 -795 -206
3434b06N50k47j81n8j18q4j25J71O37J57j056p64R54J352l78j559n43J244J399
$$ -206 344 97 -84 -142 -260 -344 -469 -298 339 496 -560 -1324 -370 982 604 -955 -1498 -254 1145
3453A145k93j633o49J078J079j85o24l77R5M12K83l56J01M98l80r23N64J288k39
$$ 1145 852 -781 -1430 -352 727 542 -82 -459 -364 48 331 -25 76 574 194 -729 -165 1123 884
3472H84j356l67J119Q25l47j054m51O57R59r6q36n60N84P00k36j033J84J189r3
$$ 884 -472 -839 280 1105 758 -296 -747 -90 869 773 -63 -623 -39 661 425 -608 -424 765 672
3491F72j356p7J055L46q38l01K99J21J85j1n80j33Q07K54p90m31P22O61p55r12
$$ 672 -684 -761 294 640 -198 -499 -200 -79 106 95 -485 -618 189 443 -347 -778 -56 605 -150 -1062
3511a062O07J313k04j442l46J163P44k70o37p88J80J484M55j437j066J123J128
$$ -1062 -455 858 654 -788 -1134 29 773 503 -134 -922 -742 742 1197 -240 -1306 -183 945
3528I45n90o47K77J20n00J09Q79K70q17r66K8J185Q49l54j364j066R83K146L62
$$ 945 355 -292 -15 105 -395 -286 593 863 46 -920 -892 293 1142 788 -576 -1642 -659 1487 1849
3547A849k479j568J665J885l33j184n69k10M52J216L36j113q90K74L90O70N71
$$ 1849 -630 -2198 -533 1352 1019 -165 -734 -944 -492 724 1060 -53 -943 -669 -279 391 962
3564I62m16j619o20J642J989o64k560p77J916J784m24j417j054J79J475J417j053
$$ 962 546 -1073 -1693 -51 1938 1274 -1286 -2063 -147 1637 1213 -204 -1258 -1079 396 1813 760
3581G60j919J58J540L28o54Q4J01j024j05J539Q32j188j540J53J471J075m74j429
$$ 760 -1159 -1001 539 867 213 297 398 -626 -731 808 1640 452 -1088 -935 536 1611 1137 -292
3599b92j013Q25J845O04j891j657J183J812l37j070L0J00l77M47R58n07q33j36
$$ -292 -1305 -480 1365 1969 78 -1579 -396 1416 1079 9 39 139 -238 209 1167 660 -173 -309
3617c09L33J70N30N41j131j508O66K102L29j972j095J165J055n82n32L08j48l00
$$ -309 24 194 724 1265 134 -1374 -708 1394 1723 -249 -1344 -179 876 294 -238 70 -78 -378
3635c78L88K17l77KN94p59j107J081J838r28k232K07J835L33p64l95J19l45J24
$$ -378 10 227 -150 -148 446 -313 -1420 -339 1499 571 -1661 -1454 381 714 -50 -445 -326 -671 -547
3654e47P31K61o23l52K58j88qJ089O41j911j471J911K374j134k355Q6J441M57
$$ -547 184 445 -178 -530 -272 -460 -468 621 1262 -649 -2120 -209 2165 1031 -1324 -1238 203 660
3672F60J91j33j171p97J321J306o41j176J86N80l68k5J070J8j736n73K048J231
$$ 660 851 718 -453 -1250 71 1377 736 -440 -254 326 -42 -67 1003 1021 -715 -1288 760 1991
3690A991j620j600O22J099L37L59n98k067J32K669J081k383j789J474J431m53
$$ 1991 371 -1229 -607 492 829 1188 590 -1477 -1345 1324 2405 22 -1767 -293 1138 685
3706F85n43J16l96p01R62J445m31j796m80R16P94Q14K49j840k384J422L920J09
$$ 685 142 258 -138 -839 123 1568 1137 -659 -1139 -223 571 1385 1634 -206 -2590 -1168 2752 2861
3724B861l777j415K260J540o72m45k21r73l8J605P98j139j234J38M36L32J089
$$ 2861 -916 -2331 -71 1469 797 352 131 -842 -880 725 1523 384 -850 -712 -276 56 1145
3741A145L84k131j931J678K999n21k782l56J598K79m61N08l00j244M07J668l63
$$ 1145 1529 -602 -2533 -855 2144 1623 -1159 -1515 83 362 -99 409 109 -1135 -728 940 577
3758E77j583L82J240p76q98J151J115j298j526J043J547n58j031N32M69q54k5
$$ 577 -1006 -624 616 -160 -1058 93 1208 -90 -1616 -573 974 416 -615 -83 386 -468 -493
3775d93R79k52r40R33R83j616j241J767J653j613j529J206J235p83q19N24K75
$$ -493 486 234 -706 227 1210 -406 -1647 120 1773 160 -1369 -163 1072 289 -530 -6 269
3792B69l74L78N04q90p85J050R05j218q16J634P74k020j069K144J076j918p99
$$ 269 -105 273 777 -113 -898 152 1057 -161 -977 657 1431 -589 -1658 486 1562 -356 -1155
3809a155J647N13j372m80P16K05K47N98p76j790L96K545N02k324j240J565J129
$$ -1155 492 1005 -367 -847 -131 74 321 919 143 -1647 -1251 1294 1796 -528 -1768 -203 926
3826I26r35l50Q40n43j257J006K034o95k123j90J005M11Q63P45j971k618J456
$$ 926 -9 -359 481 -62 -1319 -313 1721 1026 -1097 -1287 -282 129 992 1737 -234 -2852 -1396
3843a396L650K23l080j375J521J166j9N5l40j376k30J912J236j570j486N91O90
$$ -1396 2254 2477 -603 -1978 -457 709 690 745 405 -971 -1201 711 1947 377 -1109 -518 172
3860A72l07J023J015k077k326J750L011n76k476l68J199L80nJ32p03j042R52J725
$$ 172 -135 888 1903 -174 -2500 -750 2261 1685 -791 -1159 40 420 415 547 -156 -1198 -246 1479
3878A479p63k114K23K027k20j517N47J210j126j364J435J378j295j324R83R55
$$ 1479 716 -1398 -1175 852 632 -885 -338 872 -254 -1618 -183 1195 -100 -1424 -441 514
3894E14o21k53J56q43p8J860Q92k429j915J919K321q91j833M95R52o61l30J131
$$ 514 -107 -360 -204 -1047 -1125 735 1627 -802 -2717 -798 1523 632 -1201 -706 246 -415 -745 386
3912C86K14j491j4J449k07r81N94N90j314l12K122N61k448r88K081J159j482p64
$$ 386 600 -891 -905 544 337 -644 -50 540 -774 -1086 1036 1597 -851 -1839 242 1401 -81 -845
3930h45J113L82j038o1O47j78k72J016J17j829p02K369J110k157j227J660Q09
$$ -845 268 650 -388 -449 198 20 -252 764 881 -948 -1650 719 1829 -328 -1555 105 914
3947I14j352Q5J205o77j489Q74J574l11j210k08J36j35J129J347j334k786N15
$$ 914 -438 -353 852 175 -1314 -440 1134 823 -387 -595 -459 -594 535 1882 548 -2238 -1723
3964a723L254P30k478j246J359O16m64O48J70j654l74K037O92j620p23J001j36
$$ -1723 1531 2261 -217 -1463 -104 512 48 696 866 -788 -1162 875 1567 -53 -776 225 89
3981H9o21J148J155j783k072J325K603n38k296k13J494L18n14l0n48q73J224J722
$$ 89 -532 616 1771 -12 -2084 -759 1844 1306 -990 -1203 291 609 95 65 -483 -1356 -132 1590
3999A590j075k436N55K166k85j368N74N84j295m76J852P05j703j126J162J085
$$ 1590 515 -1921 -1366 800 515 -853 -279 305 -990 -1466 386 1091 -612 -1738 -576 509
4015E09l02l11m18q46N5K230J130k472k257J709K586o82j635K54N01o15L54J278
$$ 509 207 -104 -522 -1368 -1313 917 2047 -425 -2682 -973 1613 931 -704 -450 51 -564 -210 1068
4033A068n80j424L72J246k87m40M24j73j021K09J873K85k269r51J961J153j252
$$ 1068 488 -936 -564 682 395 -45 379 206 -815 -606 1267 1552 -717 -1668 293 1446 194
4050A94j037P19M20k81K06K6j068r0J786L49j974p56J677O50j092l04Q76j78r62
$$ 194 -843 -124 296 15 221 247 -821 -911 875 1224 -750 -1506 171 821 -271 -575 301 123 -839
4069h39K88J329j71j340j63R40N19j20j88p28q41J158J977o82k536j59K190Q23
$$ -839 -551 778 607 -733 -896 44 563 443 255 -473 -1314 -156 1821 1139 -1397 -1556 634 1457
4087A457j335m96M28n7k8N81Q6q47k94P17L77l23j40O8n32k57R48J058j054j656
$$ 1457 122 -374 54 -3 -31 550 636 -211 -505 212 589 266 126 194 -338 -595 353 1411 357 -1299
4107a299N21J816M5j500m51N90N20L03k31j024m36J212J099q92j284J74Q94J12
$$ -1299 -778 1038 1083 -417 -868 -278 242 545 314 -710 -1146 66 1165 273 -1011 -837 57 169
4125A69k30N8J23o70l30Q29Q98o10j126n0Q76O51P3q15j145K44J848P00j549j423
$$ 169 -61 -3 120 -550 -880 -51 847 237 -889 -939 -63 588 661 -154 -1299 -1055 793 1493 -56 -1479
4145a479O11J462K52p37o29O8L74L11Nk51j84j28K36L38O6k33m60l18N24J017
$$ -1479 -868 594 846 109 -520 -452 -78 233 238 -13 -197 -325 -89 249 315 82 -378 -696 -172 845
4165H45nj395p95J112J323m01j277m70P42J228l6j145p13N38R97K28m89q11r6
$$ 845 840 -555 -1350 -238 1085 684 -593 -1063 -321 907 871 -274 -987 -449 548 776 287 -524 -620
4184f20N94M76j53r9j11m73j76Q75P73o72j300MJ345Q94o88j408l51J129J051
$$ -620 -26 450 297 198 87 -386 -562 313 1086 414 -886 -882 463 1357 669 -739 -1090 39 1090
4203A090q7j050r84M53J328M18j225p01P49M91l73MK42m59n38N41Q11j02r32l64
$$ 1090 1003 -47 -1031 -578 750 1168 -57 -758 -9 482 109 113 355 -104 -642 -101 710 608 -324 -688
4223f88K74P97N11l60j237n03J191J389o01j889k00J749O62j033p33K28J74K12
$$ -688 -414 383 894 534 -703 -1206 -15 1374 773 -1116 -1316 433 1095 62 -671 -443 -269 -57
4241e7O57k14r86k87R45J71l28J35mp42j77J179Q64j129j461O04J716Q5j391n70
$$ -57 600 386 -600 -887 58 229 -99 36 32 -710 -887 292 1156 27 -1434 -830 886 971 -420 -990
4261i90N44N32L70J65r94r04J085J447q75j396N50J076m38o26O57K93q44k38J089
$$ -990 -446 86 456 621 -373 -1277 -192 1255 380 -1016 -466 610 172 -454 203 496 -348 -586 503
4280E03L84q18p60M21N56J43K60m02j153m5J856R52k021j609J494J685o79j053
$$ 503 887 69 -691 -270 286 429 689 287 -866 -911 945 1897 -124 -1733 -239 1446 767 -286
4298b86J14k5p4P54O40j029j090O20J010j63n13K29j34r61M05J708k8k160q04
$$ -286 -172 -197 -271 483 1123 94 -996 -376 634 471 -42 187 53 -908 -503 1205 1177 -983 -1787
4317a787K028J277j249j127K58J88M64R26l81j905r9K038P06j584p89R59L26n80
$$ -1787 241 1518 269 -858 -600 -412 52 978 597 -1308 -1407 631 1337 -247 -1036 -77 249 -331
4335c31K83Q26q08j214N79J752j32j479l87O11L42M73P00j323j727J044K629k96
$$ -331 -48 778 -30 -1244 -665 1087 955 -524 -911 -300 42 515 1215 -108 -1835 -791 1838 1542
4353A542k515m99J737N01o25kN1q54k9J331L92j160p10N89M50l54M67N50j217
$$ 1542 -973 -1472 265 766 141 139 190 -664 -693 638 1030 -130 -840 -251 199 -155 312 862 -355
4372c55j268J547J914j201k168O44J775k67q86J69j1l66O91Q78r65j369R32J527
$$ -355 -1623 -76 1838 637 -1531 -887 888 621 -265 -96 -107 -473 218 1096 131 -1238 -306 1221
4390A221o32j411M94J059n81q41J037O78j301q19J395R36j204p55O68J90j54P98
$$ 1221 589 -822 -328 731 150 -691 346 1024 -277 -1096 299 1235 31 -724 -56 134 -20 778
4408G78J13j902o41K260J330j907j583J012J384m65o95L37o4p24N24J160n30j460
$$ 778 891 -1011 -1652 608 1938 31 -1552 -540 844 379 -316 21 -43 -767 -243 917 387 -1073
4426a073L94J218l91o73Q45J34j665K6K230L81k368q27J887J062j097p16J65L5
$$ -1073 -679 539 148 -525 320 454 -1211 -1185 1045 1426 -942 -1769 118 1180 83 -633 -468 -433
4444d33L27R94j05j761n58J956J115j485j151R12N52p40L02J273q81j854P21K211
$$ -433 -106 888 783 -978 -1536 420 1535 50 -1101 -189 363 -377 -75 1198 317 -1537 -816 1395
4462A395j68j678k78L71J35Q86R49j347k250P30K891M82k484j135J322Q97m80
$$ 1395 1227 -451 -729 -358 -223 663 1612 265 -1985 -1255 1636 2118 -366 -1501 -179 718 238
4479B38M9M00j085q05J461J220j134j260P00M24m92P30Q30j525j744J528K448
$$ 238 287 687 -398 -1203 258 1478 344 -916 -216 208 -284 446 1276 -249 -1993 -465 1983
4496A983r58k216j6J681K82q94J9L8m77L65J131m09j787L00J921o9j601K34J030
$$ 1983 1025 -1191 -1207 474 756 -138 -119 -81 -558 -193 938 529 -1258 -958 963 894 -707 -473 557
4515E57q28q19J510R60j737j215J444J261q93q01L00m1l6J069N24j724j481J584
$$ 557 -271 -1090 420 1380 -357 -1572 -128 1133 240 -561 -261 -302 -338 731 1255 -469 -1950 -366
4533c66K251j008k064M05J355m13n47R35l1j354J07J659k51j401K57R28n82l44
$$ -366 1885 877 -1187 -782 573 160 -387 548 517 -837 -730 929 678 -723 -466 462 -120 -464
4551d64J142R4j780m07K192Q99j948j398J521J300r04p47L01l8k17J029M93j732
$$ -464 678 772 -1008 -1415 777 1676 -272 -1670 -149 1151 247 -500 -199 -237 -454 575 1068 -664
4569f64j157J928J496j450j123R05K69j008M81J676p61k059K34K071M23j336o65
$$ -664 -1821 107 1603 153 -970 -65 204 -804 -323 1353 592 -1467 -1233 838 1261 -75 -740
4586g40K95K2O75J305p81k447j72K887J084k105j194R95L35m33P77O31j383j064
$$ -740 -445 -423 252 1557 776 -1671 -1843 1044 2128 23 -1171 -176 159 -274 503 1134 -249 -1313
4604a313J400J131r46q38M22P5l61O60J008j149j866Q89K474k28k326k88J417
$$ -1313 87 1218 272 -566 -144 -69 -430 230 1238 89 -1777 -888 1586 1358 -968 -1256 161
$$ [...]
8191a75
##END NTUPLES=NMR FID
##END=
