##TITLE=1H_CG-1102
 CDCl3, 8 sc, 
 9.4.2019
##JCAMPDX= 6.0         $$ Bruker NMR JCAMP-DX V2.0
##DATA TYPE= NMR FID
##DATA CLASS= NTUPLES
##ORIGIN= UXNMR, Bruker Analytische Messtechnik GmbH
##OWNER= root
$$ XWIN-NMR		Version 3.5
$$ Tue Apr  9 13:58:18 2019 Russian Standard Time (UT+4h)  she@DPX200
##.OBSERVE FREQUENCY= 200.1315
##.OBSERVE NUCLEUS= ^1H
##.DELAY= (6, 6)
##.ACQUISITION MODE= SIMULTANEOUS
##.ACQUISITION SCHEME= undefined
##.AVERAGES= 8
##.DIGITISER RES= 18
##SPECTROMETER/DATA SYSTEM= spect
##.PULSE SEQUENCE= zg30
##.SOLVENT NAME= CDCl3
##.SHIFT REFERENCE= (INTERNAL, CDCl3, 0, 15.7039)
##AUDIT TRAIL= $$ (NUMBER, WHEN, WHO, WHERE, WHAT)
$$ ##TITLE= Audit trail, XWIN-NMR		Version 3.5
$$ ##JCAMPDX= 5.01
$$ ##ORIGIN= Bruker BioSpin GmbH
$$ ##OWNER= she
$$ F:/spectra/data/she/nmr/H-F/1/audita.txt
$$ ##AUDIT TRAIL=  $$ (NUMBER, WHEN, WHO, WHERE, WHAT)
(   1,<2019-04-09 13:57:13.95 +0400>,<she>,<DPX200>,
      <created by zg, POWCHK disabled, PULCHK disabled
       configuration hash MD5:
       00 E9 B6 7A A2 85 ED C7 34 08 36 98 17 FE 4E 26
       data hash MD5: 16K
       7F 3C 1B 93 E6 51 DC ED F9 3F FF A4 61 6B 93 CA>)
$$ ##END=
$$ 
$$ hash MD5
$$ 5D E4 3C C7 4E 21 64 D0 3F A2 5E CE A3 2D 77 66
##$RELAX= 
##$RELAX= 
##$RELAX= 
##$RELAX= 
##$RELAX= 
##$RELAX= 
$$ Bruker specific parameters
$$ --------------------------
##$DU= <F:/spectra>
##$EXPNO= 1
##$NAME= <H-F>
##$PROCNO= 1
##$TYPE= <nmr>
##$USER= <she>
##$AMP= (0..31)
100 100 100 100 100 100 100 100 100 100 100 100 100 100 100 100 100 100 
100 100 100 100 100 100 100 100 100 100 100 100 100 100 
##$AQSEQ= 0
##$AQ_mod= 1
##$AUNM= <au_zg>
##$AUTOPOS= <>
##$BF1= 200.13
##$BF2= 200.13
##$BF3= 200.13
##$BF4= 200.13
##$BF5= 200.13
##$BF6= 200.13
##$BF7= 200.13
##$BF8= 200.13
##$BYTORDA= 1
##$CFDGTYP= 0
##$CFRGTYP= 5
##$CHEMSTR= <none>
##$CNST= (0..31)
1 1 145 1 1 1 1 1 1 1 1 1 1 1 1 1 1 1 1 1 1 1 1 1 1 1 1 1 1 1 1 1 
##$CPDPRG= <>
##$CPDPRG1= <>
##$CPDPRG2= <>
##$CPDPRG3= <>
##$CPDPRG4= <mlev>
##$CPDPRG5= <mlev>
##$CPDPRG6= <mlev>
##$CPDPRG7= <mlev>
##$CPDPRG8= <mlev>
##$CPDPRGB= <>
##$CPDPRGT= <>
##$D= (0..31)
0 1.2 0 0 0 0 0 0 0 0 0 0.03 0 0 0 0 0 0 0 0 0 0 0 0 0 0 0 0 0 0 0 0 
##$DATE= 1554803833
##$DBL= (0..7)
120 120 120 120 120 120 120 120 
##$DBP= (0..7)
150 150 150 150 150 150 150 150 
##$DBP07= 0
##$DBPNAM0= <>
##$DBPNAM1= <>
##$DBPNAM2= <>
##$DBPNAM3= <>
##$DBPNAM4= <>
##$DBPNAM5= <>
##$DBPNAM6= <>
##$DBPNAM7= <>
##$DBPOAL= (0..7)
0.5 0.5 0.5 0.5 0.5 0.5 0.5 0.5 
##$DBPOFFS= (0..7)
0 0 0 0 0 0 0 0 
##$DE= 6
##$DECBNUC= <off>
##$DECIM= 24
##$DECNUC= <off>
##$DECSTAT= 4
##$DIGMOD= 1
##$DIGTYP= 9
##$DL= (0..7)
0 120 120 120 120 120 120 120 
##$DP= (0..7)
150 150 150 150 150 150 150 150 
##$DP07= 0
##$DPNAME0= <>
##$DPNAME1= <>
##$DPNAME2= <>
##$DPNAME3= <>
##$DPNAME4= <>
##$DPNAME5= <>
##$DPNAME6= <>
##$DPNAME7= <>
##$DPOAL= (0..7)
0.5 0.5 0.5 0.5 0.5 0.5 0.5 0.5 
##$DPOFFS= (0..7)
0 0 0 0 0 0 0 0 
##$DQDMODE= 0
##$DR= 18
##$DS= 0
##$DSLIST= <SSSSSSSSSSSSSSS>
##$DSPFIRM= 0
$$ [...]
##$SUBNAM2= <"">
##$SUBNAM3= <"">
##$SUBNAM4= <"">
##$SUBNAM5= <"">
##$SUBNAM6= <"">
##$SUBNAM7= <"">
##$SUBNAM8= <"">
##$SUBNAM9= <"">
##$SW= 24.9337058887773
##$SWIBOX= (0..15)
0 0 2 0 0 0 0 0 0 0 0 0 0 0 0 0 
##$SW_h= 4990.01996007984
##$TD= 16384
##$TD0= 1
##$TE= 0
##$TE2= 300
##$TE3= 300
##$TEG= 300
##$TL= (0..7)
0 120 120 120 120 120 120 120 
##$TP= (0..7)
150 150 150 150 150 150 150 150 
##$TP07= 0
##$TPNAME0= <>
##$TPNAME1= <>
##$TPNAME2= <>
##$TPNAME3= <>
##$TPNAME4= <>
##$TPNAME5= <>
##$TPNAME6= <>
##$TPNAME7= <>
##$TPOAL= (0..7)
0.5 0.5 0.5 0.5 0.5 0.5 0.5 0.5 
##$TPOFFS= (0..7)
0 0 0 0 0 0 0 0 
##$TUNHIN= 0
##$TUNHOUT= 0
##$TUNXOUT= 0
##$USERA1= <user>
##$USERA2= <user>
##$USERA3= <user>
##$USERA4= <user>
##$USERA5= <user>
##$V9= 5
##$VALIST= <valist>
##$VCLIST= <CCCCCCCCCCCCCCC>
##$VD= 0
##$VDLIST= <DDDDDDDDDDDDDDD>
##$VPLIST= <PPPPPPPPPPPPPPP>
##$VTLIST= <TTTTTTTTTTTTTTT>
##$WBST= 1024
##$WBSW= 4
##$XGAIN= (0..3)
0 0 0 0 
##$XL= 0
##$YL= 0
##$YMAX_a= 499383
##$YMIN_a= -797884
##$ZGOPTNS= <>
##$ZL1= 120
##$ZL2= 120
##$ZL3= 120
##$ZL4= 120
##$ABSF1= 10
##$ABSF2= 0
##$ABSG= 5
##$ABSL= 3
##$ALPHA= 0
##$AQORDER= 0
##$ASSFAC= 0
##$ASSFACI= 0
##$ASSFACX= 0
##$ASSWID= 0
##$AUNMP= <proc_1d>
##$AZFE= 0.1
##$AZFW= 0.1
##$BCFW= 1
##$BC_mod= 2
##$BYTORDP= 1
##$COROFFS= 0
##$CY= 11.3945322036743
##$DATMOD= 1
##$DC= 2
##$DFILT= <>
##$DTYPP= 0
##$F1P= 18.9103706918063
##$F2P= -1.10871071338519
##$FCOR= 0.5
##$FTSIZE= 0
##$FT_mod= 4
##$GAMMA= 1
##$GB= 0.15
##$INTBC= 1
##$INTSCL= 1
##$ISEN= 128
##$LB= 0.24
##$LEV0= 0
##$LPBIN= 0
##$MAXI= 10000
##$MC2= 0
##$MEAN= 0
##$ME_mod= 0
##$MI= 1.114404
##$NCOEF= 0
##$NC_proc= 0
##$NLEV= 6
##$NOISF1= 3.799351
##$NOISF2= 2.8
##$NSP= 1
##$NTH_PI= 0
##$NZP= 0
##$OFFSET= 15.70392
##$PC= 1
##$PHC0= -8853.662
##$PHC1= 15.20026
##$PH_mod= 1
##$PKNL= yes
##$PPARMOD= 0
##$PSCAL= 0
##$PSIGN= 0
##$REVERSE= no
##$SF= 200.130013532006
##$SI= 16384
##$SIGF1= 3
##$SIGF2= 2
##$SINO= 400
##$SIOLD= 16384
##$SREGLST= <1H.CDCl3>
##$SSB= 0
##$STSI= 0
##$STSR= 0
##$SW_p= 3612.71676300578
##$SYMM= 0
##$S_DEV= 0
##$TDeff= 0
##$TDoff= 0
##$TI= <>
##$TILT= no
##$TM1= 0
##$TM2= 0
##$TOPLEV= 0
##$USERP1= <user>
##$USERP2= <user>
##$USERP3= <user>
##$USERP4= <user>
##$USERP5= <user>
##$WDW= 1
##$XDIM= 8192
##$YMAX_p= 0
##$YMIN_p= 0
$$ End of Bruker specific parameters
$$ ---------------------------------
##NTUPLES= NMR FID
##VAR_NAME=  TIME,          FID/REAL,        FID/IMAG
##SYMBOL=    X,             R,               I
##VAR_TYPE=  INDEPENDENT,   DEPENDENT,       DEPENDENT
##VAR_FORM=  AFFN,          ASDF,            ASDF
##VAR_DIM=   8192,          8192,            8192
##UNITS=     SECONDS,       ARBITRARY UNITS, ARBITRARY UNITS
##FACTOR=    0.0002004,     1,               1
##FIRST=     0,             0,               0
##LAST=      1.6414764,     0,               0
##MIN=       0,             -797884,         0
##MAX=       1.6414764,     499383,          0
$$ Real data points
##PAGE= N=1
##DATA TABLE= (X++(R..R)), XYDATA
$$ [...]
3580a284O31J591Q49j875j870P72K392K57k040q95N84P60L7J56m83J47K12j174
3598a233o10J635J297q68j714j050J658J986R4k451j546J496K014m45k028k19
3614a984J391J117p17j516l36J986N93j680q26J223J448l60j532l05J052J170
3630G24j428j702J637K662o78l269r32K164L375j84l911k271K894L686p11l700
3646a644o45K567J251j021j531N55K081m59k869Q3L334J322k895k721N93L985
3662A986J714l546l151K193M258o17m123j404L691K847k044l857r89M111L286
3677D355k927m113J648L395r9k669j281K572K167k285l378J069N006Q77n227m021
3693d911M218N249o23n359k698L955L946j257m991J72M397P93l691k481K862L931
$$ plain form
3580 -1284 -653 938 1787 -88 -1958 -1186 1206 1463 -577 -1472 -888 -128 -91 65 -418 -271 -59 -1233
3598 -1233 -1843 -208 1089 221 -1493 -2543 -885 1101 1195 -1256 -2802 -1306 708 263 -1765 -1984
3614 -1984 -593 524 -193 -1709 -2045 -59 534 -1146 -1972 -749 699 339 -1193 -1498 -446 724
3630 724 -704 -2406 -769 1893 1215 -2054 -2986 -822 2553 2369 -1542 -3813 -919 2767 2056 -1644
3646 -1644 -2289 278 1529 508 -1023 -468 1613 1154 -1715 -1632 1702 3024 129 -2592 -1999 1986
3662 1986 3700 154 -2997 -804 3454 2837 -1286 -2690 1001 3848 1804 -2053 -3042 1069 4355
3677 4355 1428 -2685 -1037 2358 2259 -410 -1691 881 3048 763 -2615 -1546 3460 4337 -890 -4911
3693 -4911 -693 4556 3933 -1426 -4124 -169 3777 2520 -2471 -2299 2098 2891 -800 -3281 -419 3512
3709C512r71n086j401M639L347l131m934J400M954M95m158k757L283M368j591
3724A969n642j135O141K876l632n102Q36M936J582l347l289K321L814j321m555
3739c548N18M787J308l989l935K060N135R17n129l359M068M510j913m095p56L866
3755D45K008k731l419J931M049N96m621k439L522L912j416m249m64L103K130k175
3771A82k800J716L780p20m181j196L892K889j808m400n85M081L403l079l725R67
3787a584L076J267k560j598J614K234p09l479J66L478J174k192k484R45K767M05
3803B520j797k252J555K892j100k730m52L063J198j682k951J12L610J885k361
3818A510l187L48L080R24j848j644M16J608L1j771J80J735J012k558k173J793
$$ plain form
3709 3512 2541 -2545 -3946 693 4040 909 -4025 -2625 2329 2824 -1334 -4091 -808 3560 1969
3724 1969 -3673 -4808 1333 4209 577 -4525 -3689 1247 2829 -518 -3807 -1486 2328 1007 -3548
3739 -3548 -3030 1757 3065 -924 -4859 -2799 2336 3253 -1876 -5235 -1167 3343 1430 -2665 -3421 445
3755 445 2453 -278 -3697 -1766 2283 2879 -1742 -4181 -659 3253 1837 -2412 -2876 227 2357 182
3771 182 -2618 -902 2878 2158 -2023 -3219 673 3562 1754 -2646 -3231 850 4253 1174 -2551 -1584
3787 -1584 1492 2759 199 -1399 215 2449 1740 -1739 -1573 1905 3079 887 -1597 -652 2115 2520
3803 2520 723 -1529 26 2918 1818 -912 -1364 1699 2897 1215 -1736 -1624 1986 3871 1510
3818 1510 -1677 -1329 1751 2675 827 -817 -401 1207 1238 -533 -353 1382 2394 -164 -2337 -544
3834e44K939M46l261j938J222L522J10l395j623K234K425j134k545r37K943K109
3850B573k262l105R38L000R78k816j738J473K175m40k245p95K683J596l006k570
3866c561J911M107m6m941k700L176N090l08n231k077L489M095j794l584o81L040
3882a5J779k447k459K047L389r36m265m70M052K630l312l652N16N437J139m812
3898a379l428L781N096j274n433j832M801M147k198n779q2M910K678l395l604
3913b991J975L372o36l445p15M022K443l575m589K052O280L47n744l474L565N786
3929D673k65o351k510M535M748k468n571J021M592J284l562l396K314M639p22
3944B961m571j311M701K239l224l567J682M544P09n195l482M164O050j980o462
$$ plain form
3834 -544 2395 2841 -420 -2358 -1136 2386 2496 -899 -2522 -288 2137 1003 -1542 -2479 464 2573
3850 2573 311 -2794 -1856 1144 2122 -694 -2432 -959 1216 776 -1469 -2264 419 2015 -991 -3561
3866 -3561 -1650 2457 2411 -2530 -5230 -2054 3036 2728 -2503 -4580 -1091 3004 1210 -2374 -3055 -15
3882 -15 1764 -683 -3142 -1095 2294 1358 -2907 -3377 675 3305 -7 -3659 -3143 2294 3433 -1379
3898 -1379 -4807 -1026 4070 2796 -2637 -4469 332 4479 2281 -3498 -3580 1330 4008 613 -2991
3913 -2991 -1016 2356 1720 -1725 -2440 1582 4025 450 -4139 -2087 4193 4540 -1204 -4678 -1113 4673
3929 4673 4408 -1943 -4453 82 4830 2362 -3209 -2188 2404 3688 126 -3270 -956 3683 2961
3944 2961 -1610 -2921 1780 4019 795 -2772 -1090 3454 4163 -1032 -4514 -350 5700 3720 -2742
3959b742j930N701M327k778n503r04N186K986l828l879J889M278p51l766q72L246
3975F60K558k663m251J061N391Q80n100l201L407M576o29o031j548M464M549k985
3991A138n576q2N649K803m212m308J577M773N43l841k018L135K857k222l688J410
4007b062L630R83m362k633K988M902p79n512k469N063M349k287n147n22L919L425
4023C486k124m837R11L924J397l853k106K827K753q25l513n19L599J722l246l108
4039c512K258M362j12m846k266L870M693j701n557j753N322M055k540n402K22
4054b907M053K665k642l540J105L496K50l574q06L360K182k700l668J641M111
4069C026J230m652l389L299N404j021n947j733M640M235k126n305j354N301L579
$$ plain form
3959 -2742 -4672 1029 5356 2578 -2925 -3829 1357 4343 515 -3364 -1475 2803 2052 -1714 -2586 660
3975 660 3218 555 -3696 -2635 2756 3636 -1464 -4665 -1258 3318 2689 -3342 -4890 -426 4123 1138
3991 1138 -4438 -4520 1129 3932 -280 -4588 -3011 1762 2305 -1536 -3554 -419 2438 216 -3472 -2062
4007 -2062 1568 2551 -1811 -4444 -1456 3446 2667 -2845 -5314 -251 4098 1811 -3336 -3858 61 3486
4023 3486 1362 -3475 -2564 1360 2757 -1096 -3202 -375 2378 1553 -1960 -2479 1120 2842 -404 -3512
4039 -3512 -1254 3108 2996 -1850 -4116 -246 4447 2746 -2811 -4564 758 4813 2273 -3129 -2907
4054 -2907 1146 3811 1169 -2371 -1266 2230 2480 -1094 -1900 1460 3642 942 -2726 -1085 3026
4069 3026 4256 -396 -3785 -486 4918 3897 -2050 -3783 857 5092 2966 -2339 -3693 1608 5187
4084E187l834m747J605M359N41l595j997K832K252j600l797Q39M804N67m589l605
4100d778L648M623J89n934l469M814N607j914o679j059N138L370k361m493j7M181
4116H66J906l971k521L215L064k069l312J38L980J712l528m306K448N848Q0n799
4132b249l427M667N585j572n985k757N082N399k451o047l92N513J722l107l381
4147c400J521L852k91m087n76M109K719m317m336K910N428R82o094m052M114O556
4163E038n02p378k725N887N287l089n926l27N073L357l371m914J967M819k79m727
4179a810q26M374K156l101m212J301O059J119o476l382M517O258j326p169k788
4194e306N710N460j987o870j217N570L371l597m078J434M375M1m046j855L357
$$ plain form
4084 5187 1353 -3394 -1789 2570 3111 -484 -2481 351 2603 1003 -2794 -1955 2849 3416 -1173 -4778
4100 -4778 -1130 3493 3682 -2252 -5721 -907 4700 2786 -3893 -4952 186 3556 1195 -3298 -3315 866
4116 866 2772 -1199 -3720 -505 2559 490 -2822 -2684 1296 3008 -520 -4826 -2378 3470 3550 -2249
4132 -2249 -5676 -1009 4576 3004 -2981 -5738 -656 4743 2292 -3755 -4147 1366 3088 -19 -3400
4147 -3400 -1879 1973 1682 -2405 -2981 1128 3847 -470 -4806 -1896 3532 4514 -1580 -5632 -1518 5038
4163 5038 4536 -2842 -5567 320 5607 2518 -3408 -3735 1338 4695 1324 -3590 -1623 3196 2917 -1810
4179 -1810 -2636 1738 3894 793 -3419 -2118 3941 5060 -1416 -4798 -281 5977 4651 -2518 -5306
4194 -5306 404 5864 3877 -2993 -4210 1360 4731 1134 -2944 -1510 2865 2906 -1140 -2995 362
4209C62L520k796m414J165N289Q39n163l362L264N920n26o139l745N194N852k283
4225B977o392j567N658L831l006n609L09M919J853l567k602K966K524k075l598
4240c379O34M535J670m541m302L024O344k42o783l203N310N661j929o242k172
4255e615N589N116k795o170j27N245K061l575k968J809L442k98l902o69M123J416
4271B682l305l049K304N285j51o237l064M392O430j028p311k447N619N005k342
4286B783n573j107M261L742k651m375P58M177K39l385j347L044K268k300l547
4301c013L14N604J329n010l824L728N486m98o428k600M373O083j539o676k040
4316d711N072M585k225m477j059M340J941l010k723J984L443j096m540L51M867
$$ plain form
4209 362 3882 1086 -3328 -2163 3126 3965 -1198 -4560 -1296 4624 4098 -2041 -5786 -592 5260 2977
4225 2977 -3415 -4982 676 4507 1501 -4108 -3799 1120 2973 -594 -3196 -230 2294 219 -3379
4240 -3379 -2745 1790 3460 -1081 -5383 -2359 3985 3743 -3040 -6243 -933 4728 2799 -3443 -5615
4255 -5615 -26 5090 2295 -3875 -4002 1243 3304 -271 -3239 -1430 2012 1714 -2188 -2857 1266 2682
4271 2682 -623 -3672 -1368 3917 3766 -2471 -5535 -1143 5287 4259 -3052 -5499 120 5125 2783
4286 2783 -2790 -3897 364 4106 1455 -2920 -2162 2015 2254 -1131 -2478 566 2834 534 -3013
4301 -3013 -2699 2905 4234 -776 -4600 -872 4614 4116 -2312 -4912 -539 5544 4005 -2671 -4711
4316 -4711 361 4946 2721 -1756 -2815 1525 3466 456 -2267 -283 3160 2064 -2476 -2125 2742
4331B742J840m925m467K720P199M85p008m793M879O880j060o973k579M836N073
4346D849j981o296o09N425L046m352l524J965M205j133m034p92M589K924m762
4361d80n129K795O655O39p179l623M742O770p20p786l362N812O520k439o785j162
4377d732N040L483l309l897J753M829o95n385j015M927L351m184n102J680O855
4392C599J297o552n017M344P698r24p902l010N671N921j830p368j473O274M086
4407D814l674n500J228M950N48m160j513L851L133l458m991J661P275J256p091
4422a671n230M630P937o24p656l755N363P223k533p147j747O519M139l850m971
4437c373R10N317Q19m860k458M093M245l032n059J387N387J357n679l923M134
$$ plain form
4331 2742 4582 -343 -4810 -2090 5109 5594 -1414 -6207 -1328 5552 4492 -2481 -5060 -224 4849
4346 4849 2868 -3428 -4037 1388 4434 82 -3442 -1477 2728 1595 -2439 -3231 1358 4282 -480
4361 -480 -5609 -2814 3841 4480 -2699 -6322 -1580 5190 4470 -3316 -6678 -866 5654 3215 -3570 -4732
4377 -4732 308 3791 482 -3415 -1662 3167 2472 -2913 -3928 999 4350 166 -4936 -3256 3599
4392 3599 4896 -1656 -6673 -2329 5369 4445 -3457 -6467 -796 5125 3295 -4073 -5546 728 4814
4407 4814 1140 -4360 -3132 1818 2366 -1794 -3307 544 3677 219 -4772 -3111 4164 5420 -1671
4422 -1671 -6901 -2271 5666 5042 -2614 -6369 -1006 6217 3684 -3463 -5210 1309 5448 1598 -3373
4437 -3373 -2463 2854 3673 -1187 -3645 448 4693 1661 -3398 -2011 3376 4733 -946 -4869 -735
4452g35O491q27p692l390O046O347j967p327k441N725N038l155n144kM979J465
4468C411m052k283K864L175j883m011J28M987K320n062m747L018O475j8n985l587
4484e250L964O291r68o926k620N543N440l075o027n11N232K740k879m077J083
4499b040L868L91m574RL234K064l165l715J648N556Q91n899m244L819O819r9p138
4516b575l355M330N825q39o450k035M806L986k721m739J301M249Q73m218j965
4531c527K856L642k306m589P53N446J612m952m599K878P133L9o591m454M984O878
4547E203q84p131k995N202N186k078m792j062M305K668l618l013L138L330j702
4562A757m463o2N009K931m466n597K409P075J222o805m495M145P046j10p525l304
$$ plain form
4452 -735 5756 4929 -2763 -6153 -107 6240 4273 -3054 -5495 230 5268 2113 -3031 -3033 1946 3411
4468 3411 -641 -2924 -60 3115 1232 -2779 -2651 2336 4656 -406 -5153 -2135 4340 4322 -1663 -5250
4484 -5250 -1286 5005 4037 -2889 -5509 34 5474 2399 -3628 -4139 1093 3833 954 -3123 -2040
4499 -2040 1828 2219 -2355 -2346 888 2952 -213 -3928 -2280 3276 4167 -1732 -5976 -2157 4662 4563 -2575
4516 -2575 -5930 -1600 4225 3386 -3064 -5099 -293 3693 972 -3767 -2466 1783 2656 -1562 -3527
4531 -3527 -671 2971 665 -3924 -3171 2275 3887 -1065 -5664 -2786 4347 4386 -2205 -6659 -1675 5203
4547 5203 4319 -2812 -5807 -605 4581 2503 -2289 -3351 954 3622 4 -3009 129 3459 1757
4562 1757 -2706 -2768 2241 5172 706 -4891 -2482 4593 5815 -990 -5485 -1340 5706 5596 -1929 -5233
4578e233N130O278k252p077o79N819L206m316l834J322M656o0m371j626M913L073
4594D949m406n907K647O894J710o841n683M310Q088L08q279m459N896O197j837
4609C587o614j568N620L726l752m733J439N844m66m845j813M681L537l516n555
4624d428J164O668K374o829n069M004P203j3p727l686N147O782k094p200k147
4639e851O426M342m043n368J496M930O65m248k473L635M218l169n934J222O514
4654B362K147n812n309L368O919J117p507m243N456O654j763p466j634O299M223
4669D811l268n432K98O039J695m924l025L361M414k011m913k11N538K668m674
4684C66n364K801P045O73p324l913M515P036j204o861k877N238N132k473o020
$$ plain form
4578 -5233 -103 6175 3923 -3154 -3833 1986 5192 876 -2958 -1636 3020 2960 -1411 -3037 1876 4949
4594 4949 543 -5364 -2717 4177 5887 -954 -6637 -2327 5761 6069 -2210 -6669 -773 5424 3587
4609 3587 -3027 -4595 1025 4751 999 -3734 -2295 3549 3083 -1762 -3575 1106 4643 1127 -4428
4624 -4428 -3264 3404 5778 -1051 -6120 -2116 5087 5074 -2653 -6339 -1192 5590 3496 -3704 -5851
4639 -5851 575 4917 874 -4494 -2998 1932 2597 -1651 -4124 -489 3729 560 -5374 -4152 2362
4654 2362 4509 -1303 -6612 -3244 3675 4792 -2715 -6958 -1502 5152 3389 -4077 -5711 588 4811
4669 4811 1543 -3889 -3591 2448 4143 -781 -3806 -445 3969 1958 -2955 -3166 2372 5040 366
4684 366 -4998 -2197 4848 5521 -1803 -5716 -1201 5835 4631 -2230 -5107 131 5263 2790 -3230
4699c230l62N700J710m355k828K222M490o56n250r07N203K894m271n147K049O098
4715C360J496n670m689L518P147p77o948k766N085N644k250o320j380O012L039
4730D501k942m838J541M760P8m498j566M110L531l248n131R91N778K255n794n127
4746e599L456P074J65p069l379L970O641j465o835j895N775L971l387n183O74
4761c086M755J597l991l352L485L953j922n401M47N517K267m668m914K392O737
4776C816J120o660m861M971O659j227p019k453N265N128k388n901m18N657K152
4791C841m466l352K945M316j086m857j256N017L516m185n515J969O545J219o141
4806a490m407M109O828p44p295l090N394N916k768o356p71O255K819m029m607
$$ plain form
4699 -3230 -3592 2108 3818 -537 -3365 -1143 3347 2691 -2559 -3466 1737 4631 360 -4787 -2738 3360
4715 3360 4856 -814 -5503 -1985 5162 4385 -2563 -5329 -244 5400 3150 -3170 -4550 1462 4501
4730 4501 1559 -3279 -1738 3022 3100 -1398 -2964 1146 4677 1429 -3702 -2711 3067 5322 -472 -5599
4746 -5599 -2143 4931 5096 -1973 -5352 -1382 5259 3794 -3041 -4936 839 4810 1423 -3760 -3086
4761 -3086 1669 3266 -725 -4077 -592 3361 1439 -3962 -3515 2002 4269 -399 -5313 -2921 3816
4776 3816 4936 -1724 -6585 -1614 5045 3818 -3201 -5654 -389 4739 2351 -3550 -3968 1689 3841
4791 3841 -625 -3977 -1032 3284 2198 -2659 -3915 1102 4618 433 -5082 -3113 3432 4651 -1490
4806 -1490 -5897 -1788 5040 4296 -2999 -6089 -695 5221 2453 -3903 -4674 1581 4400 371 -4236
4821d236J942N045j58n005j777M914L390l410m883O64O412K298n992n357L611
4836b542P359R2p023l391M858N750j795o668j254N676L934l963n271J818N362
4851B942O60m936k706L930M589k369n440m9O242K275n594m588K813O968J92o537
4867a608l796M400O624j706p028j576O057L794l150n682J105N472J468m967l514
4882d107L866M747j840n930o0N577K733m488n121J723P015R23o370m098M276O267
4898E113j314o751k096N512M709l503n681k33O414K259n105l568K917M408o23
4913B458n332j052M945L395l827n382J588O158J702o035m034L434O291k85o841
4928b817k751N499N195k858o305j10N680K960m404m289J992N347M29n292k362
$$ plain form
4821 -4236 -2294 2751 2593 -2412 -4189 725 4115 705 -4178 -3514 2898 5196 -796 -6153 -2542
4836 -2542 4817 4909 -2114 -5505 -647 5103 3308 -3360 -4614 1062 4996 1033 -4238 -2420 2942
4851 2942 3602 -1334 -4040 -110 4479 2110 -3330 -3379 2863 5138 -456 -5044 -2231 4737 4929 -1608
4867 -1608 -5404 -1004 5620 3914 -3114 -4690 1367 5161 2011 -3671 -2566 2906 4374 -593 -4107
4882 -4107 -241 4506 2666 -3264 -3324 2253 4986 498 -4623 -2900 4115 5038 -1332 -5430 -1154 5113
4898 5113 3799 -2952 -5048 464 5173 1670 -4011 -4244 2170 4429 -676 -4244 -1327 3081 2458
4913 2458 -2874 -3926 1019 4414 587 -4795 -3207 2951 4653 -1382 -5416 -1982 4309 4024 -2817
4928 -2817 -5568 -69 5126 2268 -4037 -4147 1533 4493 89 -4200 -2208 3139 3568 -1724 -4086
4943d086M159L945k683n054O34N434K104n140m714L549O350l55o885k785N302
4958b25N473k242o469j820O453M117m000n748J618N504J408m995k942L638M386
4973D156j799n153k55N492K418m281m717K751N933M30n801m112N071N812j537
4988D408o958j402N747M108l308o321P45N801K181m604m451L361M884j239m920
5003a968j283M381L128l165m988J369O252Q53n919m044M237N572j053o546k112
5018e286N182M937k987o277j45O303K437m203m445K025N479M43n721k209M650
5033A83L971l016n485J105N568K007n366m381L682O046m29p150k834N762N575
5048E238k608o992n27O253L427m109n679J920O102L80n390k687M024M374k619
$$ plain form
4943 -4086 73 4018 1335 -3719 -3085 2349 4453 -687 -5401 -1852 4498 4143 -2742 -5527 -225
4958 -225 5248 3006 -3463 -5283 1170 5287 1287 -4461 -2843 2661 4069 -926 -3868 -230 4156
4973 4156 2357 -2796 -3051 2441 4859 578 -4139 -1388 4545 4975 -826 -4938 133 5945 4408
4988 4408 -2550 -3952 1795 5903 2595 -3726 -2981 2820 5001 397 -4054 -693 4191 2952 -1968
5003 -1968 -3251 1130 4258 1093 -3895 -2526 3726 4579 -1340 -5384 -1147 4425 3372 -3174 -5286
5018 -5286 -104 4833 1846 -4431 -4576 1727 4164 -39 -4484 -2459 3020 3463 -2258 -4467 183
5033 183 4154 1138 -4347 -3242 2326 4333 -1033 -5414 -1732 4314 3885 -3265 -6099 -337 5238
5048 5238 2630 -4362 -4889 1364 4791 682 -4997 -3077 3025 3405 -1985 -4672 -648 3726 1107
5063A107m955l06O040K566n282m606K879O158k1o401k809M641O064k405o777j270
5079e377O350M443m684n783J621O260J246n066l588L617M969j603n461k06N454
5094B192K646m423m700K208O270O00o592l352M897N872k101o747j274O189M225
5109E910l990n835P22N959K062m680m285L254M819o93n320j704M794L387l427
5124I73m917J339N813Q08n717l281L933N886j593o656j898N506M887l259o519
5139d695N38O252K566m338m758J847N601J86n387k073M202L927k960m347N08M950
5155B019J527m472l304K993N345p65o162k479N611M574k864o704J68O040L203
5170D730m105n441J712N988Q01m804k867L106M087j522m491o57M748K432l787
$$ plain form
5063 1107 -3848 -4154 1886 4452 -830 -5436 -2557 3601 3580 -2821 -5630 -989 5075 2670 -4107 -5377
5079 -5377 973 5416 732 -5051 -3430 2830 4076 -990 -4578 -961 4008 2405 -3056 -3262 2192
5094 2192 4838 415 -4285 -2077 4193 4793 -1799 -5151 -254 5618 3517 -3230 -4504 1685 5910
5109 5910 1920 -3915 -3193 2766 4828 148 -4137 -883 3936 3243 -2077 -3781 1013 4400 973
5124 973 -3944 -2605 3208 4016 -1701 -4982 -1049 4837 3244 -3412 -5310 196 5083 1824 -4695
5139 -4695 -4157 2095 4661 323 -4435 -2588 3013 3199 -2188 -4261 -59 3868 908 -3439 -2931 2019
5155 2019 3546 -926 -4230 -1237 4108 3343 -2819 -5298 313 4887 2023 -4681 -4513 1527 4730
5170 4730 625 -4816 -3104 2884 3685 -1119 -3986 -880 3207 1685 -2806 -3463 1285 3717 -70
5185g0m283K704N161j11n514k989M490N512k483o212j042O046L737l449n806J048
5201c261N662J600m053m296K549N526n16n228j148M087K968k950m133J169N481
5216C457J059n545l192L679N786j534o484j546N696M625l376o099j23O246K799
5231E448m819m186K093N112M68n299j994L797L820k733m796O81N319J389m859
5246e59l755L304N625q90o436k006N138M782k733o370k64O026L445m462n206J511
5262b850O161N65n116k931L941L866j690m694k07N032J967m657m329L457N783
5277D298o95o204k578M890N439k492o318j037O185L731l979n791J261O005J425
5292D140n218k969L106M381j346n012o44M855K471m231l968K278N306r3n385l354
$$ plain form
5185 -70 -4353 -1649 3512 3401 -2113 -5102 -612 4900 2417 -3795 -4837 1209 4946 1497 -4309 -3261
5201 -3261 2401 4001 -52 -4348 -1799 3727 3211 -2017 -3165 922 3890 940 -3193 -2024 3457
5216 3457 4516 -1029 -4221 -542 5244 3710 -2774 -4320 1376 6001 2625 -3474 -3597 2649 5448
5231 5448 629 -3557 -1464 3648 4116 -1183 -3177 620 4440 1707 -3089 -2408 2911 4300 -559
5246 -559 -4314 -1010 4615 3725 -2711 -4717 421 5203 2470 -3900 -4164 1862 5307 845 -4361 -2850
5262 -2850 3311 3876 -1240 -4171 -230 3636 1946 -2748 -2955 2077 4044 -613 -4942 -1485 4298
5277 4298 3603 -2601 -5179 -289 5150 2658 -3660 -4697 1488 5219 1240 -4551 -3290 2715 4140
5292 4140 -1078 -4047 -941 3440 2094 -2918 -3562 1293 3764 -467 -4435 -2157 3149 3056 -2329 -5683
5308e683M668N843k058p228q79O142M200l711o262Q34O069J980m740l674K631
5323a868M799o51m887j002M524K657l412m115J760N087P31n233l183M183N400
5338D790j738o261j381N517M500l432o146N74N911K555m684m137K043N076j66
5353C021m018k395M022L320k343m770J169N113P81m399l499L198N225j125o064
5368b764j645M983N102l163o339K11N513L040l870m913J616N200J094m698k683
5383c316L217L355j560m328K07M511J490l713l750K832N106m63n512k317M452
5398B11M381j704o121j154N712L284l417n619J236N287J391l907l504K603L944
5413B623n84m732n97M051K725l624m161J810N317K43n040l213L772N337j497n807
$$ plain form
5308 -5683 -1015 4828 2770 -4458 -5337 805 5005 1294 -4968 -4134 1935 3915 -825 -4499 -1868
5323 -1868 2931 2280 -2607 -3609 915 3572 160 -3955 -2195 2892 3623 -1610 -4793 -610 4790
5338 4790 3052 -3209 -4590 927 5427 1995 -4151 -3577 2334 4889 205 -3932 -1889 3187 3021
5353 3021 -997 -3392 630 3950 1607 -3163 -1994 3119 3900 -499 -3998 -800 4425 3300 -2764
5368 -2764 -4409 574 5676 2513 -3826 -3615 1898 4938 1068 -3845 -2229 2971 4065 -633 -3316
5383 -3316 -99 3256 1696 -2632 -2425 2086 3576 -137 -3887 -1055 4051 3588 -1924 -4241 211
5398 211 4592 2888 -3233 -4387 1325 4609 1192 -4427 -3191 2096 3487 -420 -3924 -1321 2623
5413 2623 2039 -2693 -3290 761 3486 -138 -4299 -2489 2828 3071 -1969 -5182 -1410 3927 2430 -3377
5429c377j685N501L901l109n519K10N378K425l851l745J730M371Mm730j067L529
5445c4K939k696l807J115M879R99m816l406L541N136j095n577k105N101M510k366
5461B318n910n20N660K901l540m647J548M464Q57m206k328L314L523k253m205
5476c024P32M934J060m356l431L393M995n51n898k530N061N031k459o273p55N366
5492A295L713l322n144Q40N397R33l871l031K931L748j425m426R5L996J979l649
5508E9l692K389N171l21n820k407M237N265j728o151j441N179M138l383m850K56
5524c099N133J959l720m186K623M107q51m159n38L991J851l078m052K346M645
5539B972L66m954l031L475N864j864n518j966N019L986k478n445k44N164K116
$$ plain form
5429 -3377 -5062 439 4340 1231 -4288 -4078 1300 3725 -126 -3871 -2141 2230 2234 -2496 -3563 -34
5445 -34 2905 209 -3598 -2483 2396 3395 -1421 -4827 -1286 3850 2755 -2822 -4927 174 4684 2318
5461 2318 -3592 -4112 1548 4449 909 -3738 -2190 2274 3131 -1075 -3403 -89 3434 1181 -3024
5476 -3024 -2292 2642 3702 -654 -4085 -692 4303 3752 -2146 -4676 385 5416 2957 -3316 -4071 1295
5492 1295 5008 1686 -3458 -2618 2779 3712 -159 -3190 -259 3489 2064 -2362 -2267 1729 3708 59
5508 59 -3633 -1244 3927 3606 -2214 -4621 -384 4881 3153 -2998 -4439 740 4878 1495 -3355 -3099
5524 -3099 2034 3993 273 -3913 -1290 2817 1966 -2193 -2731 1260 3111 33 -4019 -1673 2972
5539 2972 3338 -1616 -4647 -1172 4692 2828 -2690 -4656 363 4349 1871 -3574 -3818 1346 3462
5554C462l410l338J666M313l24m659j164L637K966k692m252J053M918J061m653
5569a416l216L150M807l33n680j971M263M646k113n228p21N376K346l376l715
5584c181J044M421O12l956k130L234L221j835m163P67M177J900m027l828K658
5599a086M813j0n098k720M207M660j917n151q86M251L564l058m626J100M272J185
5615C500m000k664K858L793j808m096N8M117K167l950l953K611M564L80n367k413
5631d203L809M979j747n291j781M803L912k774m841N04M426J625l442k946K051
5646i16L925p67l753j243M197K141l242l553J552M593R05m674l469L551M763r00
5662C110n648j776M609L792k447n213l30N034K445l709l640J871L917K15l965
$$ plain form
5554 3462 52 -3286 -1620 2693 2369 -2290 -3454 183 3149 457 -3795 -2742 2176 3237 -1416
5569 -1416 -4632 -1482 3325 2992 -2688 -4659 -396 4250 2137 -3091 -3812 1564 3910 534 -3181
5584 -3181 -2137 2284 2896 -1060 -3190 44 3265 1430 -2733 -1966 2211 4111 84 -3744 -1086
5599 -1086 3727 3717 -1381 -4101 106 4766 2849 -2302 -3188 1063 4627 1569 -3057 -1957 2315 3500
5615 3500 -500 -3164 -306 3487 1679 -2417 -2359 1758 3925 -25 -3978 -1367 3197 3577 -1790 -4203
5631 -4203 -394 4585 2838 -2453 -4234 569 4481 1707 -3134 -2630 1796 3421 -21 -2967 -916
5646 -916 3009 2242 -1511 -2754 1443 3584 342 -3211 -1659 2934 3839 -835 -4304 -753 4010 3110
5662 3110 -2538 -4314 295 4087 1640 -3573 -3903 1131 3576 -133 -3773 -1902 2015 2230 -1735
5677a735j793L182L198k676l872J189M045J318l995l214K610M805l02n753j786
5692d779M393M251k009n281l38M963K408l155l682P48M472P28l814j973L067L050
5708C049j888m105K27M524J824l919l625K259M889r8m804k375L512M665j877n060
5724b802j033M368L461k976m366O98M735P18l671k250K579L483j369l971j52L781
5740A233K221l375m092J934N092M61m904k750L612M459j038n373j340M487L271
5755C898k342m253K30M377J400l574k406K098L361o19l851o41L650K313l045l706
5771c110J108N129Q74m871l100L107M669j006m647j613L485L571j831m612j60
5786c007L870K149l374k601J696L725m43l601j275L202K640k325l998O68M882
$$ plain form
5677 -1735 -3528 -346 2852 176 -3696 -2507 1538 2856 -1139 -4353 -1743 3062 2760 -2993 -4779
5692 -4779 -386 3865 1856 -3425 -3763 1200 3608 453 -3229 -2481 1991 2719 -1095 -3068 -1 3049
5708 3049 1161 -2944 -2717 1807 3631 -288 -3913 -1654 3235 3137 -1667 -4042 -530 4135 2258 -2802
5724 -2802 -3835 533 3994 1018 -3348 -2650 2085 2803 -868 -3118 -539 2944 1575 -2396 -2548 1233
5740 1233 3454 79 -4013 -2079 3013 3474 -1430 -4180 -568 3891 2853 -2520 -3860 627 3898
5755 3898 1556 -2697 -2467 1910 3310 -264 -2670 -572 2789 2170 -1681 -2322 1328 3641 596 -3110
5771 -3110 -2002 3127 4001 -870 -3970 -863 3806 2800 -1847 -3460 25 3596 1765 -2847 -3007
5786 -3007 863 3012 -362 -2963 -1267 2458 2015 -1586 -2861 341 2981 656 -3342 -2674 2208
5801B208R73m308k994K730M528m6m925k030L559L893j792m483m87M067K144k340
5817F97l617J237L818J16l283k009L371L047k153l867Q5L974K135l614l422K000
5833a485M523K13m649k359L213L915j108m197j406L798K770k299l915J453L388
5848A855J264l952k299K377L338q47l853n19L919K204l029l485R79M596N93l812
5864f71l226K866M524n49m480j447L436L145k058l855M27L808J173l195k484K218
5880c68L346p16l857q04L607K661k632m000J014L906J771l877l584K642L928%
5896C037m368k051L347L567j469m218N5L505J887k938l263J983L550n65l631j155
5912b727K720L536k307l946K94M371J774l762l462J564M652K93m001k827L284
$$ plain form
5801 2208 3181 -1127 -4121 -1391 3137 3091 -1834 -3864 -305 3588 1796 -2687 -3174 893 3037 697
5817 697 -2920 -1683 2135 2251 -1032 -3041 330 3377 1224 -2643 -2558 1416 3551 -63 -3485 -1485
5833 -1485 3038 3251 -1398 -3757 -544 3371 2263 -1934 -3340 458 3228 929 -2986 -1533 1855
5848 1855 3119 -833 -3132 -755 2583 1736 -2117 -2636 1283 3487 458 -3027 -2048 2548 3141 -671
5864 -671 -3897 -1031 3493 2944 -1536 -2983 453 3598 1540 -2315 -1888 1920 3093 -102 -2586 -368
5880 -368 2978 2262 -1595 -2399 1208 3869 1237 -2763 -1749 2157 3928 51 -3533 -891 3037 3037
5896 3037 -1331 -3382 -35 3532 2063 -2155 -2100 1405 3292 354 -2909 -926 2624 2059 -1572 -2727
5912 -2727 -7 3529 1222 -2724 -2430 1941 3715 -47 -3509 -1945 2707 3000 -1001 -3828 -544
5927e44L673j416l925l49L106K238k343l259J073L726q4l419j561L174K671j433
5943A328m015K35L903K227l540l934J780M285P08m181k807K934L940p99m239j091
5959c266L591K118j674l774R69L554O06l067k317K970K897j637l724k70L963K510
5975C449l289l575J140M365J018l880k785K311L999l86l855j472L333K717j989
5990A101l145L6L538J255l019k501K455K874r33l417o21L259K229k577l414P17
6006b163M492J100l721l252K464L758m6l715k127L127L005j258l956J24L311J597
6022B740k830k401J716L190n87l211j442L356K610k173l767L46L921J827l452
6037a57k999J241M322O05l680k676K883K929j123l195n04K889J946k396k583J264
$$ plain form
5927 -544 3129 1713 -2212 -2561 545 2783 440 -2819 -1746 1980 1896 -1523 -3084 90 2761 1328
5943 1328 -2687 -2452 1451 3678 138 -3796 -2016 2269 2977 -1204 -4011 -1077 2863 2064 -2175 -3266
5959 -3266 325 2443 769 -3005 -2036 1518 2124 -943 -3260 -290 2607 970 -2754 -3024 939 3449
5975 3449 160 -3415 -2275 2090 3108 -772 -3557 -1246 2753 2367 -1488 -2960 373 3090 1101
5990 1101 -2044 -2008 1530 2785 -234 -2735 -280 2594 1661 -1756 -2377 882 3111 534 -2880 -2163
6006 -2163 2329 3429 -292 -3544 -1080 2678 2632 -1083 -3210 -83 2922 1664 -2292 -2168 1143 2740
6022 2740 -90 -2491 -775 2415 1828 -1383 -2825 531 3141 968 -2799 -2453 1468 3295 -157
6037 -157 -3156 -1915 2407 3012 -668 -3344 -461 2468 1345 -1850 -2354 535 2481 85 -2498 -1234
6053a234L033k06l094j143K616K744k091l566J30M017J843l049l803J682M243
6068B122M63l308k074J614L292m22l598j047L052K119j746l322J234K841M26k872
6084a226j258J779K853p97l851k90L584K222k901l240R31M074R98l515k728J738
6100a627M259l88l951r24K685K144j122l077R6L061R04k702k153K150L056q23
6116A588l386p36L231K353k086l560P45L821J071l029k815J789L729O6l580j353
6132b152K289K688r85l135m50L449J088k524j769J407K665k58l312j097K953K583
6148C440k075l456N76L299J700k931l051J376L890L03l501k458L180K706j174
6163A824l175l43K808J624k135k381J184K551L84l513r64K561K290j511l276k02
$$ plain form
6053 -1234 1799 1593 -1501 -2644 -28 2716 625 -2941 -2811 1206 3049 0 -3803 -2121 2122
6068 2122 2585 -723 -2797 -1183 2109 1687 -1911 -2958 94 2213 467 -2855 -1621 1220 1646 -1226
6084 -1226 -2484 -705 2148 1351 -2500 -2790 794 3016 115 -3125 -2194 1880 2878 -637 -3365 -1627
6100 -1627 2632 2244 -1707 -2631 54 2198 1076 -2001 -1905 1156 2060 -642 -2795 -645 2411 1588
6116 1588 -1798 -2534 697 3050 964 -2596 -1851 1970 3041 12 -2803 -1014 2715 2781 -799 -2152
6132 -2152 137 2825 1840 -1295 -1745 1704 2792 268 -1501 -94 2571 2313 -999 -2096 857 3440
6148 3440 1365 -2091 -1515 1784 3484 553 -2498 -1122 2768 3071 -430 -2888 292 2998 1824
6163 1824 -1351 -1694 1114 2738 603 -1778 -594 1957 2341 -1172 -2136 425 2715 1204 -2072 -2274
6179b274L439J893k821l172J243L882J45l374j973K102L106l12l625q03L094J719
6195B269j952k875J100K891L23l085j389K179K826j002l722l38L601K071l146
6210b49k617O15L519J094l065k572J993L178j65l534j277L121K066j727k959P12
6226a867K772J140k706j749K100K454j105l339l39K959K413k218l411P47M020
6241A871N92k970k120J584L124P1k959j691J941L073j388l079L31K584J234k157
6257D1k000J470K549l38k891r47K976K265k040l025L78L496J218k966l055J532
6273a337L576L38l306j924K934K836j337k979q34L148J359k011k160J064K658
6288B025j87k970r63K063K677j460l260j31L319J568k368l195J400L587K17k962
$$ plain form
6179 -2274 1165 3058 237 -2935 -1692 2190 2335 -1039 -3012 -910 2196 1884 -1741 -2544 550 2269
6195 2269 317 -2558 -1458 1433 1756 -1329 -2718 -539 2287 1285 -2437 -2775 826 2897 -249
6210 -249 -2866 -2251 1268 2362 -703 -3275 -1282 1896 1731 -1803 -3080 41 2107 380 -2579 -1867
6226 -1867 905 2045 -661 -2410 -310 2144 1039 -2300 -2639 320 2733 515 -2896 -2149 1871
6241 1871 2463 -507 -2627 -1043 2081 2152 -807 -2498 -557 2516 1128 -1951 -1620 964 2198 41
6257 41 -1959 -489 2060 1722 -1169 -2116 860 3125 1085 -1940 -1562 1934 3152 186 -2869 -1337
6273 -1337 2239 2577 -729 -2653 281 3117 1780 -1199 -2033 1115 2474 463 -1697 -633 2025
6288 2025 1838 -1132 -2095 -32 2645 1185 -2075 -2206 1113 2681 313 -2882 -1482 2105 2322 -640
6304f40k071K208L121r13l465n03K450K187j956k583Q11K396P80k885j230J810
6320d83K897j340l115k57K877K011k546k691Q35L417P76l360k206K177L282r62
6336A312l041q06K302J934j019k759J68K725P96k334k111K259K160o26k877l02
6352b219K668J802j843l216Q09L448J038l168k162J735K949L89l400j434K401
6367b03K867j520k808j34K695J349k230k423J676K919m42k890r05K745K117j861
6383I52k840J39L171J385k464k572J438L269k94k934j427K406K097p73l190K09
6399a428K332J635k031k173Q73K428M10k751j237K296K155j342k918q9K901J785
6415B846k575k831J334L394J56l389j363K206K615o70l122q67K937J661j733k357
$$ plain form
6304 -640 -2711 -503 2618 1705 -1760 -2263 187 2374 418 -2165 -1354 1042 1822 -1063 -2293 -483
6320 -483 2414 1074 -2041 -2298 579 2590 44 -2647 -1812 1605 2381 -979 -3185 -1008 2274 1312
6336 1312 -1729 -2535 -233 1701 682 -2077 -1909 816 1612 -722 -2833 -574 1586 960 -1917 -2219
6352 -2219 449 2251 408 -2808 -1999 1449 2487 -681 -2843 -1108 1841 2230 -1170 -2604 -203
6367 -203 2664 1144 -1664 -1798 897 2246 16 -2407 -731 2188 1746 -1144 -2049 696 2813 952
6383 952 -1888 -1749 1422 2807 343 -2229 -791 2478 2184 -750 -2177 229 2326 1553 -1637 -1428
6399 -1428 904 2539 508 -1665 -792 1636 2046 -705 -1942 354 2509 1167 -1751 -1840 1061 2846
6415 2846 271 -2560 -1226 2168 2324 -1065 -2428 -222 2393 1723 -1399 -2266 671 2332 599 -1758
6431a758N93K784K84k342j861K034K401q86l331pK865J652k237k806R34L127Q84
6448B330l416j823J959K766l98l309p76K590K035j556k784L48K691J022k550j823
6464b694J886K058n66k633o31K628K014k020k979J008L446J66k876j686J978K677
6480A776m09k887j406K389K454j055k809l22L077R96k019k172J218K997n12k327
6496a011p97J959K103j561k712N44K488J222k757j619J425K834j34l001j393K423
6512A3K741j381l056n20L089J571k038j995N69K476L28k444j175J662K359j188
6528A011k578M4K691J091j924k090R85K949M73k987j731K186K629n83l316m63
6544a613K552J919j635k324N9K898K29k189j555J824K420r75k734P6K405J138
$$ plain form
6431 -1758 -1165 1619 1903 -439 -2300 -266 2135 1249 -2082 -2089 776 2428 191 -2615 -1681 1446 2330
6448 2330 -1086 -2909 -950 1816 1418 -1891 -2667 -77 1958 402 -2382 -2034 657 1679 -871 -2694
6464 -2694 -808 1250 684 -1949 -2580 48 2062 42 -2937 -1929 1517 1683 -1193 -2879 -901 1776
6480 1776 1367 -1520 -2926 -537 1917 862 -1947 -2269 808 1804 -215 -2387 -1169 1828 1316 -1011
6496 -1011 -1808 151 2254 693 -2019 -1475 1013 2235 -522 -2141 -716 2118 1984 -1017 -2410 13
6512 13 2754 1373 -1683 -2203 886 2457 419 -1576 -1007 1469 1797 -647 -1822 -160 2199 1011
6528 1011 -1567 -1523 1168 2259 335 -1755 -770 2179 2652 -335 -2066 120 2749 2166 -1150 -1613
6544 -1613 939 2858 1223 -1101 -1042 1856 2085 -104 -1659 165 2585 1610 -1124 -1048 1357 2495
6560B495k059k684J342K736N83k843j648J844K646p87k682j064K573J939j131
6575A260k794J69K408P50j714j876J342K465p21k415j90K321J371j788k599R94
6591a017K649M47k506j833J442L378n70l186j409K783K269j402k430n57K910J020
6607A988j833k006J182K160j46k217q70K043J538j423k353O42K450R15k619j993
6623b542J721K963m43k882j222K385K142p79k995J88K063J808k109k164R20K614
6639A668k1k298r66J693J903j061k692Q22K173J020k312k103J345K700J66k669
6655f32j642J999K815j040k667r45K728J531j617k153K77K179Q87k477r74J405
6671c26J609k56k111j39J522J179j647j930O91K713K04k578j465J765K607p41
$$ plain form
6560 2495 436 -2248 -906 1830 2413 -430 -2078 -234 2412 1625 -1057 -2121 452 2391 1260
6575 1260 -1534 -1365 1043 1793 79 -1797 -455 2010 1289 -1126 -1316 1005 2376 588 -2011 -1017
6591 -1017 1632 2079 -427 -2260 -818 2560 1990 -1196 -2605 178 2447 1045 -1385 -1942 968 1988
6607 1988 155 -1851 -669 1491 1345 -872 -1742 301 1839 416 -1937 -1295 1155 2070 -549 -2542
6623 -2542 -821 2142 1699 -1183 -2405 -20 2122 1343 -1652 -1464 599 2407 298 -1866 -946 1668
6639 1668 1647 -651 -1617 76 1979 918 -1774 -952 1221 2241 -71 -2174 -829 1871 2037 -632
6655 -632 -2274 -275 2540 1500 -1167 -2112 616 2147 530 -1623 -1346 833 1720 -757 -1731 -326
6671 -326 1283 1027 -1084 -1223 299 1478 -169 -2099 -1408 1305 1509 -1069 -2534 -769 1838 1097
6687A097k569r18K142K216j471k527mK863M58j654j571N43K271N4j860q63J789
6704dJ434j756j734R43K247r1k090j444J581K203m2l023q73K493K047j416k420
6721a945j97K652R36j917j768R19K292J99k400o59J613J602j186j609n8K516P61
6738A751k405j783J633K401q9k825p72J851K287p88k824m04K921J176j546k339
6754a755M98K315O22j997j043J185K055p16k450K81K184R92k519j293J060K283
6770A702N53l141j119J918K624r33k920l71K420J577j607k273k91K982P52k020
6786a47j385J410J549n23j760l91J919R98j604k147J230K545j52k611j248J947
6802c70K487m80l250p82K598K237j477l187N59K331Q92j636j721Q50K113k60j845
$$ plain form
6687 1097 -1472 -2390 -248 1968 497 -2030 -2034 829 1287 -367 -1938 -1395 876 930 -930 -1793 -4
6704 -4 1430 -326 -2060 -1117 1130 1039 -1051 -2495 -914 1289 1247 -1776 -2649 -156 1891 475 -1945
6721 -1945 -2142 510 1446 -471 -2239 -1320 972 1171 -1229 -1888 -275 1327 141 -1468 -1526 990 1751
6738 1751 -654 -2437 -804 1597 1508 -1317 -2089 -238 2049 1261 -1563 -1967 954 2130 584 -1755
6754 -1755 -1257 1058 1680 -317 -1360 -175 1880 1164 -1286 -1005 1179 2171 -348 -1641 -581 1702
6770 1702 2255 -886 -2005 -87 2537 1604 -1316 -1687 733 2310 703 -1570 -1861 1121 1873 -147
6786 -147 -1532 -122 1427 904 -856 -1247 672 1670 66 -2081 -851 1694 1542 -1069 -2317 -370
6802 -370 2117 1637 -1613 -2395 203 2440 963 -2224 -1665 666 1558 -78 -1799 -949 1164 904 -941
6819i41r08K149J118j453j810M21L079j43k428j518J656K818n81l065q76K670
6835A88J975j299k383m84K683J457j849k011R25K069j6j959p82J497J551j025
6851E37k124P60K283M56k426j269J542K094k64k506j501K655K130j089k731k38
6867a691K465J411j311k301O67J744P08j957r34J417J141l77k075N31J975M84
6883A897k002j691J181K420j08k328j349K361K382j397k102r69K171J908j642
6898G32k427N91K186O53j912j326J284J463m87j609j92J457J024j379k031J123
6914h50K184J45k598o70J248K200o68k270p79K489J550j174k729O24J734J116
6930A552j509j789R73J939r5j907o98J952J061j325j690O02K363K41j984j268
$$ plain form
6819 -941 -1849 300 1418 -35 -1845 -1424 1655 1512 -916 -2434 -778 2040 1459 -1606 -2482 188
6835 188 2163 864 -1519 -2003 680 2137 288 -1723 -798 1271 1255 -704 -1486 11 1562 537
6851 537 -1587 -827 1456 1912 -514 -1783 -241 1853 1589 -917 -2418 237 2367 1278 -1453 -1691
6867 -1691 774 2185 874 -1427 -760 984 1692 -265 -1199 218 1359 982 -1093 -562 1413 1897
6883 1897 -105 -1796 -615 1805 1697 -631 -1980 381 2763 1366 -736 -1705 466 2374 732
6898 732 -1695 -1104 1082 1735 -177 -1503 -219 1244 757 -852 -1044 413 1437 58 -1973 -850
6914 -850 1334 1479 -1119 -1789 -541 1659 991 -1279 -2058 431 1981 807 -1922 -1298 436 1552
6930 1552 43 -1746 -773 1166 1071 -836 -1534 418 1479 154 -1536 -934 1429 1670 -314 -1582
6946a582J246K303l39k548r08J894K162j044k382n62K242J454j467k046P11J810
6962I44K54j623j029J464J398o62j903L17J822O55j889j534J464K251k94k386
6978g51r94J857J973o22k827l57K265J813j607k085O44J843N08j371j090J050
6994B49J287m11j627j0J638P16j802j371J321K085l48k363q20J764J974p95k545
7011a058o65K148J861j611k351M26K479N33j754j410R72J350k01j567m17J935
7027F70P38j653j767J467J773pk327q82J505K478l70l037o55K238K032j366k578
7044a741L30J884J180j594j445M90J941j33j475n48J542N06j228j209N73J960
7060A033M07j979j814J880K200m57k836m42K030J776j151k236m32K100J287j386
$$ plain form
6946 -1582 -336 1967 1628 -920 -1828 66 2228 1184 -1198 -1760 482 1936 469 -1577 -866 944
6962 944 1198 -425 -1454 10 1408 746 -1157 -840 982 1637 -252 -1786 -322 1929 1635 -751
6978 -751 -1745 112 2085 1463 -1364 -1721 544 2357 750 -1335 -691 1152 1660 289 -801 249
6994 249 1536 1125 -502 -512 1126 1842 40 -1331 -10 2075 1727 -636 -1456 308 2282 1487 -1058
7011 -1058 -1723 425 2286 675 -1676 -1250 1229 1762 8 -1402 -430 920 719 -848 -1265 670
7027 670 1408 -245 -2012 -545 1228 1221 -1106 -1988 -483 1995 1625 -1412 -2067 171 2203 837 -1741
7044 -1741 -1411 473 1653 59 -1386 -896 1045 912 -563 -1111 431 937 -291 -1500 -927 1033
7060 1033 1440 -539 -2353 -473 1727 1270 -1566 -2008 22 1798 647 -1589 -2021 79 1366 -20
7076b0j568J78J901O6j501o64J014J280o43j865O31J677M88k308j005J494J867
7093A022j04k313j019J767K070q12k436n62K431R61j125j559J89J772P11j527
7109e34j287J223J382n60j660K60J460O14j552j348J168J926p7k346j079J786
7125f24K117r76k027o43J899J706p09k311j57K073N24j236j240R76J364m89j145
7142h98l65J441J123j276j732J042K052p0j971j224J406K174j74k607r21K409
7158D09J278o94k161j99J856Q29p40j992N70J822L43k016l04J385Q12o62j576
7175a040M40J678L57j823j102R65K548o45k086q93J850J552q46j883o25K170J137
7192A754j236j724N36J733K72j511p21Q62J402p87j129k3J428Q77j756q63P65
$$ plain form
7076 -20 -1588 -1410 491 557 -944 -1608 -594 686 43 -1822 -1191 486 974 -1334 -2339 -845 1022
7093 1022 918 -1395 -2414 -647 1423 611 -1825 -2387 44 1005 -120 -1679 -1490 282 993 -534
7109 -534 -1821 -598 784 224 -1436 -1176 284 898 -654 -2002 -834 1092 1015 -1331 -2410 -624
7125 -624 1493 517 -1510 -2153 -254 1452 743 -1568 -1725 348 872 -364 -1604 -628 736 247 -898
7142 -898 -1263 178 1301 25 -1707 -665 1387 1317 -654 -1878 -472 1702 1528 -1079 -2000 409
7158 409 1687 993 -1168 -1367 489 1318 578 -1414 -844 978 1321 -695 -999 386 1198 536 -1040
7175 -1040 -600 1078 1435 -388 -1490 -525 2023 1378 -708 -1601 249 1801 955 -928 -1553 617 1754
7192 1754 518 -1206 -670 1063 1335 -176 -897 -35 1367 580 -549 -572 856 1733 -23 -886 -121
7209a21J576K82k209q21J345K164r24k129n47K065J329j454j562J08J552P50j270
7226A34j042P81J322l76j199j43J270Q45j131j766P64K203j37j807r11J324J803
7243A934l52k484m22J655J683j042k327L09K083R29j731j154P54J564j34j488
7259b23l85J446P57j326j388P06J844j2j871r41J307J977o40k279l74J744J461
7276A803j242k016M54J538J317j404j653O33J689P2j277r81J616N64o27j261n
7293g80J669O00j834p70R67J793o14k027m74J594J546q94j914K05J748J023j563
7310B75j177K82J570L48j492n02Q52J216j052j495P50J589M59j787j072P85J912
7327A461k89j956n43J195J664o76k070rJ690R36q67j567K87J577O08j789r03J049
$$ plain form
7209 -121 1455 1737 -472 -1293 52 2216 1292 -837 -1384 681 2010 556 -1006 -898 654 1404 134
7226 134 -908 -127 1195 819 -380 -523 747 1592 461 -1305 -541 1662 1525 -282 -1193 131 1934
7243 1934 1582 -902 -1324 331 2014 972 -1355 -1046 1037 1966 235 -919 -165 1399 1265 -223
7259 -223 -608 838 1595 269 -1119 -413 1431 1419 -452 -1393 -86 1891 1251 -1028 -1402 342 1803
7276 1803 561 -1455 -1001 537 1854 450 -1203 -570 1119 1191 -86 -1067 549 1113 486 -775 -780
7293 -780 889 1489 -345 -1115 -148 1645 1031 -996 -1470 124 1670 776 -1138 -933 815 1838 275
7310 275 -902 -620 950 1298 -194 -696 156 1372 320 -1175 -425 1164 1623 -164 -1236 -451 1461
7327 1461 1172 -784 -1327 -132 1532 856 -1214 -1223 467 1403 536 -1031 -744 833 1441 -348 -1251 -202
7345b02J064m12j229l68J822P70j642j072Q11J681J72k156p01J537J361o04j486
7362f54l36J164J397j001j791L60J379K42q36j293J057J143j80j511j56J402M05
7379G91j003j099L59J743K8j256j197J055J260k47j692o14J290J274o08j704L33
7396a287J072R25j448r60Q22J378k86j327n41Q56J344m35j376l89J594O80j147
7413e25j031M52J602J31j440p44R08J416rj907k08J437P34q52j318O63J370P6
7431G55j353r22J416J059p53j349L2J030J433j372j385O25J760L05j609r47J138
7448a37J265j97j657n12J612Q13p63j580L22K056K62j734r60J033J125k86j538
7465h76k2J071R48r81j263M98J418J17j195r55R40J692o37j604l75J154J401j026
$$ plain form
7345 -202 862 450 -779 -1147 675 1445 -197 -1269 -458 1223 1395 -761 -1462 75 1436 832 -654
7362 -654 -990 174 1571 570 -1221 -861 518 760 -76 -1369 -312 831 651 -860 -1016 386 791
7379 791 -212 -1311 -952 791 819 -437 -1634 -579 681 434 -1258 -1872 -582 692 84 -1620 -1287
7396 -1287 -215 710 -738 -1698 -876 502 216 -1111 -1652 -796 548 113 -1263 -1652 -58 622 -525
7413 -525 -1556 -1104 498 629 -811 -1555 -647 769 760 -1147 -1355 82 816 -36 -1354 -691 679 755
7431 755 -598 -1520 -104 955 202 -1147 -1115 -85 1348 -24 -1409 -784 976 1281 -328 -1275 -137
7448 -137 1128 931 -726 -1238 374 1187 424 -1156 -834 1222 1484 -250 -1210 -177 948 662 -876
7465 -876 -898 173 1121 140 -1123 -625 793 910 -285 -1240 -300 1392 755 -849 -1224 -70 1331 305
7483C05j294J3J716L26j088j528J166J194o1j332m44J089Q96r97j185R0J480N73
7501I19j309q77N03J614k02j713p28J688P28q42j309N5J536Q03j473j346J384
7518e69Q93J69j444n53R56J293q88j164J11J207P82j606r37J094J213q7j323q8
7536i41P65J339o63j813J57J532P14q22j116K97J565J36j444n80J012J246p63
7553F21j166J29J104L86o10r67M36J229K88j272r71J390P40o52j011k61J301N98
7571A312q38j027M10J300Qj050p55Q38J066k26r09k29Q80Q81q07j366M42J399
7589A329Jj015o30M74J332k70j147j77J000P38o30r99K19J092M78j208r77P15
7607C25J304n98r36l0Q16P13n60j341O8J327M39r90j146P52R41j24j271n7K36
$$ plain form
7483 305 -989 -976 740 1066 -22 -1550 -384 810 749 -583 -1027 62 958 -39 -1224 -1134 346 919
7501 919 -390 -1267 -764 850 648 -1065 -1793 -105 623 -219 -1528 -1473 63 866 -607 -1953 -569
7518 -569 324 493 -951 -1504 -548 745 -143 -1307 -1196 11 793 -813 -1750 -656 557 470 -853 -941
7536 -941 -176 1163 500 -1313 -1156 376 1090 268 -848 -551 1014 1150 -294 -874 138 1384 621
7553 621 -545 -416 688 1074 464 -503 -67 1162 1450 178 -793 597 1337 685 -326 -587 714 1312
7571 1312 474 -553 -143 1157 1165 115 -640 198 1264 1038 129 -100 780 1661 854 -512 -70 1329
7589 1329 1330 315 -315 159 1491 1221 74 -103 897 1635 1005 6 225 1317 1795 587 -390 325
7607 325 1629 1031 95 65 881 1594 1034 -307 -239 1088 1527 537 -609 143 1084 960 -311 -368 -132
7626a32J186p78r33K30J399Nj168o82N21J354m75o70p68P76J178p83j083k37J217
7645A57N65n79j079M97R94n8m16o11N31J169n96j265Q9J320L30j011n66K20J059
7664G50M43j346o86R25R92l42j135m33J195O03l85j250J81P13M96r97o30Q49P74
7683G17l85j114n1Q91P81j203r73Q54J114L80j398j036J034J259k76j265m90J089
7701g2J408q77j446K65R87M91n21r48O78P81k6j303m9R50L17p06r80M61R97K81
7721F88r32r20Q72J106l98j049l14P69O62l00q41o2N71N12q71p38N02J111l00
7740F8j206j78Q88N10p5j265p4J383L24j222n19P29R14K32j042q40J055R07m98
7759I1j174J28J317l11l98n24L4J020L16j021k15N09R27l71j127J27P38N63q21
$$ plain form
7626 -132 1054 276 -657 -427 972 977 -191 -873 -352 1002 527 -143 -911 -135 1043 260 -823 -1060 157
7645 157 722 143 -936 -439 555 497 81 -530 1 1170 574 -691 -602 718 1048 37 -529 -309 750
7664 750 1193 -153 -839 86 1078 736 -399 -832 363 966 581 -669 -488 225 721 -276 -906 -57 717
7683 717 332 -782 -833 58 839 -364 -1337 -483 631 1011 -387 -1423 -389 870 594 -671 -1161 -72
7701 -72 1336 459 -987 -722 265 756 235 -713 -35 746 720 -583 -632 318 635 -71 -1051 -590 407 688
7721 688 -244 -1164 -292 814 416 -633 -947 -178 484 184 -657 -719 -148 364 -507 -1245 -743 368 68
7740 68 -1138 -1316 -428 82 7 -1258 -1332 51 375 -847 -1366 -637 277 509 -533 -1373 -318 589 91
7759 91 -1083 -955 362 51 -347 -871 -837 183 499 -522 -737 -228 699 328 -799 -672 66 629 -192
7778a92q50K30J449m5j267n61R50P42j68j311K94O45Q05r05q70K66J165j85q59
7797f67l30M89J145n42q39J24Q43L92p81j013Q47N32N32r48l26J69J052k30j072
7816f23j05R62N63m01p43n8N22O92p68m51L07P09n31p29K40N98K56k96p70L33
7836b93N59N38o14q52M19R68l1j169R7M26P37k74j213r1J345O95j256j030J181
7855A42N17l04l54j22L85M38nj249M28Q24m9n56n14P09M04L83q50r61O83J008
7875I57j59j016j1O02p9J48r42K7Q62J68o08n03L87O21l68l00l0M15L65l03p72
7896e39j88J269m7j104k09R53M42k6r36n23R94N60l09j076J32R34J43m23l1k54
7916b38M74l6o37J10P17N77r31p44P02O53M86j170q10O62R61P4j152n78R60O17
$$ plain form
7778 -192 -1042 -812 637 592 -675 -1236 -286 456 288 -1023 -729 -84 721 -184 -1054 -788 377 192 -667
7797 -667 -997 -508 637 95 -744 -620 223 615 -166 -1179 -332 200 732 -216 -542 -373 679 449 -623
7816 -623 -728 234 797 396 -347 -405 117 809 41 -410 -103 606 75 -654 -414 184 440 144 -626 -293
7836 -293 266 804 190 -662 -243 725 694 -475 -378 48 785 511 -702 -793 552 1247 -9 -1039 142
7855 142 659 355 1 -121 264 702 697 -552 -124 700 651 95 -419 290 694 1077 227 -734 -51 957
7875 957 798 -218 -229 373 294 442 -500 -473 389 557 -51 -554 -167 454 86 -214 -244 171 536 233 -539
7896 -539 -727 542 495 -609 -818 135 577 551 -385 -908 86 646 337 -739 -607 327 470 47 16 -238
7916 -238 236 200 -437 -327 390 967 36 -708 -6 647 1133 -37 -847 -185 776 850 -302 -880 80 697
7936F97n5q85l49Q70L65j92p06L46L24J59q10M15L04J60l63p15J98J086J66j078
7956f3n04R40J033l08j164l54O74R11l25r59k62Q40M30n06l51K76M79l90j17m33
7976a53M90O00n71q79O09R51r8o86o88M93R81m02o23o46N30R05J6j145m1N95K57
7997D95k57m48R2J61K10m83l33O50K51o38J30J07K67K24o77n91N82R36k57q61
8017d40k18O91L58j21q36q9M16O38l78n22J44L48J02l37l17K24P03n16m16M1P69
8038B44j6o31J36O1P40p3o54l21M91K49P6o55l18Q69o6K72m93k55N34K64j16q61
8060e23L43L56K28r10L62K79J93j78m41j25R00j16m74l83N70L43n7n13J35L86
8080C75r4J61n63l17R03J24p05j42L20p3M76o02k62M39K06j34o61K72M19P4l33
$$ plain form
7936 697 642 -243 -592 278 643 451 -255 91 415 574 -236 179 483 643 280 -435 -237 849 1015 -63
7956 -63 -567 373 1406 1098 -66 -420 254 1165 840 -119 -381 459 889 383 32 308 787 397 280 -153
7976 -153 337 937 366 -513 96 1047 949 263 -425 68 1049 647 24 -622 -92 813 829 -316 -357 238 495
7997 495 238 -210 -118 43 253 -230 -563 87 338 -300 -170 -63 204 428 -249 -840 -258 678 421 -440
8017 -440 -658 33 391 270 -566 -655 -239 399 21 -501 -357 -9 93 -244 -561 -337 366 -150 -566 -525 244
8038 244 228 -403 -267 -206 534 461 -193 -514 -23 226 302 -353 -671 198 132 404 -89 -344 190 454 338 -523
8060 -523 -180 176 404 -506 -144 135 328 150 -291 -416 484 368 -106 -489 81 424 367 -146 -11 375
8080 375 281 442 -121 -438 465 589 -116 -258 62 -11 465 -137 -399 40 246 112 -549 -277 142 216 -117
8101a17k38k8O75k95m08k20J75N88m8q68O5K56L18q6n53k0N65j38l7n31L29L77
8123b39m5k07l21L61O9m44m1J15O15o7n29j77J22Q11j45o04m21M31O08j81l22
8144f11k52O99K70n32oJ62J72p9r0m99J065l07k23n37M15M74L83n43q79N40N60
8165A82J69p21q4L19N26m61K36m12K58J16l24r6K45J03m87P0O3N61j01k21l56
8186d15l7Q07Q4p97j89
$$ plain form
8101 -117 -355 -383 292 -3 -411 -631 -456 132 84 -784 -719 -463 -145 -231 -784 -804 -239 -377 -414 -945 -616 -239
8123 -239 -284 -491 -812 -451 -382 -826 -867 -752 -137 -204 -733 -910 -788 23 -122 -726 -1147 -716 -108 -289 -611
8144 -611 -863 -164 106 -426 -432 -270 -98 -177 -267 -766 299 -8 -231 -768 -353 121 504 -39 -918 -378 182
8165 182 351 -370 -454 -135 391 -70 166 -246 12 128 -196 -292 -47 56 -431 -361 -298 263 162 -59 -415
8186 -415 -452 355 439 -358 -547
8191e47
$$ Imaginary data points
##PAGE= N=2
##DATA TABLE= (X++(I..I)), XYDATA
0@%%%Qj3NqJ6j6K4l2L9m7N6p2Q5r8J17j40J64j91K23k60K97l40L94m47N04n74
29c06O51p32Q21r21J030j147J279j424J579j752J944k152K381k635K919l236L590
46A889l991M447m970N582o307P175q243R596j1371J3814j7405K3207l4136O1766
60D1053k56054n82883M34827O26121N9748m44009j74149K11867J33230k21547
70a71796j53769K11266K71320j15776k90985O491K83613P1540k59907j83662K03609
81a28056K99454l0506k91055r5640K03876J40246j38015j34322J31867K20188
91A78037k5450k52653j57573J25201K35089Q9975p3136r8654p9668p1402J3119
102a17115J52711J62606j2960j78891j42108M8568J60422O3409j00670j14302
$$ plain form
0 0 0 0 0 8 -5 0 -8 8 -8 16 -16 23 -24 32 -40 45 -53 64 -76 88 -103 120 -140 157 -183 211 -236 268 -306
29 -306 345 -387 434 -487 543 -604 675 -749 830 -922 1022 -1130 1251 -1384 1535 -1701 1889
46 1889 -2102 2345 -2625 2957 -3350 3825 -4418 5178 -6193 7621 -9784 13423 -20713 41053
60 41053 -215001 -797884 -363057 263064 322812 -121197 -295346 -83479 49751 -171796
70 -171796 -325565 -114299 157021 41245 -249740 -243249 40364 111904 -148003 -331665 -128056
81 -128056 171398 140892 -150163 -245803 -41927 98319 -39696 -174018 -42151 178037
91 178037 152587 -100066 -257639 -132438 102651 192626 119490 20836 -58832 -130234 -117115
102 -117115 35596 198202 185242 6351 -135757 -87189 73233 136642 35972 -78330
112g8330K3303J28034Q6666n5032j52739q7422P8155J46055M8620o0939o3210
123A3161j4713k269j6954J103O4891Q6588m480j18347r4140M3587J11986M7013
135A17426l7612l8653L018q289n1726q475J10355J10627o6147j74431l7027J54852
147G3918J31873o6875j66851l9524J39526J29326l9025j25398n3272K9761L2976
158D6435K7510M6733K5911n6279j07987m5813P9021J09981K860r0903n2554K7096
170A2011K6201j7945j4035K4239K8447k1917o2941k3173N3360N6883j5830n2944
182g644k7472K937K0164L5003J8615l5121o3955j6850O6174Q2150q317j04987
194c9303p6571L9559R1725M3658j4398m2675n2997l4506J9647P1806O4163j6006
$$ plain form
112 -78330 -55027 73007 159673 104641 -48098 -135520 -57365 88690 137310 76371 13161
123 13161 -1552 -3821 -20775 -19672 45219 131807 127327 8980 -85160 -41573 70413 117426
135 117426 79814 41161 44179 35890 -15836 -24311 86044 196671 130524 -43907 -80934 73918
147 73918 205791 138916 -27935 -67459 72067 201393 162368 36970 -16302 13459 46435
158 46435 73945 120678 146589 90310 -17677 -63490 15531 125512 128372 37469 -15085 12011
170 12011 38212 20267 6232 30471 58918 37001 -25940 -49113 4247 61130 45300 -7644
182 -7644 -35116 -32179 -12015 22988 41603 6482 -57473 -74323 -8149 74001 65684 -39303
194 -39303 -115874 -76315 15410 59068 44670 1995 -51002 -85508 -65861 5945 70108 54102
206E4102r5392n9202N9809R2382j2375q7363k2031P2739M9269n4410p8483K4449
218e6506R8484J3228j04297o0753P8943R4400k9018r8797k5193O7787M8999l4381
230g104l8259L5717L3706o7577p9773O5416J56193K8588j59790j49278N7143J92045
242F7027P5906j24119j29531L8741J13586R682p8625k4218O0049L5899m8414m4819
254d8836N0807P0334m1332j05733L122J20821N9800q6276r9463K9233J08809J9528
266H0814j03011o3562Q8933J13804m1770j45866m5021J14624J16825k8048j23045
277c5323n2211O4928O1738k1426l1293K3761J7723m7977m9727L6478Q6783J2553
289F6007r9766q1637O6777J35218J0270j35034r5217O4081J26642K5533r1387
$$ plain form
206 54102 -41290 -100492 -40683 51699 39324 -48039 -70070 2669 51938 -2472 -80955 -56506
218 -56506 41978 55206 -49091 -109844 -30901 63499 34481 -64316 -89509 -21722 27277 -7104
230 -7104 -45363 -9646 24060 -43517 -123290 -57874 98319 126907 -32883 -182161 -125018 67027
242 67027 142933 18814 -110717 -71976 41610 51292 -27333 -51551 8498 44397 -4017 -48836
254 -48836 1971 72305 30973 -74760 -71638 49183 108983 22707 -76756 -47523 61286 80814
266 80814 -22197 -85759 3174 116978 75208 -70658 -115679 -1055 115770 87722 -35323
277 -35323 -87534 -22606 39132 17706 -13587 10174 27897 -20080 -69807 -33329 53454 66007
289 66007 -33759 -115396 -48619 86599 96869 -38165 -133382 -69301 57341 82874 -8513
300h513p0317M1858O8659j9290o4962O900O9594J9507o0053m9640L1605O1836
312B7184m811o1306r891O5283K7227o7835n6937N1250R2226j023j00354o3001
324a01988O9238J10481p712j13815n3648P5664Q6997j5139p8032l1000M2212L5475
336A8733k1063k0806L4116K7003n0648o2798K7989Q8141K5772p4777p3097L2851
348d8584R3716J6327q5570n6214N5912P8190j1213p3325k8326N2722N4139k4940
360B2834o4506k491N8837K5073l9754l4023J8374L1631n199k9332j922L6211J2680
373B8413m4235l4747L8450O1517o438o7555l9154M0472P0359Q108o4987m6308
385e6105L6302N8311k264m7807k2697K7645L3165q975l5637j758L4862R631l4682
$$ plain form
300 -8513 -78830 -36972 31687 12397 -52565 -45665 23929 43436 -16617 -66257 -34652 27184
312 27184 22373 -38933 -48824 16459 43686 -24149 -81086 -29836 62390 61367 -38987 -101988
324 -101988 -32750 77731 70019 -43796 -97444 -21780 65217 50078 -27954 -58954 -16742 18733
336 18733 -2330 -23136 10980 37983 -12665 -75463 -47474 40667 66439 -8338 -81435 -48584
348 -48584 45132 61459 -24111 -80325 -24413 53777 42564 -30761 -59087 -6365 47774 22834
360 22834 -41672 -44163 14674 39747 -7 -34030 -15656 15975 10776 -18556 -20478 15733 28413
373 28413 -15822 -50569 -12119 49398 42960 -24595 -63749 -23277 47082 55190 -9797 -56105
385 -56105 -19803 38508 36244 -11563 -34260 -6615 26550 17575 -18062 -19820 15042 24673 -10009
398a0009k0963K6162L0279r279l2075p656L0615K2829k7967l8580J8320N2633
410C4309M746n2806l3986L5151N8558j45o5883l9776M7361O3797j2125o1303j9469
423d1571L7941L1368j7541l3481L878L4497K773l8210j2180L9085K5319l2959
435a081m1076J2898N1821J6995m8605m6778L0675O6437r50o9479l3054N0419N7911
448D6133j4067o5318k4055N2526M9003k6662n6619M72M5589J5759k7262j9196
460b3697J7615K3902j5897l5344Q769N2528J5318n4361m2457L5218O5514K178
472D9286o5983m3430M4576P2928n781p3551k9117N0989M7349k0754m8606m698
484b6792M1665K2433l2153l2092K3417L7752j4456m1651K211M4948J7841l9437
$$ plain form
398 -10009 -30972 -4810 25469 16190 -15885 -23541 7074 29903 1936 -36644 -18324 34309
410 34309 39055 -13751 -47737 -12586 45972 45827 -20056 -59832 -12471 51326 39201 -22102 -41571
423 -41571 -3630 27738 10197 -23284 -19406 15091 17864 -20346 -32526 6559 31878 -1081
435 -1081 -42157 -29259 22562 39557 -9048 -55826 -25151 41286 40336 -29143 -62197 -11778 46133
448 46133 32066 -33252 -57307 -4781 44222 17560 -39059 -38587 7002 22761 -4501 -23697
460 -23697 -6082 17820 1923 -33421 -24652 27876 43194 -11167 -53624 -18406 47108 49286
472 49286 -16697 -60127 -15551 57377 51596 -21955 -51072 -83 47266 26512 -22094 -26792
484 -26792 14873 37306 5153 -26939 -3522 34230 19774 -21877 -19666 25282 43123 3686
496C686m2302K3358O4573P333o8583m3386M8898O8607q931o8414l1210M5534N4954
509E4117j3930n7108j0174M4917K1699k9636k2634K2086K6671j5664l8805J779
521a6682N1781K8269m6512n5807K2941O9536J4302n8364m6395L1342O4964M547
533F3922o2036l4016M3932M9445j9068n0145n814L9509K2534k4893l2795J2134
545B709L4667n860l9247l602M1994J7949l9389m1440J8993N7680J3303n9932n1202
558e3377L5261P0351K553o3946l7951L3504M9890l824m5907j7905L4716K5068
570B8433k6202k9002J8837L2787p826l6568j0335L5386L1906k1295m5983L431
582b6431N0009J7842m1335l4322K4939M6904J230m8454k7959L8233M8238j6042
$$ plain form
496 3686 -38616 -15258 49315 56648 -11935 -55321 -6423 62184 53253 -15161 -46371 -837 54117
509 54117 40187 -16921 -27095 17822 39521 9885 -12749 9337 36008 20344 -18461 -16682
521 -16682 35099 63368 16856 -38951 -16010 53526 67828 9464 -36931 -5589 59375 63922
533 63922 1886 -32130 11802 61247 42179 -7966 -13780 25729 48263 23370 -9425 2709
545 2709 37376 31516 -7731 -11333 30661 48610 9221 -32219 -13226 44454 57757 -2175 -53377
558 -53377 -18116 52235 54788 -9158 -47109 -13605 36285 32461 -13446 -31351 3365 28433
570 28433 2231 -26771 -7934 24853 17027 -19541 -29876 5510 37416 16121 -29862 -26431
582 -26431 23578 41420 85 -34237 -9298 37606 38836 -9618 -37577 656 48894 32852
594C2852n4965j0134M3358K9791k1201l6854j470L1245J1766k7967j7535K5948
606D834K5193k2638l7129L951M1807J9696l2128m3012R234M8858J3511m0787k9829
619c8439K3763L3775p052l5098r987L2026K6760k3914m0109O936M4297J4627l3208
632e623l0587J1978L5243J0816k5549j9079J8347K0847j5850k3637J4144L4514
644B5564K917l7202k8820K2681M7401K956m8283k7666L1104L7655j0089l8225
656b0007j2325K6723K4019j7697l5278M591L6708O517l7200k4040K2571L3215
668G797m681l6317j5547K6847K4222k0919k8559J5424L4225o961m3199j6717L8495
681b5890M5906j2220n9920k1942M8232M7178j8471m8941o501L7237K4943j8016
$$ plain form
594 32852 -22113 -32247 11111 40902 19701 -17153 -18623 12622 24388 -3579 -21114 4834
606 4834 30027 7389 -29740 -25789 16018 35714 3586 -39426 -30192 18666 32177 -8610 -38439
619 -38439 -14676 19099 12047 -23051 -33038 -1012 25748 1834 -38275 -31339 12958 27585 -5623
632 -5623 -36210 -24232 11011 21827 -3722 -22801 -4454 16393 543 -23094 -8950 25564
644 25564 28481 -8721 -37541 -14860 32541 35497 -12786 -40452 -9348 28307 18218 -20007
656 -20007 -32332 -5609 18410 713 -34565 -29974 6734 13251 -23949 -47989 -25418 7797
668 7797 3116 -33201 -48748 -21901 2321 -18598 -47157 -31733 2492 -4469 -47668 -64385 -25890
681 -25890 20016 7796 -52124 -74066 -25834 21344 2873 -46068 -52569 -15332 9611 -8405
693h405k8438J0191L1975l668l4056j087M2126K1257l4483m0993J3201N2916J8720
706C9256m2900l9479K5440M7638o055m6700j2968M0488L3178k3923n0340l638
718d0003N1702L0209l5818m4055J2132M0979M969l1321j4732K5330K2111k2986
730a483l4298J8239M9874O12n6539l1363M3222N9699l637o3034l5500M1426N6376
743D3594r369n0110r218L8860J9823k7327k6510J9635L9968l800m5854j4773M3557
756A8476L3928k7940m2392R275M3005J0231l9043k8370L0782M4230j5555n8595
768b1968j0101N4590L7991l4191n7708l883N1853L3431l0955m5614O291L6575
780A6311K325k9531n048K7888J3509k8723l1922J5841M6615P681m6013l0582L0152
$$ plain form
693 -8405 -36843 -26652 5323 1655 -32401 -33488 8638 29895 -4588 -45581 -32380 20536 39256
706 39256 -3644 -43123 -17683 29955 23900 -22800 -35768 4720 37898 13975 -36365 -40003
718 -40003 11699 41908 6090 -37965 -25833 15146 20115 -11206 -25938 -608 21503 -1483
730 -1483 -35781 -17542 32332 32944 -23595 -54958 -11736 47963 44326 -18708 -54208 -12782 43594
743 43594 34225 -15885 -25103 13757 33580 6253 -20257 -622 39346 35546 -10308 -25081 18476
756 18476 52404 24464 -17928 -8653 34352 44583 5540 -22830 7952 52182 36627 -21968
768 -21968 -32069 22521 60512 26321 -31387 -35270 16583 50014 19059 -26555 -20264 16311
780 16311 18636 -10895 -15943 11945 25454 -3269 -35191 -19350 27265 34946 -11067 -41649 -11497
793a1497M1655o010l9135j3135K9301K7473j7004l4432O762M0954R061l8352k5630
806b9989K5509M0131J220l7765k2755K3541L2325o276k6770k19K0788K924k0405
819B259j0334J9630K3991q661l6630j2986L3053K9646j7137l6258n800K6928J9591
832B7292j4578k6272J354K4977M060k5251j1042K2500K1101j3283l0513p395K8262
845A212K5627j2416l1073k707K3625Q287j4299q277J2276J4344q893k5787l236
858b1317L2493K2944k2720l6689K537L5478J8713j9572k9054J279K6994J1641
870B2727j8910j3888J2917J2887j0842j7213M988K3488R914k3508k7965Q993L3880
883A7468P414k7349j7441J4371J9458o485k3565m369K6845J8151k3000l2649P857
$$ plain form
793 -11497 30158 24148 -14987 -28122 1179 28652 11648 -22784 -16022 24932 33993 -4359 -29989
806 -29989 -4480 35651 36871 -894 -23649 -108 32217 25941 -829 -1048 19740 22664 2259
819 2259 -8075 11555 35546 26885 -9745 -22731 10322 39968 22831 -13427 -19227 7701 27292
832 27292 12714 -13558 -12204 12773 16833 -8418 -19460 3040 24141 10858 -19655 -27050 1212
845 1212 26839 14423 -16650 -19357 4268 12555 -1744 -10021 2255 16599 7706 -18081 -21317
858 -21317 11176 34120 11400 -25289 -22752 12726 31439 11867 -17187 -15908 11086 22727
870 22727 3817 -10071 2846 15733 4891 -12322 -7334 16154 26068 2560 -25405 -16412 17468
883 17468 24882 -2467 -19908 -5537 13921 7436 -16129 -20498 6347 24498 1498 -31151 -23294
896b3294L4987J1650k5572k4897Q688K9259O825k4591j4618J7631J6757j3593
908g68j6758J0772K3803j408l0182j8331K6527L9687n243m6046j9531L2008L3509
921B8039r622l2122p112K5652J7433k0017k4323J3551K9731l167l0080r088K4966
934C841K0538j5358k9903J865L4017J2612l2278k4471K2221L2762q799l7854j0168
947c0975L4433L1454j9898m6017m251M2537K5553k4220l1958L815K5904P858j9276
960e041j1309J8261J6308j9466k5316J3453L4474J588l5031k1715K3445L7569
972B7220k605m1811j9197L2453L2821j5988l5098j503L0751J6132k2147k7377
984b6349R461L3598M549k9779j6074J9805K0386q732k0454M52K1526P674k3376
$$ plain form
896 -23294 11693 23343 -2229 -27126 -18438 10821 17646 -6945 -21563 -3932 12825 -768
908 -768 -17526 -6754 17049 15641 -14541 -32872 -6345 33342 28099 -17947 -37478 -5470 28039
921 28039 18417 -13705 -20817 4835 22268 2251 -22072 -8521 21210 18043 -12037 -21125 3841
934 3841 24379 9021 -20882 -19017 15000 27612 -4666 -29137 -6916 25846 17047 -20807 -30975
947 -30975 3458 34912 15014 -31003 -35254 7283 32836 8616 -23342 -19527 6377 14235 -5041
960 -5041 -16350 1911 18219 -1247 -26563 -13110 21364 22952 -12079 -33794 -10349 27220
972 27220 24615 -17196 -36393 -3940 28881 12893 -22205 -23708 7043 23175 1028 -26349
984 -26349 -16888 16710 21259 -8520 -24594 -4789 15597 6865 -13589 -13137 8389 16063 -7313
997g313j8762K1148L0567q931l7488r718L0762K8371j2846l7024q416L2661K3983
1010B6994j9367k8987N301K6762N152k0000j2949J5067K0162q650k6571p28K9493
1023A1679J2345k3074k2613J1101K6520L499k5379j6548K0047K6658j0361l2276
1035a8402l311K9590J8170j8849k7201K033K9583J2298k3191k1186J3725K3643
1047A6902m569k1068l763J8380J1399j4832j9977Q905K7716K234l0897j5934K3056
1060b448K6270o766k9264j0539K3247K2638j3628k8498K622K8129Q363k1780j8162
1073a9816J0785K2797J551k2497j2105J8493J8280j2454k1177M541K0819L927
1085A3144j8837j3797J3063K3039m705k9287q078K6523K1748j5751k8901k031
$$ plain form
997 -7313 -26075 -4927 25640 16709 -20779 -30497 265 28636 15790 -21234 -29650 3011 26994
1010 26994 7627 -21360 -16059 10703 15855 -4145 -17094 -2027 18135 9485 -17086 -17814 11679
1023 11679 24024 950 -21663 -10562 15958 19457 -5922 -22470 -2423 24235 13874 -18402
1035 -18402 -21713 7877 26047 7198 -20003 -17970 11613 23911 720 -20466 -6741 16902
1047 16902 12333 -8735 -12498 5882 17281 2449 -17528 -8623 19093 21327 -9570 -25504 -2448
1060 -2448 23822 17056 -12208 -22747 500 23138 9510 -18988 -16366 11763 20126 -1654 -19816
1073 -19816 -9031 13766 15317 -7180 -19285 -792 17488 5034 -16143 -11602 9217 13144
1085 13144 -5693 -19490 -6427 16612 11907 -17380 -25458 1065 22813 7062 -21839 -23870
1097b3870K6123J7689j6607k5129M587K6187M419k2060j1633J5512J6717o220
1109E715j9775l093K0114J1848j7927j9420J2162K4477j843k4883j0135J9017
1121c743K1584q114k8757m599K8772J7337k0077k5213O200K6156Q373j8791j7906
1134a8778J0295K1970j881k1957m019K0869R243j5939j5765Q756K1479J858k3945
1147g814j4482K0787K5306j0367k9792m480K5599J8187j3546k6014l29K5982J1725
1160B0762k0512j8577J2681K0775k381j9188o987J4932J4640r896j9778L941K3568
1173A3980L013k2374j2510J6801K0829m628k5691q812K3187K2019j3810k7872
1185a5868J015K6491J1583j6922j9454O464K1762M216k0146j0829J7684J6256
$$ plain form
1097 -23870 2253 19942 3335 -21794 -17207 8980 13399 -8661 -20294 -4782 11935 5715
1109 5715 -14060 -17153 2961 14809 -3118 -22538 -10376 14101 12258 -12625 -22760 -3743
1121 -3743 17841 9727 -19030 -23629 5143 22480 2403 -22810 -16610 9546 17919 -872 -18778
1134 -18778 -8483 13487 11606 -10351 -14370 6499 15742 -197 -15962 -7206 14273 16131 -7814
1147 -7814 -22296 -1509 23797 13430 -16362 -20842 4757 22944 9398 -16616 -16945 9037 20762
1160 20762 250 -18327 -5646 15129 12748 -6440 -13427 1505 16145 6249 -13529 -9588 13980
1173 13980 16993 -5381 -17891 -1090 19739 15111 -10580 -19392 3795 25814 12004 -15868
1185 -15868 -14853 11638 23221 6299 -13155 -6691 15071 19287 -859 -11688 5996 22252
1197B2252j2410k0566M429K1728P561j8780j8608J0671K5900l22k7295j1051K1545
1210E054J8960j1286k3072k571K1795J3983j7230k1708Q686K3564l01k1530q272
1223a3928J5880J4653q919k0123P7K3178Q974k2278j8642J4815K4660k230k4738
1236h621j2198J8217K2604o186k6581m737K2475J3399j5040j5728N897J6809K182
1249A2492j6246r533J4747J6200j0233k0858L061K1051O032j7066j5347Q199K0692
1262A3191J751k2543j2378J7805J9354r441k2122l253J8651J2793j0791j9319
1274a6302R37J9521O292j5868j0300R880J1995n235j2379j350J4192Q858j2488
1287b247j6679P189K1371K033j8334j0760J1672J6747m34j7713p272J5655J3406
$$ plain form
1197 22252 9842 -10724 -6295 15433 22994 4214 -14394 -3723 22177 21855 -5440 -16491 5054
1210 5054 24014 12728 -10344 -12915 8880 22863 5633 -16075 -7389 16175 15874 -5656 -13928
1223 -13928 1952 16605 7686 -12437 -12360 10818 19792 -2486 -21128 -6313 18347 16117 -8621
1236 -8621 -20819 -2602 20002 13816 -12765 -17502 4973 18372 3332 -12396 -6499 10310 12492
1249 12492 -3754 -13287 1460 17660 7427 -13431 -10370 10681 16713 -353 -15700 -7501 13191
1262 13191 14942 -7601 -19979 -2174 17180 7739 -14383 -17636 1015 13808 3017 -16302
1274 -16302 -15365 4156 10448 -5420 -15720 -5840 6155 920 -11459 -12809 1383 10241 -2247
1287 -2247 -18926 -11737 9634 11667 -6667 -17427 -5755 10992 10558 -7155 -14427 1228 14634
1300A4634r778j5990M485J6187M673j2629j1474O435J7043J815j6984p854J3313
1313C876J1381p743j2611Q74J2941N669j2346j3138P469J8878m53j9401q897J2373
1327a128J4107l144j5200o930J2509J2116q699j5023M851J4441r0j3027p290R507
1341c000J4555l066j8360n933J6909J3627j0759j6373K475J5667N574j2077j2331
1354a3092Q130J7443j830j9739n528J7660J3395r389j7542j688J7099J0891j2534
1367C276j6495P040J7839k284j7974m279J5478J1733j0578j9588L17K2150J0640
1380A7275j9367j9494R542K0676Q33j7614j0085J1511J5904o820j9424N73K1584
1393E094O271j9933j4536J2427K1257n55k0898j1558J7405J9079r647k1919K808
$$ plain form
1300 14634 4856 -11134 -6649 9538 14211 1582 -9892 -3457 13586 15401 -1583 -9437 3876
1313 3876 15257 7514 -5097 -4223 8718 14387 2041 -11097 -3628 15250 14797 -4604 -13501 -1128
1327 -1128 12979 9835 -5365 -12295 214 12330 3631 -11392 -6541 7900 7810 -5217 -12507 -3000
1341 -3000 11555 8489 -9871 -15804 1105 14732 3973 -12400 -9925 5742 11316 -761 -13092
1354 -13092 -4962 12481 10651 -9088 -14616 3044 16439 7050 -10492 -12180 4919 15810 3276
1367 3276 -13219 -6179 11660 9376 -8598 -12877 2601 14334 3756 -15832 -15515 6635 17275
1380 17275 -2092 -21586 -12044 8632 9465 -8149 -18234 -6723 9181 2361 -17063 -16490 5094
1393 5094 11365 -8568 -23104 -10677 10580 10025 -10873 -22431 -5026 14053 4406 -17513 -14705
1406a4705K1687O598j8373j4701J0766K3130J278k4687j2303J9690K0474q677
1418A0177k0608j471J6725Q732j1710j2639Q664J7409m359k1920l253K2500J3544
1431B1791j5720k2310K395K3506J1507j8453k0448R345K2638q90k0447p263J5508
1444A159J4387q735j9707l87K0925R550j7114j5880J0542J7080k389j5288m165
1457a0022J3249J0359j0862j6417O356K2234K537k2128j3665J4272K1290j13k0746
1470c656j1873J3822J7316n881j7053N96J4246K487j1389p208Q841J2337l760
1483H825j7098m516J6940J1531j1408j6078K732J4436M982j1166j1387O242J4641
1496H676j541j6529m814J3790J0230o782j3213k289J0957Q673o378j0228L015
$$ plain form
1406 -14705 6982 13580 -4793 -19494 -8728 14402 15680 -9007 -21310 -1620 18854 10177
1418 10177 -10431 -11902 4823 13555 1845 -10794 -2130 15279 10920 -11000 -14253 8247 21791
1431 21791 6071 -16239 -13844 9662 21169 2716 -17732 -8387 14251 13361 -7086 -14349 1159
1444 1159 15546 6811 -12896 -13283 7642 17192 78 -15802 -5260 11820 9431 -5857 -10022
1457 -10022 3227 13586 2724 -13693 -7337 14897 17434 -4694 -18359 -4087 17203 17090 -3656
1470 -3656 -15529 -1707 15609 9728 -7325 -6729 7517 10004 -1385 -8593 248 12585 8825
1483 8825 -8273 -12789 4151 15682 4274 -11804 -9072 5364 10346 -820 -12207 -5965 8676
1496 8676 7135 -9394 -14208 -418 9812 3030 -10183 -12472 -1515 7158 780 -9448 -6433
1509f433R125k401q176R01Q651L421p028j0051K251J4979O386j2834j3518M688
1523a0039J4756N371r027j0426Q70J1490L508q114m987O581N340m672n526R95
1537c880O735L922n103q296K410J0371K20r165l150P300N689l956r159p23J1956
1552E171P764j1450j4310N186J6842M466j2382j2072K822J4393N148j0154q487
1565g063O725P735m819p137L730Q970O27j0362p453Q213J4548k309j7494m913
1579a1002J4412J1210p806j3553n39J3451P754j1759j2865P350J5867j460j5105
1592d045n813J0860J0804l390j3212l043J1454O906r690q843P964J1155n349j4219
1606h461k062J4822J2003j0108k0212O22K0249R365j4367j4786N003J4355L376
$$ plain form
1509 -6433 2692 291 -7885 -6984 1667 5088 -1940 -11991 -9740 5239 11625 -1209 -14727 -10039
1523 -10039 4717 10088 1061 -9365 -8495 2995 6503 -1611 -6598 -17 5323 651 -4875 -3880
1537 -3880 2855 6777 1674 -6622 -4212 6159 6379 -2786 -5936 1364 7053 3097 -6062 -6785 5171
1552 5171 12935 1485 -12825 -7639 9203 13669 1287 -10785 -7963 6430 11578 1424 -7063
1565 -7063 -338 7397 2578 -4559 -829 8141 8768 -1594 -9047 -834 13714 11405 -6089 -11002
1579 -11002 3410 14620 6814 -6739 -7278 6173 13927 2168 -10697 -3347 12520 11060 -4045
1592 -4045 -9858 1002 11806 8416 -4796 -7839 3615 10521 831 -8012 -48 11107 5758 -8461
1606 -8461 -10523 4299 16302 6194 -14018 -13396 6853 16218 1851 -12935 -7932 6423 9799
1619I799j1935q658R229J1756o216j4625K482J4593L840j2614j0424P341J4909
1632I477L72j6500p223J4363J2014j0366j5295L865J6613N344j4824j4549P660
1645i049K0446J258j8909r388J2776J3019n418j2393j154J1564O028j0796j0147
1658a2163R271J4870n316j7018k584J6078J0870r013j7114j80J8137Q238j4500
1671d24j1694Q003J3639k313j2705m024J0874J0773o830j4617Q38J5702L218j1624
1685a184p316Q171J0036l036j1934l206J2143R092r531j4104M630J5538K802j2273
1699a72j0823N416J4734K927j2569q610P661R284l403p722J268O688K016p071
1713c76n961M994J0325j850j2276k386J0801P670p503j0624K87J1190P367q590
$$ plain form
1619 9799 -2136 -10794 -1565 10191 3975 -10650 -8168 6425 10265 -2349 -12773 -5432 9477
1632 9477 9849 -6651 -13874 489 12503 2137 -13158 -9293 7320 12664 -2160 -16709 -9049
1645 -9049 11397 12655 -6254 -15642 -2866 10153 4735 -7658 -8812 2752 8780 -2016 -12163
1658 -12163 -2892 11978 6662 -10356 -12940 3138 14008 4995 -12119 -12299 5838 14076 -424
1671 -424 -12118 -4115 9524 7211 -5494 -9518 1356 12129 5299 -9318 -8480 7222 10440 -1184
1685 -1184 -8500 -329 9707 6671 -5263 -8469 3674 12766 3235 -10869 -6239 9299 12101 -172
1699 -172 -10995 -5579 9155 12082 -487 -9097 -1436 7848 4445 -3277 -2009 4679 6695 -376
1713 -376 -6337 -1343 8982 7132 -5144 -7530 3271 10941 3438 -7186 -6899 4291 11658 3068
1727C068j2622L595J3485J368j0684o536N593R983P12j0486o442P117Q350l592
1741B909p255J818N767r03o731k335O462Q243m484j2727j148J3380O826r442j1680
1756a1300K806J1861N551r401j1427L537J2965J162j0314m468P050O067l274p807
1770f992o77Q589M442p586p327N914Q655l439r182j09Q993O427o697j1907P09
1785a0187J4193N991j1076j0227M983J1075K203q523p590M609J0677p66r532j911
1799f081P540K881n379m643M325P188l39j0071m528R869R179n805j1959N90J1241
1814D008N612p475j0750J604J3431M786j0919r505O457J0078p30q502l524O240
1828H11O718m064q740J910R761L74r432l132Q140P223n203j0627j161J2101Q756
$$ plain form
1727 3068 -9554 -5959 7526 8894 -1790 -8326 -2733 7250 7962 -2524 -8966 -1849 6501 2909
1741 2909 -4346 -2528 3239 2336 -4395 -6730 -268 7975 3491 -9236 -10384 2996 9822 380 -11300
1756 -11300 -8494 3367 8918 -483 -11910 -8373 4592 5754 -4560 -9028 -1978 4089 815 -6992
1770 -6992 -7669 920 5362 -2224 -9551 -3637 5018 1579 -7603 -7712 1281 7708 1011 -10896 -10187
1785 -10187 4006 9997 -1079 -11306 -6323 4752 6955 -1568 -9158 -4549 6128 5362 -4170 -6081
1799 -6081 1459 4340 -1039 -5682 -1357 5831 5492 -4579 -9107 762 9941 4136 -7823 -7233 4008
1814 4008 9620 2145 -8605 -7001 6430 11216 297 -9208 -2751 7327 6597 -1905 -5429 811
1828 811 7529 3465 -5275 -3365 6396 6770 -2662 -5794 2346 9569 4366 -6261 -7422 4679 13435
1843A3435r866j3210L383J3658L045j0170p725M860J0511J84j0914m439Q995O713
1857H460o032q014L093P428R22p776n391O975R302l806j2408j053J1500N846q367
1872F79r052J859J1049L767r662r733N433J2114o50r958l773O033N774k627p164
1887e911J87Q162K294q421n242P018P940l720q668j977Q915P226n851j1897J059
1902h886J2568M639r351q474M138R388K012q304o257O023R105k925r569k6P608
1917A689K917n183m599L097O994o77r182k778J0041O879p171r719J926J0178M252
1932H664p603r910L585J2239K236j1289o242P255P945j808p468k274O304N330
1946F964m999o963L188Q551q36p556k616O476N332l263q375m06R925N249q766
$$ plain form
1843 13435 3569 -9641 -6258 7400 10445 275 -7450 -2590 7921 8105 -2809 -7248 1747 8460
1857 8460 2428 -5586 -2493 4935 5857 -1919 -7310 -335 8967 5161 -7247 -8300 3200 9046 679
1872 679 -8373 -6514 4535 8302 -1360 -11093 -5660 6454 5804 -4154 -7927 -1894 3880 1253 -5911
1887 -5911 -5724 2438 4732 -3689 -8931 -1913 6027 2307 -6361 -8338 577 7803 1952 -9945 -8886
1902 -8886 3682 8321 -1030 -9504 -5366 4022 6034 -2270 -8527 -2504 6601 3676 -5893 -5919 1689
1917 1689 4606 -577 -5176 -2079 4915 4238 -4944 -7722 2319 9198 2027 -7692 -5766 4412 8664
1932 8664 1061 -8849 -5264 6975 9211 -2078 -8320 -1065 6880 5072 -2396 -4670 1634 6964
1946 6964 1965 -4998 -1810 6741 5905 -1651 -4267 2209 7541 4278 -4097 -4503 5422 10671 1905
1961A905q806M681R715J261q550n591M068R352m16r800l235P767N373m312n960
1976b548J135N481J413n894m819N912P542l516r890j80Q164M888n647p527N20
1991d966Q849M199q427p657M862Q917n09q154l650N270O438k480p618p46P746
2006B074K719o321m683M286N716j791o606j731O828O006n241j0081J854J0842
2020C871L004q209p089K724Q936K460p740o698N642Q013k416p728l46O087K809
2035C320m300m966J725P363O47q355l314P734N658m520p055q0P684M106n793q223
2051h369L089J0607J297r465n512N921P547m22p439l743O129O120m127p045K542
2066b870P026k68o041k863N435N898j985r291j134R475N342o750q200L033Q139
$$ plain form
1961 1905 -6901 -2220 7495 8756 206 -5385 -1317 8035 7619 -2181 -5416 2351 7724 3412 -2548
1976 -2548 -1413 4068 5481 -413 -5232 680 8222 4706 -5184 -5364 2800 7688 2041 -5486 -4966
1991 -4966 3883 8082 -345 -8002 -3140 5777 5268 -2886 -6536 -1266 5172 2692 -4926 -5672 2074
2006 2074 4793 -1528 -6211 -1925 3791 2000 -4606 -6337 491 6497 1256 -8825 -6971 3871
2020 3871 6875 -1334 -8423 -5699 3237 5697 -2043 -8741 -3099 4914 2498 -5230 -5576 511 3320
2035 3320 -980 -5946 -4221 3142 3789 -4566 -7880 -146 5512 992 -6063 -6143 1541 5647 -146 -8369
2051 -8369 -5280 5327 6624 -2841 -8353 -2432 5115 4693 -2746 -6489 -360 5760 1633 -5412 -2870
2066 -2870 4156 3888 -2153 -5016 419 6317 4332 -4959 -6093 3382 8724 1974 -6226 -3193 4946
2081D946K216o714o352M372Q852r14r532k063P884M903n071o447R50P140K720
2096F890o285n486N119P018l431p676J42P539L440n226p855J872R694L100r607
2111g52o902N928Q634j452p464l395N253O378l168p561L69Q289J077o788l626
2126e180M391N428j255o312k605O237M910m740o956K346P372P20o760m393M219
2141b578P523l0r254m105P570O998m421o964m78N818L782m019n219J933O193j59
2157B590o698j505N888L807l855n784O26O518K832m978o265L260Q177r94p181
2172c562k232M979N273k356o698j161P238M175n635n745K551N941J013m719l512
2187d450K993N058j024n988n72O648K298n593m423K943O523J341o257n354M590
$$ plain form
2081 4946 7162 448 -5904 -1532 7320 6406 -3126 -5189 2695 7598 2527 -3920 -2970 4170 6890
2096 6890 605 -4881 238 7256 3825 -3851 -3709 3830 7270 2044 -5811 -3939 5755 8855 -752
2111 -752 -7654 -1726 6908 5456 -2008 -5403 -150 6228 3060 -4501 -4132 4157 5234 -1554 -5180
2126 -5180 -789 4639 3384 -2928 -5533 704 5614 874 -6082 -3736 3636 4356 -2404 -6797 -2578
2141 -2578 4945 4915 -4339 -8444 -874 6124 1703 -5261 -5739 79 3861 -158 -5377 -3444 2749 2590
2157 2590 -4108 -5613 275 4082 227 -5557 -4931 1587 4419 -559 -6824 -3564 4613 3619 -3562
2172 -3562 -5794 -815 4458 2102 -4596 -5757 1481 5656 21 -5724 -3173 2768 3781 -938 -4450
2187 -4450 -1457 3601 2577 -3411 -3983 2665 4963 -630 -5053 -2110 4413 5754 -503 -5857 -1267
2202a267P402j021p239j425M778L716k431m298L30M652K181n345m017M525N327
2217E868k231n414r54N019L362k605n699L08O902J613o416m404M713N991j092
2232D961o315l482M860O678k312p341o23N894K839l736l654J146M110Q47n499
2247a627k515N664M591m596o705J604O843J773m830n670K428P228P56p339l659
2262f054N924N253k993o121o82N516L905l745o504J502P084N52o402k407M469
2277g03L894j984m976r59O037K930n726n349M011P120p07o849l331M362O230r58
2293C042p270j936O477L958m203n388K328M753J021m584l399L562N655k127o681
2308d792l0O687K349m776m107K061N509P88n967l470M984O642k778p478o06O020
$$ plain form
2202 -1267 6135 5114 -2125 -3550 1228 4944 2513 -1785 -1455 3197 5378 33 -3984 541 5868
2217 5868 3637 -1777 -2731 2288 5650 3045 -2654 -2346 4556 6169 -247 -4651 62 6053 4961
2232 4961 -1354 -4836 24 6702 4390 -2951 -3574 2320 5159 1423 -2231 -1085 3025 3872 -1627
2247 -1627 -4142 1522 6113 1517 -5188 -3584 3259 5032 202 -5468 -3040 4188 4944 -2395 -6054
2262 -6054 -130 5123 2130 -3991 -4673 843 4748 1003 -5501 -3999 3085 3637 -2765 -5172 -703
2277 -703 3191 1207 -3769 -4728 1309 4239 -1487 -6836 -2825 4295 3588 -3261 -6592 -2230 4000 3042
2293 3042 -4228 -6164 313 4271 68 -5320 -2992 1761 2782 -1802 -5201 -1639 4016 1889 -4792
2308 -4792 -4822 1865 4214 -562 -4669 -2608 2901 3689 -2278 -5748 -764 5878 3100 -4378 -4984 1036
2324A036L904k297o128o25O072L037m848l827L490L841j430m268j88M271K308
2339D348l465n178K676O792k53o224l432M951N103j464n978k414N495N695m066
2354B586o603P76N966J975l528m219J380M632P75m610k257M360K652l635l150
2369b900J377M521M27m311l488L235N692r44o948k112N884M225k419n812p43M603
2385B87L913l476n175J640M867J5m055j265K808K190j530l494j70M979J598n030
2401a898l539L378M986r41n076k894L859N773j383p167q80N644L475l274m427
2416d364M01M029J501k259l177J423L899j581l707R31M124Q57l875l067J974N489
2432B598R27o089l400M523N771j921o022j347M317M880k007n829p42N651K634
$$ plain form
2324 1036 4940 2643 -3485 -4110 1962 4999 151 -3676 -186 3655 2225 -2043 -2231 2040 4348
2339 4348 883 -4295 -1619 5173 4920 -1304 -4736 215 5318 3854 -2124 -4538 957 6652 2586
2354 2586 -4017 -3241 2725 4700 1172 -3047 -1667 2965 3740 -870 -3127 1233 3885 250 -2900
2369 -2900 -1523 2998 3425 -886 -4374 -1139 4553 3609 -3339 -5451 433 4658 2239 -3573 -4316 287
2385 287 4200 724 -4451 -2811 2056 2071 -1984 -3249 -441 1749 219 -3275 -3445 1534 3132 -1898
2401 -1898 -5437 -2059 2927 1986 -3090 -5984 -2125 3648 2265 -4902 -5782 -138 3337 63 -4364
2416 -4364 -3963 66 1567 -692 -3869 -2446 1453 -128 -3835 -2904 1220 2077 -1798 -4865 -2891 2598
2432 2598 3525 -2564 -5964 -1441 4330 2409 -3613 -4960 -643 4237 2230 -3599 -4341 1310 3944
2447C944l957l210K400K987Ml368j027L096K931l174l870K194N131m35m794k708
2463c856M074M839o28n845k792N604M828l087n663O17M517K446l112l697R05M486
2479C636Q04m344j928M502J990k772l280J006M153Q41l927l526K830N735j091
2494D629o215j146N065L136k140n234n53M565L421l546m641J819L928K34l553
2509b31j565K031L105j233l991j16M679M46m638k047L462L854j219m933k281M471
2525b06M736k228o538o5N889K017l099m100O44L671K027l035l177K106L297j626
2541C13k813Q50K979p4k406j952J752L891k90n432j394N037L612k705n204l39
2557d175M263M047k561n296k77N448J715l359k111O87K511N12k253j245K520J853
$$ plain form
2447 3944 -13 -3223 -823 2164 2168 -1200 -2227 869 3800 626 -3244 -1050 4081 3646 -1148 -3856
2463 -3856 218 5057 4429 -1416 -4208 1396 6224 3137 -2526 -1909 2608 5054 1942 -1755 -850 3636
2479 3636 4440 96 -1832 2670 4660 1888 -1392 -386 3767 4608 681 -2845 -15 5720 4629
2494 4629 -1586 -2732 2333 5469 3329 -1905 -2458 2107 5528 1982 -2659 -840 3088 3322 -231
2509 -231 -1796 235 3340 2107 -1884 -2000 2679 3125 -1513 -3560 -98 3756 2537 -2396 -4677 -206
2525 -206 4530 2302 -4236 -4301 1588 3605 506 -3594 -2950 721 2748 -287 -3464 -1358 1939 313
2541 313 -2500 -1650 1329 1255 -1151 -3103 -1351 2540 2250 -3182 -4576 461 4073 1368 -3836 -4175
2557 -4175 88 4135 1574 -3722 -3999 1449 3164 -195 -2306 -1619 892 1404 -849 -2094 426 2279
2573B279k625k382K545L072j454l198r94L034L890j224n366j201M694L976l046
2588B000m157k03L731K486j632l694KL964O35k906p28J929J059j646j678J176
2604C38K694P52l779k845L847M107j976m913j142L852L448j170n017j983M571
2619G84L378k595l715M95K338J088j331k011N84K088q16k890P99L676n01l630
2635b259j395K771L113r10m071k734M179M696k039n538m05M225K515j750l478
2650c080o71L340K302k606k753J380K194q35j996M16J852J066k041k606J445M009
2666A416j71m664j685L615L149j334l425j768L194L613j434m779K8M075J213k815
2682a772j888R48K411L05k341j432K865K385k745k801K082K861Q3k915j745K316
$$ plain form
2573 2279 -346 -2728 -183 2889 1435 -1763 -2757 277 4167 2943 -2423 -3624 1070 5046 2000
2588 2000 -2157 -2360 1371 3857 2225 -1469 -1467 2497 3132 226 -502 1427 2486 840 -838 338
2604 338 3032 3784 5 -2840 1007 5114 3138 -1775 -2917 935 4383 3213 -1804 -3787 784
2619 784 4162 1567 -2148 -1653 685 1773 442 -1569 -985 1103 287 -2603 -1804 1872 1371 -2259
2635 -2259 -3654 -883 2230 1320 -2751 -5485 -1306 3390 1351 -4187 -4592 -367 2148 398 -3080
2650 -3080 -3751 -411 1891 -715 -3468 -2088 106 -729 -2725 -2309 -457 609 -1432 -4038 -2593 1416
2666 1416 1245 -3419 -5104 -1489 1660 326 -3099 -4867 -1673 1940 506 -4273 -4245 -170 1043 -1772
2682 -1772 -3660 -2712 -301 4 -2337 -3769 -904 1481 -1264 -4065 -1983 878 961 -1954 -3699 -1383
2698a383L669k82m510j009M076K673k470l149M19L128K134k354k896J071L750
2713B867j08l372n4K382J105j312k179O76K865P89l038k550L169K927j706l098
2729f37p77K895K216j086l915j33M208J305l271k717J838K274L62k077j463J135
2745A57K317o41k620O30K312l6k071o58J588K109q69k900j023L328K380k500l341
2762a838Q90K935J179j943k479J51K800J303k755j933J867J730o52j304m32R80
2778D99N26o73j547N74K469j072k951J76K436J077j522k082p81K885J838j788
2794F4l193M28K661R73j465j393n29J660J152j242j071J314M44j237n08J410J120
2811E88n55j504r98J541K676m98k962q02K380J723o61j847j279J543K456m15k506
$$ plain form
2698 -1383 2286 2004 -2506 -3515 561 3234 764 -2385 -1966 1162 3296 942 -1954 -883 2867
2713 2867 2759 -613 -667 1715 2820 1508 -671 5 2870 3659 621 -1929 1240 4167 2461 -637
2729 -637 -1414 1481 3697 2611 -1304 -1437 2771 4076 805 -1912 -74 2200 2562 485 -978 157
2745 157 2474 1833 -787 -157 2155 2119 48 -610 978 3087 2218 -682 -1705 1623 4003 1503 -1838
2762 -1838 -948 1987 3166 1223 -1256 -1105 1695 2998 243 -1690 177 1907 1255 -49 -481 499
2778 499 1025 352 -1195 -621 1848 776 -2175 -1999 437 1514 -8 -2090 -2871 14 1852 64
2794 64 -3129 -2701 -40 933 -532 -1925 -2454 -794 358 -884 -1955 -641 -197 -1434 -1942 -532 588
2811 588 33 -1471 -2469 -928 1748 1250 -1712 -2514 -134 1589 928 -919 -2198 -655 1801 1386 -1120
2828a120n64K396N57j005n80J23J65O82m76q58J950K84k148j233K187K176l16
2845B220k874j445J533L509J83l839k122L118K364p98j783j045J175J774l24k031
2861c85M37K372o00k351M80K116M17j361j615j31K946J143k931k422K316K750
2877C181m35k957j163J914K786o59k932j193K879J462j925j288P09J200j45j263
2893A71r02K049J465k267k808J102L755P0l226j963J443K586O88k784j756J690
2909f87K532j636j979Q97J299K57j523j416J267K179m24l103l55K820J339k396
2925i29j532J040J676K57k018j852K055K684r44l626M96K389J017q95k213k41
2941b636K410J153k569j318J738K126j280k262P98J854R92j260k505M61L051L46
$$ plain form
2828 -1120 -1684 712 1269 264 -316 -193 -28 654 178 -680 1270 1554 -594 -1827 360 2536 2220
2845 2220 -654 -2099 -566 2943 3126 -713 -2835 283 2647 1849 66 -979 196 1970 1646 -385
2861 -385 52 2424 1824 -527 -47 2069 2486 1125 -490 -621 2325 3468 537 -1885 431 3181
2877 3181 2746 -211 -1374 540 3326 2667 -265 -1458 1421 2883 958 -330 379 1579 1434 171
2893 171 -731 1318 2783 516 -2292 -1190 2565 2635 -591 -2554 -1111 1475 2163 -621 -2377 -687
2909 -687 1845 209 -1770 -873 426 683 -840 -2256 -989 1190 766 -2337 -2692 128 1467 -929
2925 -929 -2461 -1421 255 512 -1506 -3358 -1303 1381 437 -3189 -2693 -304 713 -182 -2395 -2636
2941 -2636 -226 927 -1642 -2960 -1222 904 -376 -2638 -1840 14 1006 -254 -2759 -2298 753 1099
2957A099k274m02J637J89j088k43K47J688Q60k663j828K855K205r90k421m87J583
2974c3J830l31k002l02J346Q68j306j46J281L5j011n18P65M07P38j165j163P01
2992fK183r04j615M79J278J43q60m47m40J276J283j282j391N38Q34j53K34J81
3010A331p49p81M89L58O83K84j407j194Q73J317m2o70l27p39k48J858j23n98p92
3029d77k9p08J320J110r16j646R2O60L61K44p73j144Q72J061q99j137P19J065
3047b25q75m91K43l0L0N51m82j41O37k63j335O68J529n89j131l57o8J666J267
3066F04j461k052P65J730k29o46N18k47l34j03M7J80J381k24j809o65K286J309
3084A050j218j053o83R49J443m71j011j22J594m41j303P59J348j5q93j004L97
$$ plain form
2957 1099 -1175 -1577 60 249 -839 -1082 -835 853 1713 -950 -2778 77 2282 1292 -1129 -1616 -33
2974 -33 1797 1466 -536 -838 508 1376 70 -76 1205 1240 229 -289 476 883 1621 456 -707 -6
2992 -6 2177 1273 -342 137 1415 1558 698 251 -189 1087 2370 1088 -303 235 1069 916 1150 1331
3010 1331 582 -199 290 648 1331 1615 208 -986 -113 1204 1162 492 165 -574 -822 1036 913 315 -477
3029 -477 -506 -1214 106 1216 300 -1346 -1254 -594 -233 11 -762 -1906 -1034 27 -872 -2009 -1290 -225
3047 -225 -1100 -1591 -1348 -1378 -1348 -797 -1279 -1420 -783 -1046 -2381 -1713 -184 -773 -1904 -2261 -2329 -663 604
3066 604 -857 -2909 -2144 -414 -643 -1289 -771 -1018 -1352 -1455 -1408 -1228 153 -71 -1880 -2545 -259 1050
3084 1050 -168 -1221 -1904 -955 488 17 -994 -1116 478 37 -1266 -507 841 826 -67 -1071 -674
3101f74J839O18j896j528J950J308r98j314L77R76J119r25j842M44K117O83j953
3118C01p65J225L57L92q55k73P74O58j601p91J610K052k020k261Q68K130Q24p87
3136A838j768p79J956J255j558p07J106q0q71q3N80O12L48j442j037J392J737
3153B499j034j998K53J363O51j046r25M46N41L35q32n80J111M60q87m02O30k11
3171C74J0o52k0P08N87j336j012Q10J729k62j132p88N8J316N76p80q86J83M02
3190a15j61L53O02o63j019Q1J145N43J13q69j375P19J874j58j351k98P35J25K25
3209E06k82m30N4P94p16m68Q83K56r84l50J168P6j25l85q16N98J431k84j802r3
3229i69J532o2J41n77j247N20J302J5r51K76K87p88k5J255L75m24q18j263J260
$$ plain form
3101 -674 1165 1783 -113 -1641 309 1617 619 -695 -318 658 1777 852 -990 -546 1571 2254 301
3118 301 -464 761 1118 1510 655 382 1156 1814 213 -578 1032 3084 1064 -1197 -329 1801 2625 1838
3136 1838 70 -709 1247 2502 944 237 1343 1263 392 309 889 1501 1849 407 -630 762 2499
3153 2499 1465 -533 -280 1083 1734 688 -237 209 750 1085 253 -327 784 1244 357 -45 585 374
3171 374 384 -268 -288 420 1007 -329 -1341 -531 1198 936 -196 -984 -926 390 966 186 -700 -517 -115
3190 -115 -276 77 679 16 -1003 -922 223 766 879 10 -1365 -646 1228 1070 -281 -579 156 281 506
3209 506 224 -206 -152 642 -74 -542 341 597 -387 -737 431 507 382 -3 -819 -221 1210 926 -876 -969
3229 -969 563 501 642 65 -1182 -662 640 655 -296 -20 267 -521 -546 709 1084 660 -158 -1421 -161
3248a61K079J45k347r38J709J355n83j395n73O29J654k93j385o5J028L04j349
3265a86J56J238k55l05q24J82J158K19j830n94J805R35j239j684K5J306J558j110
3283E55j897l08K030N30j293r00R24L45k45l47n76P79Q07j313j326J276J679q64
3301a44j594q6J229Q79m5j423m35J463L95q36r13R81Q25p14l31o46N86J031O1
3320B83j858J4J318N07q10l44l47O48L89j25q80K37J176p59r09O04L76M57l91
3339d14q99k99J019J234j339j446J115J266l32p66r10O82J408M59j611j165J852
3356a46O36p11n34N45K09J25k82k99Q78Q59j137j361Q35K192j94j896q00O82J909
3375A510J146k227j789J138K207l14j043m68K56N79J59l26r32J148L39r29j99
$$ plain form
3248 -161 1918 2063 -284 -1222 487 1842 1259 -136 -709 -80 1574 1281 -104 -169 859 1163 -186
3265 -186 -30 1208 953 648 -176 6 1164 1383 -447 -1041 764 1699 460 -1224 -1199 107 1665 555
3283 555 -1342 -1650 380 910 -383 -1283 -359 -14 -259 -606 -1182 -403 404 -909 -2235 -959 720 -144
3301 -144 -1738 -1824 -595 284 239 -1184 -1619 -156 239 -597 -1510 -529 296 -418 -749 -1395 -809 222 283
3320 283 -1575 -1561 -243 264 -546 -890 -1237 -589 -200 -325 -1205 -968 208 -551 -1460 -856 -480 -23 -414
3339 -414 -1313 -1612 -593 641 -698 -2144 -1029 237 -95 -861 -1771 -1089 319 778 -833 -1998 -146
3356 -146 490 -221 -755 -210 -1 124 -158 -457 421 1280 143 -1218 -383 1809 1615 -281 -1081 -399 1510
3375 1510 2656 429 -1360 -222 1985 1671 628 160 416 995 1154 828 -104 1044 1383 454 255
3392B55P40M16r54o11N58N74Q53q90j919K18J989Q79j902q77L93J115J247j408
3410F76j700k3K062M23p73j057K33K53M70m14m0O80M53j840r30K121J090q43j968
3429a127k65J477J780m82l357j68K498J437j455j501J2J364O28j031r26O48J458
3446I90q43k120N10K373l89j677j031J657K018q32k963j145L204K928k328k804
3462b452l28K654J714j276k359J79K405L58k207m50K193L86j384j158R93K165
3478A433J26k447j710J708L485n91l200n51K170J862j497j936o39K679K185k872
3494B05k121J504K652m31k173o53J441J588n80k624J84L084N86k842j429K053
3510D44K463n01l028j476K568K753q65l933p6L081J296j844j619L38K139L28k544
$$ plain form
3392 255 995 1411 457 -154 404 978 1831 941 -978 -760 1229 2108 206 -671 -278 837 2084 676
3410 676 -1024 -1047 1015 1438 665 -392 -159 94 564 150 110 790 1243 -597 -1527 594 1684 841 -1127
3429 -1127 -1392 85 1865 1383 -1974 -2142 356 1793 338 -1163 -1151 213 841 -190 -1116 -468 990
3446 990 147 -1973 -1463 910 521 -1156 -2187 -530 1488 656 -2307 -3452 -248 2680 352 -2452
3462 -2452 -2780 -126 1588 312 -2047 -1868 537 895 -1312 -1762 431 817 -567 -1725 -732 1433
3478 1433 1559 -888 -2598 -890 2595 2004 -1196 -1747 423 2285 788 -1148 -1787 892 3077 205
3494 205 -1916 -412 2240 1809 -364 -1017 424 2012 1432 -1192 -1008 2076 2662 -180 -1609 444
3510 444 2907 2406 -622 -2098 470 3223 2358 -1575 -1651 1430 2726 882 -737 -399 1740 2068 -476
3527d76j253K900K134k412k989Q65L018N42k019k121J260K848k50l544m18K945
3543A030J697k054k777Q07K874P46k681k329J401L227k71k699r93J792J193j097
3559a34j243M05J887K78k599j509K359K107j066k357j41J424J460p08k570M87
3575a920K488M99k515j042J396J849Q4k100j184J302J987J14k426q15J305J175
3591A97k54l88k30M17o0n26k07R67J624j420k334L65K200J384q55k474n52K518
3609C72K016j712j745m6J756P60j038j293K29K061L9j549j024J831J409j191j398
3626e23K28J218O04j051j588J857K039j307l186P6K837K634j357m027j021L225
3642F58L415k078l244o26K902J193j307j641Q49J289m03k191N75K757P80l623
$$ plain form
3527 -476 -1729 1171 3305 893 -2096 -1231 1787 2329 310 -1811 -551 2297 2047 -1497 -1915 1030
3543 1030 2727 673 -2104 -1297 1577 2323 -358 -2687 -1286 1941 1670 -1029 -2022 -230 963 -134
3559 -134 -1377 -972 915 1193 -1406 -2915 -556 1551 485 -1872 -2013 -589 871 163 -2407 -1920
3575 -1920 568 1067 -1448 -2490 -1094 755 839 -1261 -2445 -1143 844 958 -1468 -2283 -978 197
3591 197 -57 -445 -675 -258 -318 -844 -1051 -84 1540 120 -2214 -1849 351 1735 880 -1594 -2146 372
3609 372 2388 676 -1069 -1115 641 1401 363 -930 -701 1360 1399 -150 -1174 657 2066 875 -523
3626 -523 -295 923 1527 476 -1112 745 2784 1477 -1709 -1633 1204 3838 2481 -1546 -2567 658
3642 658 4073 1995 -1249 -1875 1027 2220 913 -728 121 1410 1007 -1184 -609 2148 2928 -695
3658f95k017K457L035L14l998k327K741L708j043m469k93M184J662k483l961N19
3674b666M191J930l601l419K202L284k44l493m23L135R26k386k565J751M062j74
3690B510n294k189M330M792k064n597j347M981L636l043m497Q65M862j1m176j758
3706d000L456L312k067m526l92M927K666m209m132K624M928o73m334j887M039
3721b68L592k430n059J94O001K266n052m416K604N175L62m483k523L112L767k203
3737F39l997J337M319L47m332k657L330M876j017n553j790M933M014k918m410
3752b879Q41L723J393l028l330K521M451r20m844j323M321K829j766m234J06L569
3768A430J746k775k511K232K907j330l740J13L952K377l294l842N89M668J857
$$ plain form
3658 -695 -2712 -255 2780 3094 -904 -3231 -490 3218 2175 -2294 -2587 1597 3259 776 -3185 -2666
3674 -2666 1525 3455 -146 -3565 -1363 1921 1677 -1816 -2239 896 1822 -564 -3129 -1378 2684 2510
3690 2510 -2784 -4973 -643 4149 2085 -3512 -4859 122 3758 715 -3782 -2917 1945 1934 -2242 -4000
3706 -4000 -544 2768 701 -3825 -4217 710 3376 -833 -4965 -2341 2587 1914 -2420 -4307 -268
3721 -268 3324 894 -4165 -3971 2030 4296 -756 -5172 -2568 2607 2969 -1514 -4037 -925 2842 639
3737 639 -3358 -2021 2298 2645 -1687 -4344 -1014 3862 2845 -2708 -4498 435 4449 1531 -2879
3752 -2879 -2038 1685 3078 50 -3280 -759 3692 2772 -2072 -3395 926 3755 1989 -2245 -2139 1430
3768 1430 3176 401 -2110 122 3029 1699 -2041 -1928 2024 4401 1107 -2735 -2146 2522 4379
3783D379l761l488J923L487R8k933r91J848J897j240k912N13L198Q90k799k355
3799b246J895K896k45k663j709J842K651j409k684N11K712P92k812k063J361L030
3815A859J003k919k957J713L139l17j968j580J162J793l91j300p1J517K30k369
3831a456j047K082K719j315l205r33J901L348m60l847q68K980J941j324l152K48
3847b388K993J284k474k821J541L368M85l193j336J957J853o47k371L18K529N59
3863A657l029j809K849L402j417m429j126M087M115j647n471j342M902L204k739
3878A207l698N89L244J258k626k161K192L394j967l923M76M457J244l796k908
3893c018J881M721J71n068k252M139M371k584n600q3N450L284l670n357J045N199
$$ plain form
3783 4379 618 -2870 -947 2540 2638 -295 -1286 562 2459 1219 -1693 -1180 2018 2908 109 -2246
3799 -2246 -351 2545 2300 -363 -2072 -230 2421 1012 -1672 -1161 1551 2343 -469 -2532 -1171 1859
3815 1859 2862 -57 -3014 -1301 1838 1521 -447 -2027 -865 928 537 -763 -834 683 913 -1456
3831 -1456 -2503 -421 2298 983 -2222 -3155 -1254 2094 1634 -2213 -3081 -101 1840 516 -2636 -2388
3847 -2388 605 1889 -585 -3406 -1865 1503 1988 -1205 -2541 -584 1269 622 -1749 -1431 1098 1657
3863 1657 -1372 -3181 -332 3070 1653 -2776 -3902 185 4300 2653 -2818 -4160 742 3946 1207
3878 1207 -2491 -1902 1342 2600 -26 -2187 5 3399 1432 -2491 -2015 2442 3686 -110 -3018
3893 -3018 -1137 3584 3755 -1313 -3565 574 4945 2361 -3239 -3322 2128 5412 1742 -3615 -2570 2629
3909B629K074m684k807K352L458j004l606L8L740J338l935l407L106N477j009
3924C760o317j890M885M770k119o092j296N655L753l625n260J485N144N14m596
3939a229k410K769M649j556m764p72M808K124m171l125K632M252n91n273j985
3954d642M905M636l191o522L38N822L397m540m832O94N781K042m616m006L209
3969a525M342j743l951m29M225J567l260l795K353M945k60n340k277M807M230
3984C889k732m818k39M545L680l875n334J714N709J408n078l068K525M496j8m097
4000a293k010L638K734k697k861J193M079n52l771j732L575M363k085n713p81
4015c913N733L369l663n217P69N120K019l335l893J877M126K3m050j489L079K374
$$ plain form
3909 2629 4703 19 -2788 -436 3022 2018 -1588 -1550 2190 3528 -407 -3814 -708 4769 3760
3924 3760 -2557 -4447 438 5208 3089 -3003 -4299 1356 5109 1484 -3776 -2291 2853 3367 -1229
3939 -1229 -3639 -870 3779 2223 -2541 -3313 1495 3619 -552 -3677 -1045 3207 2616 -2657 -4642
3954 -4642 263 4899 1708 -4814 -4476 1346 4743 203 -4629 -3935 1846 3888 -728 -4734 -1525
3969 -1525 2817 1074 -2877 -3306 919 2486 -774 -4569 -2216 2729 2469 -2871 -5148 -341 3889
3984 3889 1157 -3661 -3900 645 4325 450 -4884 -3170 2539 3947 -1131 -4199 -1674 2822 2804 -1293
4000 -1293 -3303 335 3069 372 -2489 -1296 2783 2231 -1540 -3272 303 4666 2581 -3132 -3913
4015 -3913 1820 5189 1526 -3691 -2922 2198 4217 882 -3011 -1134 2992 3015 -1035 -2524 555 2929
4031B929j261l588M60L512J090l416k976L223M090j708m610j025M749L567l018
4046B018n449K8O153K911m516m867J074N206J342l412l276J773L805l95m051m70
4062b126L751J496l632k596K340L719k5n058k211M326M593k195o036q93N848L235
4078D536l467n567N22N751K159m458m129K457M477l49m039j174L082J981k021
4093b39l291J555M128l8m896j987M206M318j502o364j764N942M700l391o215K91
4109d547O050K933m182m134J072M651Q10l525k472K982L216j996l818R33M368
4124B341N90l766l473L237N173j022o311j814N704M834l227o311n33N505M737
4139E664l674o069L64O543J278m265l068K688L595j069l913l30M460J464m380
$$ plain form
4031 2929 1668 -1920 -1460 2052 3142 -274 -3250 -27 4063 2355 -2255 -3280 1469 5036 2018
4046 2018 -3431 -3403 2750 5661 1145 -3722 -2648 2558 3900 488 -2788 -1015 2790 2395 -1656 -2126
4062 -2126 1625 3121 -511 -3107 -767 2952 2927 -2131 -4342 -16 4577 2382 -3654 -4547 1301 4536
4078 4536 1069 -4498 -3976 1775 3934 -524 -4653 -2196 2281 1932 -2107 -3281 -199 1782 -239
4093 -239 -3530 -1975 2153 2115 -2781 -4768 -562 3756 2254 -4110 -5874 68 4768 1377 -4838 -4547
4109 -4547 1503 4436 254 -3880 -2808 1843 2653 -872 -3344 -362 2854 858 -2960 -2027 2341
4124 2341 2931 -835 -4308 -1071 4102 3080 -3231 -5045 659 5493 2266 -4045 -4578 927 5664
4139 5664 1990 -4079 -3715 2828 4106 -159 -3227 -539 3056 1987 -1926 -2256 2204 3668 -712
4154g12l281L911N052j593n765k455N495N478k134p410j283O716M148m453n817
4169d103J359N843J902m370m475K949M620p06m818l72M264J549l874l328K864
4184f96M758m15o156k505N603M957k974p061p21O784M210l634o937K95O197K968
4200D673m646m148J949M863q87m018r96L249K991k926l946J922M576J7n423k140
4216d890M352M822j616o677j406N909N094m091o768N54O611K805m475m960J637
4231c099N433P85m267k642L410K585k070l330J228M635J57m799k815L845N619
4246D675j738o992j010O154M409l371o381m72O564L664m072n955J604N753Q46
4261C678l900k878K597L784r14m231k10M091J140l962k260L346M124j625n861
$$ plain form
4154 -712 -3993 -82 4970 3377 -2388 -4843 652 6130 3996 -3414 -4697 2019 6167 1714 -4103
4169 -4103 -2744 3099 5001 631 -3844 -895 3725 3019 -1799 -2171 2093 3642 -232 -3560 -696
4184 -696 4062 3647 -2509 -5014 589 5546 2572 -4489 -5210 1574 5784 2150 -4787 -4492 1705 4673
4200 4673 27 -4121 -2172 2691 1804 -2214 -3210 39 3030 104 -3842 -1920 2656 2673 -2750 -4890
4216 -4890 -538 4284 2668 -4009 -5415 494 5588 1497 -5271 -4717 1894 4699 224 -4736 -3099
4231 -3099 2334 3119 -1148 -3790 -380 2205 135 -3195 -1967 2668 2825 -1974 -4789 -944 4675
4246 4675 2937 -4055 -5065 1089 5498 2127 -4254 -4726 1838 5502 1430 -4525 -2921 2832 3678
4261 3678 -222 -3100 -503 3281 2367 -1864 -2074 2017 3157 -805 -3065 281 4405 2780 -3081
4276c081j520N572N036k888p271o69O814L607l910n393N12N287K576m074l815
4291c217J537M392K2l888o18L154J653k662l280J705M916l67m910k741M466M927
4307E089k227n926j657O000M441l139o714q06O781L352l826n021J197M486J027
4322C057l583k421K273L475j820m149Q61N009N9m803l274M549N713j511p071l197
4338f833O266O562l506p118q92N674M734l763o174Q48O531J491m616l551L268
4353a079L994j825l764J23M413J827m766m153L698O454j283p205k596O401N871
$$ plain form
4276 -3081 -4601 971 6007 3119 -4152 -4821 1993 5600 1690 -3703 -3191 2096 4672 598 -3217
4291 -3217 -1680 2712 2734 -1154 -1772 1382 3035 373 -2907 -1202 3714 3347 -1563 -4304 162 5089
4307 5089 2862 -3064 -4721 1279 5720 2581 -4133 -4939 1842 5194 1368 -3653 -2456 2030 3057
4322 3057 -526 -2947 -674 2801 981 -3168 -2307 2702 2761 -2042 -5316 -767 4946 3435 -3636 -6833
4338 -6833 -567 5995 2489 -4629 -5521 153 4887 1124 -5050 -4202 2329 3820 -796 -4347 -1079
4353 -1079 2915 1090 -2674 -2551 1862 3689 -1077 -5230 -1532 4922 3639 -3566 -6162 239 6110
$$ [...]
8191A36
##END NTUPLES=NMR FID
##END=
