##TITLE=1H_CG-1102-5
 CDCl3, 8 sc, 
 12.4.2019
##JCAMPDX= 6.0         $$ Bruker NMR JCAMP-DX V2.0
##DATA TYPE= NMR FID
##DATA CLASS= NTUPLES
##ORIGIN= UXNMR, Bruker Analytische Messtechnik GmbH
##OWNER= root
$$ XWIN-NMR		Version 3.5
$$ Fri Apr 12 14:27:58 2019 Russian Standard Time (UT+4h)  she@DPX200
##.OBSERVE FREQUENCY= 200.1315
##.OBSERVE NUCLEUS= ^1H
##.DELAY= (6, 6)
##.ACQUISITION MODE= SIMULTANEOUS
##.ACQUISITION SCHEME= undefined
##.AVERAGES= 8
##.DIGITISER RES= 18
##SPECTROMETER/DATA SYSTEM= spect
##.PULSE SEQUENCE= zg30
##.SOLVENT NAME= D2O
##.SHIFT REFERENCE= (INTERNAL, D2O, 0, 15.7039)
##AUDIT TRAIL= $$ (NUMBER, WHEN, WHO, WHERE, WHAT)
$$ ##TITLE= Audit trail, XWIN-NMR		Version 3.5
$$ ##JCAMPDX= 5.01
$$ ##ORIGIN= Bruker BioSpin GmbH
$$ ##OWNER= she
$$ F:/spectra/data/she/nmr/H-F/1/audita.txt
$$ ##AUDIT TRAIL=  $$ (NUMBER, WHEN, WHO, WHERE, WHAT)
(   1,<2019-04-12 14:26:56.59 +0400>,<she>,<DPX200>,
      <created by zg, POWCHK disabled, PULCHK disabled
       configuration hash MD5:
       00 E9 B6 7A A2 85 ED C7 34 08 36 98 17 FE 4E 26
       data hash MD5: 16K
       FC 4B 21 64 4D BE 07 19 2B 28 81 00 76 50 D5 8C>)
$$ ##END=
$$ 
$$ hash MD5
$$ A5 F6 2C 12 6C FF EB DE F2 61 14 98 16 BB 1F AA
##$RELAX= 
##$RELAX= 
##$RELAX= 
##$RELAX= 
##$RELAX= 
##$RELAX= 
$$ Bruker specific parameters
$$ --------------------------
##$DU= <F:/spectra>
##$EXPNO= 1
##$NAME= <H-F>
##$PROCNO= 1
##$TYPE= <nmr>
##$USER= <she>
##$AMP= (0..31)
100 100 100 100 100 100 100 100 100 100 100 100 100 100 100 100 100 100 
100 100 100 100 100 100 100 100 100 100 100 100 100 100 
##$AQSEQ= 0
##$AQ_mod= 1
##$AUNM= <au_zg>
##$AUTOPOS= <>
##$BF1= 200.13
##$BF2= 200.13
##$BF3= 200.13
##$BF4= 200.13
##$BF5= 200.13
##$BF6= 200.13
##$BF7= 200.13
##$BF8= 200.13
##$BYTORDA= 1
##$CFDGTYP= 0
##$CFRGTYP= 5
##$CHEMSTR= <none>
##$CNST= (0..31)
1 1 145 1 1 1 1 1 1 1 1 1 1 1 1 1 1 1 1 1 1 1 1 1 1 1 1 1 1 1 1 1 
##$CPDPRG= <>
##$CPDPRG1= <>
##$CPDPRG2= <>
##$CPDPRG3= <>
##$CPDPRG4= <mlev>
##$CPDPRG5= <mlev>
##$CPDPRG6= <mlev>
##$CPDPRG7= <mlev>
##$CPDPRG8= <mlev>
##$CPDPRGB= <>
##$CPDPRGT= <>
##$D= (0..31)
0 1.2 0 0 0 0 0 0 0 0 0 0.03 0 0 0 0 0 0 0 0 0 0 0 0 0 0 0 0 0 0 0 0 
##$DATE= 1555064815
##$DBL= (0..7)
120 120 120 120 120 120 120 120 
##$DBP= (0..7)
150 150 150 150 150 150 150 150 
##$DBP07= 0
##$DBPNAM0= <>
##$DBPNAM1= <>
##$DBPNAM2= <>
##$DBPNAM3= <>
##$DBPNAM4= <>
##$DBPNAM5= <>
##$DBPNAM6= <>
##$DBPNAM7= <>
##$DBPOAL= (0..7)
0.5 0.5 0.5 0.5 0.5 0.5 0.5 0.5 
##$DBPOFFS= (0..7)
0 0 0 0 0 0 0 0 
##$DE= 6
##$DECBNUC= <off>
##$DECIM= 24
##$DECNUC= <off>
##$DECSTAT= 4
##$DIGMOD= 1
##$DIGTYP= 9
##$DL= (0..7)
0 120 120 120 120 120 120 120 
##$DP= (0..7)
150 150 150 150 150 150 150 150 
##$DP07= 0
##$DPNAME0= <>
##$DPNAME1= <>
##$DPNAME2= <>
##$DPNAME3= <>
##$DPNAME4= <>
##$DPNAME5= <>
##$DPNAME6= <>
##$DPNAME7= <>
##$DPOAL= (0..7)
0.5 0.5 0.5 0.5 0.5 0.5 0.5 0.5 
##$DPOFFS= (0..7)
0 0 0 0 0 0 0 0 
##$DQDMODE= 0
##$DR= 18
##$DS= 0
##$DSLIST= <SSSSSSSSSSSSSSS>
##$DSPFIRM= 0
$$ [...]
##$SUBNAM2= <"">
##$SUBNAM3= <"">
##$SUBNAM4= <"">
##$SUBNAM5= <"">
##$SUBNAM6= <"">
##$SUBNAM7= <"">
##$SUBNAM8= <"">
##$SUBNAM9= <"">
##$SW= 24.9337058887773
##$SWIBOX= (0..15)
0 0 2 0 0 0 0 0 0 0 0 0 0 0 0 0 
##$SW_h= 4990.01996007984
##$TD= 16384
##$TD0= 1
##$TE= 0
##$TE2= 300
##$TE3= 300
##$TEG= 300
##$TL= (0..7)
0 120 120 120 120 120 120 120 
##$TP= (0..7)
150 150 150 150 150 150 150 150 
##$TP07= 0
##$TPNAME0= <>
##$TPNAME1= <>
##$TPNAME2= <>
##$TPNAME3= <>
##$TPNAME4= <>
##$TPNAME5= <>
##$TPNAME6= <>
##$TPNAME7= <>
##$TPOAL= (0..7)
0.5 0.5 0.5 0.5 0.5 0.5 0.5 0.5 
##$TPOFFS= (0..7)
0 0 0 0 0 0 0 0 
##$TUNHIN= 0
##$TUNHOUT= 0
##$TUNXOUT= 0
##$USERA1= <user>
##$USERA2= <user>
##$USERA3= <user>
##$USERA4= <user>
##$USERA5= <user>
##$V9= 5
##$VALIST= <valist>
##$VCLIST= <CCCCCCCCCCCCCCC>
##$VD= 0
##$VDLIST= <DDDDDDDDDDDDDDD>
##$VPLIST= <PPPPPPPPPPPPPPP>
##$VTLIST= <TTTTTTTTTTTTTTT>
##$WBST= 1024
##$WBSW= 4
##$XGAIN= (0..3)
0 0 0 0 
##$XL= 0
##$YL= 0
##$YMAX_a= 466160
##$YMIN_a= -612221
##$ZGOPTNS= <>
##$ZL1= 120
##$ZL2= 120
##$ZL3= 120
##$ZL4= 120
##$ABSF1= 10
##$ABSF2= 0
##$ABSG= 5
##$ABSL= 3
##$ALPHA= 0
##$AQORDER= 0
##$ASSFAC= 0
##$ASSFACI= 0
##$ASSFACX= 0
##$ASSWID= 0
##$AUNMP= <proc_1d>
##$AZFE= 0.1
##$AZFW= 0.1
##$BCFW= 1
##$BC_mod= 2
##$BYTORDP= 1
##$COROFFS= 0
##$CY= 11.3945322036743
##$DATMOD= 1
##$DC= 2
##$DFILT= <>
##$DTYPP= 0
##$F1P= 18.9103706918063
##$F2P= -1.10871071338519
##$FCOR= 0.5
##$FTSIZE= 0
##$FT_mod= 4
##$GAMMA= 1
##$GB= 0.15
##$INTBC= 1
##$INTSCL= 1
##$ISEN= 128
##$LB= 0.24
##$LEV0= 0
##$LPBIN= 0
##$MAXI= 10000
##$MC2= 0
##$MEAN= 0
##$ME_mod= 0
##$MI= 1.114404
##$NCOEF= 0
##$NC_proc= 0
##$NLEV= 6
##$NOISF1= 3.799351
##$NOISF2= 2.8
##$NSP= 1
##$NTH_PI= 0
##$NZP= 0
##$OFFSET= 15.70392
##$PC= 1
##$PHC0= -8854.079
##$PHC1= 14.80026
##$PH_mod= 1
##$PKNL= yes
##$PPARMOD= 0
##$PSCAL= 0
##$PSIGN= 0
##$REVERSE= no
##$SF= 200.130013532006
##$SI= 16384
##$SIGF1= 3
##$SIGF2= 2
##$SINO= 400
##$SIOLD= 16384
##$SREGLST= <1H.CDCl3>
##$SSB= 0
##$STSI= 0
##$STSR= 0
##$SW_p= 3612.71676300578
##$SYMM= 0
##$S_DEV= 0
##$TDeff= 0
##$TDoff= 0
##$TI= <>
##$TILT= no
##$TM1= 0
##$TM2= 0
##$TOPLEV= 0
##$USERP1= <user>
##$USERP2= <user>
##$USERP3= <user>
##$USERP4= <user>
##$USERP5= <user>
##$WDW= 1
##$XDIM= 8192
##$YMAX_p= 0
##$YMIN_p= 0
$$ End of Bruker specific parameters
$$ ---------------------------------
##NTUPLES= NMR FID
##VAR_NAME=  TIME,          FID/REAL,        FID/IMAG
##SYMBOL=    X,             R,               I
##VAR_TYPE=  INDEPENDENT,   DEPENDENT,       DEPENDENT
##VAR_FORM=  AFFN,          ASDF,            ASDF
##VAR_DIM=   8192,          8192,            8192
##UNITS=     SECONDS,       ARBITRARY UNITS, ARBITRARY UNITS
##FACTOR=    0.0002004,     1,               1
##FIRST=     0,             0,               0
##LAST=      1.6414764,     0,               0
##MIN=       0,             -612221,         0
##MAX=       1.6414764,     466160,          0
$$ Real data points
##PAGE= N=1
##DATA TABLE= (X++(R..R)), XYDATA
0@%%%qJ6j6J6k4L2m0N6p2Q8j05J29j60J92k32K73l21L81m40N10n96O84p80Q96
$$ 0 0 0 0 -8 8 -8 8 -16 16 -24 32 -40 48 -57 72 -88 104 -128 145 -176 205 -235 275 -321 363 -417 479
27D79j021J156j312J481j662J868k093K336k608K907l230L583l975M404m875N398
$$ 479 -542 614 -698 783 -879 989 -1104 1232 -1376 1531 -1699 1884 -2091 2313 -2562 2836
43B836n976O620p341Q149r063J0112j1322J2735j4420J6467j9010K2275k6644
$$ 2836 -3140 3480 -3861 4288 -4775 5337 -5985 6750 -7670 8797 -10213 12062 -14582
56a4582L2832m2355N9070r6971L34784P279n87966J35670L79488K58911j94625
$$ -14582 18250 -24105 34965 -62006 272778 280057 -307909 -172239 207249 466160 271535
67B71535k70035j00278J78432J35478j0516j36488j08245m2193J45577J97374
$$ 271535 1500 -98778 79654 215132 204616 68128 -40117 -82310 63267 260641
77B60641o082k91689k33368Q4020L18938J74649j82137l38612m9254K70554J94325
$$ 260641 254559 -37130 -270498 -186478 132460 307109 124972 -213640 -262894 7660 201985
88B01985j21085k07804l1761J53542J45824k6701j81891j25591N4161J55919J23441
$$ 201985 80900 -126904 -158665 -5123 140701 114000 -67891 -193482 -139321 16598 140039
99A40039k604j67964j81318L4855K14257J17731q6640j41732k8657J00324R3064
$$ 140039 137435 -30529 -211847 -176992 37265 154996 68356 -73376 -102033 -1709 91355
110I1355m8267j18298o649J02371O8797j0794n8488q2531k9990P8623R1981q96
$$ 91355 43088 -75210 -81859 20512 89309 78515 20027 -62504 -92494 -13871 78110 77214
122G7214o4993n6497r518M4889K7290n7749m7571O8247Q1656m4808j17876n1482
$$ 77214 12221 -44276 -53794 -8905 18385 -39364 -86935 -18688 62968 18160 -99716 -151198
134a51198O2928J09696L1351q1195o3311L7343L6303k6074m818L7521J4205m665
$$ -151198 -88270 21426 52777 -28418 -91729 -54386 -18083 -44157 -48975 -11454 2751 -1914
146a914J1972j602l0249k7019L204N9884Q5616r252j21964o3199Q1542R0719j4971
$$ -1914 10058 8456 -21793 -48812 -45608 14276 99892 90640 -31324 -94523 -12981 77738 62767
159F2767o9441l1164M7844P3264j9723j08671m0875Q3261Q3031O784m2419o3305
$$ 62767 -6674 -37838 10006 83270 63547 -45124 -85999 -2738 80293 87077 44658 -18647
171a8647m5222K8795P2609L9529j3311n4088n8553J5166P7067R757p2705k7263
$$ -18647 -63869 -35074 37535 77064 63753 9665 -48888 -33722 43345 53102 -19603 -46866
183d6866N3944M1968j4451m9517m6084R327N8479K8899j6057j3080j6809l0794
$$ -46866 7078 49046 34595 -14922 -61006 -51679 6800 35699 19642 6562 -10247 -41041
195d1041P232M3569J2986j1231Q344O021j3446r435p951l49L9350L9977k9939
$$ -41041 -33809 9760 22746 11515 19859 25880 12434 2999 -4952 -5301 34049 74026 44087
208D4087m7310J0309K3600j4810j9645P605L0760K7866k8507q0165k1895P0654
$$ 44087 -3223 7086 30686 15876 -3769 3836 34596 62462 33955 -46210 -68105 2549
220B549M8526k9291l5481q412m307P435J6937j889j2452p238n757K1933M6070
$$ 2549 51075 21784 -13697 -22109 -26416 -18981 -2044 -3933 -16385 -23623 -29380 -7447 38623
233C8623j7756r3030l2082Q7717R3635m488r3908r0786J9338J15232N5320p1160
$$ 38623 20867 -72163 -104245 -16528 77107 72619 -21289 -112075 -92737 22495 77815 6655
245F655p4938J0699M6875K7121m737l8238k9389K3564M4556K2577l632m5374o2516
$$ 6655 -68283 -57584 -10709 16412 11675 -26563 -55952 -32388 12168 34745 31113 -14261 -76777
258g6777J8369J02782N0370o3429q2034j2071N6517O7247l686p7908l9575N0822
$$ -76777 -58408 44374 94744 31315 -50719 -62790 -6273 60974 57288 -20620 -60195 -9373
270i373N3061q831m2848m2620q104N0023N1341j5382n1480l2729p131K9246N9032
$$ -9373 43688 34857 -7991 -50611 -58715 -8692 42649 27267 -24213 -56942 -64073 -34827 24205
283B4205J5410n1898m1981Q375L0310L3114J2460l5934l8421K0347M7324J7842
$$ 24205 39615 -12283 -54264 -45889 -15579 17535 29995 -5939 -44360 -24013 23311 41153
295D1153j6631m2929l5494L5329P7449J3016o0204m7453l158K9183N0707K3085
$$ 41153 24522 -18407 -53901 -18572 58877 71893 11689 -35764 -38922 -9739 40968 64053
307F4053l9527n1123q508K8650M7341K4866n1013p4285K0101R6153M0219o2573
$$ 64053 24526 -26597 -35105 -6455 40886 65752 14739 -59546 -39445 56708 96927 34354
319C4354r3452k5582Q7537J12742j5036j30646p3900N5902R3323L6141m7023q7913
$$ 34354 -59098 -84680 2857 115599 100563 -30083 -103983 -48081 45242 81383 34360 -53553
331e3553l2754O2233P4333M056o0839p7258j7115R7880J11535l4294j46874p3297
$$ -53553 -86307 -24074 50259 54315 -6524 -83782 -100897 -3017 108518 74224 -72650 -145947
343a45947Q3733J43584M9841j07358j41932R962J46074Q7712o0964j13116m1870
$$ -145947 -62214 81370 131211 23853 -118079 -108117 37957 125669 64705 -48411 -90281
354i0281P1105J11400J6382j05566r1948K3765R5396P2683k0430j12636q4022
$$ -90281 -19176 92224 108606 3040 -88908 -65143 30253 102936 82506 -30130 -114152
365a14152N8507J27452L4188q8003j02288p571J01737R3347m4753j27240m0069
$$ -114152 -55645 71807 105995 17992 -84296 -91867 9870 103217 58464 -68776 -108845
376a08845Q5947R8216J0766q8755j03040J1557J22850P4177o1875j06811l1476
$$ -108845 -22898 75318 86084 -2671 -105711 -94154 28696 102873 40998 -65813 -97289
387i7289O6381R3046O605r8334p0421N0741R2915K2063n6679p6817j5084Q0747
$$ -97289 -30908 62138 68743 -29591 -100012 -49271 43644 65707 9028 -67789 -82873 -2126
399b126Q4676j9854q9036m5543L6099P8474M8559m8969r8009j1674R6306P4586
$$ -2126 82550 62696 -26340 -71883 -35784 42690 91249 42280 -55729 -67403 28903 103489
411A03489l5609j01739n4552O7606J20769J0304j23136r0542M6396J04355M3203
$$ 103489 67880 -33859 -88411 -20805 99964 110268 -12868 -103410 -57014 47341 90544
422I0544n6455r8728k7469Q0718Q0286j8640p9274n1974K1102Q3327N9975n0143
$$ 90544 34089 -64639 -92108 -11390 68896 50256 -29018 -80992 -59890 23437 83412 33269
434C3269j05842k4274Q0655R0063Q934q9005r4785K6613J24427N6155p6947j00427
$$ 33269 -72573 -96847 -16192 73871 82805 -6200 -100985 -74372 50055 106210 29263 -71164
446g1164j0359Q4280Q7561j5278j08045o0309N9722R4466K4384n7428q2604k0358
$$ -71164 -81523 2757 90318 75040 -33005 -93314 -33592 60874 85258 27830 -54774 -75132
458g5132P7896Q1555j7980q0792m2318K6856O4178M0862l9316p8844j4793O1434
$$ -75132 2764 84319 66339 -14453 -56771 -29915 34263 75125 35809 -43035 -57828 3606
470C606N5036o184n9147o0089J2816Q0265L8329n3817o5781n293M4963M7297k203
$$ 3606 58642 52458 -6689 -66778 -53962 26303 64632 10815 -54966 -60259 -15296 32001 29798
483B9798n7854l5496L8982M9107m721l2368j8014N531K8260K2109j4445k0232
$$ 29798 -28056 -63552 -24570 24537 19816 -12552 -30566 -25035 3225 25334 10889 -9343
495i343N168O993j547J3527J0221j6970j2633J2163P484m644j766m557r57J2370
$$ -9343 -4175 2818 1271 14798 25019 8049 -4584 7579 15063 10419 8653 4096 3139 15509
509A5509j007k4155r29K7318N648k4865j6076P644K2560J9838k1129m7381N85
$$ 15509 14502 -9653 -10582 16736 22384 -2481 -18557 -10913 11647 31485 10356 -37025 -36440
522c6440N4377K6577l1774m0926j1397K8495M3581K016m7273k9547K0831L1379
$$ -36440 17937 44514 12740 -28186 -39583 -11088 32493 34509 -12764 -42311 -21480 9899
534I899J4902q489l6447k6976K8658M8395N400l4247l5502p495M1542N5439q241
$$ 9899 24801 16312 -20135 -47111 -18453 29942 35342 1095 -34407 -41902 -360 55079 46838
547D6838o6011l2340L7686N7604J9939m2614o4563J129P2792M1924l9097n8563
$$ 46838 -19173 -51513 -13827 43777 63716 21102 -43461 -42332 30460 72384 33287 -25276
559b5276j6420L2384N1757J2540n2271m9107J1518M2760K3523p738l7948l5847
$$ -25276 -41696 -9312 42445 54985 2714 -46393 -34875 7885 31408 23670 -14278 -50125
571e0125J6175M9641J5809k8337l5667j4295K7655N2272N095n5882l5993K8790
$$ -50125 -33950 15691 31500 3163 -32504 -46799 -19144 33128 38223 -17659 -53652 -24862
583b4862M7287J4654k5444m2467o329M4371L0371k1805k9891l064J2252J8222
$$ -24862 22425 37079 11635 -30832 -37161 7210 37581 15776 -14115 -17179 -4927 13295
595A3295J1753j5953k2371M070J4753N196P432n52k4326j1562K3657K1696m793
$$ 13295 25048 9095 -13276 -9206 5547 10743 18175 17623 -6703 -18265 5392 27088 22295
608B2295j8074j6290J823K7009J5013k5348k3564R952J5326J44k562r311j2507
$$ 22295 4221 -12069 -10246 16763 31776 6428 -17136 -7184 8142 8286 5724 -3587 -16094
621a6094M631J0670m318l115N697r962j3897J0186J7223k257j0470r825l448J9374
$$ -16094 -11463 -793 -5111 -8226 -2529 -12491 -26388 -16202 1021 -1236 -11706 -21531 -24979 -5605
635e605K1530j6219k8928P769K7632R124q237j6698j3080J5160K9713r12k5924
$$ -5605 15925 -294 -29222 -21453 6179 15303 7066 -9632 -22712 -7552 22161 21249 -4675
648d675j0827O433J2160J6364j365k6788j3312J8645J8911L940p390k4714j6766
$$ -4675 -15502 -9069 3091 19455 18090 -8698 -22010 -3365 15546 19486 12096 -12618 -29384
661b9384K8421L9715p431m0865k2571J6284M1029K4129l4220n2841N162N3092
$$ -29384 -963 38752 31321 -9544 -32115 -15831 25198 49327 15107 -37734 -32572 20520
673B0520K6486k4473m3213k0573L1216N2501M73n4698l4630J9898M0734K5860
$$ 20520 47006 22533 -20680 -41253 -10037 42464 42937 -11761 -46391 -26493 14241 40101
685D0101j5010n1172k7032L7248N3388P126l9823m9297n500O1384N9898k8055
$$ 40101 25091 -26081 -53113 -15865 37523 44649 4826 -44471 -49971 11413 71311 43256
697D3256q1579k8563N3260P1520J3790o7015p5346J6240Q8573M3732m7718p3653
$$ 43256 -38323 -66886 -13626 57894 71684 4669 -70677 -54437 34136 77868 30150 -43503
709d3503k2543N1448P2246K096p6208n4658K8191O6329L5137k8202p1568l5370
$$ -43503 -66046 -14598 57648 59744 -16464 -71122 -42931 23398 58535 30333 -41235 -76605
721g6605N3697P8770N695o5913o1935P089P6076O2025l7419r4084k6819O8192
$$ -76605 -22908 55862 61557 -4356 -66291 -59202 16874 78899 41480 -52604 -79423 -11231
733a1231P5918K445p5384p3263K3809R7371M3574n9364p7936j0959N7126O5544
$$ -11231 64687 67132 -8252 -81515 -57706 39665 83239 23875 -54061 -65020 -7894 57650
745E7650O13o9609n0086K8767O3310K6707k8715n8172k6580M7602O7953k61o3789
$$ 57650 58263 -11346 -61432 -32665 30645 57352 28637 -29535 -56115 -8513 59440 59179 -4610
758d610m8655J4386O3046M5729l6526q1122j6150O6617N5716k0608o5289l8219
$$ -4610 -53265 -38879 24167 69896 33370 -47752 -63902 2715 58431 37823 -27466 -65685
770f5685L4782P0538J0924o2409m9050J8340M8651K7988j3910m6736k5083K9653
$$ -65685 -30903 39635 50559 -11850 -60900 -42560 6091 34079 20169 -26567 -51650 -21997
782b1997M3430M377k6544k8920o193L4211L8857j3829m9596j6083L2731M0365
$$ -21997 21433 25810 -734 -29654 -35847 -1636 37221 23392 -26204 -42287 -9556 30809
794C0809P393l8941m4039J3475N8174J7977m1301l6009Q197L6621K5170j7605
$$ 30809 38202 -739 -44778 -31303 26871 44848 3547 -32462 -24265 12356 37526 19921
806A9921m3262p450L8619K7829j0686k5701j9741L545L2027K1069k0454k9255
$$ 19921 -23341 -30791 7828 35657 24971 -730 -20471 -16926 15101 36170 15716 -13539
818a3539j867J5621J6737O114k1819k7218J0966L4486O970k4782k6206l858K8583
$$ -13539 -15406 215 16952 23066 1247 -25971 -15005 19481 26451 1669 -24537 -28395 188
831A88L3311j2551m4261j0680L2649K6923m925k6148k1474J5319M0585O703l7575
$$ 188 33499 20948 -23313 -33993 -1344 25579 20654 -5494 -26968 -11649 28936 35639 -1936
844a936k5463J4610L0221J7117j1848l4320j2752K5740K4631n942j6470j4249
$$ -1936 -27399 -12789 17432 34549 22701 -11619 -24371 1369 26000 20058 3588 -10661
856a0661m101J9831K2305j3939l3519n911K4059K5685K630l1942l5278J4185M8682
$$ -10661 -14762 5069 27374 13435 -20084 -25995 -1936 23749 26379 -5563 -40841 -26656 22026
869B2026J3968l5071l3433K005L3864K9570j7235m7701r256M0897L0993j2041
$$ 22026 35994 923 -32510 -30505 3359 32929 15694 -32007 -41263 -366 30627 18586
881A8586l2287k3593P857L9149K2525k2938l3866p857J7580K9916J4557k7809
$$ 18586 -13701 -37294 -29437 9712 32237 9299 -24567 -32424 -14844 15072 29629 1820
893A820l7688Q733M2391J9132j9497l5637j6828L0465M8906o45n0209l0864J9841
$$ 1820 -35868 -27135 15256 34388 14891 -20746 -37574 -7109 41797 41152 -9057 -39921 -20080
906b0080M0103K0061k2836m5151q398M0580K9987j6334l2591j7695J2023L6362
$$ -20080 20023 40084 17248 -27903 -36301 4279 34266 17932 -14659 -32354 -20331 16031
918A6031J8383k8953l8561k46K8507K5985N240k5574l3734M369L6943K0917j3637
$$ 16031 34414 5461 -33100 -33346 -4839 21146 26386 812 -32922 -28553 8390 29307 15670
931A5670k7792j6804J6666L9831P406l9952k8522J6995L3598J4807j5471l3402
$$ 15670 -12122 -28926 -12260 27571 34977 -4975 -33497 -16502 17096 31903 16432 -16970
943a6970j1566K7924K4937p763j7871p058m36R595J4081k699j5488n116M061Q444
$$ -16970 -28536 -612 24325 16562 -1309 -8367 -8803 792 14873 12174 -3314 -8430 -4369 4075
957D075J4698q41k8418j5446K2665K6693j388k0993k0666N44K5119J6273j7177
$$ 4075 18773 17932 -10486 -25932 -3267 23426 22038 1045 -19621 -19077 6042 22315 5138
970E138j9078L706Q309L200N123l511j3900j659J0261P873N275k110k0444j2086
$$ 5138 -13940 -10234 -1925 1275 6398 2887 -11013 -12672 -2411 5462 10737 8627 -11817 -23903
984b3903K2211K6441m693k2162j5939M007K6401J7324k0391k8504N693K4309R770
$$ -23903 -1692 24749 20056 -2106 -18045 -14038 12363 29687 9296 -19208 -13515 10794 20564
997B0564p257j8833j5562J1175K8508M477k1717j7480k954J2310K3526N106k6454
$$ 20564 13307 -5526 -21088 -9913 18595 23072 1355 -16125 -19079 -6769 16757 21863 -4591
1010d591k1527R785K2858J3558o992k9711j8014K7661L8472m970l8327k4202J3066
$$ -4591 -26118 -16333 6525 20083 13091 -16620 -34634 -6973 31499 26529 -11798 -36000 -22934
1023b2934L8631K2808k7918m5917P61M0250K3961j3002l0930j8847J7644L8334
$$ -22934 15697 38505 10587 -35330 -34569 5681 29642 16640 -14290 -33137 -15493 22841
1035B2841O878l2090k5468N011K4116K6645J526l6662l1716J8282M3985J7776
$$ 22841 29719 -2371 -27839 -22828 1288 27933 29459 -7203 -38919 -20637 23348 41124
1047D1124k5052m4264j3586M4853M8765j8094n9021k2062L4926M8039R766m3666
$$ 41124 16072 -28192 -41778 3075 51840 33746 -25275 -47337 -12411 35628 45394 1728
1059A728m9960R728N6245K7392k6412m2204j7233K4119M5563J1241m0044l8621
$$ 1728 -48232 -38504 17741 45133 18721 -23483 -40716 -16597 28966 40207 163 -38458
1071c8458P526L8560L2626p799m9947l3573L2866N8255Q598m3915m5237J144N0129
$$ -38458 -30932 7628 40254 32455 -17492 -51065 -18199 40056 48654 4739 -40498 -39354 10775
1084A0775M3190k3322o0101j7247M0871M3698K652m1628m2623J1346N5087K4829
$$ 10775 53965 30643 -29458 -46705 -5834 37864 40516 -1112 -43735 -32389 22698 47527
1096D7527l1487m0889q893K5894L8056P709l6928l3738J1602L3932J8882j0839
$$ 47527 16040 -24849 -33742 -7848 30208 37917 989 -32749 -21147 12785 31667 20828
1108B0828l3962k1983K5121M1721R31l6651k7075O766L3799K6416j9264m4542
$$ 20828 -13134 -35117 -9996 31725 32656 -3995 -31070 -24304 9495 35911 16647 -27895
1120b7895o323L6761K4851j2698k8134j3311J7025L0385J92k9260j3040J4549
$$ -27895 -34218 2543 27394 14696 -13438 -26749 -9724 20661 20853 -8407 -21447 -6898
1132f898J5014M553m467j5325q498J4241J4364m487j0297o259q29J2792J3805
$$ -6898 8116 12669 8202 -7123 -15621 -1380 12984 8497 -1800 -8059 -8888 3904 17709
1145A7709j3619k3239L858K2789J0792j0451k1768j1172K2381K9103j0300l5192
$$ 17709 4090 -19149 -15291 7498 18290 7839 -13929 -25101 -2720 26383 16083 -19109
1157a9109o203K4230K1512k082k5031k2139J4107L4192O509k6347k1327J109J9171
$$ -19109 -25312 -1082 20430 18348 -6683 -28822 -14715 19477 25986 -361 -21688 -20579 -1408
1170a408K3283k372l1050j8128J7856K4817P607j4083k7320j0656K9165L3407
$$ -1408 21875 19503 -11547 -29675 -11819 12998 20605 6522 -20798 -31454 -2289 31118
1182C1118r029l6956j9420J5902L7732J9770k9286m4559K672M3734K6821j6678
$$ 31118 22089 -14867 -34287 -18385 19347 39117 9831 -34728 -32056 11678 38499 21821
1194B1821l6695j9570K4187M4005L688m1737k8772J4440L2813J8760j3574l6927
$$ 21821 -14874 -34444 -10257 33748 37436 -4301 -33073 -18633 14180 32940 19366 -17561
1206a7561j5162K6972L0941kk2296k4914m485K9686L1719j3059m0722j4116K4324
$$ -17561 -32723 -5751 25190 25188 2892 -22022 -26507 3179 34898 21839 -18883 -32999 -8675
1219h675L3850Q642l2472l8734J0280M6186J8124k8730l2960l792K7300K9957
$$ -8675 25175 33817 1345 -37389 -27109 19077 37201 8471 -24489 -28281 -981 28976
1231B8976p176l7400j3734K3009K2172J187j4059j9813n975K2240K2524o934k2411
$$ 28976 21800 -15600 -29334 -6325 15847 17034 2975 -16838 -22813 -573 21951 15017 -7394
1244g394j3262M868K4797J8579j8008l3945k34K9994J9457r546k7651j8503J9109
$$ -7394 -20656 -15788 9009 27588 9580 -24365 -24599 5395 24852 15306 -12345 -30848 -11739
1257a1739L5844P15l4875j9933J4453K4120J1432j4466k7698m659K6020J7453
$$ -11739 24105 24820 -10055 -29988 -15535 8585 20017 5551 -22147 -26806 -786 16667
1269A6667q220j6795j1050K231K1230J6574j3455k4589l027J4967J9020Q716j9134
$$ 16667 8447 -8348 -19398 -17167 4063 20637 7182 -17407 -20434 -5467 13553 22269 3135
1282C135k7669L314L2108J5945j4696k4720j1492J7467L1248J443l1636j8405
$$ 3135 -24534 -21220 10888 26833 12137 -12583 -24075 -6608 24640 26083 -5553 -23958
1294b3958J4916K0618Q347q608k0293r419J6387J7452j694r849j0350p951R604
$$ -23958 -9042 11576 19923 11315 -8978 -18397 -2010 15442 13748 3899 -6451 -14402 -4798
1307d798K1459J846k0241j4959K598J6557J8206m978l0416j3692K3276K3094l024
$$ -4798 16661 18507 -1734 -16693 -14095 2462 20668 15690 -14726 -28418 -5142 17952 14928
1320A4928j7725j6572k81K1078J6401j0011j8130n058L584J2200J5979l492k3682
$$ 14928 -2797 -19369 -19650 1428 17829 7818 -10312 -15370 -11786 414 16393 12901 -10781
1333a0781j0569J3207J9341J0556j0430k8484r996K8768K8673q613k8540j6736
$$ -10781 -21350 -8143 11198 21754 11324 -17160 -27156 1612 30285 21672 -6868 -23604
1345b3604R385K9919J6847k2532l1836O02K4566J8117K88k0705k4619N215L0643
$$ -23604 -14219 15700 32547 10015 -21821 -21219 3347 21464 21752 1047 -23572 -18357 12286
1358A2286J5733j4751k3530j3124J2035L1989J2713k8165l1707L850K8802K4453
$$ 12286 28019 13268 -10262 -23386 -11351 20638 33351 5186 -26521 -22671 6131 30584
1370C0584n252l5852k5691K3132M0876M276l0642k7838J140K9642K7953j2141
$$ 30584 25332 -10520 -36211 -13079 27797 32073 1431 -26407 -25267 4375 32328 20187
1382B0187l7110j2512K1774K4371O059j6217k6681m244K6933K0909q582k1108
$$ 20187 -16923 -29435 -7661 16710 22769 6552 -20129 -24373 2560 23469 14887 -6221
1394f221j4015M222K5705J8216j9494l1859l1K5788J9868m622k8006j9705J8914
$$ -6221 -20236 -16014 9691 27907 8413 -23446 -23477 2311 22179 17557 -10449 -30154 -11240
1407a1240L3157q99k8460j5074Q598K0458J2934j2751k4923k58K1959J0747p424
$$ -11240 21917 21018 -7442 -22516 -13918 6540 19474 6723 -18200 -18458 3501 14248 6824
1420F824j0022p965J916J5768Q840j1379j2895r2Q179J1793M009j7492j6364J3160
$$ 6824 -3198 -11163 -9247 6521 15361 3982 -8913 -9005 -826 10967 14976 -2516 -18880 -5720
1434e720K2925o18j9241j3449M313K2012J3598j8223k7179N206K6662J0940j2111
$$ -5720 17205 16587 -2654 -16103 -11790 10222 23820 5597 -21582 -16376 10286 21226 9115
1447I115j9947q990J6618K4546l083k4622j0233R501J4421R458n420k0778q676
$$ 9115 -10832 -19822 -3204 21342 18259 -6363 -16596 -7095 7326 16784 11364 -9414 -18090
1460a8090J6251J7478m59j3298j6440k370K2294K0037j3868k7694m836J9113K1851
$$ -18090 -1839 15639 15180 1882 -14558 -16928 5366 25403 11535 -16159 -20995 -1882 19969
1473A9969K162k5614k4620J4721L4103M582k5369j9391L473K2211J7999j2135
$$ 19969 22131 -3483 -28103 -13382 20721 25303 -66 -19457 -15984 6227 24226 12091
1485A2091k6772l593J9104J2425k167q988j4003k980J6513J3317p114j4382p568
$$ 12091 -14681 -18274 830 13255 11088 2100 -11903 -14883 1630 14947 7833 -6549 -14117
1498a4117L321J7816J2155j7683k3315O367K4662Q900j3286k0904l959K3295K0937
$$ -14117 -10796 7020 19175 1492 -21823 -15456 9206 18106 4820 -16084 -20043 3252 24189
1511B4189j5436k8360J779K2789J1704p060j7536j0675J2320K1038m89j7794r528
$$ 24189 8753 -19607 -17828 4961 16665 9605 -7931 -18606 -6286 14752 14263 -3531 -13059
1524a3059K442J0292J4760j198k1373j2887J4211J9626M870j3610k2721l405K7950
$$ -13059 -10617 -325 14435 13237 -8136 -21023 -6812 12814 17684 4074 -18647 -22052 5898
1537E898K3661j7183l1857o221K1971K6810K534l1280k7404J5411L6607R591k3204
$$ 5898 29559 12376 -19481 -25702 -3731 23079 25613 -5667 -33071 -17660 18947 28538 5334
1550E334k7858o012K6103L2396n755l8576j9714J8623L0666J3861j8270l5238
$$ 5334 -22524 -28536 -2433 29963 24208 -14368 -34082 -15459 15207 29068 10798 -24440
1562b4440j0000L1715L1518m514k9730k4922M432L7411K7343k2393m3619q540
$$ -24440 -34440 -2725 28793 24279 -5451 -30373 -25941 11470 38813 16420 -27199 -35739
1574c5739L1499L5083J783l8317l4795J5072M7451J6146k9776l3899m650K7627
$$ -35739 -4240 30843 32626 -5691 -40486 -25414 22037 38183 8407 -25492 -30142 -2515
1586b515L1784k737l4766k0862J4846K6306J4408r638k9924j8111K2723L5259
$$ -2515 29269 26532 -8234 -29096 -14250 12056 26464 16826 -13098 -31209 -8486 26773
1598B6773L105k7755k7481J37L1894K8600j4746l8709j0915K4990K5347J948k1707
$$ 26773 29878 2123 -25358 -25221 6673 35273 20527 -18182 -29097 -4107 21240 23188 1481
1611A481k4719M335K8751J3443j4840j8313o909P862J9275R594j6042j8904J899
$$ 1481 -23238 -18903 9848 23291 8451 -9862 -16771 -8909 10366 19960 3918 -14986 -13087
1624a3087J3780J0528J476j2969j4900O500J8402L329j0525r686m075P212J6272
$$ -13087 693 11221 12697 -272 -15172 -8672 9730 13059 2534 -7152 -11227 -4015 12257
1637A2257J712j7823j0538P921J1090N209m323j2235m557J1861P388o973l946
$$ 12257 13969 -3854 -14392 -6471 4619 9828 5505 -6730 -11287 574 7962 989 -2957
1650b957J913k056N56N599L78m462j746k347j35J0026N738j2347j0670O816J0189
$$ -2957 -1044 -3100 -2544 3055 3433 -1029 -2775 -5122 -5257 4769 10507 -1840 -12510 -5694 4495
1665D495J392m970p864j211J0194M947j0356n395Q239L778m457j51J028j806L19
$$ 4495 5887 917 -6947 -8158 2036 6983 -3373 -8768 -529 3249 -1208 -1359 -331 -2137 -1818
1680a818N43o01M124M049q785p199R259R721n570q980j206N200R594R58j5155
$$ -1818 -1275 -1876 2248 6297 -2488 -9687 -428 9293 3723 -5257 -6463 -1263 8331 9289 -5866
1695e866q650J3425J3415m919j0728m494J757Q903O460p823q965L502N504J146
$$ -5866 -14516 -1091 12324 7405 -3323 -7817 -6060 2843 9303 1480 -7485 -3983 1521 2667
1709B667J363k036r658M60J1922N596n574q313p012L669J7074O999j6520j5652
$$ 2667 4030 1994 -7664 -7204 4718 10314 4740 -3573 -10585 -6916 10158 17157 637 -15015
1723a5015M804J5921R889n936j9290r171J8528K0612o450k0900r389P832J7671
$$ -15015 -10211 5710 15599 9663 -9627 -18798 -270 20342 13892 -7008 -16397 -8565 9106
1736I106J1027j2498k1648o88J6017J0504L68r480j3966q96J7374J1380q630j5076
$$ 9106 20133 7635 -14013 -14701 1316 11820 12188 2708 -11258 -12154 5220 16600 7970 -7106
1750g106q097O621K1444R619k0646k4622N992K4343J2825r801k2450j0284J8733
$$ -7106 -15203 -8582 12862 22481 1835 -22787 -16795 7548 20373 10572 -11878 -22162 -3429
1763c429K2224o133k0837o287Q785J1801O664q076j5491j401J1673Q314Q81m191
$$ -3429 18795 12662 -8175 -14462 -5677 6124 12788 4712 -10779 -12180 -507 7807 8688 4497
1777D497j2459o448J3246J4758m659j4124o462N569J3039N479j4302j3503R393
$$ 4497 -7962 -14410 -1164 13594 8935 -5189 -11651 -6082 6957 12436 -1866 -15369 -5976
1790e976J5224j384j0430n006J321P497N476o808p254O138O412m668m756P00J239
$$ -5976 9248 7864 -2566 -7572 -6251 1246 6722 -86 -7340 -1202 5210 542 -4214 -3514 -2275
1805b275M237M021o070p816L860O765L21j022k681o217K058J1009J403j0095o122
$$ -2275 1962 5983 -87 -7903 -4043 2722 3043 2021 -660 -6877 -4819 6190 7593 -2502 -8624
1820h624K489P452J0056j579j7644q821J3858J5847J458j2644j5932j390K2387
$$ -8624 -6135 1317 11373 9794 -7850 -16671 -2813 13034 14492 1848 -14084 -15474 6913
1833F913J6498j4495k4770k531J9101J8918o91k3804j9364J2505K7169N999j5735
$$ 6913 23411 8916 -15854 -18385 716 19634 18943 -4861 -24225 -11720 15449 21448 5713
1846E713j7983o105J3567K2061K939k2093j7143N175J9105J7012n942k9265j6429
$$ 5713 -12270 -18375 -4808 17253 20192 -1901 -19044 -13869 5236 22248 16306 -12959 -29388
1859b9388K3426L2239j5k9537k4603O954L3772K0367k2441l3623j013K6209J9454
$$ -29388 -5962 26277 26262 -3275 -27878 -20924 12848 33215 10774 -22849 -23862 2347 21801
1872B1801m456k2068j8562R508K7163R158j5608k0781p378J4238K5957N536k5579
$$ 21801 17345 -4723 -23285 -13777 13386 22544 6936 -13845 -21223 -6985 18972 24508 -1071
1885a071k3692Q004K5571J5006j0512k8132j1394K4236K7266o948k7042j4311
$$ -1071 -24763 -16759 8812 23818 13306 -14826 -26220 -1984 25282 18334 -8708 -23019
1897b3019J1085K4516J2030j8567k6755R85K3614J4770o141j8338j3389R962K2985
$$ -23019 -11934 12582 24612 6045 -20710 -19725 3889 18659 12518 -5820 -19209 -9247 13738
1910A3738M222j8906j4448L923J4135J3221l092k0620j2682J3494J9544L998j2506
$$ 13738 17960 -946 -15394 -11471 2664 15885 12793 -7827 -20509 -7015 12529 16527 4021
1923D021j8652m126K0335J9755j0015k5329o224J6793J8672J380k0910j9381J0783
$$ 4021 -14631 -18757 1578 21333 11318 -14011 -20235 -3442 15230 16610 -4300 -23681 -12898
1936a2898K6413M604j7366j5263L64J2839J3664j727j6185q437P919J0288O398
$$ -12898 13515 18119 753 -14510 -14146 -1307 12357 10630 -5555 -13992 -6073 4215 10613
1949A0613l000j5822j0544J4164K0694m35j8771j4936L403K1380J5372j4131k4520
$$ 10613 7613 -8209 -18753 -4589 16105 15670 -3101 -18037 -14634 6746 22118 7987 -16533
1962a6533n59J9569J2561m325j4952j0693P917J7636L114j2791r187K72O036J0922
$$ -16533 -17092 2477 15038 10713 -4239 -14932 -7015 10621 13735 944 -8243 -7971 -1935 8987
1976H987M356j1520j2164K426J0254Q019O9j1713j1775P429J6109J656j1430r434
$$ 8987 13343 1823 -10341 -7915 2339 10358 10427 -1286 -13061 -5632 10477 12133 703 -8731
1990h731j7R763J2189l254j6132n387R914Q369J262m102q433l039P380O054k438
$$ -8731 -8748 1015 13204 9950 -6182 -11569 -1655 6714 7976 3874 -4559 -7598 -218 5836 3398
2005C398k238k022m897K053J0145J593r039o101L41O557R942p88j5118p281J0702
$$ 3398 1160 -862 -5759 -3706 6439 8032 -1007 -7108 -6767 -210 9732 8944 -6174 -13455 -2753
2020b753J0085k78o256p559j170P895O888m750n106K00j050J432P685J422r430
$$ -2753 7332 7054 798 -6761 -7931 -36 6852 2102 -3004 -2804 -3854 -2422 5263 6685 -2745
2035b745o603L640Q578P061l569j4931n566J3731J2690m646j2578n871M807J1601
$$ -2745 -9348 -5708 2870 9931 6362 -8569 -14135 -404 12286 7640 -4938 -10809 -6002 5599
2049E599N255j0785j1250M310R388L237j636m988p678J238J0180M789l895n509
$$ 5599 10854 69 -11181 -6871 2517 5754 4118 -870 -8548 -7310 2870 7659 3764 -1745
2063a745n994P25J1384O183r495j0026K454Q593N159j195j0588o721R578J0851
$$ -1745 -7739 -7014 4370 10553 1058 -8968 -6514 2079 7238 6043 -4545 -11266 -1688 9163
2077I163k978r550k889L009N715L532n058o294L127N609k180j995J432j398q26
$$ 9163 6185 -3365 -6254 -3245 2470 6002 944 -5350 -2223 3386 1206 -789 643 -755 -1581
2092a581L535L29l005N42N9k073K214M450l177n110K731K935r59q76j226j131
$$ -1581 1954 2283 -722 -180 -121 -2194 20 4470 1293 -3817 -1086 1849 890 14 -1212 -2343
2108b343M774K931p629m864P164O358k604n758k871K222Q222K135j0153o385P437
$$ -2343 2431 5362 -2267 -7131 33 6391 3787 -1971 -4842 -2620 5602 7737 -2416 -8801 -1364
2123a364Q385j622m552m842j642P209O196m457o062K24J120J618M820m3p705l590
$$ -1364 7021 5399 847 -3995 -5637 1572 7768 3311 -2751 -2527 -1407 211 5031 4988 -2717 -6307
2139f307N963N871P62m693r046m01J3352P527j0952j1733J512J0462P727j974
$$ -6307 -344 5527 6289 1596 -7450 -7851 5501 13028 2076 -9657 -8145 2317 10044 8070
2153H070j4244o586J2733J1679m692j1636l940L975R403N485q267j0680J419P727
$$ 8070 -6174 -12760 -27 11652 6960 -4676 -8616 -4641 4762 10247 1980 -8700 -7281 446
2167D46M708P14m923r693Q3J2303O087o525r865l763P099J3767J480j7358j1271
$$ 446 5154 5868 945 -8748 -8665 3638 9725 3200 -6665 -10428 -3329 10438 11918 -5440 -16711
2182a6711J0645J6500K136j1640j5112K82J8278J2257j2035j7549n18J2925J1551
$$ -16711 -6066 10434 12570 930 -14182 -13900 4378 16635 4600 -12949 -13467 -542 11009
2195A1009o36j3710j2157O358J6278N764q570j1271p258P756J8120M409j6616
$$ 11009 10373 -3337 -15494 -9136 7142 12906 4336 -6935 -14193 -6437 11683 16092 -524
2208e24j5506L428J6686J3753o554k3328j0301K0086K2569l553k2603j4194P945
$$ -524 -16030 -12602 4084 17837 11283 -12045 -22346 -2260 20309 16756 -5847 -20041 -12096
2221a2096K3467J1223j7762k2348J409J9127J3249k999j6986j3871P340K1364
$$ -12096 11371 22594 4832 -17516 -16107 3020 16269 13270 -3716 -17587 -10247 11117
2233A1117P781j2904j7354n378J2645K1324L205k2864j8668P914K2022J2585j0490
$$ 11117 18898 5994 -11360 -16738 -4093 17231 20436 -2428 -21096 -13182 8840 21425 10935
2246A0935k5069q592K1544K3132n941k3078j1836R210K0506R199j4687k0428j84
$$ 10935 -14134 -22726 -1182 21950 16009 -7069 -18905 -9695 10811 20010 5323 -15105 -15289
2259a5289J7654J2227l098j3049j2874M005J8381Q119j0793j4391l896R652J5837
$$ -15289 2365 14592 11494 -1555 -14429 -10424 7957 16076 5283 -9108 -13004 -3352 12485
2272A2485L338j7578j6114P780J8705P164r458j6948o058J5522J6862m842j7354
$$ 12485 15823 -1755 -17869 -10089 8616 15780 6322 -10626 -16684 -1162 15700 10858 -6496
2285f496o145P941J0971M530q532j2578J187J1849N490m014n865n351O46R143
$$ -6496 -12641 -4700 6271 10801 2269 -10309 -9122 2727 8217 4203 -1662 -7013 -6367 2776
2299B776N144n702p301r54L579O697L073q522r214O205J0263L78p105n630o86
$$ 2776 7920 2218 -5083 -6037 -2458 4239 7312 -1210 -10424 -4219 6044 6422 -683 -6313 -6999
2314f999P959P435n340r693O04P663J749j456k953k948K469M828j124m565R66
$$ -6999 960 8395 3055 -6638 -6034 1629 3378 1922 -1031 -3979 -1510 3318 2194 -2371 -1405
2329a405J882j941R27L278k437k354N82O05J471K142k187m539K294N189k125l865
$$ -1405 477 -1464 -537 2741 304 -2050 -1468 -863 608 2750 563 -3976 -1682 3507 1382 -2483
2345b483N92J737J877J542l253n156L927N432k008m681J618J938L7J0k175j207
$$ -2483 -1891 -154 1723 3265 12 -5144 -1217 4215 2207 -2474 -856 1082 1119 1129 -1046 -2253
2361b253L696K953m888l207M103K288k077p13n31p28L881J229n028k064M204J429
$$ -2253 1443 4396 -492 -3699 404 2692 615 -98 -629 -1357 2524 3753 -1275 -3339 865 2294
2377B294k343J138N64k287j32Q05p37K726K530n424m077N329M683l344m412n10
$$ 2294 -49 1089 1653 -634 -766 39 -698 2028 4558 -866 -4943 386 5069 1725 -2687 -3197
2393c197L021M929Q78q296m824O922O497k816m707j770Q48M579J807m266l388
$$ -3197 -176 4753 5631 -2665 -7489 -567 5930 3114 -1593 -3363 -2515 2064 3871 -395 -3783
2408c783L831J452j475J036J349m226k333L360L355R26k217n914j973P916O109
$$ -3783 48 1500 25 1061 2410 -1816 -4149 -789 2566 3492 1275 -4639 -6612 1304 7413
2423G413n515p072P75M564L071j70n339l968N801N066l341m206J366P89l62J941
$$ 7413 1898 -5174 -4399 165 3236 3066 -2273 -6241 -440 4626 1285 -2921 -1555 -766 -1128 813
2439H13J5j541J199q03l638J914N346j456m623P93J342J123Q12j693l989K336
$$ 813 828 -713 486 -317 -3955 -2041 3305 1849 -2774 -1981 -639 484 1296 -397 -4386 -2050
2455b050N457j544l690JQ73q06J370J881r79M26p78m661J019P643J548p646m112
$$ -2050 3407 1863 -1827 -1826 -953 -1759 -389 1492 513 939 161 -4500 -3481 4162 5710 -1936 -6048
2472f048L233N644L602m423r167j17J1147N154o376p497j450L837O678L173o658
$$ -6048 -2815 2829 6431 2008 -7159 -7276 3871 9025 2649 -4848 -6298 -2461 4217 7390 732
2487G32o050J634L865K742K840l520q791K81J0086N080m467r259n552P271J4182
$$ 732 -5318 -3684 181 2923 5763 2243 -6548 -6267 3819 8899 4432 -4827 -10379 -3108 11074
2502A1074J356j5372r844P153J2474M837p033j2770k628J2602J0278n855j0434
$$ 11074 12430 -2942 -12786 -5633 6841 11678 4645 -8125 -10753 1849 12127 6272 -4162
2515d162m215L973R790O650q244j2502p72R186Q831J766q915j2688J685J5389
$$ -4162 -8377 -4404 5386 12036 3792 -8710 -9482 -296 8535 10301 1386 -11302 -9617 5772
2529E772P522q849j2427l081R521J3681j88j6730j0377R156J5497L564j0297j3280
$$ 5772 13294 4445 -7982 -11063 -1542 12139 11951 -4779 -15156 -6000 9497 13061 2764 -10516
2543a0516k332J4475J2005o868j3596l854P180R531L947q542j1812R39J1681P459
$$ -10516 -12848 1627 13632 6764 -6832 -10686 -3506 6025 9972 1430 -10382 -9443 2238 9697
2557I697k862r769r684L728J5650P154j1924j3676K14J1473J2278k470j7673q753
$$ 9697 6835 -2934 -12618 -8890 6760 13914 1990 -11686 -11472 1 12279 9809 -7864 -16617
2571a6617J3341J6151k058j4105j0029M038J4768Q464r930j3951k52R423P696
$$ -16617 -3276 12875 10817 -3288 -13317 -9279 5489 13953 4023 -9928 -10180 -757 6939
2584F939J432p859j0455J728J2160O924n961j0681n709O904J4802L653j5032j3260
$$ 6939 8371 512 -9943 -8215 3945 10869 4908 -5773 -11482 -4578 10224 13877 -1155 -14415
2598a4415N453J4184Q120o643j5266n268J3918J3234m425j3517n166M929J0882
$$ -14415 -8962 5222 13342 6699 -8567 -13835 83 13317 8892 -4625 -9791 -4862 6020
2611F020N867q806j2169N27J0116O661m71p675q112N94J1457N724n754q222l329
$$ 6020 11887 3081 -9088 -8561 1555 8216 7745 70 -8042 -7448 4009 9733 3979 -4243 -7572
2626g572M679R769L700j1495j0496N812J1951L540o053j0148l291R536J0129m325
$$ -7572 -2893 6876 10576 -919 -11415 -5603 6348 9888 3835 -6313 -9604 -68 10061 5736
2640E736r623j715M546M435J683l840n465J068N121J161j739j64l391k193M482
$$ 5736 -3887 -5602 -1056 3379 5062 1222 -4243 -3175 1946 3107 1368 1204 -2187 -4380 102
2655A02M911k386m391j617O16M260L562m829n480L659N424j309m329j013J166
$$ 102 5013 2627 -1764 -3381 -2765 1495 5057 228 -5252 -1593 3831 2522 -1807 -2820 -1654
2670a654L305J916m545l705M742L388l470k927J952J869J012n40l852j823N069
$$ -1654 1651 3567 -978 -4683 59 3447 -23 -2950 -998 871 1883 1343 -2509 -4332 737
2685G37K791m154j206K119r89k82J965l89k156O89J73n70K818R30n410k577N392
$$ 737 3528 -626 -1832 287 -702 -984 981 592 -1564 -875 -702 -1272 1546 2476 -2934 -5511 -119
2702a19M646j743m222l770K88P995L707p106o572L810N599Q03k334m489j825N175
$$ -119 4527 2784 -1438 -5208 -4920 3075 6782 -324 -6896 -3086 2513 3316 982 -3507 -5332 -157
2718a57N161l469l773l07J17J505L707J85m551j839J860J484K739K88n082l318
$$ -157 5004 1535 -2238 -2545 -2428 -923 2784 2969 -1582 -3421 -1561 -77 2662 2950 -2132 -5450
2734e450N128N680k220n149k411J405O125L599o548o495L414O008Q0k210k017
$$ -5450 -322 5358 3138 -2011 -4422 -3017 3108 6707 159 -6336 -2922 3086 3166 956 -1061
2749a061j154J885L488k120k439J885N13k289J697K911k182l028M95J063K518
$$ -1061 -2215 -330 3158 1038 -1401 484 997 -1292 405 3316 1134 -1894 -1399 -336 2182
2764B182K043l875m857L076O185j829m226l63J403J706J542l192l284K794L675
$$ 2182 4225 350 -4507 -1431 4754 2925 -1301 -1664 -261 1445 2987 -205 -3489 -695 2980
2779B980k316j565J725m40j342J169NJ30J598q12m195R34N139n30m236p33J617
$$ 2980 664 -901 824 384 -958 211 216 346 1944 1132 -3063 -2129 3010 2480 -1756 -2489 -872
2796h72K121J643k782m218J451N398J64l372r78l44K91L051M90l603q99K747l09
$$ -872 1249 2892 110 -4108 -2657 2741 2905 -467 -1445 -1789 -1498 1553 2043 -1560 -2459 288 -21
2813b1k5J900j624l519J312L311J336j192l285l874K949Q409j59q496l607M051
$$ -21 -46 1854 230 -3289 -1977 1334 2670 1478 -1807 -5681 -2732 5677 5518 -2978 -6585 -2534
2829b534N527K528m262q085O03R062L744n161n403q95K470N851K408n656n349
$$ -2534 2993 5521 1259 -6826 -6223 2839 6583 1422 -3981 -4876 -2406 3445 5853 197 -5152
2844e152J215L247L662K525l900q953O96J0434M583n088q928l805P594J2038q28
$$ -5152 -3937 -690 2972 5497 1597 -7356 -6660 3774 8357 3269 -5659 -9464 -1870 10168 9340
2859I340j4299o789Q062J0514K337o619j0511j332J1430P574m896q355l280J985
$$ 9340 -4959 -11748 -3686 6828 9165 2546 -7965 -9297 2133 9707 4811 -3544 -6824 -4839
2873d839Q294O210n691j0893j809P948Q216K125q375j2194K129J4104P506q249
$$ -4839 3455 9665 3974 -6919 -8728 -780 7436 9561 1186 -11008 -8879 5225 12731 4482
2887D482j1403l539Q640J2613N72j4465r075P749J1567K907o614j0288k533J0094
$$ 4482 -6921 -10460 -1820 10793 11365 -3100 -12175 -4426 7141 10048 3434 -6854 -9387 707
2901G07R400l539r108m087K053O815O508l125j0958l055P530P389J757o929j0379
$$ 707 10107 6568 -2540 -6627 -4574 2241 8749 5624 -5334 -8389 -859 6530 8287 1358 -9021
2916i021M40J2887P469q141j0771j730P889R114K07j1287p377Q038Q978r43n923
$$ -9021 -8581 4306 11775 3634 -7137 -8867 -978 8136 8343 -2944 -10321 -2283 6695 5752 -171
2931a71m473l65N874N187k997n841j069J469K951M182j013p513k458N964N135
$$ -171 -4644 -5009 865 6052 3055 -2786 -3855 -2386 565 4747 3734 -3779 -6237 -273 4862
2946D862j323m598m835J408Q972K549q144o485M061O246J971l357n904j125O753
$$ 4862 3539 -1059 -5894 -4486 4486 7035 -1109 -7594 -3533 2713 4684 1327 -4577 -5702 1051
2961A051M282m389m516J004K242J565J676l069l898J999L644j84o62q29l468N78
$$ 1051 5333 944 -3572 -2568 -326 1239 2915 -154 -4052 -2053 1591 1407 745 -84 -3552 -2974
2977b974N487J665m555l068P73K713L792k81o923k911O980M772k840m494k260
$$ -2974 2513 4178 -377 -3445 -2672 41 3833 3552 -3371 -6282 698 5470 2630 -1864 -4124
2992d124J963N410K483n963n022L777M133l85r88k377j919K909L466j838k695
$$ -4124 -2161 3249 5732 -231 -5253 -1476 2657 2272 1284 -1093 -3012 -103 3363 1525 -1170
3007a170R52n30k17K852J372l996j811K336J710J365r66m259j292O281K906m792
$$ -1170 -218 -748 -965 1887 3259 -737 -2548 -212 1498 2863 1897 -2362 -3654 2627 5533 741
3023G41m015J455L288K229r13m927j855N734K870l986k960J313J868R17O3k650
$$ 741 -3274 -1819 1469 3698 2785 -2142 -3997 1737 4607 621 -2339 -1026 842 1759 1822 -828
3039h28j627L283J386j932P2R10k628k09L512O52k912j337lJ351L659m79n738
$$ -828 -2455 828 2214 282 354 1264 -1364 -1573 1939 2591 -321 -1658 -1661 -310 3349 2870 -2868
3056b868k068N839M006k556l829l026J625O231K282o498m851L177M673P58j466
$$ -2868 -4936 903 4909 2353 -1476 -4502 -2877 3354 5636 -862 -5713 -2536 2137 2895 1429
3071A429m107k033L916M564k156l017o48n58J532M275J45n417k315J991L088L115
$$ 1429 -2678 -4711 -795 3769 1613 -1404 -2052 -2610 -1078 3197 3342 -2075 -4390 -2399 689 3804
3087C804j055o645l339O732O574k767o101k838K275O746K594o086o360K835N241
$$ 3804 2749 -3896 -7235 -503 6071 3304 -2797 -5635 -3360 3386 5980 -106 -6466 -3631 1610
3102A610J396p99k818l093R50M423P97j047j798k720j030N716M366m486n953m97
$$ 1610 3006 2207 -611 -3704 -2754 1669 2466 1419 -379 -3099 -4129 1587 5953 1467 -4486 -4983
3118d983M537N500K47p196n548N161P381o99m951k538j71L311L639j354l986o98
$$ -4983 -446 5054 5301 -1895 -7443 -2282 5099 4400 -551 -3089 -3260 51 3690 2336 -1650 -2348
3134b348J464P47K267J747m161m541K043N236J845j431n548l920N134Q252j770
$$ -2348 -884 -137 2130 3877 -284 -4825 -2782 2454 4299 2868 -2680 -6600 -1466 6786 5016
3149E016p312k912K946M819L202l492o856K08N754K434j337k294l148r18M804
$$ 5016 -2296 -5208 -2262 2557 5759 2267 -4589 -4381 1373 3807 2470 176 -2972 -3890 914
3164I14L795k378l516j822q1M125N172l298p544p62N938M530j135n419n456L547
$$ 914 4709 2331 -1185 -3007 -3088 1037 6209 2911 -4633 -5395 543 5073 3938 -1481 -6937 -3390
3180c390Q838Q90p737l924K322L951L555j667n837j866M724L155q66j357k229
$$ -3390 5448 6338 -1399 -5323 -3001 950 4505 2838 -2999 -4865 -141 3014 2148 791 -1438
3195a438k649L115N144j090m312k866K39M965M947l121q774o09P367M850k969
$$ -1438 -4087 -972 4172 3082 -1230 -4096 -3857 1108 6055 2934 -5840 -6449 918 5768 2799
3210B799n557l142L618P606q1p704l446M209M165J144j745n105j879M890L794
$$ 2799 -2758 -5900 -2282 5324 5243 -2461 -5907 -1698 2467 3611 1866 -3239 -5118 -228 3566
3225C566j699k410k166q35L405N062j758o810j513M279M406J744m285q045J520
$$ 3566 1867 -543 -2709 -3544 -139 4923 3165 -3645 -5158 -879 3527 5271 986 -7059 -5539
3240e539R647K877n983n738o94N134O077p21q376l325N478N452m23l183m199j073
$$ -5539 4108 6985 1002 -4736 -5430 -296 5781 5060 -3316 -6641 -1163 4289 3866 683 -3516 -4589
3256d589N032M981k527m593j486L68L712M398k170o864j480N302M429J08m843
$$ -4589 443 5424 2897 -1696 -3182 -2814 898 5296 3126 -3738 -5218 84 4513 4621 -222
3271b22n642J550Q824L118o998n550O24M964M950j247o669l060N371M265j863
$$ -222 -5864 -4314 4510 7628 630 -4920 -4296 668 5618 4371 -2298 -5358 13 4278 2415
3286B415k078j624j109K673L331j195k979r92J11J475L602K28n539k795M372L664
$$ 2415 337 -1287 -2396 277 3608 2413 -566 -1558 -1447 28 3630 3858 -1681 -4476 -104 3560
3302C560o27k681l261Q44N349J466n391k979L082K855k4j608k498Q7L068M35k967
$$ 3560 2933 252 -3009 -2165 3184 4650 -741 -3720 -638 2217 2193 585 -1913 -1826 1242 1677 -1290
3319a290K69K532p41j728M39M39m04J492j35k260M72J760j364o93K238o0k688
$$ -1290 -1021 1511 770 -958 -519 -80 -484 1008 873 -1387 -915 845 -519 -1212 1026 966 -1722
3336a722K34K013J75J13j005l098J286N313p0n053k363K448L287K221k604m973
$$ -1722 -1488 525 700 813 -192 -3290 -2004 3309 3239 -1814 -4177 -1729 1558 3779 1175 -3798
3352c798l94N940K426l523l255o77J951L822Q09m408k902K448J990J140R53k335
$$ -3798 -4192 1748 4174 651 -2604 -3281 -1330 2492 3301 -1107 -4009 -1561 429 1569 2522 187
3368A87m089O11N011K025k437l381k694K840O853K05p855l761M693O030J350m215
$$ 187 -3902 -3291 1720 3745 1308 -2073 -4767 -1927 4926 5131 -2724 -6485 -1792 4238 5588 1373
3384A373o521l05P541M020m624m079l3J670K896J977k675l998K77K503J865J880
$$ 1373 -5148 -5453 2088 6108 1484 -2595 -2628 -958 1938 3915 1240 -2758 -2481 22 1887 3767
3400C767k117n811j82O365L669l174n202j719K973O038P03p071m111M990M497
$$ 3767 1650 -4161 -4343 2022 5691 2517 -2685 -4404 -1431 4607 5310 -1761 -5872 -882 3615
3415C615p3k937l357p59M259L599l260k551k63M07J154L010j140l392j023K404
$$ 3615 3542 605 -2752 -3511 748 4347 1087 -1464 -1727 -1320 -166 2844 1704 -1688 -2711 -307
3431c07J476J067j254l309j162N109K577l086l445n69J968L795J110m850l560
$$ -307 1169 2236 982 -2327 -3489 1620 4197 1111 -2334 -2903 -935 2860 3970 -880 -4440
3446d440L386L962q39k336j375j80K449K322k399k918J428J169p32J771M16k912
$$ -4440 -1054 2908 2069 -267 -1642 -1822 627 2949 550 -2368 -940 229 -503 1268 1684 -1228
3462a228j702J685J807J373p2l967k151M527L963l178m160P6K726L065o6m481
$$ -1228 -2930 -1245 562 1935 1863 -2104 -4255 272 4235 1057 -3103 -3027 -301 2764 2698 -1783
3478a783k876L773L434q68k312m91o22L44K526K17j448o98j202L08K690K243l796
$$ -1783 -4659 -886 2548 1680 -632 -1123 -1745 -1401 1125 1342 -106 -804 -2006 -1698 992 3235 -561
3495e61l725K442L896J381j881m460k084M625N254k064n367o45K135K869J358
$$ -561 -4286 -1844 2052 3433 1552 -2908 -4992 -367 4887 2823 -2544 -3189 -1054 1815 3173
3510C173k109m224L16L938J239o74j321k895m74L783L379j711l485k159O20M623
$$ 3173 1064 -3160 -2844 1094 2333 1659 338 -2557 -3031 752 4131 2420 -1065 -3224 -2604 2019
3526B019L325l362o361N30N286K952j662m505l318L533O250J03n809k861J634
$$ 2019 5344 1982 -4379 -3849 1437 4389 2727 -1778 -5096 -1563 4687 4790 -1019 -3880 -2246
3541b246L264K907j045m240k206K850K561M79k97k867l254K986N069J28m591l223
$$ -2246 1018 3925 2880 -1360 -3566 -716 1845 2324 2027 -840 -4094 -1108 3961 4089 -502 -3725
3557c725N19M523M673k923p461o95O107L771j994l751k988J776N393Q09n047j632
$$ -3725 -3206 1317 5990 3067 -4394 -5089 1018 4789 2795 -956 -3944 -2168 3225 4034 -1013 -2645
3573b645J269J775J300O57k283k680P02K514J204L05j941l785J050N064Q02m194
$$ -2645 -1376 399 1699 2356 73 -2607 -1905 609 1813 2118 177 -3608 -2558 2506 3308 -886
3589h86k274J132L100K310j983m594l59M738J751k573j935l13Q52K202J62k497
$$ -886 -3160 -2028 1072 3382 1399 -3195 -3554 1184 2935 362 -1573 -1886 -1034 1168 1330 -1167
3605a167k65K092n41r85P83K13j146K55Q47n6k12Q2j323k92K953L33l111k10J889
$$ -1167 -1432 660 119 -866 -83 130 -1016 -761 86 30 -182 -100 -1423 -1715 1238 1571 -1540 -1750 139
3624A39Q95l63j171j814J339L452n63m023k82K826J105k70j774j613J463L116
$$ 139 1034 671 -500 -2314 -975 2477 1914 -2109 -2391 435 1540 1270 -504 -2117 -654 2462
3640B462q02l331k04K637N9j57j15j000p62J573L88r74J222p59k316R08L315j44
$$ 2462 1660 -1671 -1875 762 821 664 549 -451 -1213 360 748 -226 996 237 -2079 -1171 2144 2000
3658B000k222j692Q01K230J916j972m128O87M847J210l659j980nK282K807j305
$$ 2000 -222 -1914 -1113 1117 3033 1061 -3067 -2380 2467 3677 18 -1962 -1967 315 3122 1817
3674A817l646k04L066M93j210K30r54q67K065Q31p49p70m42q70R96L034j143l785
$$ 1817 -1829 -2033 1033 1526 316 546 -408 -1275 790 1621 872 102 -340 -1210 -214 2820 1677 -2108
3692b108j61K960J252q2k323k932K222M599%m970j830K210K705J424j910l776
$$ -2108 -2269 691 1943 1861 -462 -3394 -1172 3427 3427 -1543 -3373 -1163 1542 2966 1056 -2720
3708b720K7L918J450k548p94p70K1K084J952k406k414M04J511J376J746k100m523
$$ -2720 -2693 1225 2675 127 -667 -1437 -1416 668 2620 214 -2200 -1796 -285 1091 2837 737 -3786
3725c786R29M598J728k507l332j608L023M912o84n955j703L438L652L17k385m127
$$ -3786 -2857 1741 3469 962 -2370 -3978 -955 3957 3273 -2682 -4385 -947 2705 3022 637 -3490
3741c490J22M683K270k705k724l09M01K090K476j281l468j010K014K277K067k674
$$ -3490 -3368 1315 3585 880 -1844 -2153 -1752 338 2814 1533 -1935 -2945 -931 1346 3413 739
3757G39m784J14N971K591l456l867j418L150M808J69n755l069L416L748N93j649
$$ 739 -4045 -3931 2040 4631 1175 -2692 -4110 -960 3848 4017 -1738 -4807 -1391 2357 2950 1301
3773A301l228j328L065K960q15k169j141p65J371L575q4l621k351J498L062K235
$$ 1301 -1927 -3255 -190 2770 1955 -214 -1355 -2120 -749 2826 2742 -879 -3230 -1732 1330 3565
3789C565j500m819j492M940L655k154l687j719J704L683J848l941l005J833K388
$$ 3565 2065 -2754 -4246 694 4349 2195 -1492 -3211 -1507 2176 4024 83 -2922 -1089 1299
3804A299L99n32q68j822L92K262O86p06p65j797o65L626K202l098l376O03K782
$$ 1299 1698 1166 298 -1524 -1132 1130 1816 1110 345 -1452 -2117 1509 3711 613 -2763 -2160 622
3821F22K153q2l922k570L387L735j592k632p95M10J569J647j306k253M37J241
$$ 622 2775 2693 -1229 -3799 -412 3323 1731 -901 -1696 -1286 283 1930 624 -1629 -1192 49
3837D9l02O91J088j725k279K088J378K78m20k222j591K989L310k094l795L29K616
$$ 49 -253 438 1526 -199 -2478 -390 988 1266 846 -1376 -2967 22 3332 1238 -2557 -2228 388
3854C88J193q3k436k295K502L154j472k062lN89K48J000l12j311j55O53q3Q96
$$ 388 1581 1498 -938 -3233 -731 2423 951 -1111 -1114 -525 -277 723 411 -900 -1055 -402 -485 411
3872D11J233j745k617J167L143k0j686j341j014K422L116j886l961R14K551P48
$$ 411 1644 -101 -2718 -1551 1592 1572 -114 -1455 -2469 -47 3069 1183 -2778 -1864 687 1435
3888A435o00j609j279J411K571j007j933R1J430p99O99R70r01j686P86L33P65
$$ 1435 835 -774 -2053 -642 1929 922 -1011 -920 510 -289 410 1380 479 -1207 -421 -88 677
3905F77J094j706k384J248L336k48k697r61n5K482K019j733l712P86L638J99j484
$$ 677 1771 65 -2319 -1071 2265 2017 -680 -1641 -1696 786 2805 1072 -2640 -1854 1784 1983 499
3922D99r78k58K84J928k71j935M85P63o07j3J086k87j455K43O08M82J195j284
$$ 499 -479 -737 -453 1475 1204 -731 -246 517 -90 -103 983 696 -759 -516 92 574 1769 485
3940D85k592R69L079L3k432r81J329J184M50p03k401N01K408j19j934M18P84n77
$$ 485 -2107 -1138 1941 1974 -458 -1439 -110 1074 1524 821 -1580 -1079 1329 1210 -724 -306 478 -99
3958i9r7L09p60J033P33j509j496J991J483j750n44K52l53Q09P76j069p95J716
$$ -99 -196 113 -647 386 1119 -390 -1886 105 1588 -162 -706 -454 -807 2 778 -291 -1086 630
3976F30l00j162L87R28l26j075L23K86R52J071k265k080J735K916q23k032p74
$$ 630 330 -832 -445 483 157 -918 -595 -309 643 1714 -551 -2631 -896 2020 1197 -835 -1609
3993a609J09K081J532k122k676J319K348K45q92q23q95J35J960L06q65m22o51
$$ -1609 -1500 581 2113 -9 -2685 -1366 982 1227 335 -488 -1383 -1248 712 1018 153 -269 -920
4010i20r32K083K019j330l120J29K303J637K45l092k723K112M641k65l609j832
$$ -920 -1852 231 2250 920 -2200 -2071 232 1869 2114 -978 -3701 -1589 3052 2787 -822 -2654
4026b654R32K224K200j430l710q5L128R36n90j48j750j325K424K049n72j923j620
$$ -2654 -1722 502 2702 1272 -2438 -2523 605 1541 951 803 -947 -2272 152 2201 1629 -294 -1914
4043a914Q6K401K905j642m604k23L598K321n54k753k791J345M640L99l921j776
$$ -1914 -1828 573 3478 1836 -2768 -2991 607 2928 2374 -379 -3170 -1825 2815 3214 -707 -2483
4059b483J224K171J717p17l397o51K081J459j96k67j346j589J172L144l47k095
$$ -2483 -1259 912 2629 1912 -1485 -2136 -55 1404 1208 941 -405 -1994 -822 2322 1975 -120
4075a20j549l14K026L086j215m266p09L296K490r20k686k119J568L819P57m066
$$ -120 -1669 -1983 43 3129 1914 -2352 -3061 235 2725 1805 -881 -3000 -1432 2387 3144 -922
4091i22j196J711J146O94k73k159j009J944J081l71J76j261j668P42L295J05k336
$$ -922 -2118 -407 739 1433 1160 -999 -2008 -64 1017 646 822 -439 -2107 -1365 1930 2035 -301
4108c01j838L72J969K380j204m018m43L802K132j746k653p68J400K525M11k784
$$ -301 -2139 -1767 202 2582 1378 -2640 -3083 719 2851 1105 -1548 -2316 -916 1609 2020 -764
4124g64j554J606J009r6O53q33j478N7J691N88n49n17k068N08L394R79k833k241
$$ -764 -2318 -712 297 201 854 21 -1457 -1400 291 879 330 -187 -2255 -1747 1647 2626 -207 -2448
4142b448J013K011J750o83l599q59K985K360j544j970k09L19J962P92j519j809
$$ -2448 -1435 576 2326 1643 -1956 -2815 170 2530 986 -984 -1193 -874 1088 1880 361 -1448
4158a448R82O67Q0Q26J97k200o41J754R75j32q11j762l98L056J964k492k657O59
$$ -1448 -466 201 281 1107 1304 -896 -1537 217 1192 1060 249 -1513 -1911 1145 3109 617 -2040 -1381
4176a381J709J594J45k671j831K093K243j070j074M9l20K58J349m5q82l56k94
$$ -1381 328 1922 2067 -604 -2435 -342 1901 831 -243 -194 -514 -256 1093 1048 166 -190 -484
4193d84p76K133J400k134k213J063J960R51q33j886j359K216K557j641k237J91
$$ -484 -1260 873 2273 139 -2074 -1011 949 1900 1067 -819 -2178 38 2595 954 -1283 -1092
4209a092J570p8L08q76j103R72J066o08m04Q29n35j365R84J369m50n26o52o69
$$ -1092 478 400 708 -168 -1271 -299 767 159 -245 584 49 -1316 -332 1037 587 61 -591 -1260
4227a260J351J705j185k176J79K294O8n59q75p00M84K132j009j634P96O51r11
$$ -1260 91 1796 611 -1565 -1386 908 976 417 -458 -1158 -674 1458 449 -1185 -389 262 -649
4244f49K41P15k4n42O37r97j44J613L43k157m24J926J84k10m93j111L57J585K75
$$ -649 -408 307 283 -259 378 -619 -763 850 1193 -964 -1388 538 722 512 19 -1092 -735 850 1125
4263A125k028J73J165k90o73M70lJ3N15r19j071J799Q60j332j492J380J292k23
$$ 1125 -903 -730 435 145 -528 -58 -61 -48 467 -452 -1523 276 1136 -196 -1688 -308 984 761
4281G61m83j421j82K293J059k214j296J525Q61n35k25k66m16R43J97j305N35J176
$$ 761 278 -1143 -1325 968 2027 -187 -1483 42 903 368 143 -123 -539 404 601 -704 -169 1007
4299A007r83j322J465J658j314p31o05J70J429J418k130k137J973J465k49j436
$$ 1007 24 -1298 167 1825 511 -220 -825 -655 774 2192 62 -2075 -102 1363 1114 -322
4315c22l91j14J339J067j206j473J096N70l01K6O05j583L2J049k2R1K95r13j359
$$ -322 -713 -827 512 1579 373 -1100 -4 566 265 291 896 -687 -655 394 372 463 758 -155 -1514
4334a514J789K086j713j850K28P51J176J201k418k200J956K540l58j824o38K7
$$ -1514 275 2361 648 -1202 -974 -223 953 2154 -264 -2464 -508 2032 1674 -150 -788 -761
4350g61J344R92r95j926L89J768k34m67M15j270m33J134J351m45o75j112p53J678
$$ -761 583 1575 580 -1346 -957 811 577 110 525 -745 -1178 -44 1307 862 187 -925 -1678 0
4368@K700k005k605k94K263J656j36k490k342K466L130m87k749j076J006J284
$$ 0 2700 695 -1910 -2204 59 1715 1579 -911 -3253 -787 2343 1856 -893 -1969 -963 321
4384C21J271j041j908j88J287M37N92Q1j308j977K087K111l61j655j871j6K605
$$ 321 1592 551 -1357 -1545 -258 179 771 852 -456 -2433 -346 1765 1404 -251 -2122 -2138 467
4401D67K556j909l589k74L144J467o2k130k100J123L365k41j995q82K47O00J462
$$ 467 3023 1114 -2475 -2749 395 1862 1800 -330 -2430 -1307 2058 1817 -178 -1060 -813 -213 1249
4418A249N29j996j634J208J036P33N94j577k594J484K821L65k150j143r72K131
$$ 1249 1778 -218 -1852 -644 392 1125 1719 142 -2452 -968 1853 2218 68 -1075 -2047 84
4434H4K765j262l134j015K524J677K68j882j672J96K594M31j558q93P15l59N75
$$ 84 2849 1587 -1547 -2562 -38 1639 1907 25 -1647 -1451 1143 1574 16 -877 -162 -521 54
4451E4J578p95k079J47Q58P31J359q43l108K67L224R38j985j395o69J321K237
$$ 54 1632 837 -1242 -1095 -237 494 1853 1010 -2098 -1831 1393 2331 346 -1049 -1718 -397 1840
4468A840j15k606j063K184R26n18m20n85l75M82J360q80k17P01j566q3J715P68
$$ 1840 1725 -881 -1944 240 1166 648 228 -357 -732 -250 1110 230 13 714 -852 -935 780 1548
4486A548j946q41O26P27J220m77k237k77K158J149j569j342K57J056M49K18j393
$$ 1548 -398 -1239 -613 114 1334 857 -1380 -1657 501 1650 81 -1261 -1004 52 501 719 -674
4503f74o70J756J8n05l68N70o13J95L90k5k53L91n52r52J709Q48j874n15N69R56
$$ -674 -1344 412 430 -75 -443 127 -486 -291 99 74 -179 212 -340 -1292 417 1265 -609 -1124 -555 401
4523D01R5r1j053m35J661O26j317j159J181L95m9l06m89l40J251N06j504K0J579
$$ 401 496 405 -648 -1083 578 1204 -113 -1272 -91 304 255 -51 -540 -880 371 877 -627 -607 972
4542I72o09j188M55O79m9J68o61q58R28J704j317j353Q16J292k50m79p16k58J337
$$ 972 363 -825 -370 309 260 428 -233 -1091 -163 1541 224 -1129 -313 979 729 250 -466 -724 613
4561F13N18j398m04J110N22j298p8N18r9L94K20j190M25J561q29j343q5J575n6
$$ 613 1131 -267 -671 439 961 -337 -415 103 4 398 618 -572 -147 1414 585 -758 -843 732 676
4580F76l97m96k05N54J356j206r96L56J001j12o55L88l34J61L67n65k20J249n1
$$ 676 279 -217 -422 132 1488 282 -714 -358 643 531 -124 264 -70 91 458 -107 -327 922 871
4599H71j712j64J359O78o48n72p50L76J988k03k347j52J045J014r9o05q07j49
$$ 871 -841 -1005 354 1032 384 -188 -938 -562 1426 1223 -1124 -1276 -231 783 684 79 -728 -877
4617h77J386K87j284K68M23p93pJ356J57j449j59k49L43J935J08k655q19K164
$$ -877 509 796 -488 -220 203 -590 -597 759 916 -533 -692 -941 -598 1337 1445 -1210 -2029 135
4635A35J513j104j404o21N19J925J057k458j095J161O29K40L18q88r45P09N31
$$ 135 1648 544 -860 -1481 -962 963 2020 -438 -1533 -372 257 497 815 -73 -1018 -309 222
4652B22K64j6j00j722j48K361J006j758j406k01J321J658K72k552j744K179J751
$$ 222 486 470 370 -1352 -1500 861 1867 109 -1297 -1498 -177 1481 1753 -799 -2543 -364 1387
4669A387m93j052q02j97J888Q86j365j229K21P49p4R71Q9j787o05J071J032P73
$$ 1387 894 -158 -960 -1157 731 1617 252 -977 -756 -7 -81 890 979 -808 -1413 -342 690 1463
4687A463n13j955q58K462J758j291k482J33J072J384O61j952j833J316K205o26
$$ 1463 950 -1005 -1863 599 2357 1066 -1416 -1283 -211 1173 1834 -118 -1951 -635 1570 944
4703I44p75m24n45O56Q88K29j296R2n6l66J071J300j846j221R58J111M21k45j699
$$ 944 169 -255 -800 -144 744 973 -323 -231 -287 -653 418 1718 -128 -1349 -391 720 1141 896 -803
4722h03j001J754K039r25k377m1J339R20L84j712j077J085J267j99p89L47m46
$$ -803 -1804 -50 1989 1064 -1313 -1354 -15 905 1289 -423 -1500 -415 852 653 -136 211 -235
4739b35k87R00K88k02o83l11r2O80J618j375k086N95J857M89p54j250p73J154
$$ -235 -522 378 666 464 -219 -530 -622 58 1676 301 -1785 -1190 667 1156 402 -848 -1621 -467
4757d67K287j153k232J81J519N14j5q11j006R15O60l3p97L19r8o70O74J013m75
$$ -467 1820 667 -1565 -1384 135 649 634 -177 -1183 -268 392 359 -438 -119 -217 -887 -213 800 325
4776C25p74l32M0O38J279r31j857J62K043L77q98q30l77N63K007n46j633j70J302
$$ 325 -449 -781 -741 -103 1176 245 -1612 -1450 593 970 72 -758 -1135 -572 1435 889 -744 -914 388
4795C88j2J94j90o67m80P84M85o74M42K4j386O87J618j5j422r97P45N09J146k58
$$ 388 376 570 380 -287 -767 17 502 -172 270 294 -1092 -405 1213 1198 -224 -1221 -476 33 1179 921
4815I21k154j45K391M31j027j091J20K5J286L43j764P7R08j77l40P46l2o97k09
$$ 921 -1233 -1378 1013 1444 417 -674 -554 -529 757 1100 -664 -587 321 144 -196 550 518 -179 -388
4834c88M76P3P08k63j268n08K129N13j424j044P09O59O10L04k191k38J903K31
$$ -388 88 161 869 606 -662 -1170 959 1472 48 -996 -287 372 982 1286 -905 -1143 760 991
4852I91j006l17K40n0K84L64l24j25L53m51q14J137Q98j179q18K70Q89M16p6j147
$$ 991 -15 -332 -92 -142 142 506 182 57 410 -41 -855 282 1180 1 -817 -547 342 758 682 -465
4872d65q64J134J346r94q13K00M81oL95n06m58P52J80r95L54J029p56m82R1M28
$$ -465 -1329 -195 1151 157 -656 -456 25 19 414 -92 -550 202 382 -613 -259 770 14 -468 -377 51
4892E1L19J22o26j607J377J497k66j569k5L15P06P91r29j008J66J124n8q97R28
$$ 51 370 492 -134 -1741 -364 1133 867 -702 -727 -412 294 1085 156 -852 -686 438 380 -517 411
4911D11l96r10Q53L30P9j40n33q03Q13J817n53j942l38J212O27O11q19j659N27
$$ 411 15 -895 -42 288 367 227 -306 -1109 -296 1521 968 -974 -1312 -100 527 1138 319 -1340 -813
4930h13J744j4j372l73Q75k47P55J58q67m99P82k90J48J028k01j727KJ839J59
$$ -813 931 917 -455 -828 47 -200 555 713 -154 -653 129 -161 -13 1015 814 -913 -911 928 1087
4949A087m67j077p10O89J927k80j953p30J638Q05l9n98j171K58J174P47j269o50
$$ 1087 620 -457 -1167 -478 1449 1169 -784 -1514 124 929 890 292 -879 -621 553 1300 31 -619
4967f19P36p62R07N00k22r82R1J81K55Q68l85j775j18K083N65j064p17o53Q43
$$ -619 117 -645 262 762 540 -442 -351 -170 85 953 568 -1207 -1325 758 1323 259 -458 -1111 -268
4986b68J514L97k344q25J649R34k32p77n62k77J437L35p50q04N28m00k8R86K20
$$ -268 1246 1643 -701 -1526 123 1057 825 48 -514 -791 646 981 231 -573 -45 -445 -473 513 733
5005G33j293m07N48Q83R7j65j616r3K187M68j148j580J66R97J044L42k024q04
$$ 733 -560 -967 -419 464 561 396 -1220 -1313 874 1342 194 -1386 -1220 -223 821 1163 -861 -1665
5023a665J579R78n25k83o24l52Q96P78n94m58l87J69P2J039O13j502q68N49J164
$$ -1665 -86 892 367 84 -540 -892 4 782 188 -270 -657 -488 -416 623 1236 -266 -1134 -585 579
5042E79P25m91k133n22K210J070j393j207L04P78P00L78j069j049Q90P98k81m3
$$ 579 1304 813 -1320 -1842 368 1438 45 -1162 -858 -80 620 998 -71 -1120 -230 568 287 244
5060B44j9m83l87P80N41k91k65n22m81J248J303j273j736P26J062M42Q5j126j383
$$ 244 225 -258 -645 135 676 385 120 -402 -883 365 1668 395 -1341 -615 447 889 974 -152 -1535
5079a535J264J728p01j011k45N98L37N28o80n48k4M67k92K52N92q98r51R51R75
$$ -1535 -271 1457 756 -255 -500 98 435 963 283 -265 -289 178 -114 138 730 -168 -1119 -168 807
5098H07N2m57j418K4Q13J737p28j879P0J472J77K85r87p58N62R04k2j152M45O
$$ 807 859 402 -1016 -992 -179 1558 830 -1049 -979 493 670 955 -32 -790 -228 676 654 -498 -53 -47
5118d7m70M34P77m26j83n37K9O19O75k93j728K47J553K85p81m58n55N41J413o46
$$ -47 -517 -83 694 268 85 -452 -423 196 871 578 -1150 -903 650 935 154 -304 -859 -318 1095 449
5138D49r02l44P66N50l14n2n84j9N02L8l05N36j70o33l10J099K35r36k33J76p8
$$ 449 -453 -797 -31 519 205 153 -431 -450 52 90 -215 321 151 -482 -792 307 542 -394 -627 -451 -529
5159e29J488l51j320k85J260L00m67j82m77M28N81N6r85j93J025J96r78L27K46
$$ -529 959 608 -712 -997 263 563 96 -86 -563 -135 446 502 -483 -676 349 545 -433 -106 140
5178A40m37K87j63J88L04L12j081n50J129M46m50l84l94P84K24J54q42o23J229
$$ 140 -297 -10 -173 15 319 631 -450 -1000 129 575 125 -259 -653 131 355 509 -333 -956 273
5197B73N27q17l95K07L87j9J33o83N46P74q65q49P11N76l32l91q3j47O06L83n17
$$ 273 800 -17 -412 -205 182 163 296 -387 159 933 68 -781 -70 506 174 -217 -300 -447 159 542 25
5218B5p53O31J224j022l73n9L49Q7L75m02m48O83M8m03m6J67j3o07N52K31O1j76
$$ 25 -728 -97 1127 105 -268 -327 22 109 484 82 -366 317 365 -38 -84 83 70 -537 15 246 307 131
5240A31J5q75N84J430q48j091j0M29M43P40p12j504R09J495p79q20l14Q62l35
$$ 131 146 -729 -145 1285 437 -654 -664 -235 208 948 236 -1268 -359 1136 357 -463 -777 85 -250
5259b50O63k4o37J75j18m41R44K67j59j282Q9J033N74k10j073r70R09J731m52
$$ -250 413 389 -248 -73 -191 -632 312 579 420 -862 -773 260 834 624 -449 -1419 -510 1221 769
5278G69j697l27J065O88L04r81p91K92J051O9o86j19j21O7K18Q84l81o98q7K13
$$ 769 -928 -1255 -190 498 802 -179 -970 -678 373 442 -244 -363 -484 -417 -199 685 304 -394 -481 -268
5298b68O03J078q81k151L70J892O53p13j098j100J255J439k62j783l46J164P52
$$ -268 335 1413 532 -1619 -1249 643 1296 583 -515 -1615 -360 1079 817 -966 -1312 -148 604
5315F04J16j93j276j57Q54Q57p49O0m76k43N3J605k14j315l64J84J091K60j3j893
$$ 604 720 527 -749 -906 -52 805 56 116 -360 -603 -550 1055 841 -474 -838 -654 437 697 684 -1209
5335a209j53K107M41p25q45n40O95J171R0j538n81J131L62j09q2j00p33K37Q02
$$ -1209 -1362 745 1186 461 -384 -924 -229 942 1032 -506 -1087 44 406 297 215 115 -618 -381 421
5354D21k39K85m81m03j86J299J4p14p83J18P91O16L12j797M6R17P21o27p00p5
$$ 421 182 467 -14 -417 -603 696 710 -4 -787 -669 122 738 1050 -747 -701 216 937 310 -390 -465
5374d65j08P33M81o75m68O93l9l10L08J40n59Q8K13J23L22j70p92j75Q33P44p05
$$ -465 -573 160 641 -34 -502 191 152 -158 150 290 -269 -181 32 155 477 307 -485 -660 173 917 212
5395B12r06n7O43P51j30j016j76P72N25k75n70K39k98K35L3q8n5K36k14l56K59
$$ 212 -694 -751 -108 643 513 -503 -679 93 618 343 -227 12 -286 -51 -18 -106 -161 75 -139 -495 -236
5416b36Q07p00n87K46N24p1K11l01r22R21Q22n24q13K62K96j9L15j38o47M60L38
$$ -236 571 -129 -716 -470 54 -17 194 -107 -1029 -108 714 190 -623 -361 -65 -84 231 93 -554 -94 244
5437B44m40n8L65J06k98j93P23l08n8l21l78L78J133o03r49N9R50L48o0o88o78
$$ 244 -196 -254 111 217 -81 -274 449 141 83 -238 -616 -238 895 292 -657 -598 352 700 640 -48 -726
5458g26M77J224n67p60J5N30j50K42q4m60K31K27J03l80O09m51p62R1J354p7o15
$$ -726 -249 975 408 -352 -337 193 43 285 201 -259 -28 199 302 -78 531 80 -682 -591 763 686 71
5479G1n05L3P85L75qj843L03J092M42l79p28l51O27Q32l5o41j06K21k83r9N18
$$ 71 -434 -401 384 759 751 -1092 -789 303 745 366 -362 -713 -86 746 711 70 -36 185 -98 -197 321
5500C21k2l92M9j54K06M86l66n89l53J500K55r40n78J18L69O64l83q49l07J212
$$ 321 299 -93 -44 -198 8 494 128 -461 -814 686 941 1 -577 -459 -90 574 191 -658 -965 247
5520B47K68m60ol68N4K37L34l81j82N15p09j41J020J26p78k63J80J72N93K20j261
$$ 247 515 55 49 -319 -265 -28 306 -75 -257 258 -451 -592 428 554 -224 -487 -307 -135 458 678 -583
5541e83J8M44R37p65n86K83k87N53M88o10J22k19n1n1L43P95q56l26J65M15m4
$$ -583 -565 -121 816 51 -535 -252 -539 14 502 -108 14 -205 -256 -307 36 831 -25 -351 -186 229 185
5562A85L03q65l1P07O03p34r60J18N59M78J59l20p46L70O57m98l72K66r8l32R62
$$ 185 488 -377 -408 299 902 168 -792 -674 -115 363 522 202 -544 -174 483 -15 -387 -121 -219 -551 411
5583D11k13r2L29q62k09O34R04m99j189R4O47Q33j16r77p55R69J089m92p55j32
$$ 411 198 106 435 -427 -636 -2 902 403 -786 -692 -45 788 672 -305 -1060 -91 998 506 -249 -381
5603c81K00M85L89k51j023J33O72k65K94l9n22j67M80M92j12n24k84p5Q50J002
$$ -381 -181 304 693 442 -581 -448 224 -41 253 214 -308 -475 5 497 385 -139 -423 -498 352 1354
5623A354o13j569J88P73J031o15o95q02M91J490j90j241k86M76L83L15j93n92
$$ 1354 741 -828 -640 133 1164 549 -146 -948 -457 1033 843 -398 -684 -208 175 490 297 -295
5641b95J14K12K68L81m96k22p11M75J214k68r46l30p7J009P69p05j697K23J550
$$ -295 -181 31 299 680 184 -38 -749 -274 940 672 -274 -604 -681 328 1097 392 -1305 -1082 468
5660D68J95k90o03l42L46R31O4j213k74O64k64K92M5j44m33L11jN60j90r4j086
$$ 468 663 373 -230 -572 -226 705 769 -444 -718 -54 -318 -26 19 -125 -558 -247 -248 312 122 28 -1058
5681a058M20J236o3p51k56K0N92O31o2j406j70J062L64l41n24k46J70Q26J46p64
$$ -1058 -638 598 535 -216 -472 -452 140 771 709 -697 -867 195 559 218 -306 -552 -382 444 590 -174
5701a74O3J06R8j94K69M59r68k19M47M75J83j80o34l90J095N55j263j17M4L65
$$ -174 -111 -5 93 -101 168 627 -341 -560 -113 362 545 365 -269 -659 436 991 -272 -389 -345 20
5721B0K22L79j049J24L89L5J15o31P35k42j65K99l83M89r3o77j78P56O97m86q08
$$ 20 242 621 -428 -304 85 120 235 -396 339 97 -68 231 -152 337 244 -433 -611 145 842 356 -452
5742d52J68L38N03j51n55j88N20O88p97k18j09N5L27J91k24j59Q5k0n2J85J93
$$ -452 -284 54 557 406 -149 -337 183 871 74 -144 -253 -198 129 320 96 -63 22 2 -50 135 328
5763C28k88o33M28O33J3N9o55n92O28Q93m41j057J66K11O18K56q80l32K49R66
$$ 328 40 -593 -165 468 481 540 -115 -707 -79 814 373 -684 -518 -307 311 567 -313 -645 -396 570
5783E70j34n12O1l34k9M35K53m81j95O6j75O15P53o78j164N06R94P2k88o05l24
$$ 570 436 -76 -15 -349 -378 57 310 -171 -366 -300 -475 140 893 215 -949 -443 551 623 335 -270 -594
5804e94K54J374j86j605J28Q31K73o66L43m31j59O32J95p15M56m62l34M28R12
$$ -594 -340 1034 848 -757 -629 202 475 -191 152 -279 -438 194 389 -326 130 -332 -666 -238 674
5823F74n06j69l86k02O27O06k41j125KR62K28j77q10O3K1J053l53o16k58P58L5
$$ 674 168 -1 -387 -589 38 644 403 -722 -720 242 470 293 -517 -454 -433 620 267 -349 -607 151 186
5844A86l99N23k07m31N40k8n0K18j18n66n3R20K3q36r3J21K80O50k72q67p8O33
$$ 186 -213 310 103 -328 212 184 134 352 234 -332 -385 535 558 -278 -371 -250 30 680 408 -459 -537 96
5866I6L2k95J43j84K21K88p8k39j13J46J63m96J47M14m42P4L25o8M1K13n27l69
$$ 96 128 -167 -24 -208 13 301 223 -16 -129 17 180 -316 -169 245 -197 -123 202 134 175 388 -139 -508
5888e08Q02J13o4n93K34l7K61L05j138L60M4M00k80Q6L22l15m15O70k12J41L6
$$ -508 294 407 343 -250 -16 -53 208 513 -625 -265 -221 179 -101 -15 307 -8 -423 247 35 176 212
5909B12k50p80Q95M95l66m57j11O40M6j10p36l63P97O30m39l46k78J8L42Q33p06
$$ 212 -38 -818 77 572 206 -251 -362 278 324 214 -522 -885 -88 542 103 -243 -521 -503 -161 672 -34
5930c4j16P7L38l16K61no68k12O94Q4L58m09m58m36J142P10r03r48J47Q21L39
$$ -34 -150 -73 265 -51 210 205 -463 -675 19 103 461 52 -406 -842 300 1010 107 -841 -694 127 466
5951D66J45p97m01M82P29K27n37p07QM03M03j27m68k60L63n5M15K63l19j048O16
$$ 466 611 -186 -587 -105 624 851 314 -393 -385 18 421 294 -174 -434 -71 -126 289 552 233 -815 -199
5972a99Q72J13l93q03k74R76Q60o88j361l5R69N74J9o58l78K13P43q2o52J88p0
$$ -199 673 786 393 -410 -684 292 1152 464 -897 -932 37 611 630 -28 -406 -193 550 468 -184 4 -66
5993f6J19J21J91R8n44k02J33M10N82n71j078L53J015J37o53m36l5N16L98m30
$$ -66 53 174 365 463 -81 -283 -150 260 842 271 -807 -454 561 698 45 -391 -426 90 488 58
6013E8o99J71Q22j18p2R2p59l1N72L15l55J65o2j92r9O40q4n76k50J32N25K12
$$ 58 -641 -470 352 234 162 254 -505 -536 36 351 -4 161 99 -93 -192 448 364 -212 -462 -330 195 407
6035D07m5j225M89P45J10m58n14K85j06O32l16o70M83M96l50o7l7K43l35J64J97
$$ 407 362 -863 -374 371 481 23 -491 -206 -312 320 4 -666 -183 313 -37 -104 -141 102 -233 -69 128
6056A28m86O52J22j084L76O51J48p11l16K8M20M24k5p27J34L61L38n72N5J33l54
$$ 128 -358 294 416 -668 -292 359 507 -204 -520 -492 -72 352 327 -400 -266 95 433 -139 -84 49 -305
6077c05K88L15l27J76J19l36k37L55N75m76n10P5M06K75o0p37k71J054J75l87
$$ -305 -17 298 -29 147 266 -70 -307 48 623 147 -363 -288 118 393 333 -404 -675 379 554 167
6097A67n14O3M58j18K41k20o27N32K07j54N5j52r4r8K42M85m33J4m77L11K91O26
$$ 167 -347 -284 174 56 297 77 -550 -18 189 35 90 -62 -156 -254 -12 473 40 54 -423 -112 179 805
6119H05q31m44J12P95K29k85q43m31O88R71l71q11L45p2J99L00mn08L7K57K29
$$ 805 -26 -470 -358 437 666 381 -462 -893 -205 766 395 -416 -71 -143 56 356 352 -156 -119 138 367
6140C67l84N80p08k46M29M49j70l70k98O0L17P45o17j083N91P91R5k28m53n74
$$ 367 -17 563 -145 -391 38 487 317 -53 -351 -291 26 771 154 -929 -338 453 548 320 -133 -707
6160g07N86P11k41m89l33L22J57q0J50j65j45L12j81M6L94l27n19K58Q37m95j48
$$ -707 -121 590 349 -140 -473 -151 6 -74 76 -89 -234 78 -103 -57 337 10 -509 -251 586 91 -57
6181e7m42j47O05O95l34r08j60J036L7k06j21n59L50O95j94n12j80M22R2m81M84
$$ -57 -499 -646 -41 654 320 -588 -748 288 325 119 -2 -561 -211 484 290 -222 -402 20 112 -369 115
6202A15L46l70l65J07K77K08J99p62r7O16O7n21J51l95J87K22M05p46P2M52L7
$$ 115 461 91 -274 -167 110 318 517 -245 -342 274 341 -180 -29 -424 -237 -15 390 -356 -284 168 205
6223B05n23K73K38k36m2J23m5K10o1o67%O64k46K80n02N2J73L95O37j262r9N70
$$ 205 -318 -45 193 -43 -85 38 -7 203 142 -525 -525 139 -107 173 -329 -277 -104 291 928 -334 -433 137
6245A37O43n14n89M15r9J87K47m18r4P9K03m42K71M11n24n19M44N22R2j88k55
$$ 137 780 266 -323 92 -7 180 427 9 -85 -6 197 -245 26 437 -87 -606 -162 360 452 264 9
6266In64N48P42m56o40J54N52m41N01n37l34P40k94j51K89m2k06k10M43R6j61
$$ 9 -555 -7 735 279 -361 -207 345 -96 405 -132 -466 274 -20 -171 118 76 -130 -340 103 199 38
6287C8l32K5j14O80J04m41o95L98N40K36m28l12j71M69N78k25q91J06M44R2J79
$$ 38 -294 -269 -383 297 401 -40 -735 -337 203 439 11 -301 -472 -3 575 350 -541 -435 9 101 280
6308B80k22m20j00O78j87j02L39o68m2O17K28l15j08n93M85K82K96o03m07rQ33
$$ 280 58 -362 -462 216 29 -73 266 -402 -444 173 401 86 -22 -615 -130 152 448 -155 -562 -571 262
6329B62K26m64m57O5J34P00l51n97K38K24NJ06J44n47J14l4M06r6K4k35j55RN66
$$ 262 488 24 -433 -368 -234 466 115 -482 -244 -20 -15 91 235 -312 -198 -232 174 78 102 -133 -288 -279 287
6352B87l7n49p6k9M33O43n67m80l1P58q8j15m63J59Q7M87m05l86J86K31M7q3K09
$$ 287 250 -299 -375 -404 29 672 105 -375 -406 352 264 149 -314 -155 -68 419 14 -372 -186 45 92 9 218
6375B18k70j40K25J0J1K11k86k1m48P60o0j80k62n8K52M83o17P3K42J70l60j35
$$ 218 -52 -192 33 43 54 265 -21 -42 -490 270 210 30 -232 -290 -38 445 -172 -99 143 313 -47 -182
6397a82M86k58o0l58P16m00o9K26k06j12N90k51j70n73L25L11M37l86p5j57M21
$$ -182 304 46 -14 -372 344 -56 -125 101 -105 -217 373 122 -48 -621 -296 15 452 66 -9 -166 255
6418B55L62p14LJ00k76K91K65m86q0M43l16q4M46J25j97l54o8M17p2M67r30j9
$$ 255 617 -97 -94 6 -270 21 286 -200 -280 163 -153 -237 209 334 137 -217 -285 132 60 527 -403 -422
6440d22L89O27l79m71k9K91L00J17m87n70N09M97j75l06O9P5j36K79p7m23N01
$$ -422 -33 594 215 -256 -285 6 306 423 -64 -634 -125 372 197 -109 -40 35 -101 178 101 -322 179
6461A79j77K2j73N04j66j005P29MK46J60n26m39O13M79k65m52J69K51Q8j78j87
$$ 179 2 24 -149 355 189 -816 -87 -83 163 323 -203 -642 -29 450 185 -267 -98 153 241 63 -124
6482a24k79L97M07k38J2Q0k88m02M68J50m58n4O3n3M70J93k14m47J35M43j18j79
$$ -124 -403 -6 401 163 175 255 -33 -435 33 183 -275 -329 -266 -319 151 344 130 -317 -182 261 143 -36
6504c6l64l6N17L75j72m23P0m8N36k15j72l17Q4J96J9Q8j20K8k38K53L64j55k28
$$ -36 -400 -436 81 456 284 -139 -69 -117 419 204 32 -285 -201 -5 14 102 -18 10 -228 25 389 234 6
6527Fl55M74N8q2mn57J98N33j64j96Q2j14J55P7j09k84K52K64l83L59K2n19n5
$$ 6 -349 125 183 101 97 -460 -262 271 107 -89 -7 -121 34 111 2 -282 -30 234 -149 210 232 -287 -342
6550c42K59K32O3o2%n38L6P14l77l91kJ98RK38L41p43M27J50p6n2j47j81J72j81
$$ -342 -83 149 212 150 150 -388 -352 362 -15 -406 -408 -210 -201 37 378 -365 62 212 136 84 -63 -244 -72 -253
6574b53O8OJ85o4j87l6N00R0k58j34L8L47R2j99k63l14L91K90j23n50K13r5K58
$$ -253 -185 -179 6 -58 -245 -281 219 309 51 -83 -45 302 394 195 -68 -382 9 299 176 -374 -161 -256 2
6597BK74n49n5J08m8M18O2j77j64j40L33J81J65l80m15M32K5M72n39m00m7O28
$$ 2 276 -273 -328 -220 -268 150 212 35 -129 -269 64 245 410 30 -385 47 72 544 5 -395 -442 186
6619A86O0J27n58l97M35J76K5n7k96J16N5M63nm18PJ92k58L91J9j65n34L55L76
$$ 186 246 373 -185 -582 -147 29 54 -3 -299 -183 -128 335 330 -88 -81 111 -147 244 263 98 -436 -81 295
6642B95L15k89o27K06J81N09o11l81J70L72J96Nn14K8J31J97J68l75ml60L16J34
$$ 295 610 321 -306 -100 81 590 -21 -402 -232 140 336 341 -173 -145 -14 183 351 -24 -28 -388 -72 62
6664F2j51j11L2k9K84J8m6p4k95K12K92L1r6l73j69M43K89l29n01L80J02J7L7
$$ 62 -89 -200 -168 -197 87 105 59 -15 -310 -98 194 225 129 -244 -413 30 319 -10 -511 -131 -29 -12 25
6687B5j99k86J55M95l31N5m0o5j93N33K18k34n08K20M3j92P07k94m35N89n20M05
$$ 25 -174 -460 -305 190 -141 -86 -126 -191 -384 149 367 133 -375 -155 -112 -304 403 109 -326 263 -257 148
6709A48j8j67l4K0R4n4j12R5K95j02J2k07J43j59J76l67J73K93j32j84j40L46
$$ 148 130 -37 -71 -51 43 -11 -123 -28 267 165 177 -30 113 -46 130 -237 -64 229 97 -87 -227 119
6731A19o1l90J57J94K9j3K99m91K23oJ40k13J83k72j12K42N8m46K29L19l18n0
$$ 119 58 -332 -175 19 48 35 334 -157 66 60 200 -13 170 -102 -214 28 86 -360 -131 188 -130 -180
6753a80J97L65m78l0K81j72k54K54k87J08K09J36J7j06q3p8K22n9K4l83K62K61
$$ -180 17 382 -96 -126 155 -17 -271 -17 -304 -196 13 149 166 60 -23 -101 121 62 86 -297 -35 226
6775B26n65M55m1k27k88M72P5M9l11l8J26K19K67l63m22M70j98L35J30p13L58
$$ 226 -339 116 75 -152 -440 32 107 156 -155 -193 -67 152 419 56 -366 104 -94 241 371 -342 16
6796A6K20K00m06K35j32j24P9J49l07K16k79L44j45K8K18l46m13O77O1j58j80
$$ 16 236 436 30 265 133 9 88 237 -70 146 -133 211 66 94 312 -34 -447 230 291 133 -47
6817d7j50j9J90R8k3o78M87M83n07L41m66j52M52N63l62m18m9K8K33L56k01m36
$$ -47 -197 -216 -26 72 49 -629 -142 341 -166 175 -291 -443 9 572 210 -208 -257 -229 4 360 159 -277
6839b77J15q6L37Qk39Q1n93P14R4j07o9k58N64P2k76l64N8k2K65J12m07K02K51
$$ -277 -162 -248 89 97 -142 -61 -654 60 154 47 -22 -280 284 356 80 -284 -226 -248 17 129 -278 -76 175
6862A75l13M05m07k9o0K19j1l7K08m9Q4j58J64J7J44j08m52M85l20M70n36K5k80
$$ 175 -138 267 -140 -169 -229 -10 -21 -58 150 101 185 27 191 208 352 244 -208 277 -43 427 -109 -84 -364
6885c64P35Nj81k43jJ37J2J14j50j30k50Q6L06j52K87L45n01n36P55k37l59M65
$$ -364 371 376 195 -48 -49 88 100 214 64 -66 -316 -230 76 -76 211 556 55 -481 274 37 -322 143
6907A43m7N0qJ40n12K20R2Q2j33K50l22J17l99O42k91O8k71L9J16N8N4L6j22m0
$$ 143 96 146 138 278 -234 -14 78 160 27 277 -45 72 -327 315 24 92 -179 -140 -24 34 88 124 2 -38
6931c8J57K87m25r1k5M11o7l73K26M7m57K66K48k96kK73K28m15%k24j02M29N4
$$ -38 119 406 -19 -110 -135 276 209 -164 62 109 -348 -82 166 -130 -132 141 369 -46 -46 -270 -372 57 111
6954A11J17k92j0J6J05j91K61l38K67l03J40J35J25m78O0K92P3o0k03n5K47K64
$$ 111 228 -64 -74 -58 47 -144 117 -221 46 -257 -117 18 143 -335 -275 17 90 30 -173 -228 19 283
6976B83j11l03Q0j2K77l04k37N12k90k58M85K9M5l59L1J40J93Ol32q7j9L68N2
$$ 283 172 -131 -51 -63 214 -90 -327 185 -105 -363 122 151 196 -163 -132 8 201 207 -125 -212 -231 137 189
6999A89l71l5J7K19K7o4k55L37J96k80O4j95J15k2J52p9l01N7M74l50p8M13j29
$$ 189 -182 -217 -200 19 46 -18 -273 64 260 -20 44 -151 -36 -58 94 15 -286 -229 245 -105 -183 230 101
7022A01k35j02K76J71k24Ql42L02J58K04m51k48J74M24j0k50Q7o0q6K36l17J30
$$ 101 -134 -236 40 211 -13 -5 -347 -45 113 317 -134 -382 -208 216 206 -44 43 -17 -103 133 -184 -54
7044e4L1J81J16k62J0J52n1l42L11J25o2j53Q7l29M37k93K24l65L45l29K38J91
$$ -54 -23 158 274 12 22 174 123 -219 92 217 155 2 89 -240 197 -96 128 -237 108 -221 17 208
7066B08l59K60l14J53J61n9j09K87k5m55J22K93O6l76k18K18K54k4n18L09M4K52
$$ 208 -151 109 -205 -52 109 50 -59 228 203 -252 -130 163 229 -147 -365 -147 107 83 -435 -126 -82 170
7088A70j72k38N9K09p8j41J9J45o8L02m26j63O24j93n2J77j81J82M8m47q2L88
$$ 170 -2 -240 -181 28 -50 -191 -172 -27 -95 207 -219 -382 242 49 -3 174 -7 175 223 -224 -306 82
7110H2J51k58j43M4j95L29Kj44K2K37K48k04l2M4m8J22J69l25k86L03j28k54J01
$$ 82 233 -25 -168 -124 -319 10 12 -132 -110 127 375 171 139 183 135 257 426 101 -185 118 -10 -264 -163
7133a63J86k1k61K96J91o5l96J70J29j41L09j78m05Q9K53l0j1P0k16K20J10j90
$$ -163 23 2 -259 37 228 163 -233 -63 66 -75 234 56 -349 -260 -7 -37 -48 22 -194 26 136 -54
7155e4K5m8jj21L82j81J04k08K05Rj62q4K82o2o2k38N04k08k44KM39P0n06OJ13
$$ -54 -29 -77 -78 -199 183 2 106 -102 103 112 -50 -134 148 86 24 -214 290 82 -162 -160 279 349 -157 -151 -38
7180c8P6K25j89j19j20J51J59p2J0k72M05j18j66L33j10o9k28P9O9J4j4P4k12
$$ -38 38 263 74 -45 -165 -14 145 73 83 -189 216 98 -68 265 155 86 -142 -63 6 20 6 80 -132
7203a32J19R2j73L5q2Q3L50k06l03J37K4j2L44j08l71R9N29k01m5r5l4l38J21
$$ -132 -13 79 -94 -59 -141 -58 292 86 -217 -80 -56 -68 276 168 -203 -104 425 224 179 84 50 -288 -167
7226a67J53J97l19N1k62O04O1l80Q5l21K62j03Q1l2q9k79N30L8O5k35L09l24P6
$$ -167 -14 183 -136 -85 -347 257 318 -62 23 -298 -36 -139 -58 -90 -179 -458 72 110 175 -60 249 -75 1
7249AJ71k46K84l25mJ52k8J60l77j31P91j88j75k77N4p2M29j14o0k33P0K99k80
$$ 1 172 -74 210 -115 -119 33 5 165 -212 -343 448 260 85 -192 -138 -210 219 105 45 -188 -118 181 -99
7272i9j24j39K83J09k16J94j23J61j47p9L70Qj85n0L6J7J02lj84l3K2r2N94o06
$$ -99 -223 -362 -79 30 -186 8 -115 46 -101 -180 190 198 13 -37 -1 16 118 115 -69 -102 -80 -172 422 -184
7296a84J22k19M29j9m08N17k08J4r9K71j83j60J36k19M52j21L5M6l75p1J59M4
$$ -184 -62 -281 148 129 -279 238 30 44 -55 216 33 -127 9 -210 242 121 156 202 -173 -244 -85 -41
7318d1j61P4j09M05lm47n2J78K15j5j91J65J29j20j6K21k37P3j33n7J03J27j17
$$ -41 -202 -128 -237 168 165 -282 -334 -156 59 44 -147 18 147 27 11 232 -5 68 -65 -122 -19 108 -9
7341il05L24k22K35j48j26L6J37K51J0m02N4J53Q4k20J45J32l61L57j97l6R5J81
$$ -9 -314 10 -212 23 -125 -251 -215 -78 173 183 -219 -165 -12 72 -148 -3 129 -232 125 -72 -108 -13 168
7364A68j88p4K32q0j31K76l10J32O0o2j54J52J75K10m33j20N38k26k12j27k5L10
$$ 168 -20 -94 138 58 -73 203 -107 25 85 23 -131 21 196 406 -27 -147 391 165 -47 -174 -199 111
7386A11L6j58r1O03p04L42p4NO8m25M18k26P8J62q6l9K79m19L05K19p41L56q8
$$ 111 147 -11 -102 501 -203 139 65 70 138 -287 131 -95 -17 145 59 20 299 -120 185 404 -337 19 -69
7409f9L78o21N33lj78q0o7j37J28L18j37J8l4q2P1j06N5j41M1J6J02K16k98J14
$$ -69 309 -312 221 218 40 -40 -107 -244 -116 202 65 83 49 -33 38 -68 -13 -154 -113 -97 5 221 -77 37
7433C7P7K81m64J78k29K74J86l19l5L2K86k70N8J96n74J27J60m3K96k02k49n5
$$ 37 114 395 -69 109 -120 154 340 21 -14 18 304 34 92 288 -286 -159 1 -42 254 52 -197 -252
7455b52P7K37P8j08j5M8k10K66O5r5m2J64k13r4Q8%J2J34l34J57Q4k58L05M9j51
$$ -252 -175 62 140 32 17 65 -145 121 186 91 49 213 0 -94 -6 -6 6 140 -194 -37 47 -211 94 143 -8
7480hM7m2j82N13k68j64k18N61k25l8L75l76J21k21J91l8o5j41K69m9J30j32k52
$$ -8 39 -3 -185 328 60 -104 -322 239 14 -24 351 -25 96 -125 66 28 -37 -178 91 42 172 40 -212
7503b12J24j05K31j83r9M82k78L32k06L96m06k02L1L9M73k66l15r0K58q1R6j44
$$ -212 -88 -193 38 -145 -244 238 -40 292 86 482 76 -126 -95 -56 417 151 -164 -254 4 -77 19 -125
7525a25k90M83J16l46L0l0K14J79l15k4L2L42l13K5j0l7m6O5k8J13K27n50O6N58
$$ -125 -415 68 184 -162 -132 -162 52 231 -84 -108 -76 266 -47 -22 -32 -69 -115 -50 -78 35 262 -288 -222 336
7549C36j24j05j78J58j66J76J64J01k60J32k43k1J76k30K61j07L15n22M24k98
$$ 336 212 107 -71 87 -79 97 261 362 102 234 -9 -30 146 -84 177 70 385 -137 287 -11
7569a1j49j0J67L08l40J54j08q7J35J05J3m69j17M39j58OR8l0N1j66L74l34kJ86
$$ -11 -160 -170 -3 305 -35 119 11 -76 59 164 177 -292 -409 30 -128 -122 -24 -54 -3 -169 205 -129 -131 55
7593E5o0r7O4K15k16Q3r3MJ73l56J13j14M11m7l23J97p5K58l4l63Q0K7J06K62
$$ 55 -5 -102 -38 177 -39 44 -49 -45 128 -228 -115 -229 182 135 -188 9 -66 192 158 -205 -125 -98 8 270
7617B70j55j00l9Q3k15J31J49lkj60pK45j45Q5k63j6K88j64l39L95j98K57R0j49
$$ 270 115 15 -24 59 -156 -25 124 121 119 -41 -48 197 52 137 -126 -142 146 -18 -357 38 -160 97 187 38
7641C8k91K99j16L29j40K1k42N2j78L52r6k28L31j69J6N8kk04K16P9N6k09J77
$$ 38 -253 46 -70 259 119 140 -102 -50 -228 124 28 -200 131 -38 -22 36 34 -170 46 125 181 -28 149
7664A49k31j21lL98L5j33k20J64K59l68j17J16j16K17J54k98k41j27O91j22q3
$$ 149 -82 -203 -206 192 227 94 -126 38 297 -71 -188 -72 -188 29 183 -115 -356 -483 208 86 3
7685CJ45l58K03k30J32J97j2q6k89M69j57J52p2r0Q8j15n3L32j29o8n1J02k03
$$ 3 148 -210 -7 -237 -105 92 80 -6 -295 174 17 169 97 7 95 -20 -73 259 130 62 11 113 -90
7708i0J22k64J21p1N93p17O32j62n70L93l70J85L47j94k16N35k55p6P9K94j56
$$ -90 32 -232 -111 -182 411 -306 326 164 -406 -13 -383 -198 149 -45 -261 274 19 -57 22 316 160
7729A60j78J6l52O91k57k3L50m94K41j6k36L0J00M9k25KM50Jl04j42k2k02P09
$$ 160 -18 -2 -354 337 80 57 407 -87 154 138 -98 -68 32 81 -144 -142 308 309 5 -137 -159 -361 348
7752C48n31J39J77r6L3q5J37j30k88O00l35n6O7j66L5J37j8J90k43j42K46J03
$$ 348 -183 -44 133 37 70 -15 122 -8 -296 304 -31 -87 -20 -186 -151 -14 -32 158 -85 -227 19 122
7774A22r9k2l61m8L67p5L14l44L12j47M16k89k44K67L09n57j44M01j78m5L4k18
$$ 122 23 1 -360 -408 -41 -116 198 -146 166 19 435 146 -98 169 478 -79 -223 178 0 -45 -11 -229
7796b29M24Jl63K83m7o0k18N2K59OJ77n62K12L90l72q8kR2J07j4k45N71o83N36
$$ -229 195 196 -167 116 69 9 -209 -157 102 108 285 -277 -65 325 -47 -135 -137 -45 62 48 -197 374 -309 227
7820B27M1n49K98n2m7j02J42J45p6l0N9K98m03pK30j39k25L24j5l28J30J49n5
$$ 227 268 -281 17 -35 -82 -184 -42 103 27 -3 56 354 -49 -56 174 35 -190 134 119 -209 -79 70 15
7843A5l68O74l21j01P3J5K0K88k80l3n5k9j09k1L40j09K19J64k45LJ51m10N04
$$ 15 -353 321 0 -101 -28 -13 7 295 15 -18 -73 -102 -211 -232 108 -1 218 382 137 140 291 -119 385
7866C85p03N73k40k58K24J57J10m4k82J02k45L71l99M13J03l61J36o3m8k31L75
$$ 385 -318 255 15 -243 -19 138 248 204 -78 24 -221 150 -249 164 267 -94 42 -21 -69 -300 75
7887G5Lj68l6%P7M05l45J75J27l15j61l18O6O16r7K62j21l94J23l62L63L09l02
$$ 75 78 -90 -126 -126 -49 356 11 186 313 -2 -163 -481 -415 201 104 366 245 -149 -26 -388 -25 284 -18
7910a8j39k4K05L9k54L3K76n2k40J11M00k42k05OJ53j72K00m1k40J79n0R2J07
$$ -18 -157 -181 24 63 -191 -158 118 66 -174 -63 337 95 -110 -104 49 -123 77 36 -204 -25 -75 17 124
7933A24l31J68K06J40km49R3l5K21K18n6m98L30o5j16J52k66MK00J51q6j8j08
$$ 124 -207 -39 167 307 305 -144 -51 -86 135 353 297 -201 129 64 -52 100 -166 -162 38 189 103 85 -23
7956b3j36K72k18l5L44j51R5k83K03n5jO9j62j36K26j12J3K34j02j14L3k72L57
$$ -23 -159 113 -105 -140 204 53 148 -135 68 13 12 81 -81 -217 9 -103 -90 144 42 -72 -39 -311 46
7979D6R6j72n1K72l55J65j90N5K18j64K5K16P0l3o7r0K04Q0l29P1Q4k83P7J20
$$ 46 142 -30 -81 191 -164 1 -189 -134 84 -80 -55 161 231 198 131 41 245 325 -4 67 151 -132 -55 65
8003F5O5o67J027l62p7l0k68J43j12J6K73j12K24k15M2J14r9N9J6M7o33M36J83
$$ 65 130 -537 490 128 51 21 -247 -104 -216 -200 73 -39 185 -30 12 126 27 86 102 149 -484 -48 135
8026A35k51K91k50J43q5J78r6K7k02K91j44l50L16l10O06j94J30m54L18K1n9m2
$$ 135 -116 175 -75 68 -17 161 65 92 -110 181 37 -313 3 -307 299 105 235 -219 99 120 61 19
8048A9o1O8Nk00M00k86L24l73J07j69K39l34r3L3L47l6Pq8j05N27m93L74l22J89
$$ 19 -42 26 31 -169 231 -55 269 -104 3 -166 73 -261 -354 -321 26 -10 -3 -91 -196 331 -162 212 -110 79
8072G9k21k74O37k9k81o6K96j79J6J79P1j94Q3j07k34M03m05L33ok50R1Q9Q4k00
$$ 79 -142 -416 221 192 -89 -155 141 -38 -22 157 228 34 117 10 -224 179 -226 107 101 -149 -58 31 115 -85
8096h5Mn1J66k16n2J20K64J04p2l42J27K38o16N10q9j49N10j50j45L9M6k34j7
$$ -85 -81 -132 34 -182 -234 -114 150 254 182 -160 -33 205 -411 99 10 -139 371 221 76 115 161 -73 -90
8119i0o0K62Rr6O0J23j70J15m2o57O52k42j80O39m30k1L22k53J63j9k41K0K98
$$ -90 -150 112 121 25 85 208 38 153 111 -546 106 -136 -316 323 -107 -128 194 -59 104 85 -156 -136 162
8142A62k23M79m45k02K49j88J92K0j76j07K80l8MM6J53m39M18l60J75R0K49j98
$$ 162 -61 418 -27 -229 20 -168 24 44 -132 -239 41 3 7 53 206 -233 185 -175 0 90 339 141
8164A41n5M4l76J58J75j17J36q4J45k0r7J20k54J22J20q2k34K21Jn2n1q4J08J58
$$ 141 86 130 -246 -88 87 -30 106 22 167 147 50 170 -84 38 158 76 -158 63 64 12 -39 -123 -15 143
8188A43k52j03J66
$$ 143 -109 -212 -46
8191d6
$$ Imaginary data points
##PAGE= N=2
##DATA TABLE= (X++(I..I)), XYDATA
0@%%%%%%qJ6j6J6k4L2l8M6n5O8q2R3j09J32j52J76k06K37k72L14l56M01m58N20
$$ 0 0 0 0 0 0 0 -8 8 -8 8 -16 16 -22 24 -31 37 -45 48 -61 71 -81 95 -111 126 -146 168 -188 213 -245 275
30B75n82O54p37Q23r19J027j140J265j405J554j721J909k113K340k595K878l196
$$ 275 -307 347 -390 433 -486 541 -599 666 -739 815 -906 1003 -1110 1230 -1365 1513 -1683
47a683L562l981M468n046N739o590P669r082J1018j3855J8430k7019M8617j99354
$$ -1683 1879 -2102 2366 -2680 3059 -3531 4138 -4944 6074 -7781 10649 -16370 32247 -167107
61a67107m45114L19690M86161J24803l10029k74744K5188K50433J32138q4160
$$ -167107 -612221 -292531 193630 318433 8404 -266340 -241152 9281 141419 57259
71E7259j52942m9290N3915J48300J16941r7285k78228j15319K10827L07207M6548
$$ 57259 -95683 -144973 -91058 57242 174183 76898 -201330 -316649 -105822 201385 247933
82B47933k73287k84856O6462L25226J41332j99400k11085M1713J90065R4638r6171
$$ 247933 -25354 -310210 -243748 81478 222810 23410 -187675 -145962 44103 138741 42570
93D2570j80101n0837J37625J67162M2423r4776j69614r8069J16932K24503N2738
$$ 42570 -137531 -188368 -50743 116419 158842 64066 -105548 -203617 -86685 137818 190556
104A90556j59008j44894K2501J24585O8566p1899j06458K6031J22180M5210o0187
$$ 190556 31548 -113346 -90845 33740 102306 30407 -76051 -50020 72160 117370 57183
115E7183p1731l8986K3225R8845P5060l9582q6847l4139K7056N5254K3584m7931
$$ 57183 -14548 -53534 -30309 68536 143596 104014 17167 -16972 10084 65338 88922 40991
127D0991l5855O2518N8126p0108j11635n353R5595Q5034j9267j10342o4161N0685
$$ 40991 5136 67654 125780 55672 -55963 -61316 34279 119313 100046 -10296 -74457 -23772
139b3772M9196k9448j9118L2004P493k3936n278l321k3265o450K8778N2782M2768
$$ -23772 25424 -4024 -23142 8862 16355 -7581 -12859 -16180 -39445 -45895 -17117 35665 78433
152G8433m0618j12161k6946J12539Q7395m4618q0235q965N9371N1322l6585r4414
$$ 78433 37815 -74346 -101292 11247 98642 54024 -26211 -35176 24195 75517 38932 -55482
164e5482p461J06378O8981m2360p4125m5793k296N6953P1552P924m9443n5711
$$ -55482 -62943 43435 112416 70056 -4069 -49862 -52158 4795 76347 84271 34828 -20883
176b0883k6849L7514P4011L18p6328j9906O3424L1874m0386n2857k0543L0562
$$ -20883 -47732 -10218 63793 64111 -12217 -32123 31301 63175 22789 -30068 -50611 -20049
188b0049N7894J1205m4865l2432q882j2700J3892M1457M519k9609o255M134j4467
$$ -20049 37845 49050 4185 -28247 -37129 -49829 -35937 5520 10039 -19570 -25825 -21691 -36158
201c6158p075Q598J1328L0217K3561l4569m4541K1846M1116o127j4477J7953K7800
$$ -36158 -43233 -34635 -23307 6910 30471 -4098 -48639 -26793 14323 8196 -6281 11672 39472
214C9472P587l3527n6652N869Q2862M0626n3227m8737N208J1989Q978J2662n921
$$ 39472 47059 13532 -43120 -37251 45611 86237 33010 -15727 -10519 1470 10448 23110 17189
227A7189j8218l359L747J2255K2280k5746p2773j978J00361O6534n3524j04457
$$ 17189 -1029 -4388 -641 11614 33894 8148 -64625 -66603 33758 100292 46768 -57689
239e7689m6995O2037J13888K2888r9565p3522L8534O3584R659k6633l7208j5032
$$ -57689 -104684 -42647 71241 94129 -5436 -78958 -40424 23160 32819 6186 -31022 -46054
251d6054L3897M1976k149l0699l9174k7673M0410R3031J7672r0271p0776K9124
$$ -46054 -12157 29819 27670 -3029 -42203 -69876 -29466 63565 81237 -9034 -79810 -50686
263e0686P7948M8396k7888p5692j8609O9802N1684l0075n1910j8127K0309N1829
$$ -50686 27262 75658 47770 -27922 -46531 23271 74955 44880 -7030 -25157 -4848 46981
275D6981L1958l9086o1983j4801K2928L4978L5663j2056o5709l7045L0009L8961
$$ 46981 78939 39853 -22130 -36931 -14003 20975 56638 44582 -21127 -58172 -28163 10798
287A0798J4106j0498l9455k8582L0875M6589k034l6050l2661p296M6202O2223
$$ 10798 24904 14406 -25049 -53631 -22756 23833 21799 -14251 -46912 -54208 -8006 54217
299E4217j2744p6104l4889L1489M5921L3292l447n2045m3202J6746M5938L0601
$$ 54217 41473 -34631 -69520 -38031 7890 41182 37735 -14310 -57512 -40766 5172 35773
311C5773l137n3246n1555M0398R1166Q732q6289o9630K4878J02079P5866n6408
$$ 35773 32636 -20610 -72165 -31767 59399 68131 -18158 -87788 -62910 39169 115035 58627
323E8627j32025l1863J02300R4255o900p6953p1497N197Q2404N8357l4651p7865
$$ 58627 -73398 -105261 -2961 91294 84394 7441 -64056 -58859 23545 81902 47251 -30614
335c0614m6197K5804R4914O3501p8099j43280k0860J26374J17718k0310j39207
$$ -30614 -76811 -51007 43907 107408 29309 -113971 -134831 -8457 109261 88951 -50256
346e0256j05428O3150J57218M5628j09230j07797J0433J02027Q6683k7135j16857
$$ -50256 -155684 -92534 64684 110312 1082 -106715 -96282 5745 92428 65293 -51564
357e1564n7756P3300J07082K8376o4959j03020l3405R5677J16441j2271j17658
$$ -51564 -109320 -36020 71062 99438 34479 -68541 -101946 -6269 110172 97901 -19757
368a9757p5547M2413J10396N4408p9237j19023K094J15792P5371m1997j03962
$$ -19757 -95304 -52891 57505 111913 32676 -86347 -84253 31539 106910 64913 -39049
379c9049o1881N5705J23959L5030j00736r9779J4517R3746O8029l1768j04723
$$ -39049 -100930 -45225 78734 113764 13028 -86751 -72234 21512 89541 57773 -46950
390d6950m3061P7809Q6440j6747q3354n5962K1743Q5712N4308n6319r6142j4654
$$ -46950 -90011 -12202 74238 57491 -25863 -81825 -60082 25630 79938 23619 -72523 -87177
402h7177O8951O9818Q333o8444p7420K2738J07439M7597p0142r2064o224R4763
$$ -87177 -18226 51592 59925 -8519 -85939 -63201 44238 91835 21693 -70371 -76595 18168
414A8168R5847l0058j31295n3998R2371J07135k42q7659q0008J3142R6523N7747
$$ 18168 114015 83957 -47338 -101336 -8965 98170 97928 10269 -69739 -56597 39926 97673
426I7673n5617q9305k0924N3389P3196J8392p6921r1195J4623J01478O2504m0597
$$ 97673 42056 -47249 -68173 -14784 58412 76804 -117 -91312 -76689 24789 87293 46696
438D6696r9551n6744O3480J19523J6472j08732q5106L5789J00304N3497n3625
$$ 46696 -52855 -109599 -46119 73404 89876 -18856 -103962 -68173 32131 85628 32003
449C2003j06271k5184R2049Q6035j8963q4004n9718J9937Q9260N7958n1299q8813
$$ 32003 -74268 -99452 -7403 78632 59669 -24335 -84053 -64116 25144 83102 31803 -57010
461e7010j3842N9201O0941J0202n5383o3947J4737P8566L9787l6728o1886k8843
$$ -57010 -70852 -11651 49290 59492 4109 -59838 -45101 33465 73252 36524 -25362 -54205
473e4205L9763P6356J3680p3589n8803K3682N8858K7597k6514n9165k1273M9651
$$ -54205 -14442 61914 75594 2005 -56798 -33116 25742 53339 26825 -32340 -53613 -3962
485c962M3457k3905m5131r655J7947K5421R582k2916k4050R553J6298p58N556
$$ -3962 39495 15590 -29541 -39196 -21249 4172 13754 -9162 -33212 -23659 -7361 -8119 -2563
498b563P243j5400j1239J7276J2449o289l237Q80J080R079O35j7990P00K6986
$$ -2563 4680 -10720 -21959 -4683 7766 1477 -1760 -880 200 9279 9914 -8076 -7376 19610
512A9610L276k7734j0304J6718K0210N756k4202l4982J2595N4480J2779m6335
$$ 19610 22886 -4848 -15152 1566 21776 27532 3330 -31652 -19057 35423 48202 1867
524A867l6670J0287L8134L0032j4015n0248j7870L6119L3574l146k4009k9736
$$ 1867 -34803 -24516 13618 43650 29635 -20613 -38483 -2364 31210 28064 4055 -25681
536b5681j0198L5616L9364j4924m7260k3645J4954M2245L2999k8995o5831j2532
$$ -25681 -35879 -263 39101 24177 -23083 -46728 -31774 10471 43470 14475 -51356 -63888
548f3888N7408N0096q969n3526m3867K5422P5880K3718n8460n3339J3073N1409
$$ -63888 -6480 43616 34647 -18879 -62746 -37324 38556 62274 3814 -49525 -36452 14957
560A4957M0016r930n6146l4199L4813N1645P788k8141l5653j7283K9330M6370
$$ 14957 54973 45043 -11103 -45302 -10489 41156 48944 20803 -14850 -32133 -2803 43567
572D3567j438m4194k9706P089L4154L5343j3677n9216k2515M5833M5169o838l9220
$$ 43567 42129 -2065 -31771 -24682 9472 44815 31138 -28078 -50593 -4760 40409 33571 -5649
585e649l1688R760M6711K0736l4161l3668R196K2886J2313L94j9353j9752J0507
$$ -5649 -37337 -27577 19134 39870 5709 -27959 -18763 4123 16436 16830 -2523 -22275 -11768
598a1768K0467J820m811n081j7856m974K6566J7899j5340k1472n287J1240K3861
$$ -11768 8699 10519 5708 627 -17229 -22203 4363 22262 6922 -14550 -19837 -8597 15264
611A5264Q395k7250k0285J9887K1673m070q657o415n663P693J2460m205q138L408
$$ 15264 23659 -3591 -23876 -3989 17684 13614 4957 -1458 -7121 572 13032 8827 689 4097
625D097n169j0388J0945J5506q394j5973m849L689J4993J2206j9433k6415J3312
$$ 4097 -1072 -11460 -515 14991 6597 -9376 -14225 -10536 4457 16663 -2770 -29185 -15873
638a5873L0634J444j8947j3251j579J8810K4516p571k8903m685J8174J4001O359
$$ -15873 14761 16205 -2742 -15993 -17572 1238 25754 18183 -10720 -15405 2769 16770 23129
651B3129p667k3705o497K5547J7520q264j5799j6342l752K8688K9467k0525m4128
$$ 23129 15462 -8243 -14740 10807 28327 20063 4264 -12078 -15830 12858 42325 21800 -22328
664b2328p965L0951L4433L788m1581m1325K0777N7597J1177m1994l7890J543M0366
$$ -22328 -30293 658 35091 38879 -2702 -44027 -23250 34347 45524 3530 -34360 -32817 7549
677G549L9217j7909n9141k0050M0001M0840K578l2495m4473p145M8473M3424j7979
$$ 7549 46766 28857 -30284 -50334 -10333 30507 33085 590 -43883 -51028 -2555 40869 22890
690B2890n2024l1132J9936O0513L4847m9171p6022J466P4748N5510k0866p4967
$$ 22890 -29134 -60266 -40330 20183 55030 5859 -70163 -68697 6051 61561 40695 -34272
702c4272m7558M6981R0315J6529p3317o3332J3334O9096N2667k6267q1337l1425
$$ -34272 -81830 -34849 55466 71995 -1322 -64654 -51320 17776 70443 44176 -37161 -68586
714f8586N6769O6971L771n3495n9973l597O9469O2305k6743p9903l7681M0738
$$ -68586 -11817 55154 58925 5430 -54543 -58140 11329 73634 46891 -33012 -70693 -29955
726b9955P6206K9673o2385q4649O350Q8488N5745l5383q3400m1508N4208R2999
$$ -29955 46251 75924 13539 -71110 -64760 23728 79473 44090 -39310 -80818 -26610 66389
738F6389J0759q5618o7620K4860P3558M2262l0799p4571k9546N3601O2375r36
$$ 66389 77148 -8470 -76090 -51230 22328 64590 33791 -40780 -70326 -16725 45650 44714
750D4714n0338m7111J799N8775N2341k6328p1473k5703M4271O2199J7323n3867
$$ 44714 -5624 -52735 -50936 7839 60180 33852 -37621 -63324 -19053 43146 60469 6602
762F602o7315J1491P9896L8894m6149o5447j0520N3818N8862j2691p2949l3649
$$ 6602 -60713 -49222 30674 69568 23419 -42028 -52548 1270 60132 47441 -25508 -59157
774e9157M2720N3012O156l4564m2647p489M1526L8131j2991l8574j9223J1740
$$ -59157 -16437 36575 42731 8167 -34480 -41969 -443 37688 24697 -13877 -33100 -21360
786b1360L5054K4102k5428m7029p72M5638L1083j3806m2081k7953K8775N5532
$$ -21360 13694 37796 12368 -34661 -35433 10205 41288 27482 -14599 -42552 -13777 41755
798D1755K613n2958k9732K6072L8639R207k8787l6776N851M4197J9531k6507l0017
$$ 41755 44368 -8590 -38322 -12250 26389 35596 6809 -29967 -24116 20081 39612 13105 -16912
811a6912n114J7021K9481R696k8383k7643R600K4553J0449m813k1073j7883J7302
$$ -16912 -22026 -5005 24476 34172 5789 -21854 -12254 12299 22748 17935 -3138 -21021 -3719
824c719L2288l154l3399j8580J1600K9092J7857k3409m2636m61M0449J9407k0197
$$ -3719 28569 25415 -7984 -26564 -14964 14128 31985 8576 -34060 -34521 5928 25335 5138
837E138k8284r383K1679L3021m492m2131j6738K9001L1461K092k2391k8145j5
$$ 5138 -23146 -32529 -10850 22171 17679 -24452 -41190 -12189 19272 21364 -1027 -29172 -29187
850b9187L3452K2033j5956k2346m908P484J8873J3978j8472l0192N827L0665J6167
$$ -29187 4265 26298 10342 -12004 -16912 -9428 9445 23423 4951 -25241 -19414 11251 27418
863B7418j2539l1824k0497K5174M5143j72m5111k5657J9298L6267J4757k6889
$$ 27418 14879 -16945 -37442 -12268 32875 32703 -12408 -38065 -18767 17500 32257 5368
875E368m1599M684M7554K1918k8961l4838p173K2396L4796P703l4246l2283P589
$$ 5368 -36231 -31547 16007 37925 8964 -25874 -33047 -10651 24145 31848 -2398 -34681 -27092
888b7092K8839K1205k075l1931k8198K0258M2902N655l3064k9455L065L6987L6125
$$ -27092 1747 22952 20877 -11054 -39252 -18994 23908 29563 -3501 -32956 -29891 7096 43221
901D3221j6428n3154j5879L9205L9790J516l3564l5480P899M6884K1020l0630
$$ 43221 26793 -26361 -42240 -3035 36755 38271 4707 -30773 -22874 24010 45030 14400
913A4400l4825j300K4714K8724K826l7089l2086J5087L6629J4848j3703l0161
$$ 14400 -20425 -21725 2989 31713 34539 -2550 -34636 -19549 17080 31928 18225 -11936
925a1936k2989J6298L9169Q738k7651k6551k566K4757L0681n463m2582j8831L1084
$$ -11936 -34925 -18627 20542 29280 1629 -24922 -27488 -2731 27950 22487 -20095 -38926 -7842
938g842L4234o54k6831k6563J713L3354K1113j8307k3445p97Q527J0103Q692o697
$$ -7842 26392 25738 -1093 -27656 -25943 7411 28524 10217 -13228 -14025 -5498 4605 13297 6600
952F600j6707j263J1676Q579M935o117k3310o278K8507K3084j3178k6253j0486
$$ 6600 -10107 -11370 306 8885 13820 7703 -15607 -21885 6622 29706 16528 -9725 -20211
965b0211J1587K5095R283k2891j9790J0014J4229R3j915n294j1295M02J3428M854
$$ -20211 -8624 16471 25754 2863 -16927 -6913 7316 7409 5494 200 -11095 -10693 2735 7589
979G589l953p075j4585m292K3622K0454j4557k6938n996J5304K3323P991k5120
$$ 7589 3636 -3439 -18024 -22316 1306 21760 7203 -19735 -25731 -10427 12896 20887 -4233
992d233k4263J4776K8924K699j6723j5166m094J7061K4727m072k7289j2612R885
$$ -4233 -28496 -13720 15204 17903 1180 -13986 -18080 -1019 23708 19636 -7653 -20265 -10380
1005a0380J7302J4465m392k7977j4935J9871K3911K156j7291k3524n273L1556
$$ -10380 6922 21387 16995 -10982 -25917 -6046 17865 20021 2730 -20794 -26067 5489
1017E489L0490j8462m1981j0009K8995L4201N158l6331l7595J5086M6831J3262
$$ 5489 35979 17517 -24464 -34473 -5478 28723 33881 -2450 -40045 -24959 21872 35134
1029C5134k8830l0691l437K6258L1477o271l8955j7962K0285K7991J2328j3421
$$ 35134 6304 -24387 -27824 -1566 29911 23640 -15315 -33277 -12992 14999 27327 13906
1041A3906l5255j7780L1379M1685m89l7565l2886P082M9025L3130l3061n7788
$$ 13906 -21349 -39129 -7750 33935 33446 -4119 -37005 -29923 19102 52232 19171 -38617
1053c8617j887N1380L8533j3955n0165l3023K8791N8010J0068m4785l9829M027
$$ -38617 -40504 10876 49409 35454 -14711 -47734 -18943 39067 49135 4350 -35479 -31452
1065c1452L6200L5049p817m7514k7317K5633M2217J3595k6308m5317j3359M5797
$$ -31452 4748 39797 31980 -15534 -42851 -17218 24999 38594 12286 -33031 -46390 -593
1077e93N0157j3436n6237k8752K5215N1726K3280m0223n5844L098N4405L3510
$$ -593 49564 36128 -20109 -48861 -23646 28080 51360 11137 -44707 -41609 12796 46306
1089D6306k0822m7166k4724K8608N3247P402m6978l6466J1379L6886K6790j0313
$$ 46306 25484 -21682 -46406 -17798 35449 42851 -4127 -40593 -29214 7672 34462 24149
1101B4149m1075k2518K6521L7053N016k4403k9191n321L2404L4461j3250m2613
$$ 24149 -16926 -39444 -12923 24130 29146 4743 -24448 -29769 2635 37096 23846 -18767
1113a8767j5075K3550L3732J0274k9159l8472O460M3441J6250k6154k8505j612
$$ -18767 -33842 -10292 23440 33714 4555 -33917 -27457 15984 32234 6080 -22425 -24037
1125b4037K3558K3735r107l1532q111K3261J5853m453j0752j1520k094J6757J2716
$$ -24037 -479 23256 14149 -17383 -25494 -2233 13620 9167 -1585 -13105 -15199 1558 14274
$$ [...]
8191a5
##END NTUPLES=NMR FID
##END=
