##TITLE=1H_CG-1102-3
 CDCl3, 8 sc, 
 11.4.2019
##JCAMPDX= 6.0         $$ Bruker NMR JCAMP-DX V2.0
##DATA TYPE= NMR FID
##DATA CLASS= NTUPLES
##ORIGIN= UXNMR, Bruker Analytische Messtechnik GmbH
##OWNER= root
$$ XWIN-NMR		Version 3.5
$$ Thu Apr 11 13:47:27 2019 Russian Standard Time (UT+4h)  she@DPX200
##.OBSERVE FREQUENCY= 200.1315
##.OBSERVE NUCLEUS= ^1H
##.DELAY= (6, 6)
##.ACQUISITION MODE= SIMULTANEOUS
##.ACQUISITION SCHEME= undefined
##.AVERAGES= 8
##.DIGITISER RES= 18
##SPECTROMETER/DATA SYSTEM= spect
##.PULSE SEQUENCE= zg30
##.SOLVENT NAME= CDCl3
##.SHIFT REFERENCE= (INTERNAL, CDCl3, 0, 15.7039)
##AUDIT TRAIL= $$ (NUMBER, WHEN, WHO, WHERE, WHAT)
$$ ##TITLE= Audit trail, XWIN-NMR		Version 3.5
$$ ##JCAMPDX= 5.01
$$ ##ORIGIN= Bruker BioSpin GmbH
$$ ##OWNER= she
$$ F:/spectra/data/she/nmr/H-F/1/audita.txt
$$ ##AUDIT TRAIL=  $$ (NUMBER, WHEN, WHO, WHERE, WHAT)
(   1,<2019-04-11 13:46:17.25 +0400>,<she>,<DPX200>,
      <created by zg, POWCHK disabled, PULCHK disabled
       configuration hash MD5:
       00 E9 B6 7A A2 85 ED C7 34 08 36 98 17 FE 4E 26
       data hash MD5: 16K
       13 B2 BD F4 7A D7 B3 C5 83 8F BA 89 62 AB 5B E3>)
$$ ##END=
$$ 
$$ hash MD5
$$ E2 31 F6 2C C6 4A FB CF B8 77 DA 40 3E 98 4A 3D
##$RELAX= 
##$RELAX= 
##$RELAX= 
##$RELAX= 
##$RELAX= 
##$RELAX= 
$$ Bruker specific parameters
$$ --------------------------
##$DU= <F:/spectra>
##$EXPNO= 1
##$NAME= <H-F>
##$PROCNO= 1
##$TYPE= <nmr>
##$USER= <she>
##$AMP= (0..31)
100 100 100 100 100 100 100 100 100 100 100 100 100 100 100 100 100 100 
100 100 100 100 100 100 100 100 100 100 100 100 100 100 
##$AQSEQ= 0
##$AQ_mod= 1
##$AUNM= <au_zg>
##$AUTOPOS= <>
##$BF1= 200.13
##$BF2= 200.13
##$BF3= 200.13
##$BF4= 200.13
##$BF5= 200.13
##$BF6= 200.13
##$BF7= 200.13
##$BF8= 200.13
##$BYTORDA= 1
##$CFDGTYP= 0
##$CFRGTYP= 5
##$CHEMSTR= <none>
##$CNST= (0..31)
1 1 145 1 1 1 1 1 1 1 1 1 1 1 1 1 1 1 1 1 1 1 1 1 1 1 1 1 1 1 1 1 
##$CPDPRG= <>
##$CPDPRG1= <>
##$CPDPRG2= <>
##$CPDPRG3= <>
##$CPDPRG4= <mlev>
##$CPDPRG5= <mlev>
##$CPDPRG6= <mlev>
##$CPDPRG7= <mlev>
##$CPDPRG8= <mlev>
##$CPDPRGB= <>
##$CPDPRGT= <>
##$D= (0..31)
0 1.2 0 0 0 0 0 0 0 0 0 0.03 0 0 0 0 0 0 0 0 0 0 0 0 0 0 0 0 0 0 0 0 
##$DATE= 1554975976
##$DBL= (0..7)
120 120 120 120 120 120 120 120 
##$DBP= (0..7)
150 150 150 150 150 150 150 150 
##$DBP07= 0
##$DBPNAM0= <>
##$DBPNAM1= <>
##$DBPNAM2= <>
##$DBPNAM3= <>
##$DBPNAM4= <>
##$DBPNAM5= <>
##$DBPNAM6= <>
##$DBPNAM7= <>
##$DBPOAL= (0..7)
0.5 0.5 0.5 0.5 0.5 0.5 0.5 0.5 
##$DBPOFFS= (0..7)
0 0 0 0 0 0 0 0 
##$DE= 6
##$DECBNUC= <off>
##$DECIM= 24
##$DECNUC= <off>
##$DECSTAT= 4
##$DIGMOD= 1
##$DIGTYP= 9
##$DL= (0..7)
0 120 120 120 120 120 120 120 
##$DP= (0..7)
150 150 150 150 150 150 150 150 
##$DP07= 0
##$DPNAME0= <>
##$DPNAME1= <>
##$DPNAME2= <>
##$DPNAME3= <>
##$DPNAME4= <>
##$DPNAME5= <>
##$DPNAME6= <>
##$DPNAME7= <>
##$DPOAL= (0..7)
0.5 0.5 0.5 0.5 0.5 0.5 0.5 0.5 
##$DPOFFS= (0..7)
0 0 0 0 0 0 0 0 
##$DQDMODE= 0
##$DR= 18
##$DS= 0
##$DSLIST= <SSSSSSSSSSSSSSS>
##$DSPFIRM= 0
$$ [...]
##$SUBNAM2= <"">
##$SUBNAM3= <"">
##$SUBNAM4= <"">
##$SUBNAM5= <"">
##$SUBNAM6= <"">
##$SUBNAM7= <"">
##$SUBNAM8= <"">
##$SUBNAM9= <"">
##$SW= 24.9337058887773
##$SWIBOX= (0..15)
0 0 2 0 0 0 0 0 0 0 0 0 0 0 0 0 
##$SW_h= 4990.01996007984
##$TD= 16384
##$TD0= 1
##$TE= 0
##$TE2= 300
##$TE3= 300
##$TEG= 300
##$TL= (0..7)
0 120 120 120 120 120 120 120 
##$TP= (0..7)
150 150 150 150 150 150 150 150 
##$TP07= 0
##$TPNAME0= <>
##$TPNAME1= <>
##$TPNAME2= <>
##$TPNAME3= <>
##$TPNAME4= <>
##$TPNAME5= <>
##$TPNAME6= <>
##$TPNAME7= <>
##$TPOAL= (0..7)
0.5 0.5 0.5 0.5 0.5 0.5 0.5 0.5 
##$TPOFFS= (0..7)
0 0 0 0 0 0 0 0 
##$TUNHIN= 0
##$TUNHOUT= 0
##$TUNXOUT= 0
##$USERA1= <user>
##$USERA2= <user>
##$USERA3= <user>
##$USERA4= <user>
##$USERA5= <user>
##$V9= 5
##$VALIST= <valist>
##$VCLIST= <CCCCCCCCCCCCCCC>
##$VD= 0
##$VDLIST= <DDDDDDDDDDDDDDD>
##$VPLIST= <PPPPPPPPPPPPPPP>
##$VTLIST= <TTTTTTTTTTTTTTT>
##$WBST= 1024
##$WBSW= 4
##$XGAIN= (0..3)
0 0 0 0 
##$XL= 0
##$YL= 0
##$YMAX_a= 304915
##$YMIN_a= -380922
##$ZGOPTNS= <>
##$ZL1= 120
##$ZL2= 120
##$ZL3= 120
##$ZL4= 120
##$ABSF1= 10
##$ABSF2= 0
##$ABSG= 5
##$ABSL= 3
##$ALPHA= 0
##$AQORDER= 0
##$ASSFAC= 0
##$ASSFACI= 0
##$ASSFACX= 0
##$ASSWID= 0
##$AUNMP= <proc_1d>
##$AZFE= 0.1
##$AZFW= 0.1
##$BCFW= 1
##$BC_mod= 2
##$BYTORDP= 1
##$COROFFS= 0
##$CY= 11.3945322036743
##$DATMOD= 1
##$DC= 2
##$DFILT= <>
##$DTYPP= 0
##$F1P= 18.9103706918063
##$F2P= -1.10871071338519
##$FCOR= 0.5
##$FTSIZE= 0
##$FT_mod= 4
##$GAMMA= 1
##$GB= 0.15
##$INTBC= 1
##$INTSCL= 1
##$ISEN= 128
##$LB= 0.24
##$LEV0= 0
##$LPBIN= 0
##$MAXI= 10000
##$MC2= 0
##$MEAN= 0
##$ME_mod= 0
##$MI= 1.114404
##$NCOEF= 0
##$NC_proc= 0
##$NLEV= 6
##$NOISF1= 3.799351
##$NOISF2= 2.8
##$NSP= 1
##$NTH_PI= 0
##$NZP= 0
##$OFFSET= 15.70392
##$PC= 1
##$PHC0= -8850.223
##$PHC1= 14.20026
##$PH_mod= 1
##$PKNL= yes
##$PPARMOD= 0
##$PSCAL= 0
##$PSIGN= 0
##$REVERSE= no
##$SF= 200.130013532006
##$SI= 16384
##$SIGF1= 3
##$SIGF2= 2
##$SINO= 400
##$SIOLD= 16384
##$SREGLST= <1H.CDCl3>
##$SSB= 0
##$STSI= 0
##$STSR= 0
##$SW_p= 3612.71676300578
##$SYMM= 0
##$S_DEV= 0
##$TDeff= 0
##$TDoff= 0
##$TI= <>
##$TILT= no
##$TM1= 0
##$TM2= 0
##$TOPLEV= 0
##$USERP1= <user>
##$USERP2= <user>
##$USERP3= <user>
##$USERP4= <user>
##$USERP5= <user>
##$WDW= 1
##$XDIM= 8192
##$YMAX_p= 0
##$YMIN_p= 0
$$ End of Bruker specific parameters
$$ ---------------------------------
##NTUPLES= NMR FID
##VAR_NAME=  TIME,          FID/REAL,        FID/IMAG
##SYMBOL=    X,             R,               I
##VAR_TYPE=  INDEPENDENT,   DEPENDENT,       DEPENDENT
##VAR_FORM=  AFFN,          ASDF,            ASDF
##VAR_DIM=   8192,          8192,            8192
##UNITS=     SECONDS,       ARBITRARY UNITS, ARBITRARY UNITS
##FACTOR=    0.0002004,     1,               1
##FIRST=     0,             0,               0
##LAST=      1.6414764,     0,               0
##MIN=       0,             -380922,         0
##MAX=       1.6414764,     304915,          0
$$ Real data points
##PAGE= N=1
##DATA TABLE= (X++(R..R)), XYDATA
0 0 0 0 0 0 8 -8 8 -8 16 -16 24 -24 32 -40 48 -57 72 -81 100 -116 137 -160 185 -212 245 -281 319 -364
28 -364 412 -466 524 -589 662 -742 826 -921 1026 -1138 1262 -1402 1550 -1716 1902 -2105
44 -2105 2333 -2587 2874 -3201 3577 -4012 4526 -5144 5896 -6851 8091 -9787 12259 -16207
58 -16207 23548 -41918 185536 219229 -153450 -59332 173475 304915 174630 83542 93662
69 93662 127859 29988 -19283 109291 293487 216108 -51907 -178643 13172 251840 244551
80 244551 13405 -121074 -31031 98708 71990 11451 64300 122571 10232 -153726 -121775
91 -121775 111512 252989 105180 -157713 -200619 2077 158118 99315 -13584 -22820 2637
102 2637 -41174 -79453 8894 157840 151035 -59773 -218247 -95191 157174 210246 21648
113 21648 -145590 -109201 29972 78213 20053 -5145 38427 11223 -117092 -147743 24463
124 24463 183415 91281 -150400 -239778 -79371 108778 93802 -62890 -135534 -79326 -47728
135 -47728 -88491 -78249 16882 50803 -73179 -226128 -198732 4751 128519 4103 -197264
146 -197264 -213040 -66413 20413 -23526 -75355 -59739 -50345 -111139 -156826 -67285 83614 77111
158 77111 -110601 -230598 -120782 66352 101300 -19777 -117903 -89435 -19831 -16876 -35135
169 -35135 18540 73518 145 -134820 -133948 28228 153650 84701 -91283 -152992 -36428
180 -36428 85049 62450 -20830 -27235 4166 -26627 -76390 -32436 79858 103743 -25606 -158218
192 -158218 -110229 62348 129159 18045 -99602 -87577 -11274 15034 -9012 -8721 25337 13671
204 13671 -75568 -120667 -22329 106141 86284 -57616 -134388 -60186 52260 68600 -1193
215 -1193 -39760 -9882 2642 -36092 -32276 51755 97826 20163 -88669 -82087 38084 126717
227 126717 75313 -40585 -66543 6061 55555 37595 24333 42379 35348 -17847 -50319 3191
239 3191 99203 110172 1012 -90686 -41429 71457 97130 27485 -26931 -12784 20322 14574
251 14574 -5232 20417 65454 39093 -47346 -69298 14178 90135 62520 -23271 -61385 -17279
263 -17279 39792 37104 2026 4666 25579 47 -43648 -23343 52091 84412 23934 -60589
275 -60589 -62068 25867 87667 50116 -17072 -24155 7662 17491 13512 28220 48247 33766 -17005
288 -17005 -44224 5707 80532 77148 -3178 -49218 -11424 45571 53728 21652 -269 10102
300 10102 20463 1009 -9939 26656 62848 32225 -29505 -38614 13049 57708 43852 -6685
312 -6685 -26736 1070 21817 5143 -1882 22928 29713 -7806 -40242 -20702 31197 53519 12514
325 12514 -44944 -41935 11919 38253 13448 -13095 -11208 -3040 -5867 -10836 1861 25324 20926
338 20926 -23025 -48246 -10434 38226 30767 -13284 -34565 -16975 8418 11518 -3966 -6571 6807
351 6807 397 -25781 -24456 11766 30619 6373 -28144 -33110 -3720 25038 14810 -15475 -18699
364 -18699 187 1117 -11664 -6508 11646 12394 -9672 -29563 -18816 15725 27811 -3770 -31474
377 -31474 -16757 8222 7770 -3816 -5334 263 854 -9621 -17637 -2553 21746 15245 -17399 -27776
391 -27776 -5114 15955 14271 -2550 -15282 -10034 2897 332 -6874 2940 11323 -5146 -23098
404 -23098 -14025 9243 17132 2551 -19204 -21487 122 13285 746 -10925 -5543 -2052 -7729
417 -7729 -8773 -2620 2483 2191 -8565 -20009 -12421 6385 5941 -11162 -16559 -8647 -4495 -6780 -10435
432 -10435 -10139 -2770 -1657 -15415 -23950 -8972 5990 -1712 -16285 -19253 -12989 -5806 -2781 -8493
446 -8493 -13118 -10023 -10325 -17257 -12364 206 -1579 -14816 -21879 -17306 -5014 4357 -3590 -21252
460 -21252 -21235 -5896 -1867 -7842 -9251 -8416 -10486 -10595 -9226 -7493 -1852 -1975 -12755 -16229 -5076
475 -5076 1128 -6226 -11035 -8275 -6712 -5557 -6453 -11372 -9738 -164 -1618 -13860 -15623 -6099 -1040
490 -1040 -1861 -5917 -12349 -11929 -4294 -1865 -4368 -991 -492 -10618 -13552 -1246 8668 5050 -3568
505 -3568 -11174 -8077 6040 14144 4422 -4609 -635 4098 5960 9971 11286 7781 6826 7270 6223
520 6223 11807 21648 17485 7186 7783 15594 18584 18217 16961 15092 16828 18433 12331 10887 21484
535 21484 27180 16522 6826 9446 15497 20500 21855 14146 6868 9394 13142 12450 15641 19382 12452
550 12452 2037 2081 10381 18514 20234 9574 -3996 216 15232 17524 10723 8548 8113 4662 5594
565 5594 10310 15256 19457 15120 1789 -443 15071 26666 21461 12718 9219 10392 17024 23482
579 23482 21698 20312 21883 15772 7936 16111 31308 31491 18560 8011 8202 19687 29686 23271
593 23271 11189 11233 14684 9688 8030 16181 20319 11783 42 -6038 -266 14573 17044 61
607 61 -12667 -9012 -2517 -1718 -1044 -1824 -7199 -14499 -20617 -19473 -4368 7187 -6902 -31410 -32663
622 -32663 -13993 -426 -2574 -14879 -25276 -22504 -13632 -11384 -9655 -2437 -5449 -22245 -27727 -11926
636 -11926 5698 6746 -7925 -24201 -22009 -2827 5766 -4156 -9817 -6224 -8259 -16654 -15684 -4402
650 -4402 5547 904 -19945 -33728 -19341 2992 704 -17689 -25347 -23268 -22719 -22366 -18903 -14265
664 -14265 -14609 -29011 -48078 -43625 -15786 -3863 -24540 -50533 -53625 -36365 -18860 -20076 -34256
677 -34256 -41185 -38188 -39580 -41751 -27440 -11437 -19345 -42435 -51304 -34121 -7880 -407 -19670
690 -19670 -38513 -29237 -10555 -7757 -12036 -6190 -1434 -7969 -17147 -15962 2845 22852 16555 -10402
704 -10402 -19261 2363 22309 20745 10027 5167 5954 7655 6073 9974 26635 33163 10054 -15581
718 -15581 -5221 27912 40922 21507 -3581 -8503 8913 23403 18197 11131 14604 11785 -4048
731 -4048 -6464 14987 34405 26613 -1093 -17807 -251 31560 36229 11731 -1527 9132 17993
744 17993 14917 16592 27765 34031 23179 2740 1961 31942 56161 41202 10672 6517 26213
757 26213 42117 41328 33912 31174 33490 28161 17416 28057 54302 57101 26891 3339 14446
770 14446 43286 55202 38611 14065 11008 25103 28178 21000 25483 33471 21045 -2792 -7665
783 -7665 13926 36557 30618 -3608 -24608 -7155 18146 16730 363 -5936 -5254 -9451 -14406 -9960
797 -9960 5535 14374 -4812 -35433 -33287 866 19834 1135 -24432 -28298 -12845 -1159 -4784
810 -4784 -10671 -4454 -1358 -17858 -30304 -12714 14531 13621 -12786 -32108 -22960 2964 13558
823 13558 -2367 -17122 -11836 -6299 -14265 -15556 164 10598 -2572 -27843 -36215 -13056 14804
836 14804 9883 -22275 -37480 -23412 -7932 -7458 -11847 -14390 -17342 -25455 -33918 -26445 -2872 5333
850 5333 -20741 -48093 -40290 -11291 2143 -10117 -29861 -33855 -22727 -15404 -19585 -17491 -5727
863 -5727 -8180 -28682 -36888 -18609 4708 6144 -14513 -31758 -22438 -1095 2694 -7801 -7980 -1278
877 -1278 -6699 -16783 -12141 6339 19141 8199 -17800 -25325 -285 23591 17220 -3664 -11132
890 -11132 -4630 1667 5221 7479 10637 8929 -5095 -18091 -5914 20819 25120 1488 -18220
903 -18220 -13344 5801 17630 10259 -3743 -4408 1478 -1822 -5075 6596 16524 7729 -10051 -14413
917 -14413 -1255 16426 18389 179 -11814 -3705 7374 6332 4345 9122 9175 1512 -6483 -4280
931 -4280 12086 24889 14423 -7868 -10530 7359 19401 15974 8323 2912 1791 4186 5867 9887
945 9887 17968 16524 -708 -10504 2362 20176 22224 8268 -5375 -5994 7381 15499 10431 5086
959 5086 6449 3361 -3547 -321 11728 16829 9094 -4182 -10364 120 15405 14107 985 -4150
973 -4150 -533 874 1549 5500 7586 5676 -881 -8262 -6153 7868 15490 4904 -7581 -7259 -378
988 -378 5323 7202 3743 -861 -1179 -2331 -4129 2523 11633 7498 -5734 -9727 -3044 5231 9809
1003 9809 4611 -5218 -6858 -1203 1618 2327 5361 3813 -3576 -7711 -3195 3697 8795 6530 -4570
1018 -4570 -9730 -1720 6768 5906 1831 -561 -4017 -2642 1657 3535 3752 3708 -1475 -6667 -2360 6606
1034 6606 7115 2012 -1493 -3060 -1398 3713 5188 2220 1176 1968 -1259 -2237 3403 6890 4939 1691
1050 1691 -1846 -2997 2465 8002 5587 734 10 -253 -631 4583 7830 4108 -605 -1893 -1620 3358
1066 3358 9573 6152 -2189 -3565 196 3685 6476 6224 114 -3267 115 2905 2844 4666 3483 -1938
1082 -1938 -3179 1176 3215 2348 1818 -638 -3240 -857 1492 -318 -693 1261 -969 -3651 -2027 -750
1098 -750 -850 469 -146 -4877 -5659 -1589 -655 -1870 -1599 -4063 -7596 -6199 -1916 -1971 -3408 -4703 -8979
1115 -8979 -9947 -4265 -1577 -4503 -7905 -9158 -9912 -7586 -3861 -5597 -9133 -9788 -9293 -10056 -7579 -4834
1131 -4834 -8777 -11733 -10215 -9634 -9148 -7913 -8736 -12720 -11737 -9001 -10460 -11796 -9494 -9101 -11343 -11431 -10753
1148 -10753 -10944 -8723 -7143 -10550 -12144 -8833 -7757 -9453 -7583 -5597 -7824 -8824 -7890 -7719 -5144
1163 -5144 -1938 -4880 -9269 -6456 -1346 -1577 -2588 -2534 -3699 -2674 87 192 -259 2176 3025 -1582
1179 -1582 -1696 4002 6421 4356 2179 1019 2487 6855 7355 3331 3115 6916 6201 3020 4742 7662
1195 7662 7749 5989 3424 2594 7077 11253 7328 2066 5531 9116 7452 5985 6761 8138 9238 8608
1211 8608 4361 5124 12437 14008 6726 4293 8993 11824 11267 9799 8738 10522 13848 10108 6096
1226 6096 11214 18210 14681 7028 6906 12619 17210 16886 10597 6790 12139 16594 11976 8780 13559
1241 13559 15452 9760 5479 7290 12750 15946 9927 335 1701 11358 12476 3683 350 3781 5655
1256 5655 3311 -878 -1167 3945 6459 -1919 -9586 -3579 5235 2507 -5831 -7877 -4497 -653 -2072
1271 -2072 -7507 -6869 364 37 -10882 -13161 -2868 4706 -598 -10294 -12905 -5344 3550 789 -7837
1286 -7837 -7648 -329 -1203 -7446 -4881 3111 4323 -3136 -11569 -8772 4220 9953 -1716 -12781 -6793
1301 -6793 3329 2872 -4620 -6033 -2033 450 -4579 -12034 -7324 5095 3644 -11354 -17226 -6727
1315 -6727 1864 -1181 -9715 -13326 -7497 -3048 -9116 -15376 -7291 2061 -5194 -19513 -18731 -4827 4241
1330 4241 -2584 -16695 -19458 -6586 1851 -6033 -12057 -5392 -750 -7788 -13605 -7548 4899 8243
1344 8243 -4842 -18108 -10317 9382 12012 -2341 -9835 -2486 4995 3280 -2073 -181 8291 8774
1358 8774 -5160 -12153 2487 17885 10611 -7082 -11197 235 10438 7079 -3632 -4425 4901
1371 4901 3893 -8464 -8917 6297 13483 -158 -16228 -14580 2405 13349 2587 -14334 -12348
1384 -12348 844 1524 -7394 -6366 3047 3713 -8771 -17611 -8352 11476 14061 -7222 -21421 -8131
1398 -8131 10501 9614 -3032 -6684 307 4527 -1233 -6681 3809 17702 10132 -11624 -13637 7448
1412 7448 22305 13271 -5070 -8924 4712 15167 7159 -1502 5894 15022 5041 -9183 -2944 16653
1426 16653 22486 5613 -13359 -9452 13106 20860 4672 -7210 173 8506 2476 -5128 1104
1439 1104 13532 12418 -6385 -18886 -3405 20740 17597 -6420 -16552 -2781 10866 8245 -1356
1452 -1356 -2049 6766 5913 -7646 -10430 9692 23201 8107 -15566 -14549 7773 22133 12292 -6745
1466 -6745 -7521 7735 10935 -316 -848 13586 16217 -413 -13570 -3528 18864 24895 3449
1479 3449 -16295 -6581 15132 15734 476 -3281 5694 8470 -2087 -9806 1484 18934 14368 -11655
1493 -11655 -22343 -1273 19404 12242 -8160 -13967 -2988 5647 -613 -7701 -181 10368 -19
1506 -19 -19819 -16308 8666 19306 1953 -20353 -19518 1861 14406 2232 -12395 -7066 3341
1519 3341 -2263 -12204 -5228 10845 10626 -8289 -23119 -10525 14875 17128 -6106 -19783 -6571
1532 -6571 7770 3786 -5841 -3557 5157 4403 -10159 -16485 842 19757 9678 -16361 -20718 -167
1546 -167 14636 7108 -7936 -9936 1265 3725 -7265 -9393 6833 14322 -3145 -21520 -13980
1559 -13980 9714 18512 1905 -18224 -14754 4546 10023 -2595 -7248 2081 4550 -7227 -13747
1572 -13747 -2358 14365 12543 -9530 -22366 -6377 15677 12472 -6689 -12434 -1829 4626 -323
1585 -323 -6067 406 10379 4868 -13988 -15872 5667 19669 6464 -13446 -13646 1275 11237 4767
1599 4767 -5692 -2545 6021 941 -11273 -5651 11703 14263 -3002 -17885 -10225 10053 16865
1612 16865 740 -13492 -6514 5766 3380 -4479 -857 7281 4466 -8531 -13767 -665 16111
1625 16111 11441 -10378 -17818 -2007 11436 6326 -4955 -6282 835 2330 -4942 -7989 2986
1638 2986 12798 1326 -15795 -12424 5967 13837 3039 -10708 -10294 1797 6803 -1540 -5798 2503
1652 2503 6278 -4200 -12665 -3741 10449 11270 -3329 -15489 -7834 9196 10789 -2245 -7498 -573
1666 -573 3211 -1588 -4265 1659 9192 5494 -7664 -12901 1863 15901 8593 -7494 -9838 1129
1680 1129 7818 4421 -1550 -684 5122 2757 -5874 -4500 8602 12736 986 -10245 -5611 6751
1694 6751 11661 4077 -5544 -3145 5211 4499 -2115 112 8030 6776 -3042 -7251 -283 10746 11236
1709 11236 -982 -8848 -1243 8817 6120 -1089 134 4258 3315 -1410 -2450 3853 10887 6337
1723 6337 -6372 -7443 5334 11777 5404 -2212 -2803 2226 5244 2638 -281 3404 7247 776 -6135
1738 -6135 -816 8834 9201 860 -5718 -3238 5181 8337 1927 -3191 648 3990 106 -2134 2111
1753 2111 5706 3825 -2229 -5798 -744 7408 6014 -3083 -5379 651 3516 698 -1174 -167 1944
1768 1944 970 -3378 -5022 1695 6635 961 -6468 -5312 534 3353 821 -2884 -3976 -411 -86
1783 -86 -3378 -2980 2059 2061 -4581 -7013 -2856 1950 2371 -1899 -7210 -5182 983 1242 -3916 -4324 -1701
1800 -1701 -2228 -4089 -3896 -1702 205 -673 -5374 -7521 -1897 2404 -877 -5506 -3960 -2206 -1748 -1999
1816 -1999 -2936 -2354 116 -820 -5445 -4741 803 1784 -1942 -4374 -3840 -1702 425 -422 -2598 -1836 56
1833 56 -1909 -4032 -839 1997 108 -2998 -3703 -1882 1475 2466 -1349 -4607 -1094 1079 -601 -1097
1849 -1097 -69 -495 -1257 -1483 -1155 -322 2354 827 -3257 -2845 1393 2053 -125 -678 -680 -268 751 -92
1867 -92 -870 1046 3011 192 -2288 144 2692 1899 1166 21 -579 1046 2664 1166 508 2563 1855
1884 1855 -595 224 2516 3012 2014 731 -1119 652 3982 3329 -8 -118 1702 975 974 1892 1653 1544
1902 1544 958 -761 -1140 1793 3556 561 -1444 -312 405 543 1271 -211 -830 72 301 -1757 -849
1919 -849 2038 1105 -1662 -1873 -529 540 1927 718 -1882 -1189 1061 27 -998 854 1638 -388
1935 -388 -1490 -797 404 1792 2078 -1127 -2296 322 2063 1136 54 941 428 -113 283 574 1646
1952 1646 3083 713 -2247 -1516 2633 3205 850 -446 -635 -338 1188 1321 134 1200 1901 -948
1968 -948 -1827 762 3362 2039 -176 -1570 -836 2085 3198 643 -927 1066 1227 -603 75 2256
1984 2256 2379 871 -635 -1650 733 4720 2992 -1008 -1030 1307 1777 1021 1956 1993 1644 741 -1100
2001 -1100 -695 3447 5238 619 -2581 -934 1842 2989 2293 319 -930 741 683 -479 1183 3564
2017 3564 1683 -3057 -2979 665 3381 3141 -870 -4004 -2174 2260 999 -1052 -334 489 -1435 -2789
2033 -2789 -1607 1219 2725 828 -4446 -5160 269 3115 -86 -2497 -2252 -1619 -1549 -1579 -1118 252 793
2050 793 -2541 -6364 -3442 3184 2926 -2071 -5235 -4364 -894 1216 -69 -2625 -1709 -1172 -4111 -4386
2066 -4386 342 3303 -310 -5374 -6279 -2666 2658 2569 -3165 -5366 -2239 -71 -2100 -1649 800 813
2082 813 -2326 -5139 -4417 1725 5383 453 -6417 -5072 903 2404 298 -719 -991 -916 -1270 -2332
2098 -2332 -741 4684 4217 -3549 -6716 -1459 4782 4788 180 -4030 -2691 1271 2093 -401 419 3124
2114 3124 721 -4511 -3705 2889 5916 3185 -3665 -6557 -187 5664 3006 -1899 -1354 540 -789
2129 -789 -2021 67 3593 4272 -681 -6243 -4258 4698 7667 832 -4703 -2855 1454 2774 1698
2144 1698 492 1380 2039 -1787 -4534 1267 8318 5159 -3684 -5856 -1055 5870 6036 591 -3327 -313
2160 -313 2728 -268 -928 3684 5888 182 -5364 -4448 2892 8056 3793 -4943 -6444 596 4272 1143
2176 1143 -836 383 601 -2102 -4307 -1604 4847 5925 -1917 -9129 -4805 5039 6171 190 -4129
2191 -4129 -3524 16 1131 -955 -131 3873 2622 -4984 -6650 1946 8315 5043 -3467 -6613 -1414
2206 -1414 5699 5268 -317 -1059 2699 1505 -2632 -715 5521 7338 1860 -5473 -5569 4165 9990 4192
2222 4192 -3835 -2787 2415 3255 1262 1304 3469 3830 -1482 -5711 -657 8592 8448 -1890 -7451 -2403
2238 -2403 5526 6192 1246 -2229 -619 1794 -432 -2188 2471 7084 1958 -6457 -6419 1598 7905 5649
2254 5649 -3158 -6175 -474 4704 1796 -1329 1492 3224 -535 -5028 -1865 4848 7718 1442 -7564
2269 -7564 -5907 3890 7210 1537 -2947 -1652 325 16 -1731 -32 4110 3596 -4144 -8909 -1345
2284 -1345 7324 5717 -3527 -7451 -4150 1972 3103 -1267 -2920 254 -553 -5384 -5429 1751 5480 -64
2300 -64 -7869 -8418 -866 5554 2458 -5611 -6043 -862 104 -3167 -2681 1701 1669 -3112 -7476 -4839 3788
2317 3788 6477 -1371 -8802 -5324 1673 3295 -281 -2340 -1125 -99 -2097 -4336 -745 5592 3450
2332 3450 -5318 -7978 -533 5928 4006 -1914 -5105 -1930 2464 1012 -2029 567 3054 -498 -5695
2347 -5695 -3310 3011 6688 1907 -5685 -6297 1256 6086 1772 -2927 -1072 1627 -532 -2072 192
2362 192 3856 4184 -1544 -6856 -2297 6021 6636 -688 -4624 -1434 2277 3022 594 -170 1790 2110
2378 2110 -1897 -3940 1869 7087 3235 -3704 -4742 403 5392 4138 -909 -3019 982 2039 -1108
2393 -1108 -1194 3127 4180 -619 -4757 -3015 2802 6228 1505 -5135 -3748 1728 2807 -303 -790 559
2409 559 868 -1377 -2858 -913 3899 3501 -2628 -6495 -1739 4304 3141 -1055 -3116 -1779 694 486
2425 486 -1742 -267 2458 987 -4287 -3686 1690 4360 1328 -2872 -4102 -891 2851 1649 -1718
2440 -1718 -1090 1406 -294 -2480 -935 2320 2625 -329 -3826 -2893 2475 4509 189 -3168 -2010 1152
2456 1152 1094 -126 -139 1031 1089 -847 -3157 -70 4755 3130 -2278 -3081 -203 2742 2831 358 -1023
2473 -1023 2 1617 515 -1130 1999 3874 1005 -1956 -1336 1520 3763 2808 -1210 -1430 1734 3461
2489 3461 1247 395 2447 2372 485 -73 928 3064 4150 1386 -1981 -347 3920 4030 1349 151
2505 151 1226 1859 2086 1670 1383 2626 2876 -348 -1342 2063 4359 2428 174 -254 662 2484 2196
2522 2196 406 -73 2058 1416 -636 -407 1962 2388 571 -775 -1473 639 2238 1151 -1671 -1122
2538 -1122 829 538 -666 59 603 -17 -948 -1825 -1456 1232 1506 -1645 -2959 -1204 542 121 -712
2555 -712 -1000 -1544 -606 -702 -1749 -1586 568 -416 -2993 -2679 -429 -251 -954 -2043 -2798 -1918 -237 -1225
2573 -1225 -3097 -1529 -852 -2309 -3583 -2226 -1597 -1229 -1809 -3770 -4063 -1962 -1342 -3106 -3717 -2969 -2466
2590 -2466 -3535 -3572 -2862 -2896 -2511 -3675 -4948 -3838 -1757 -2461 -4145 -4183 -3608 -2960 -2497 -3219 -3978 -2897
2608 -2897 -2008 -3409 -3816 -1796 -1020 -2601 -3226 -2593 -1335 -914 -520 -2090 -2380 -586 -400 -1800 -1193
2625 -1193 400 -60 -1191 -822 -444 563 1728 384 -1148 91 1672 955 562 731 677 839 1223
2642 1223 806 748 2044 2195 3 -147 1707 2441 1456 987 742 780 1981 1924 697 1085 2897 2067 533
2661 533 1429 2837 2784 2205 1621 1320 2562 3741 2989 1776 2542 3615 2887 2480 3540 3768 4034 3645
2679 3645 2793 3134 5393 5269 3089 2894 4473 4682 4314 4327 3908 4091 4700 3999 2660 3693 5261 4121
2697 4121 2266 3093 3846 3601 3388 2767 2188 2881 2980 1669 801 2454 2712 746 -171 430 1089 1654 694
2716 694 -1167 -1176 980 837 -1155 -797 -195 -285 -1207 -1028 -1203 -266 271 -1553 -3213 -1133 717 -344
2734 -344 -1671 -1439 -894 -278 -398 -1508 -1170 -77 408 -1818 -2018 -16 556 -902 -1503 -1609 -800 26
2752 26 -632 -2131 -1822 -291 -1339 -2795 -2066 -406 -1083 -2469 -3536 -3240 -1424 -839 -2552 -4564 -3225
2769 -3225 -2028 -3161 -3853 -3194 -2854 -3337 -3871 -4595 -3670 -1488 -2223 -4863 -4798 -2728 -1804 -2702 -3410 -3305
2787 -3305 -2736 -2326 -2822 -3541 -1894 183 -1566 -3702 -2643 -309 -78 -562 -1870 -1894 -687 885 -693
2804 -693 -1060 925 1150 -732 -1640 309 1918 1655 -52 -1877 -855 1821 1656 -508 -457 714 496
2821 496 -207 -318 391 961 796 -1092 -2312 51 2127 132 -2081 -1401 -39 397 17 -995 -753
2838 -753 823 278 -2206 -1881 1627 1788 -91 -1737 -732 1084 2112 951 -769 -260 1716 1045
2854 1045 -410 1093 2858 2210 363 -133 1019 3593 3725 618 -988 1907 3926 2199 1178 1960
2870 1960 2563 2221 1133 890 2346 4012 2411 -767 -695 2648 3283 1566 -21 405 1482 1755 829
2887 829 -356 1723 2810 -63 -2292 424 2761 2348 444 -1643 -855 1649 2489 342 -535 1404
2903 1404 1337 -151 -676 1210 2338 1582 -579 -1748 657 3551 2573 -776 -712 1379 1644 704 280
2920 280 1005 2297 1628 -980 -1333 1877 3905 940 -1855 -781 1155 2009 908 -423 -357 1201 334
2937 334 -1618 -375 2075 1836 -1523 -2946 -968 1467 2070 -541 -3055 -1348 1101 364 -1894 -814
2953 -814 420 -278 -2057 -2016 -545 1444 988 -2559 -3406 -149 1753 -241 -1790 -1159 -278 -275 -1088 -1551
2971 -1551 213 1819 -149 -3062 -2311 1644 1880 -302 -1736 -1869 55 768 64 -1026 -94 668 -1325
2988 -1325 -2401 196 2230 958 -1204 -2714 -954 1871 2054 -722 -2249 -157 846 -623 -871
3003 -871 401 931 391 -1598 -1663 457 2841 1132 -2266 -1333 851 1335 264 -194 93 765 654 -1121
3021 -1121 -1090 2301 2986 -394 -2669 -903 2124 2499 835 -1385 -1077 780 1312 -699 -235 1274 888
3038 888 -1593 -1914 164 2072 1272 -1059 -2749 -610 1785 375 -1569 -1214 523 -625 -1599 -1389
3054 -1389 -356 784 -58 -2931 -3111 -78 1481 -466 -2851 -1656 -759 -565 -1131 -1569 -751 -474 -1646
3071 -1646 -3283 -1892 1204 552 -2164 -3059 -2002 104 287 -1234 -2598 -1377 29 -1355 -2242 -939
3087 -939 349 -1056 -2465 -2668 -1372 727 330 -2436 -3146 -852 101 -894 -1538 -895 -580 -908 -1722 -1886
3105 -1886 -41 1375 -253 -3038 -2166 463 1160 -14 -982 -1330 -661 222 -437 -702 640 1037 -1016
3122 -1016 -1718 485 1788 1069 -166 -1113 -382 2148 2073 60 412 1615 1710 499 772 2008 2459 2011
3140 2011 860 275 1937 3486 2736 940 1415 2658 2251 2178 2039 2510 2996 2693 748 1362 3457 3881
3158 3881 1991 664 1812 2800 3354 2773 1625 1678 2837 2262 973 2200 3146 2343 830 728 1662
3175 1662 2536 2389 1132 187 1107 2633 1498 605 1505 1962 964 532 397 1224 2197 1639 -306 -574
3193 -574 1260 1614 659 -45 339 251 424 389 204 539 677 -210 -1260 60 1398 583 -416 -557 -660
3212 -660 -58 812 -45 -889 -62 -56 -1003 -749 29 250 -560 -994 -1200 -1285 -101 -100 -1629 -1580 -617 -1149 -1801
3233 -1801 -1156 -1037 -1211 -1160 -1959 -2554 -1793 -915 -1553 -2628 -2448 -1830 -2042 -1919 -1869 -2181 -2391 -2047 -2433 -2720
3253 -2720 -1225 -1461 -2755 -2615 -2183 -1630 -1384 -1462 -2213 -2274 -1340 -766 -1636 -1599 -975 -1104 -1536 -879 -334 -590
3273 -590 -349 -1076 -1143 -436 -104 -410 -823 -206 -27 -792 -360 -98 -437 89 -140 -985 -763 239 173 -881
3293 -881 -1173 -717 -668 -411 -190 -782 -1299 -648 -1016 -1328 -805 -438 -1281 -1339 -1159 -1037 -679 -449 -689 -1577 -733
3314 -733 -388 -1164 -985 -138 -435 -455 -83 -198 -628 538 499 -446 -195 816 606 220 1064 1030 739 1027
3334 1027 1270 887 1383 2165 1635 912 1399 1748 1767 1804 1460 1204 1582 1872 1528 1255 1675 1658 1046 1446 1623
3355 1623 1122 1119 1211 625 893 1286 1231 148 470 684 552 330 688 566 668 1155 583 54 476 1202 553
3376 553 385 545 692 571 1033 1240 887 660 1048 1090 1331 2061 1833 821 1383 1527 1761 1905 1636 1509
3396 1509 1663 2416 2088 1042 1433 1998 1747 1709 1761 1176 1416 1754 1139 403 806 1279 610 -62 728 536
3416 536 171 277 -111 -287 129 -180 -1282 -894 -310 -497 -1026 -1207 -1226 -1195 -1127 -869 -1389 -786 -520 -1532
3436 -1532 -1699 -787 -812 -1187 -1200 -1224 -1351 -597 -303 -946 -1447 -716 -525 -1183 -793 -420 -91 -651 -445 -774 -758
3457 -758 201 -138 -805 -543 382 -494 -524 -177 -5 -332 -530 -614 -809 -302 613 -936 -1239 -763 -632 -1036
3477 -1036 -614 -702 -1118 -1169 -492 -1204 -1274 -603 -785 -1667 -1640 -884 -992 -1021 -1055 -1331 -1183 -598 -1009 -1184 -714 -319
3499 -319 -941 -1110 -665 -544 -190 143 -546 -594 -144 724 -26 -340 228 212 36 -51 302 464 806 671 -740
3520 -740 152 1161 633 -114 -43 226 279 439 432 -325 605 847 -135 -470 496 541 307 -489 -451 -568 -83 594
3542 594 -325 -919 37 130 -759 -648 672 -221 -398 -762 -883 -66 474 -196 -936 -595 302 44 -11 112
3562 112 121 -38 -304 -65 -110 735 1284 -258 -653 410 824 255 -52 34 -1 801 618 -87 217 669 607
3583 607 -530 -295 677 562 313 -406 -601 -153 672 510 -151 232 910 -191 -414 289 767 914 207
3602 207 -894 -606 867 1577 -63 -116 235 480 374 505 502 696 955 300 -656 526 1769 1342 27
3621 27 -77 559 1081 1119 758 193 737 1152 279 24 1131 1286 779 -121 54 726 1264 1442 455 75
3641 75 856 1163 211 679 1317 1066 594 93 461 1167 1493 793 -564 123 1065 1238 96 403 535 707
3661 707 699 677 533 969 1077 406 -316 993 1513 1025 432 67 340 1047 1085 -109 324 1247 717 -394
3681 -394 -339 828 901 807 -494 -758 202 748 253 -649 -266 490 -161 -845 -256 -174 4 -670 -1204 -945 675
3702 675 265 -1380 -1453 -966 -243 -841 -612 -926 -823 -441 -1268 -1431 -808 47 -553 -1809 -1588 -842 -282 -153
3722 -153 -1095 -1787 -749 -709 -1108 -1091 -502 -541 -1418 -1801 -1126 -381 -128 -487 -1645 -1893 -528 -264 -1186 -1234
3742 -1234 -1064 -1252 -1240 -1241 -1156 -677 -541 -1331 -2282 -1463 -494 -687 -1798 -1597 -1304 -982 -845 -1097 -1300 -634 -691
3763 -691 -2221 -1882 -654 -317 -800 -1639 -1622 -939 -263 -216 -1127 -920 -324 -692 -1073 -689 322 -24 -549 -604
3783 -604 -531 298 1043 116 -585 -78 821 290 30 404 605 549 418 24 722 1347 1660 -247 -235 618 1342
3804 1342 1325 857 711 780 1056 883 769 1182 1941 1113 346 477 1523 1846 1540 716 110 1318 1983 1101
3824 1101 971 1155 1326 905 720 1297 1607 1691 984 211 832 1967 1996 783 704 892 1021 1167 1129 1032 1590
3845 1590 1244 765 530 1575 1961 1549 679 547 813 1306 1518 577 655 1099 890 643 515 1459 1286 897
3865 897 146 424 686 1017 970 29 -144 947 675 11 197 863 160 -122 49 -402 117 740 -270 -997
3885 -997 -100 5 -244 -533 -530 -801 -557 -456 -912 -1002 -438 -438 -1325 -1485 -590 -589 -763 -763 -1450 -1215 -649 -382 -1395
3908 -1395 -803 -715 -780 -1236 -982 -487 -620 -813 -1058 -1175 -583 69 -442 -1010 -581 -146 -507 -467 -384 -426 -148
3929 -148 -512 -1035 -868 -322 2 -702 -850 -495 -390 -12 -365 -574 -518 -434 -530 -1139 -471 -94 -466 -1251 -909
3950 -909 -627 -669 -472 -1021 -1285 -920 -605 -953 -1116 -518 -555 -1257 -1138 -901 -811 -388 -661 -1120 -923 -313 -657
3971 -657 -873 -492 -289 -321 -354 -58 -237 -61 349 -56 -480 303 343 95 -60 365 5 254 557 375 385
3992 385 322 444 165 196 690 571 425 494 204 279 331 453 180 -152 442 168 66 529 291 181 364 139
4014 139 -155 27 468 10 -200 236 136 -61 -196 223 92 -14 -49 -355 118 747 623 -149 392 582
4034 582 264 265 724 341 372 952 935 441 805 992 832 465 1057 593 739 927 814 505 1010 1001 632 651
4056 651 1008 646 642 805 830 559 786 412 369 766 815 497 72 175 516 39 130 270 -402 -120 246 -9
4078 -9 -371 -271 213 -165 -301 -90 -238 -147 142 47 -706 -256 -63 -481 -220 -301 -97 -200 183 -287 -298 -44
4100 -44 47 -358 -412 -56 -34 124 323 41 -83 -16 -166 -363 -154 210 -214 -356 57 71 -243 -227 -107 -443
4122 -443 -312 -16 -266 -261 -237 -446 -358 -310 -398 -357 -282 -10 -624 -497 -51 -250 -433 -239 -151 -723 -474 -520 -179
4145 -179 -489 -210 -215 -236 -106 70 -78 -249 -137 147 -147 431 88 -108 101 200 183 260 516 432 320 101
4167 101 762 232 427 553 257 443 607 673 61 796 925 268 378 568 453 486 857 135 340 675 385
4188 385 76 130 516 156 190 413 396 291 485 276 -23 -6 723 336 -155 -7 116 61 -420 75 -86 -253
4210 -253 29 -270 -118 3 -324 -117 -419 -576 -621 -472 -258 -472 -381 -67 -379 -688 -448 -255 -626 -661 -222
4231 -222 -711 -573 -583 -698 -662 -889 -533 -751 -697 -654 -965 -513 -599 -867 -1269 -1042 -535 -750 -924 -731 -746 -1071
4253 -1071 -1070 -634 -1066 -794 -506 -434 -1101 -393 -471 -1062 -493 -395 -690 -263 -264 -600 -253 -198 -269 -431 -9 -89 -468
4276 -468 -384 -278 79 -43 -51 -144 -391 -189 598 116 166 -109 -36 21 118 386 -97 699 166 132 344 864 451
4299 451 304 511 645 398 628 585 548 537 922 761 466 1152 806 645 908 729 536 1062 1389 654 957
4320 957 1290 971 1140 959 1565 972 1318 1144 866 989 1537 879 895 865 931 1052 733 1247 738 850 760
4341 760 1049 670 757 1043 681 480 981 838 580 723 405 365 666 538 183 -200 797 -8 -90 97 318
4362 318 374 -25 31 -319 -188 432 -57 -282 30 -42 -243 -142 -93 196 298 242 -123 -514 -174 141 -266 -414
4384 -414 -189 -304 -540 -461 -694 -318 -185 -396 -966 -558 -131 -406 -616 -299 -648 -682 -359 -1032 -981 -748 -388
4405 -388 -859 -931 -851 -1007 -990 -1097 -1255 -772 -869 -641 -1070 -812 -653 -656 -789 -906 -390 -1014 -950 -623 -1054 -703
4427 -703 -293 -385 -871 -800 -525 -631 -519 46 -597 -472 -233 -397 -327 92 -48 -629 -426 -340 -25 -358 111
4448 111 -336 -15 144 307 -278 316 248 -4 -374 95 -48 -5 -1 83 -278 183 296 -197 -126 -98 345 24
4470 24 240 69 61 145 128 -4 -39 443 470 330 -197 178 291 331 -50 62 67 627 281 285 428 325 593 326
4494 326 318 330 315 582 286 114 -95 539 408 176 482 373 413 289 330 491 479 671 568 286 560 492 207
4517 207 648 203 181 160 284 348 584 719 244 24 -5 255 55 216 194 96 314 548 110 -30 261 378
4539 378 156 -144 292 253 76 238 -341 -36 169 153 -20 140 528 -180 9 185 59 -156 -173 -41 -325
4560 -325 40 421 256 -77 117 313 20 176 188 -101 219 205 -47 -59 316 541 334 -273 69 -41 -86
4581 -86 372 -129 -442 61 114 -39 -229 204 77 -144 41 74 -142 226 46 -427 57 92 -111 -317 367
4602 367 -268 7 8 -164 65 -256 189 -369 -52 62 287 -257 -189 -387 -331 213 -107 45 24 -55 -16 -183
4624 -183 -267 -25 67 99 292 -182 49 89 92 160 53 196 -68 22 304 135 -224 5 -200 32 366 412 -269
4647 -269 -110 89 73 -28 -81 39 -406 231 -15 -345 -3 567 -278 -316 -133 -254 -58 92 -128 -238 69
4668 69 -192 -419 -306 -276 -128 -271 -283 -157 -57 -406 -213 -148 -652 189 -74 -395 -161 -169 -160 -336 -201 -150 -273
4691 -273 18 -186 -633 -294 188 -379 -283 -157 -97 -149 -87 207 -219 106 22 -150 14 23 -218 -299 -402 -535 -131
4714 -131 178 231 19 -175 247 -83 -527 -137 179 -156 -24 -5 -77 -122 95 -53 -188 -10 -82 -245 -285 -177
4736 -177 6 135 8 -223 62 299 305 -110 -101 -169 141 -136 -36 152 80 188 172 62 163 410 454 215 19
4759 19 141 -33 246 424 93 450 84 152 262 376 419 -209 111 209 87 351 195 172 -5 455 409 53
4781 53 -119 114 202 -24 21 8 417 257 98 -280 198 72 300 -281 431 242 -373 272 231 199 181 44
4803 44 -53 87 521 60 -83 325 108 -159 63 425 -95 -442 107 149 -159 -25 5 -209 121 -245 -391
4824 -391 102 74 -144 131 357 -216 -407 23 -185 76 316 66 228 -13 258 215 34 113 -31 293 285 51
4846 51 -14 -104 2 147 30 -207 233 -8 -138 397 -84 -12 217 0 -353 147 1 240 -461 -177 -197 -93
4868 -93 0 23 -178 46 -64 -328 -175 221 100 -409 -489 50 -93 -106 -261 -110 98 -10 -430 -356 -121 -58
4890 -58 -81 -318 -81 -38 -271 102 -263 -262 -220 42 -469 -366 -76 -58 -267 -231 -272 -20 -183 -226 -285 -197 -269 -153
4914 -153 -279 -231 47 -121 -346 -415 -61 -304 -103 -484 -123 -300 -140 -44 -133 -142 -137 -452 -468 -121 -250 5 -172
4937 -172 -391 -515 -299 -184 -353 -441 -193 -210 -112 -131 -353 -121 -195 -5 -254 257 -82 1 -358 80 -91 -13
4959 -13 122 154 -18 -402 64 -103 124 236 -154 -126 372 108 -99 502 228 316 63 80 207 27 263 495
4981 495 300 446 52 179 210 537 162 92 139 311 189 326 266 -107 86 268 275 116 265 50 225 149
5003 149 -43 -103 83 323 147 -51 99 500 -69 178 108 427 207 256 75 -131 308 -207 75 398 532
5024 532 344 99 260 313 -35 -29 398 13 245 213 -35 115 550 322 128 73 50 141 354 -166 -331 237
5046 237 263 203 -515 124 149 98 95 -191 -100 169 417 -269 -199 -105 -82 -408 35 154 -76 3 288 -138 -448 -152
5070 -152 -267 -50 -216 -164 121 -58 -100 -72 -70 217 97 -253 350 144 -164 -168 95 293 -94 42 -43 8 -11
5093 -11 94 -245 -50 46 -16 164 -159 -126 215 1 61 -343 258 392 -66 29 -47 -151 -254 159 -200 74
5115 74 142 278 -156 -174 322 171 -189 -257 -15 188 -67 103 -73 -87 394 -291 -361 -195 84 -62 -155 -186 198
5138 198 113 -187 -265 -588 199 -68 7 -243 -152 -127 -49 -86 -23 -94 173 137 -26 -256 -84 131 12 -260 2
5161 2 19 287 -312 -469 -301 66 -8 -361 -409 295 -199 3 -257 -204 192 10 130 -82 -143 229 -93 -395
5183 -395 -7 263 170 -90 11 73 109 -84 -11 59 -71 -94 -163 -83 19 229 290 -61 -454 100 -51 -147 -278
5206 -278 -74 97 -176 52 -489 -196 54 252 -227 -555 89 -251 77 69 112 262 279 144 -187 -187 478 338
5228 338 -200 -340 178 119 -255 -343 -204 -19 329 -131 -309 188 100 84 -329 262 11 38 -242 -508 -61 172
5250 172 252 41 -117 -441 33 -178 -302 -74 -176 -56 185 -200 225 408 -69 -322 -210 421 217 -70
5270 -70 -343 -287 270 463 -50 -324 411 270 -41 -279 -359 224 209 -57 -137 -20 225 -140 -14 -221 96 493
5292 493 -9 -228 8 395 -8 189 -263 -167 294 142 2 -122 24 98 41 -83 -56 433 332 -93 -157 370
5314 370 215 22 -230 -218 -4 293 223 -161 105 147 210 -193 -80 492 343 165 -18 -221 505 411 23 197
5336 197 201 339 295 49 217 218 244 192 -114 -187 -46 298 48 -10 295 366 -56 131 -70 -137 196 -45 -93 279
5360 279 386 51 -16 175 -185 -50 -41 -143 -176 25 205 47 -152 144 216 -361 -227 -250 208 287 -235 -214 -192
5383 -192 -24 182 -125 -362 68 -193 -37 -227 -248 -33 13 -325 -388 -321 -149 -66 -470 -339 64 -275 -255 -281
5405 -281 -197 34 -82 -95 42 79 247 -316 -222 -364 -325 150 86 -443 -175 7 81 -217 -166 -54 -144 -145 -199 -152
5429 -152 52 229 58 -223 -147 62 43 -141 -62 50 -9 -88 50 -174 -50 -135 -329 -132 53 474 -117 -146
5451 -146 -31 82 275 -296 -90 -74 109 -84 -229 146 289 106 -47 -243 -374 184 87 -8 -109 90 196
5472 196 -59 160 -12 121 -277 59 303 87 168 346 -50 33 85 67 173 391 255 178 347 -90 350 146
5494 146 -57 -38 -172 -79 280 254 327 279 -153 73 362 127 -31 195 -161 -103 246 -105 92 115 -102 -316
5516 -316 -46 -31 -206 -137 -35 -120 275 130 -376 -268 299 332 58 132 57 530 -19 43 -16 32 50 144 81 16
5540 16 33 -11 -206 4 412 131 -108 -198 20 0 177 -36 -40 -194 135 343 -235 77 268 217 -8 16 -88
5563 -88 114 209 81 83 -151 22 -216 -232 123 -42 50 -132 -19 173 -7 -73 -127 30 238 4 241 359 -29
5586 -29 -168 114 -21 111 116 211 -203 -341 161 114 109 -206 23 -31 111 129 -26 229 -49 -211 -82 94 137
5609 137 135 202 -207 215 53 290 -195 -50 -290 351 74 118 -112 -99 227 -67 -91 -160 -174 248 -111 241 -122
5632 -122 -298 3 -103 -274 -116 -7 9 281 -11 213 82 -265 -94 -119 -6 -153 -148 -149 -202 226 185 13 -238
5655 -238 160 -135 -144 -96 -244 -169 -33 -80 -414 71 145 -296 -58 -337 -89 246 -114 -160 -122 41 65 -148 71
5678 71 -231 -8 -63 -92 -102 -220 -134 -52 -338 -8 39 -317 -263 265 -39 48 -357 -241 -119 -218 -218 -337 -198 25
5702 25 428 70 -252 -133 195 339 24 -366 -468 -124 -95 64 45 114 -192 -4 106 34 188 251 269 387
5724 387 413 373 -153 -331 4 -146 89 133 143 -41 160 222 -404 321 8 208 -2 -240 358 172 -197 -117
5746 -117 -52 -55 235 32 -246 -154 63 44 22 -151 234 178 36 6 -257 -113 42 -22 -285 215 67 -165 131
5769 131 380 -132 45 -99 -476 156 242 174 -55 -282 -123 306 31 -51 46 246 -12 -35 292 79 12 -63
5791 -63 51 -38 -197 186 205 -377 284 161 41 20 -33 -158 -270 -77 -368 -113 127 -9 -162 -302 71 68
5813 68 332 -108 -170 140 -170 210 -228 169 96 324 -176 -116 -265 136 135 -73 -37 -190 146 5 -4 147 407
5836 407 15 137 234 -137 341 111 -51 -107 -39 406 27 297 172 85 200 111 27 323 449 -23 -514 -50
5858 -50 424 446 165 -224 -55 353 338 -217 -51 308 257 222 -164 47 658 213 453 16 -107 131 49 71
5880 71 -97 92 -83 94 -245 -67 173 196 -197 -99 286 385 118 -111 -471 133 174 -87 -129 -10 55 -13 -93
5903 -93 -249 66 -100 -218 -33 -135 35 108 -15 -261 -322 18 -60 172 -576 28 70 -190 -369 -233 -92 -88
5925 -88 -428 -555 -480 134 -67 -602 -214 77 -139 -586 -362 52 210 -126 -523 -315 -43 260 -150 -355 -231
5946 -231 16 81 -20 -172 -147 235 -97 -430 -538 73 -151 37 -136 42 467 139 -130 -286 76 43 214
5967 214 -386 -106 5 -148 -360 -316 35 440 112 -191 -149 257 178 -35 -435 -115 118 120 200 112 464 194
5989 194 33 -64 -333 267 345 205 -328 -203 208 208 -36 111 363 437 204 36 188 387 189 40 -198 -75
6011 -75 354 234 57 358 43 252 13 81 358 485 340 145 213 303 704 91 190 -77 509 285 18 24
6033 24 91 266 -72 -122 124 88 253 97 -187 187 113 440 131 -93 119 173 206 -106 239 215 229 -181 79
6056 79 182 317 347 -146 25 473 606 220 193 224 142 256 -228 44 409 381 174 -306 99 -1 408 -130
6078 -130 -92 148 260 -51 -266 14 158 274 -170 -436 -160 261 -290 -393 -243 -170 -9 -309 -315 -216 93 285
6100 285 -253 -121 -291 39 61 90 -358 -77 101 -64 -44 -149 117 -95 -142 -5 58 440 118 -585 -268 -6
6122 -6 -19 118 -385 -63 136 232 248 -6 13 278 -181 117 74 172 -57 -124 19 65 147 -289 98 -238 -245 -329 140
6147 140 -357 -199 14 -124 -100 -467 -126 72 -96 -411 -318 -418 102 -322 -391 -111 -114 -442 -147 -298 -13 64
6169 64 -27 -709 93 234 148 51 -294 44 -194 -67 -54 -19 66 96 -79 -29 -260 128 56 -140 -55 -74 55 -51
6193 -51 182 69 7 194 115 -88 90 138 182 -97 32 -86 242 -52 174 -119 -256 -131 -90 -145 -8 102
6215 102 -104 -69 295 95 -266 424 109 131 7 66 -12 -93 -20 229 355 163 -165 120 135 -100 219 -88
6237 -88 -19 207 2 33 -26 342 49 155 -57 82 125 113 125 106 301 54 226 -195 253 178 -12 -147 82
6260 82 67 170 101 8 -116 -108 142 -245 35 69 -120 -188 -413 -32 -182 -141 -62 -306 -110 38 17 -313 -68 268
6284 268 -144 -80 -466 4 313 -43 -126 -181 -47 -165 261 50 -257 -46 -290 -28 82 95 212 264 -129 75
6306 75 -153 -65 -34 -20 -184 -40 632 151 57 -47 115 2 -43 155 162 241 -32 -72 -285 108 -141 110 -51
6329 -51 263 -218 -97 295 203 -70 54 195 -59 37 13 -29 60 63 68 389 142 271 67 6 -83 -50 66 332
6353 332 312 -265 -35 164 357 115 57 -133 219 88 148 157 21 29 192 90 160 132 -135 229 472 83 220
6376 220 -63 167 44 -30 244 93 -187 -145 -42 382 122 -199 -89 13 -80 -401 -260 -154 -130 -197 -82 -317
6398 -317 -231 -173 -82 -68 -176 -201 -411 -354 -347 -293 -16 -205 -199 -298 -118 -412 58 -494 -58 -303 92 -158 -512 -337
6422 -337 -16 -81 -79 -209 265 -319 -268 -465 -208 -287 38 -248 -97 -66 -129 -365 -661 -51 -77 53 -199 -58 -247
6445 -247 -87 -196 36 -467 35 33 -304 37 84 -103 -208 -155 -32 -6 237 -2 -229 129 33 -269 16 -193
6467 -193 -41 43 -340 -292 -508 246 -149 -267 -137 -19 -22 25 -101 -88 172 504 -210 -110 274 -3 148 53
6489 53 -64 33 253 149 58 -35 8 246 59 12 379 226 196 -110 -55 152 90 -71 -7 15 160 157 127 -429 280
6514 280 274 29 135 32 281 680 -301 22 97 413 346 49 98 80 96 291 145 -33 287 424 120 -169
6536 -169 253 195 163 -74 51 207 284 -21 24 188 434 231 66 33 208 254 260 171 239 -10 337 151 -182
6559 -182 315 251 12 348 7 57 361 35 -6 323 366 551 -13 -17 222 96 320 -257 -89 81 232 55
6581 55 -140 82 42 523 -63 -165 157 356 259 -295 106 478 397 -5 -160 -101 229 -10 -58 -366 -23 490
6603 490 -3 -300 -117 97 26 -135 -139 28 190 -206 -460 -387 -33 -244 -279 -577 -415 3 -311 -511 -482 -155
6625 -155 -67 -467 -116 -444 -184 -248 -402 -382 -568 12 -349 -701 -747 80 -261 -254 -403 -183 -217 133 -534 -658
6647 -658 78 -194 -330 -473 -320 -163 66 -223 -320 -195 46 -18 -211 -361 228 111 111 -322 -141 -39 -87 -362
6669 -362 -356 36 216 240 -257 -246 -21 -45 -123 -480 23 105 -104 13 -59 401 464 39 -54 -453 51 122 -91 -89
6693 -89 -16 81 -27 -289 113 221 221 7 -275 117 404 616 111 -21 358 273 228 130 226 117 660 41 16
6716 16 172 301 517 391 69 279 499 454 254 183 443 339 62 -82 415 357 470 181 138 396 311 327
6738 327 -60 78 248 284 315 225 168 441 131 -298 -86 376 266 -81 -170 -284 499 85 -94 -31 -65 380
6760 380 -102 -73 167 -1 -28 148 183 310 198 258 17 54 387 540 -28 -227 251 505 342 -200 -154 409
6782 409 253 -50 19 -473 -148 353 105 -421 206 184 -205 -266 -54 214 102 -375 -374 -210 95 -181 -584 -496
6804 -496 -61 -217 97 -355 -7 -322 200 -131 -189 -74 -288 -556 -507 -368 -278 -204 -130 -392 -599 14 -32 -272
6826 -272 -272 257 179 18 -290 29 82 188 -158 -269 -206 35 -114 113 5 70 -35 29 -72 -365 189 185 -199
6849 -199 -362 -65 109 -72 -47 -65 -221 118 26 -285 38 -97 -25 -243 35 -108 229 136 -94 6 -259 -86
6871 -86 182 -39 257 62 -17 116 187 287 320 49 350 -128 240 483 -204 43 -70 166 -58 66 254
6892 254 211 392 105 140 75 539 343 -92 233 423 243 -95 111 165 -129 436 -287 -103 141 93 -8 -185
6914 -185 36 -195 -202 -49 189 -355 -65 -44 111 -342 -202 -336 -76 108 -268 -327 -164 -255 -143 -69 -121 129
6936 129 -248 -260 -60 -297 -38 19 -411 -74 -87 197 -457 39 -32 -307 -79 -319 -139 118 -125 70 -76
6957 -76 50 -393 -125 180 149 107 -231 -340 153 -264 211 -299 -178 114 95 -410 -400 173 -424 -96 -212 63
6979 63 -367 112 79 -242 -25 -71 260 -172 -212 208 -30 -145 -101 -81 -164 9 94 73 -58 34 86 183 55 -129
7003 -129 -71 170 -73 95 342 73 -179 -97 161 155 -3 31 -72 -121 273 172 -131 85 164 -64 401 193
7025 193 194 -54 299 305 70 -26 398 297 272 107 -126 9 97 -151 -73 218 435 181 20 150 215 587 191
7048 191 60 48 407 322 108 -133 155 -43 -55 35 212 264 401 145 -14 162 83 -149 69 239 325 219
7070 219 58 98 119 325 83 -79 34 130 -92 273 -225 33 235 254 121 -155 39 -51 444 -104 176 8
7092 8 -118 -108 92 403 98 -160 -110 -237 15 -115 -236 -249 -25 -34 44 -53 86 -147 -230 -42 -171 -91 -100 -229
7116 -229 -399 -69 -87 -160 -484 -161 -206 -289 -18 -477 -345 -486 -216 -288 -699 -668 -463 -192 -78 -17 -131 -423
7138 -423 -276 -254 -100 -113 -353 29 -420 -172 -334 -399 -32 -106 -336 -217 -215 -325 30 -148 252 -338 -115 -264
7160 -264 -68 21 -87 -91 -54 115 -140 14 143 -288 -48 -118 -7 -189 -36 -293 -171 -199 145 58 78 -179 -251
7183 -251 380 160 -194 -87 138 29 -47 -422 -129 263 28 -176 185 60 493 394 12 155 465 -170 177
7204 177 160 228 -94 276 591 57 -140 332 338 -45 92 89 401 4 125 -11 281 240 208 126 397 128 -152
7227 -152 132 160 348 307 491 593 -44 10 319 37 240 461 192 92 174 324 321 101 166 -169 108 435
7249 435 354 -224 427 269 419 49 212 329 106 586 221 -2 156 369 -102 140 -40 206 -10 -138
7269 -138 203 -73 -117 -140 -143 -57 93 -169 -119 182 172 -32 198 -204 -282 -356 -330 10 -323 -123 119 -87 -114 -128
7293 -128 -294 -130 -244 -58 -135 -178 -30 -183 -30 -213 -115 -133 -213 -215 45 -52 -19 -296 46 30 -31 -232 -123 -38
7317 -38 -109 -87 -22 -238 73 -132 -47 -107 -197 -73 -147 -141 -34 -215 -315 -86 -252 -322 -82 278 -295 -329 -198 -118
7341 -118 -155 -297 -528 27 -247 134 -205 -300 -101 98 -179 -40 -224 85 327 -276 -154 -329 477 165 -262
7362 -262 91 73 144 251 -418 49 139 234 -217 -217 305 147 155 -45 -106 105 -21 -13 155 9 137 172 -169 -71
7386 -71 222 13 -59 -303 -45 -52 82 104 -392 -25 111 -48 88 -57 -288 -148 -46 -116 296 102 -131 -367
7408 -367 -322 190 168 -340 26 197 113 144 -348 -127 -57 153 -227 -194 67 86 -93 -153 70 120 352 -20 -235
7431 -235 -204 321 -91 76 -12 324 12 125 -123 142 -30 193 -64 -42 -334 195 256 81 173 37 178 177
7453 177 -167 -130 120 150 -254 -264 205 91 -228 92 -7 -37 39 58 34 -37 518 236 66 -205 143 152 308 65
7477 65 -142 275 49 62 -7 251 305 368 40 138 65 466 247 -56 -31 168 478 -2 136 375 140 92 153
7500 153 323 468 413 113 7 -121 114 143 19 109 -231 -16 264 -3 -271 64 85 -45 -770 42 301
7521 301 129 -300 -14 293 -216 -6 -259 -42 -46 4 -101 105 -155 357 112 250 -182 -120 148 339 -223
7542 -223 356 -7 284 346 -13 -180 -106 263 37 84 230 358 -287 -174 18 -211 -148 -255 -122 -53 207 -83
7564 -83 -146 -340 316 133 24 -7 -43 121 157 -274 -262 90 146 -68 29 95 -209 -336 -230 -308 -127 -147 -227 -470
7588 -470 -172 386 218 -208 127 247 -94 -245 -99 -80 173 -125 -241 -357 0 -140 -132 -267 -10 -177 -144
7609 -144 254 -151 -22 -133 -34 -170 -103 51 -43 -309 -76 6 -59 -226 -36 -301 -178 -69 -40 -32 -159 205 -374
7632 -374 -227 -160 -152 12 17 -103 -185 19 29 79 -40 126 -465 -21 177 -216 228 43 218 -297 100 54 -95
7655 -95 99 277 -277 -196 352 76 -74 88 22 -30 47 -245 427 -38 -153 43 -361 -78 144 -336 74 -100
7677 -100 134 3 20 187 110 29 180 -20 201 -203 135 -103 214 335 328 45 -18 -174 416 241 53 -357
7699 -357 61 100 -88 -30 169 300 68 204 189 5 140 -17 -124 104 -67 229 235 173 -31 90 -302 276
7721 276 -113 -198 190 -144 -142 -91 199 53 -128 -330 -72 178 352 140 -51 50 86 165 -87 11 273 195 167
7744 167 -406 9 -29 139 -98 -102 162 58 168 17 -38 427 518 78 168 48 424 168 68 -420 97 276
7766 276 78 183 -147 544 256 -141 -97 -167 406 -76 121 220 -208 -286 179 103 -198 209 105 -189 104 -45
7788 -45 -80 110 -38 -365 70 -44 78 -155 22 407 -267 -225 -228 -7 -179 -22 -218 -133 -246 -116 -310 -344
7810 -344 -31 -195 -322 -109 11 -115 -275 -5 -234 -195 30 26 -214 75 -54 -191 60 -87 -43 -421 164
7831 164 -282 -3 -180 69 72 -160 -11 -219 -167 -408 57 -232 -7 58 28 -298 262 -350 -398 -219 -185 -246 -282
7854 -282 -214 -157 43 22 -354 -324 -253 -317 -235 -392 -42 -130 -265 -85 -86 -508 272 -456 -265 48 -155 -98 -62 -16
7878 -16 125 -267 60 -46 -24 51 94 -78 172 47 210 -126 115 -111 -301 396 36 -55 11 109 -227 -70
7900 -70 48 -161 300 286 242 56 33 270 119 132 131 -155 -91 80 429 92 207 -19 190 -50 109 -2 48
7923 48 142 -45 -222 146 123 170 30 116 372 -237 31 199 0 -245 28 14 -171 -17 378 -268 -107 109
7945 109 154 7 -33 386 35 -66 133 75 -53 209 288 -33 148 -412 21 -87 -174 -123 -75 -10 112 -94 8
7968 8 69 132 94 162 159 98 234 -93 16 193 135 29 -113 191 135 125 -294 -158 214 -57 40 -77 -288 159
7992 159 59 -32 81 -139 394 -124 -7 110 124 -68 -188 -22 119 -2 -157 64 -140 -214 -87 32 171
8013 171 131 277 -113 -133 152 54 316 -69 -249 298 -66 -79 34 -5 236 286 -108 12 288 283 -71 100 184
8036 184 92 290 163 -260 -247 -76 37 -10 -284 -98 87 -115 101 -230 -71 43 -1 -1 -304 73 -212 -260
8058 -260 -167 36 138 110 -80 -232 241 -112 -421 -18 -152 -295 -148 -389 -502 -321 -26 -272 -347 -311 -534
8079 -534 -30 -85 -335 -79 -176 -215 -361 -542 39 -152 -134 -213 -31 97 -112 -119 -497 -211 -240 -215 -256 -387 -15
8102 -15 -65 -327 -413 22 -318 -193 -170 -219 -78 -136 -186 -379 -129 -242 76 -328 -181 69 62 -78 -172 -373 57
8125 57 200 -235 -176 -36 -40 -30 276 -34 -73 26 -15 -118 152 177 51 154 -35 236 217 72 370 102 -84
8148 -84 363 -135 335 180 21 15 384 -230 100 175 456 -465 86 -92 41 337 -33 564 83 429 383 223
8170 223 324 308 426 103 342 324 -154 255 4 298 327 497 93 -62 187 270 -234 -102 106 159 176
8191A76
$$ Imaginary data points
##PAGE= N=2
##DATA TABLE= (X++(I..I)), XYDATA
0 0 0 0 0 0 0 0 0 2 0 8 -8 8 -8 16 -16 22 -24 30 -34 40 -48 56 -62 71 -83 94 -107 121 -137 153 -176 194
32 194 -220 244 -271 304 -337 373 -414 460 -507 564 -623 689 -765 848 -945 1054 -1179 1329
50 1329 -1504 1721 -1989 2334 -2790 3440 -4422 6081 -9415 18757 -97651 -380922 -192197
63 -192197 105401 160348 -36111 -158484 -114532 -50510 -97410 -116451 5123 120329 -3748
74 -3748 -241889 -262222 -6318 194168 93967 -158633 -233281 -66086 87749 46442 -42601
85 -42601 -10146 38513 -48097 -147372 -51766 166486 220879 14121 -203911 -145222 112247
96 112247 234114 106249 -41056 -31020 34912 28905 15465 94038 183924 119681 -75587
107 -75587 -149509 36440 259376 222277 -18123 -145338 -32357 135548 155106 57855 8870
118 8870 43646 34447 -46407 -34138 128173 219359 68064 -149401 -147547 70484 225787 138651
130 138651 -49754 -94956 10176 72485 37876 35499 100328 99399 -21795 -112541 -20553 174729
142 174729 225479 48297 -129118 -74394 114583 181864 90964 13398 30960 56225 23426
153 23426 8367 94192 191850 130033 -54397 -112735 48626 216447 178463 9728 -73249
164 -73249 -3765 86607 83804 42663 60832 82901 5697 -93182 -47570 111636 172079 40251
176 40251 -128699 -132071 21842 123079 53363 -61273 -67621 -18632 -30744 -64638 -20949 56794
188 56794 34189 -100004 -182590 -85142 79763 90458 -63624 -168453 -110595 -5730 11763
199 11763 -33247 -50375 -30506 -43829 -104255 -111724 -7703 83308 15860 -132012 -162951 -45687
211 -45687 60884 36673 -59587 -95858 -50721 -21790 -48372 -46157 16212 31584 -58153 -138102
223 -138102 -88618 36329 81100 -11781 -124404 -115686 -14916 31941 -9031 -43882 -33959 -36787
235 -36787 -72724 -78149 -16670 49151 21140 -90984 -145646 -59248 53160 44981 -51614 -98845
247 -98845 -59502 -11406 -14377 -35174 -19145 9686 -20491 -86282 -77661 16491 70008 11397
259 11397 -75361 -81838 -11332 45130 27039 -19962 -21216 3924 -8839 -35730 -4756 58909
271 58909 62023 -12096 -73034 -38132 56479 94542 28935 -42593 -30246 22776 37728 25022
283 25022 27789 35604 15524 -21037 -22700 33609 87661 57077 -27448 -51755 10311 67565 55178
296 55178 8535 -12251 5512 22217 10578 2639 31642 53132 14844 -37344 -24522 36981
308 36981 66225 31892 -20412 -27113 13396 37589 17675 4336 22283 25536 -8095 -26032
320 -26032 6731 51168 50855 -859 -44435 -21449 38696 53460 12384 -17638 -7439 9353
332 9353 9622 6313 14477 26427 14721 -21207 -30417 14319 53725 29196 -21413 -30830 857
345 857 27108 21892 901 -4808 7338 4610 -14825 -8414 24619 32334 -1240 -30041 -19444
358 -19444 15292 34299 13356 -18196 -16493 8630 12731 -2129 897 15698 11632 -9978 -19575
371 -19575 -461 28781 28577 -7210 -28740 -5343 23227 17620 -689 -3199 4100 4688 -2449 -5017
385 -5017 8686 25512 12938 -17254 -18514 11461 29130 17053 -3347 -10484 1172 15171 12508
398 12508 3569 8980 15265 1444 -11689 2982 25275 24015 3077 -12772 -6579 16562 26176
411 26176 8651 -5280 2650 10637 6172 4793 11507 13987 9958 1458 -4184 6107 22251 17811
425 17811 -1305 -4614 8340 13685 8635 4849 5901 10045 10246 -330 -5610 9932 21857 9151
439 9151 -6739 -4722 6239 11776 11097 3512 -1872 2040 4191 -366 3277 12110 7402 -6954 -10011
454 -10011 -232 9444 11194 -395 -15814 -12295 4339 6458 -4811 -8589 -6808 -8660 -9129 -7217
468 -7217 -6096 -5303 -7290 -16800 -19233 -7540 -3032 -13372 -19637 -15243 -13380 -13969 -15678 -18986 -18247
483 -18247 -11797 -14393 -25700 -26335 -15279 -11829 -17276 -23001 -26380 -24210 -16748 -14808 -19905 -20876 -19437
498 -19437 -25768 -26899 -14164 -7445 -16268 -26260 -28452 -21432 -8915 -6301 -18632 -28358 -21942 -13929
512 -13929 -14035 -14257 -14808 -19546 -20827 -18102 -18200 -14795 -9666 -14944 -25319 -23511 -13339 -11712 -15793 -17984
528 -17984 -19087 -17913 -16201 -19251 -20069 -11681 -7801 -19367 -26893 -19552 -11078 -8463 -10403 -17559 -22438
543 -22438 -16117 -8571 -8689 -8289 -5531 -10512 -16643 -10467 864 6700 4155 -4704 -11493 -1774 15473
558 15473 17134 7164 6066 9687 10588 14335 20724 24462 24553 19848 12110 14499 32146 40367 29445
573 29445 18844 19632 26022 32807 36773 32993 27949 28811 26488 22533 30776 42589 37640 22185 15539
588 15539 22297 34099 39062 29790 16494 18233 25875 23531 21004 27261 29082 18793 9945 11171
602 11171 21544 33110 30444 12523 3451 14690 25846 25808 23281 21497 16872 13400 14254 20655
616 20655 32701 37508 20993 1981 9151 33242 41704 30410 15769 10064 17319 28072 29148
629 29148 25025 25890 20973 7227 6180 23936 35298 25751 6272 -4918 2816 20556 23434 6943
643 6943 -3547 681 -127 -7350 -6099 2456 4383 -7401 -25866 -32329 -14526 3595 -7394 -30669
657 -30669 -36172 -27640 -23371 -23914 -21937 -22610 -26953 -37904 -47137 -36051 -10886 -7111 -34051 -55373
671 -55373 -45925 -21422 -9056 -16703 -34590 -39367 -30121 -24709 -24555 -15301 -5679 -18487 -38778 -37996
685 -37996 -14493 5794 1408 -23250 -37710 -22301 -1108 -2459 -13086 -12504 -9447 -16733 -23032
698 -23032 -17284 -1762 6832 -8224 -34083 -35467 -9563 6432 -5709 -23436 -27081 -23117 -19400
711 -19400 -18703 -16402 -8437 -9050 -31353 -47641 -28190 3851 5470 -22947 -43754 -36288 -12401 540
725 540 -9383 -20511 -17479 -15309 -23186 -19348 2614 14382 -1291 -25266 -28382 -1688 26675 22073
739 22073 -7086 -16643 2180 16219 12601 11514 18776 19936 8592 -3095 4318 32715 46036
752 46036 21697 -7723 -2641 24461 36396 27236 13881 10348 13415 11899 7011 16059 34035
765 34035 27355 -4539 -18783 3408 31136 31902 6214 -15417 -9797 10284 15045 5225 4989 10333
779 10333 -238 -16976 -11258 14156 28613 12744 -18721 -26618 1503 28107 19597 -2400 -6224
792 -6224 1642 4305 3859 10868 21909 23018 4182 -15422 -2331 34077 43801 15464 -8537 -1083
806 -1083 21034 31407 23042 13617 16740 19720 8369 1718 20607 40780 29226 -903 -11119
819 -11119 7367 31975 32776 9806 -6498 2132 12485 6508 3934 15237 18614 985 -18641
832 -18641 -15676 10550 29520 13269 -21104 -27579 -3613 13795 7794 -3148 -7352 -8206 -11714
845 -11714 -12586 -2833 13977 12842 -14961 -33739 -14651 16555 20640 -1154 -19612 -16449 0
858 0 8510 2018 -148 6803 2887 -13546 -14821 6914 23378 13655 -10491 -21296 -5680 16164
872 16164 14193 -2862 -6399 254 -2756 -10362 -4304 10494 13183 -3764 -24868 -22988 4624 21544
886 21544 4559 -20932 -23367 -9604 -800 -1028 -3440 -5668 -9756 -19077 -24208 -8932 12464 6959
900 6959 -21219 -33948 -18578 2922 7802 -5856 -19727 -18019 -7852 -7642 -10444 -2020 3963 -7479
914 -7479 -21500 -18080 -434 11970 6016 -12984 -20815 -7189 6098 3060 -3025 -1214 -668 -7315
928 -7315 -10868 -3696 9812 14691 -437 -19756 -15036 7376 15888 4925 -5795 -8062 -5192 367
942 367 2617 3931 6864 2267 -11494 -15348 910 16622 10355 -7406 -16451 -9754 5163 10731
956 10731 1776 -6200 -4323 -3541 -7300 -2878 7514 7932 -3152 -13295 -11970 1484 13585 7090
970 7090 -8572 -11347 -3067 1396 1183 3158 3047 -1221 -6109 -8633 -3037 9030 11371 -2438 -13874
985 -13874 -8237 2554 6464 4163 -1349 -5905 -4073 -2116 -1973 2430 8091 1524 -10533 -10109 481
1000 481 7825 7034 -1341 -9404 -8002 850 4049 1734 1501 -537 -6719 -7668 -739 5480 6484 1034
1016 1034 -7923 -9877 992 9096 4243 -2598 -3993 -3658 -799 3783 4874 2102 -58 -2520 -4667
1031 -4667 774 8663 6600 -766 -3610 -1632 1764 5545 6296 1514 390 1618 526 80 5690
1046 5690 8426 4074 288 -241 1446 6968 10359 6035 182 1487 3799 4843 7867 9819 4846
1061 4846 663 1826 4888 9226 12114 7332 -296 209 7415 10628 10257 7844 2986 1154 6516
1076 6516 10368 8979 7726 7037 3278 3079 8947 10580 7830 5702 4777 3428 6280 9062 6707 4606
1092 4606 6335 5379 2862 4635 6941 6077 5360 4928 1874 1480 6079 7516 4500 3764 2618 296
1108 296 2769 7063 5682 2285 1098 -951 -683 4692 6498 1392 -2769 -1864 -342 1472 3631 1108
1124 1108 -3839 -3200 -1414 -1691 252 1031 -2239 -5481 -3037 -907 -1609 -1227 -1992 -5091 -4519 -830 -2321
1141 -2321 -4503 -2574 -2030 -4698 -4853 -3310 -3650 -2471 -1766 -4731 -5842 -2805 -1315 -4068 -3099 -1836
1157 -1836 -4105 -5290 -3340 -2768 -2066 -676 -4066 -8017 -5008 -290 -1664 -4995 -5428 -5889 -5535 -3532
1173 -3532 -4032 -6182 -5112 -4875 -9160 -9229 -3927 -2702 -7608 -10374 -9816 -7992 -5088 -5573 -10432 -11353 -6846
1190 -6846 -7765 -11249 -9418 -6355 -7650 -10217 -11397 -11050 -7342 -4172 -8435 -13884 -10126 -4972 -7121
1205 -7121 -9305 -8026 -6070 -5547 -6648 -9743 -8049 -1382 -870 -7767 -9697 -3388 -411 -2409 -4125
1220 -4125 -4263 -3036 -669 -2618 -6309 -1396 4110 -489 -8161 -6051 946 4058 777 -5018 -6626
1235 -6626 -1028 3665 -1171 -4977 -628 1823 -3451 -6092 -1843 3288 3772 -2226 -8982 -5153 5100
1250 5100 5776 -3610 -5815 8 2957 874 -1238 81 4704 6575 7 -4606 3954 13192 9184
1265 9184 350 1200 7469 11595 10157 6237 7629 14445 13955 5166 5357 17314 22985 13519 5634
1280 5634 7490 16571 23262 18032 8945 10074 17947 17658 11131 13396 20008 18654 10067 5712 10419
1295 10419 21368 22893 8985 -563 8547 19206 15621 6300 5283 9821 10991 6096 1102 6071
1309 6071 15416 11184 -3477 -5863 6900 14581 7535 -1875 -3030 4194 8613 2386 -2618 4421
1323 4421 11557 2809 -9090 -3763 10704 14850 4162 -8622 -7282 6858 12938 2996 -4892 1693
1337 1693 6176 -954 -5369 1927 10314 7665 -6350 -15138 -4371 12628 10449 -8982 -14906 -4621
1351 -4621 2615 -1389 -8238 -7465 -1879 -3705 -15570 -19359 -4802 6412 -6250 -24526 -23565 -8645
1365 -8645 -892 -8177 -19844 -19744 -10506 -10344 -20909 -19744 -5885 -2609 -17931 -29792 -21742 -3241
1379 -3241 1906 -12443 -27161 -20564 -4697 -3683 -13993 -13761 -4386 -5590 -15569 -19215 -6956 8396
1393 8396 5212 -16394 -25034 -6012 12329 5478 -10153 -12045 -2423 2112 -3056 -6675 1599 10984
1407 10984 874 -17267 -13674 9706 18567 2352 -15165 -13271 3431 11452 1549 -8383 -1165
1420 -1165 6840 -2549 -13154 -4164 13383 12835 -6644 -20075 -8565 13398 16290 -3078 -14678
1433 -14678 -2711 7957 2239 -4823 1873 11543 6942 -8751 -13374 5139 25038 15373 -10151
1446 -10151 -14272 5406 19126 11882 204 593 9013 8758 -936 -857 16917 24837 5642 -13990
1460 -13990 -4646 19265 27548 10305 -7738 -4361 13030 16116 3693 1680 13341 13657 -2941
1473 -2941 -10444 4262 22401 19791 -4212 -18169 -2671 19365 15467 -3841 -7612 3610 6434
1486 6434 -3000 -6843 4286 16088 6569 -16594 -19026 6044 23074 8461 -14153 -14439 1747
1499 1747 9439 2266 -5715 480 8220 -1361 -15862 -8078 16160 19118 -3959 -21332 -11433 11791
1513 11791 18855 1701 -13118 -5119 7546 2478 -6466 599 13198 8114 -10513 -17300 -171
1526 -171 20759 15922 -10677 -20084 -927 14107 6683 -5952 -3743 4879 2550 -8944 -10635 5933
1540 5933 18776 3309 -20221 -17514 7288 17829 3607 -12298 -10809 1903 5410 -4538 -6706
1553 -6706 6540 10629 -7421 -20156 -6174 16193 16581 -4988 -20671 -10290 10893 12940 -2848
1566 -2848 -8955 1151 4810 -5571 -8861 3940 15215 7898 -12428 -18745 1950 20778 11300
1579 11300 -11133 -12865 1731 8654 1888 -3920 1394 8267 1376 -12951 -10132 11451 19572 881
1593 881 -17243 -10997 7410 14177 3222 -7832 -4035 5291 1157 -8394 -1977 12636 10360 -8562
1607 -8562 -17590 -4064 14469 14889 -4595 -16754 -5087 9017 5235 -4788 -2074 5270 1010
1620 1010 -9251 -9809 4301 15414 5669 -15363 -17048 3011 14920 4125 -8610 -7921 424
1633 424 2574 -3594 -5480 3490 8978 -3164 -16760 -8582 10307 12793 -2489 -14292 -9316 4462
1647 4462 7381 -2293 -7410 548 4473 -5540 -11179 -427 11294 6175 -8903 -15771 -3980 11584
1661 11584 9244 -6667 -11558 -1554 3663 -1855 -4365 865 5487 -369 -10603 -10420 4486 13679
1675 13679 1927 -14120 -11047 2729 7936 1172 -5581 -3924 1390 -348 -6621 -4354 7230 8012
1689 8012 -5793 -13612 -4652 8069 8439 -2461 -10192 -5254 4354 3151 -4446 -2489 4971 2699
1703 2699 -6928 -7998 1629 9411 5626 -6624 -10754 -166 9433 4584 -4131 -2830 2500 1516 -2552
1718 -2552 -1846 4059 7653 1395 -8206 -6263 7236 11402 1757 -5962 -3613 3011 5721 2058 -862
1733 -862 1753 4884 -384 -5254 1180 10018 6891 -2897 -6233 -724 7186 8434 474 -4572 620
1748 620 5158 1530 -1110 3428 6007 2133 -3079 -2997 2694 8887 5165 -4082 -4345 3347 6377 1990
1764 1990 -172 1340 3103 1684 -876 -892 4803 7792 906 -5636 -1723 5281 6104 1831 -1768 -1471
1780 -1471 2204 3307 167 169 4406 3548 -2496 -3638 1903 6003 3994 -791 -4292 -639 5476 4483
1796 4483 -1072 -1713 1953 1819 -759 -86 2159 2900 1552 -2196 -2833 2547 5712 1340 -3662 -973
1812 -973 1876 1559 530 -285 167 1593 1131 -2613 -1926 3710 3671 -1195 -3665 -911 1162 2003 334
1829 334 -2126 -1642 611 -591 -2703 127 2238 -441 -3609 -3102 -691 1700 1587 -2487 -5072 -1412
1845 -1412 1622 -829 -2086 -1138 -811 -2522 -2149 -1372 -898 742 -1086 -4511 -3329 1098 822 -2083
1861 -2083 -2459 -1545 -1446 -362 -1117 -2111 -401 756 -1639 -3926 -1036 1581 -248 -2049 -2377 -2680 -990
1878 -990 247 -1165 -2077 -918 -434 -2720 -2238 54 81 -1624 -2951 -3474 -1531 1437 21 -3522 -3101
1895 -3101 -1085 -1453 -1857 -853 -791 -2002 -1959 -2404 -2432 -226 1299 -1816 -3920 -1736 343 -258 -841 -1362
1913 -1362 -1771 -740 181 -1497 -1239 1496 1037 -2285 -1943 888 1654 1231 423 -1704 -600 1775 1322
1930 1322 -27 974 2013 492 -844 664 2307 2276 2065 -621 -1259 1457 4001 1486 346 1245
1946 1245 1178 351 1060 1385 1705 2398 599 -1875 -327 3661 3570 301 -956 140 820 2137 2111 227
1964 227 552 1380 -479 -1565 1910 3968 1021 -1757 -1573 524 2618 3003 -47 -1461 905 1877
1980 1877 -438 182 2498 1865 -157 -979 -797 1309 3744 1612 -2311 -2164 1634 1602 387 600 321
1997 321 -343 -909 -1362 -558 2517 2952 -2012 -4570 -1396 2397 2165 132 -2110 -2467 -680 882 -940
2014 -940 -487 1645 -725 -4389 -3179 1375 2390 419 -2945 -4308 -1468 3142 1350 -1800 -1695 262
2030 262 -1108 -1923 -122 1897 2053 -682 -3980 -3130 2462 4620 414 -2821 -837 679 658 543 1187
2047 1187 1686 1720 -1392 -3535 679 6198 4565 -1583 -3357 -431 2813 3983 1716 -640 359 1569
2063 1569 32 -128 3774 5535 872 -2833 -1479 3476 6949 4753 -1059 -2768 2198 4782 2186
2078 2186 1686 3575 2858 -171 -1155 1310 5635 6998 984 -4465 -1232 5647 5945 1814 -14 43
2094 43 1190 1276 278 1885 4940 2992 -3273 -5250 1745 7088 3928 -1935 -4374 -1992 2484 2706
2110 2706 -403 -1039 722 -1131 -5187 -2428 3547 4254 -1065 -6565 -6645 497 5162 1334 -5098 -4320
2126 -4320 -730 -1360 -2387 -736 1248 172 -4280 -7202 -3897 4510 4663 -3839 -8893 -4548 852
2141 852 1531 -1721 -3070 -2741 -1895 -4433 -5519 -19 4378 -262 -8968 -8558 -1375 3710 1415 -4985
2157 -4985 -7774 -3818 -103 -2265 -4049 -495 51 -5065 -8962 -5285 1840 4424 -1952 -9843 -8484
2172 -8484 299 3563 -1489 -4545 -2566 -1688 -3475 -3841 -742 3889 2619 -5083 -9624 -2152 7074
2187 7074 5779 -2462 -5947 -2462 1922 2706 156 49 2839 1218 -4070 -3598 5362 9390 3058 -4790
2203 -4790 -5245 2279 8346 5689 -1199 -1684 3089 2714 -844 1379 6637 6188 -684 -5415 -2067 7242
2219 7242 10133 2250 -5616 -2328 4816 4990 1758 1237 2974 2228 -1208 -2947 2418 9403 6416 -4058
2235 -4058 -7317 1336 8475 6952 158 -2997 -35 3283 2221 271 3521 6630 986 -5629 -2783
2250 -2783 6179 9430 3906 -4713 -5023 2863 7760 2998 -1157 1392 3016 -635 -2950 1002 6192
2265 6192 6389 -1228 -7766 -3094 6699 7841 -652 -5181 -2040 1542 971 -459 637 2759 1336
2280 1336 -5195 -6771 1322 7921 3221 -6309 -7927 -1515 4265 3321 -2171 -4356 -888 210 -3733
2295 -3733 -3054 3362 4972 -2470 -8145 -5189 3056 7143 1325 -6121 -5403 1451 2606 -1041 -1134 1939
2311 1939 1383 -3402 -5091 -1095 6196 6206 -2918 -8409 -2624 5451 4545 -950 -2929 -1007 129 -574
2327 -574 -2097 1246 5038 1585 -6167 -6245 2769 7384 2726 -4303 -5538 -780 3710 1974 -1666 -369
2343 -369 1936 -1306 -4762 -1334 4431 5319 -1175 -6398 -4276 3295 6471 596 -4323 -2168 1614
2358 1614 417 -1375 787 3355 2134 -2902 -5716 -583 6857 4916 -3588 -6051 -504 3599 2891
2373 2891 -437 -1637 388 746 -2130 -2990 2350 5309 292 -6334 -4695 1899 5207 2019 -3453
2388 -3453 -4300 174 1593 -1144 -1603 1570 1861 -2883 -5289 -1884 3415 4178 -1266 -6975 -4195 2327
2404 2327 2833 -1508 -2465 -1110 -717 -1865 -2371 -282 2564 1409 -4388 -6654 -501 4746 1776 -3366
2420 -3366 -4460 -1414 952 480 -1959 -1355 1265 -518 -4881 -3366 1937 3209 -609 -4909 -4443 -105
2436 -105 2858 366 -3565 -2539 149 -925 -2528 -740 1687 1035 -2659 -4803 -2287 2399 3258 -2051
2452 -2051 -4843 -1811 1567 712 -1340 -1093 -400 -230 -1902 -2557 -10 3318 1121 -3905 -3467 1028
2468 1028 3131 1234 -1474 -2029 -280 1311 296 -742 1656 2816 -273 -2760 -495 3117 3802
2483 3802 1324 -1691 -1336 2103 3730 884 -388 1452 1939 480 -181 1811 3409 2817 344 -1842
2499 -1842 673 4528 3978 219 -442 1065 2169 2334 1520 1367 2165 2421 -353 -693 2998 4649 2157
2516 2157 -726 -207 2135 3344 2909 912 566 2582 2435 387 1067 3153 3082 732 -22 791 2633
2533 2633 3877 1940 -546 395 2968 2552 851 1556 2026 1523 745 523 1476 3255 2930 -14 -1021
2550 -1021 1674 3298 2010 854 526 510 1310 1369 842 667 1958 790 -988 -664 1819 1779 156 -597
2568 -597 -1355 -66 1143 312 -1712 -419 348 -1095 -2094 -674 -35 -393 -1309 -2244 -2313 -302 68 -2014
2586 -2014 -2541 -1171 -1073 -1828 -1807 -1472 -1408 -1528 -1717 -2759 -1525 485 -1033 -2968 -2661 -817 -846 -998 -1419
2605 -1419 -2100 -1492 -576 -1637 -2231 -257 341 -1682 -2461 -1233 -522 -194 -785 -1906 -2156 -743 -108 -1653
2623 -1653 -1458 -577 -935 -1874 -1960 -1492 -876 -701 -1787 -3033 -2093 -380 -1445 -2684 -1866 -1576 -1996 -1830
2641 -1830 -1976 -2221 -1582 -1247 -3041 -3140 -1090 -472 -1693 -2689 -2199 -1480 -1155 -1128 -1719 -1558 -384 -802 -1997
2660 -1997 -1094 821 229 -557 -740 -565 240 1618 662 -760 239 2031 840 100 999 1532 1135 359
2678 359 229 860 2152 1809 -210 -660 1230 2039 944 702 731 541 1027 668 -527 481 1953 515
2696 515 -1309 -720 1167 943 120 -89 -604 233 746 -645 -909 1003 1242 -209 -736 591 1335 1287
2714 1287 729 -629 -49 2248 2250 377 916 2155 2067 1257 1977 2434 2780 2790 1666 1303 2346 4453 3476
2733 3476 1554 2092 3175 3249 2798 2590 2195 3506 3071 1340 1184 3447 3809 1531 789 1641 1967 2338
2751 2338 1669 735 844 2146 1078 -113 554 1842 932 -601 -911 -213 1270 1590 -292 -1983 -445
2768 -445 1314 -329 -564 116 98 -102 -405 -700 71 1775 783 -1462 -868 1322 1925 428 -345 76
2786 76 577 1241 464 -217 771 2154 413 -1641 -353 1902 1472 91 -809 -1241 498 973 -356 -1188
2804 -1188 318 152 -1951 -2218 -792 235 -836 -2557 -3497 -2173 131 -687 -3116 -3257 -1737 -2068
2820 -2068 -3056 -2721 -2512 -1813 -2062 -3785 -4333 -1784 51 -2444 -4397 -3205 -1154 -1356 -2021 -2294 -2006
2837 -2006 -973 -1160 -2753 -2324 876 906 -2389 -2795 -896 876 1059 -603 -1881 -1394 993 603 -1047
2854 -1047 -362 1804 436 -1289 -1061 666 2201 1234 -1332 -2287 654 2348 231 -1515 -80 387
2870 387 -167 -854 -1098 507 1387 151 -3023 -1806 1372 1438 -716 -2178 -1141 -164 434 -296 -1156 455
2888 455 1122 -1129 -2460 163 2722 1600 -921 -1785 -681 2050 2269 -28 -927 1102 1934 -52
2904 -52 -48 1967 2196 1221 -900 -962 1281 3355 1945 -1185 -981 1596 1911 240 181 750 1210 577 -1271
2923 -1271 -1411 1654 2887 -501 -3023 -1355 1383 1432 -406 -1271 -1366 242 84 -1615 -636 1481 550
2940 550 -2366 -3107 -37 1705 909 -1655 -3086 -966 1720 717 -1982 -760 1072 -327 -1521 -737
2956 -737 892 1400 512 -2172 -2038 1204 2709 527 -1721 -502 892 511 -394 -377 1204 1737 6
2973 6 -2415 -438 2896 2949 -479 -2113 -609 1589 2451 654 -576 733 1718 -162 -721 1478 3142
2990 3142 1274 -1242 -1263 1223 3387 2837 -743 -1152 1385 2548 892 218 1952 2076 1112 -115 96
3007 96 2258 3622 1758 -960 -160 2835 3128 1240 889 1421 2059 1429 350 755 3168 3320 -248
3024 -248 -1842 879 3552 2681 809 -810 11 2021 2085 134 265 1866 1242 -1027 -741 1692 2499
3041 2499 1347 -1102 -1660 605 2501 889 -1171 -990 759 499 -777 -401 821 1257 -159 -2191
3057 -2191 -1897 1436 2490 -680 -2264 -786 271 588 -709 -930 -730 1 -991 -2142 -659 1659
3073 1659 668 -2303 -3121 -888 686 332 -1464 -3004 -1385 -26 -1034 -2034 -940 -122 -1564 -2872
3089 -2872 -2244 -766 268 -932 -3549 -3385 -936 24 -2038 -2582 -1816 -1372 -1922 -2609 -2708 -917 -48 -2327
3107 -2327 -4201 -2959 264 -196 -2321 -2694 -2613 -1377 -1025 -1915 -1803 -977 -775 -2485 -2728 -1007 322
3124 322 -815 -2386 -2911 -1532 305 -127 -2204 -2346 -755 -602 -2054 -1513 115 144 -900 -2114 -2015
3141 -2015 -509 1212 -775 -2438 -1393 195 -528 -1002 -788 -620 -85 -787 -1745 -1075 834 1038 -1555
3158 -1555 -2297 -492 424 757 -522 -1114 -762 78 101 -679 76 1208 205 -1585 -837 594 1155 880
3176 880 -348 -479 747 1579 573 -140 1047 1459 975 475 967 1551 2385 1865 358 354 2493 3013 1629
3195 1629 1165 1816 2254 2092 2389 2305 2323 2942 1691 1120 2540 3952 3232 1724 2042 2137 3219 3471 2634
3214 2634 1641 2333 2914 2226 2125 2635 3255 1917 1645 2161 2345 3183 2701 1128 1487 2642 2544 1271 1391
3233 1391 2270 1890 1672 970 1323 2191 2731 1617 323 1167 1708 1716 1354 1237 863 1224 1430 1312 939 1832
3253 1832 1459 306 -97 1511 1565 876 849 273 320 1171 1051 201 127 600 408 -316 83 422 -478 -264
3273 -264 -858 -1266 -967 -281 -1138 -1873 -1257 -1382 -1946 -1913 -1847 -1819 -1897 -2086 -2900 -2921 -2049 -2253 -3410 -3888 -3239
3294 -3239 -2969 -3054 -2948 -3474 -3755 -3123 -3189 -3683 -3073 -2627 -3284 -3573 -3224 -2784 -2717 -2676 -2764 -3056 -2493 -1973 -2616
3315 -2616 -2776 -1662 -1548 -2169 -1694 -1351 -1870 -1254 -919 -1667 -1667 -819 -663 -1428 -1041 -1298 -1244 -1182 -826 -1027 -934
3336 -934 -1064 -1562 -1848 -366 -349 -955 -1083 -992 -1363 -1055 -711 -1036 -1009 -775 -855 -987 -894 -147 -438 -977 -465
3357 -465 -345 -177 265 -46 -315 -53 794 465 139 831 1111 1174 1242 1135 812 1646 2374 1747 1195 2053 2227
3378 2227 2205 2417 2589 2305 2089 2617 2576 2534 3080 2896 1889 2304 2992 2758 2809 2428 2337 2069 2769 2481 1675
3399 1675 1854 2119 1666 1357 1615 1540 781 1369 1001 884 1083 1191 413 278 904 703 499 407 359 191 531
3420 531 604 1 115 717 761 213 512 312 256 545 908 374 603 797 638 -103 1182 1220 593 428 479
3441 479 632 595 1357 870 105 1041 996 330 92 781 586 205 263 -8 -238 434 159 -927 -849 -100 -499
3462 -499 -1008 -432 -429 -909 -1126 -1063 -1211 -1008 -524 -1277 -2165 -1213 -922 -1228 -1296 -1186 -1531 -1319 -912 -1341 -1500
3483 -1500 -157 -909 -1605 -1240 -578 -623 -690 -1003 -1038 -678 194 -72 -691 -488 270 -175 -700 -65 324 152
3503 152 130 -371 -521 217 339 -312 -334 593 248 -280 105 222 -79 -72 -321 -871 -543 521 474 -925 -804
3524 -804 -125 -343 -384 -418 -729 -585 -318 -499 -830 -364 485 -639 -1055 -615 -12 -251 347 -456 -638 29
3544 29 148 -791 -254 478 69 -356 -224 -171 551 1038 570 -424 -86 1117 821 104 59 582 331 120 84
3565 84 491 1033 563 -120 -681 468 1236 550 -179 -411 -333 295 188 -186 -216 468 159 -1121 -522 204
3585 204 326 -153 -840 -716 -68 646 -29 -497 -341 203 -711 -838 -132 535 114 -719 -951 -702 522 871
3605 871 -848 -812 -142 -341 -314 -294 -231 -322 -233 -599 -771 -243 903 -135 -1368 -954 -293 -200 -67 -433 -858
3626 -858 -507 55 -732 -1264 -97 312 -653 -1595 -725 -37 614 92 -876 -1128 -9 172 -441 -535 276 -200
3646 -200 -822 -885 164 463 370 -754 -1285 -108 1082 464 -452 -216 272 577 167 15 60 610 784 -311
3666 -311 -729 887 1483 571 -431 27 426 961 973 80 351 1070 762 -445 562 1130 1215 291 53
3685 53 204 790 1763 721 31 362 1109 519 417 1040 1424 674 140 78 555 1976 1811 101 -249 1102
3705 1102 1540 1375 1257 967 1016 1242 999 610 1256 2085 1245 -81 412 1550 1700 1477 692 408 1181
3724 1181 1463 905 397 1147 1172 354 40 674 1321 1016 309 -513 -352 986 1107 -309 -412 214 47
3743 47 -418 -325 -342 176 262 -708 -1344 -222 493 97 -1007 -1109 -700 -302 -322 -593 -940 -491 -235 -1160 -1291
3764 -1291 273 165 -1041 -1376 -1164 -493 -138 -244 -1367 -958 -632 -504 -1147 -794 68 -881 -1439 -1446 -939
3783 -939 -67 -216 -1107 -1928 -1174 11 -758 -1105 -1047 -1348 -1115 -1439 -1576 -1111 -401 -1228 -1806 -2054 -982 -405
3803 -405 -1209 -1741 -1587 -1380 -1106 -1039 -1651 -1068 -696 -1115 -2085 -1539 -518 -712 -913 -1846 -1864 -931 -216 -920
3823 -920 -1484 -782 -828 -1267 -884 -657 -209 -458 -895 -1283 -1164 345 -41 -690 -777 -412 -301 -237 29 -394 141
3844 141 320 -275 -245 526 1129 445 -526 28 616 782 958 362 95 603 677 105 94 1294 1014 190 -23
3865 -23 474 1018 1525 956 214 346 1091 1025 395 772 850 530 511 493 915 1261 1412 606 -80 717 1738
3886 1738 1265 1066 875 927 820 1173 1195 1107 1781 1649 1005 610 2061 1917 1491 1229 1087 1078 1783 1524 920
3907 920 1165 1781 1223 1129 1366 1736 1371 1079 1137 1066 1606 1637 1066 578 1022 1320 1107 692 1145 936 761
3928 761 477 76 239 1132 426 -367 -84 480 564 -327 -142 -523 -539 35 -257 -721 -110 -3 -891 -1031 -526
3949 -526 -185 -527 -774 -959 -1132 -800 -465 -814 -810 -305 -729 -965 -937 -658 -555 -616 -776 -1141 -826 -421 -515 -1048
3971 -1048 -826 -701 -489 -563 -730 -516 -730 -413 -731 -1229 -698 -572 -723 -1066 -404 -1142 -900 -544 -682 -1075
3991 -1075 -904 -753 -1020 -1008 -560 -1145 -1294 -1171 -869 -1377 -818 -954 -1226 -1201 -822 -1017 -1010 -909 -761 -971 -1027
4012 -1027 -938 -999 -576 -269 -327 -848 -291 -146 -405 -106 52 63 -420 127 73 73 533 276 300 125 541 314
4034 314 579 413 46 628 671 796 280 389 926 298 250 919 672 320 278 77 94 539 753 267 -130
4055 -130 283 -75 -10 3 63 -353 -15 117 -478 -366 46 -166 -348 -237 115 -297 -414 105 -403 -474 -122
4076 -122 -414 -489 -35 296 -237 -38 -34 64 -93 204 217 -13 315 65 6 232 504 250 -159 304 268 265 273 301
4100 301 74 -65 266 145 263 57 263 -148 68 16 43 -252 202 192 -244 162 -46 -3 -81 30 -141 -388
4122 -388 56 -173 -202 -118 116 -239 44 258 64 -139 -147 -126 118 430 311 -88 418 497 -21 565 286 727
4144 727 447 530 428 579 526 962 579 697 1199 711 402 881 973 525 658 749 608 351 880 946 79 606
4166 606 576 682 521 898 261 80 812 387 418 201 786 474 133 178 379 244 254 27 248 133 295
4187 295 172 162 325 40 -81 334 131 -174 169 171 -123 -146 146 -22 -179 -8 -152 -213 251 -47 -456 57
4209 57 180 -185 -742 -44 -272 -386 -177 -355 -370 -442 -79 -502 -768 -218 -550 -747 -586 -356 -838 -661 -466
4230 -466 -680 -622 -621 -366 -611 -357 -405 -765 -692 -411 -670 -638 -318 -569 -660 -569 -429 -668 -465 -356 -358 -651 -284
4253 -284 -707 -540 -800 -470 -582 -571 130 -353 -344 -1 -78 -351 -637 -113 -267 -617 -427 -388 -676 -197 9 -314
4275 -314 -306 -136 -300 -185 -249 -378 -434 40 296 -284 -340 -155 129 -44 259 208 -476 124 253 -400 -2 561
4297 561 378 -474 -36 335 -62 93 299 3 224 456 -100 12 317 707 86 -12 91 202 48 131 149
4318 149 0 -206 53 -186 273 558 11 193 -245 3 -250 251 412 -430 -54 328 251 -373 40 -95
4338 -95 -228 -49 66 -124 -19 196 -82 -470 -328 21 86 31 81 134 420 417 123 143 163 301 99 21 320
4361 320 245 119 477 -263 365 518 253 62 415 617 370 155 333 816 503 630 562 269 665 674 188
4382 188 134 602 492 -9 420 471 35 614 429 134 290 370 386 -76 -66 463 309 225 529 -23 -5 827
4404 827 114 -24 456 464 18 -138 328 115 392 619 42 -85 500 567 -296 271 428 290 47 382 484
4425 484 253 533 203 -25 60 770 292 253 -154 32 197 -183 -53 25 -5 417 -296 -321 45 217 -182 -25
4447 -25 -138 -603 -412 -304 -252 -741 -97 -527 -699 -347 -95 -627 -561 -404 -971 -577 -530 -387 -1045 -539 -489 -224
4469 -224 -613 -511 -569 -440 -80 -841 -659 -301 -349 -420 -763 -356 -291 -623 -560 -404 -220 -236 43 -648 -732 -47
4491 -47 -386 -647 -352 -220 -334 -168 -361 -598 -266 -118 -343 -677 -183 18 -480 -211 -374 -215 -148 112 -430
4512 -430 -631 12 -151 -212 -277 -232 -234 -150 355 -110 -55 159 -49 -456 -152 279 -106 -535 37 -143 137 105 -138
4535 -138 104 -219 450 -72 -66 247 78 254 156 103 -44 677 378 25 128 432 200 -17 231 484 226
4556 226 529 556 53 7 1095 740 141 465 400 598 370 529 638 622 532 403 214 411 478 -9 -144 486
4578 486 334 215 337 294 121 383 186 345 24 276 290 154 45 196 143 220 286 -260 62 288 220 -166
4600 -166 64 -132 -18 -55 -32 -109 79 247 198 -47 105 366 206 -77 43 109 51 219 17 -226 203 -77
4622 -77 -177 -244 -5 -56 -100 147 -242 -85 1 -46 -545 5 89 -103 -183 232 43 -24 -44 123 -156 -76 134 -272
4646 -272 -248 10 -333 220 -41 207 140 -85 -350 -395 -253 -58 -10 -460 -339 -148 -36 -95 -63 -84 25 -370
4668 -370 -22 36 -61 261 138 167 19 251 147 228 -164 141 303 12 279 -199 363 74 205 396 124
4689 124 -163 -60 283 140 33 371 95 352 107 248 270 273 209 203 229 383 -312 -286 262 177 -191 216 278
4712 278 138 142 65 -28 -45 178 93 -239 75 1 317 -135 512 46 -110 94 30 -349 -284 435 -7 -144 -37
4735 -37 141 21 46 -163 -349 248 -122 -226 -174 108 -119 -358 -111 -99 -277 -78 172 -306 -249 160 -132 -339
4757 -339 -389 -228 -245 -217 -93 -741 -469 -288 -435 -286 -194 60 -506 -401 -332 -387 -591 -14 -311 -619 -116 -185
4779 -185 -311 -524 -481 -359 -406 -122 -241 -600 -433 -292 -729 -567 32 -108 -296 -528 -14 -88 -91 -388 -481 -127
4801 -127 80 -115 -521 133 -151 -124 -12 -86 -155 81 95 96 -55 -188 -7 -83 -305 276 -260 16 258 157
4823 157 121 181 65 58 304 486 226 294 595 760 495 604 614 247 421 174 679 504 614 374 546 416
4845 416 511 531 574 740 421 99 582 483 215 451 615 281 202 206 399 601 540 173 243 254 492 44 376
4868 376 355 359 553 479 426 159 584 434 67 328 378 99 313 137 195 285 179 -151 219 481 297 137 -110
4891 -110 -14 344 199 637 277 -271 305 135 -202 87 -276 180 -97 -133 -164 -336 114 -179 -302 -364 -60
4912 -60 4 -201 -196 -95 -273 -284 -179 -351 -447 -156 -418 -420 -572 -474 -131 -519 -383 -465 -253 -187 -569 -328 -34 -204
4936 -204 -458 -408 -1 -122 -479 -363 -225 -517 55 46 -298 -11 -72 -260 -132 -285 -424 -146 -368 -230 -329 -290
4958 -290 221 -434 74 -93 29 -77 -417 -37 -211 -461 -33 -50 -387 -189 -79 45 -389 101 100 -389 -308
4979 -308 -99 -251 -383 -103 -430 -19 -228 -164 -439 237 -128 -335 -112 -194 -190 197 481 56 1 -99 -76 -349
5001 -349 -67 119 193 41 277 -342 -79 22 68 -62 -87 141 106 -21 176 37 293 218 144 -45 51 361
5023 361 -163 124 -19 114 250 262 108 -22 138 264 37 -45 244 312 63 139 278 88 137 78 382 -21
5045 -21 396 359 189 80 172 75 203 306 71 -52 105 329 -97 153 172 -211 -83 -50 237 8 311 156
5067 156 91 462 196 130 -134 223 230 286 -31 249 -26 144 255 169 233 195 118 81 167 243 119 83 21 -34 415
5092 415 176 -163 60 610 380 -141 -70 -160 105 14 -13 -198 -148 -13 94 -94 -388 -285 -272 -4 -149 -150 -32
5115 -32 -152 -256 -453 104 243 -345 -139 -255 -169 -77 -243 -198 -76 244 -150 -150 -71 -4 -58 -130 -5 -88 -428 196
5139 196 10 -339 310 477 -217 -44 -52 136 135 -362 -239 -254 147 132 -190 -71 -121 150 4 111 142 9 -24
5162 -24 -362 32 10 552 -143 -406 191 112 -83 -204 -219 45 80 212 6 -152 113 170 95 -134 48 14 68
5185 68 217 -73 -206 38 260 -132 -231 57 275 138 -223 -60 226 261 -32 -158 267 567 -185 108 179
5206 179 99 411 156 17 97 31 131 -154 -164 209 29 -188 -389 -44 185 130 224 -85 -250 274 225 -366
5228 -366 -235 -292 -65 -73 -498 34 35 101 -72 -178 59 -111 -276 -386 -119 177 14 7 -444 -274 97 -161 -339
5251 -339 -315 -95 -245 -168 -385 -32 37 -7 -111 -118 -267 -195 -357 -479 -109 -66 48 31 -167 -449 0 78 -187
5274 -187 -390 -101 -70 -87 -579 -378 247 93 -156 -239 -169 375 71 -278 -193 219 -95 -130 -187 36 242 356
5296 356 -98 -339 370 60 133 -48 180 64 -28 -46 66 20 22 12 100 -298 342 457 90 137 228 279 22 277
5320 277 -268 194 114 75 -294 473 306 159 28 -96 -48 254 571 91 -113 293 302 173 -301 -87 387 298
5342 298 88 103 351 361 420 186 -47 376 491 -155 69 107 400 51 -66 165 409 88 10 -263 -25 375
5364 375 24 0 9 236 43 86 94 -286 138 181 145 -313 54 233 -15 -221 -143 248 196 143 -222 -394 144 120
5388 120 90 -149 85 67 117 4 41 4 371 27 -510 -252 294 177 5 -147 -154 259 390 -393 -462 371 337
5411 337 -183 -129 199 74 198 -230 -151 -82 125 110 116 259 315 -6 -28 185 -97 -48 105 -228 -462 79 83 -205
5435 -205 -221 -82 -70 419 82 -39 190 -96 -201 -225 -39 265 -133 -199 -232 -194 -79 114 164 -212 158 -174
5457 -174 -37 -117 60 -60 -123 -294 -83 -61 -44 21 -207 -187 -153 49 -493 -282 176 -20 -98 -45 -80 -59 -140 -136 -430
5482 -430 7 95 232 -112 -496 221 -118 -135 -330 -157 -96 -3 -157 -212 -149 144 147 -352 -13 -148 -251 214 103
5505 103 -11 -163 -9 -213 -185 -148 79 9 -69 101 -252 -223 -147 -56 360 -95 201 -51 82 113 -150 183 -368
5528 -368 -46 98 127 78 -233 -176 177 -25 157 313 204 27 -108 -88 -193 236 -278 -22 -47 73 143 45
5550 45 15 21 -44 -263 -40 308 98 -219 194 -29 339 41 -168 70 43 113 219 -146 179 -20 -166 118
5572 118 494 56 -70 18 287 -13 -75 313 346 74 -89 104 -185 178 6 -115 75 96 126 -6 -28 155
5594 155 247 160 86 226 -89 164 -44 209 -211 -12 141 -273 59 243 211 20 -32 206 -112 372 56 75
5616 75 -16 -48 472 -206 -186 -83 222 331 -82 86 26 254 -67 -44 43 -72 298 64 162 86 -247 -63 -44
5639 -44 -79 178 83 -149 -102 -185 87 103 -61 -56 -75 -95 192 -155 11 97 -12 -101 -383 83 -61 11 -214 -126 198
5664 198 -150 -192 -61 89 -121 125 -174 -92 -48 -181 359 -231 50 7 -248 -178 27 -272 -279 -99 43 5 -65
5687 -65 -54 -287 -26 159 249 303 70 125 -75 90 98 132 -105 -140 30 155 149 271 138 139 -6 347 -179 182
5711 182 105 -313 168 -70 260 114 -78 -22 91 -209 -123 49 311 -77 -151 -162 -47 222 -79 -180 -111 -88
5733 -88 302 119 -163 164 -111 -152 -146 -105 -31 -8 -89 -390 -126 72 101 -132 -24 -101 119 271 -187 -165 8 172
5757 172 32 -192 -380 -10 -156 147 -211 87 27 -68 2 261 38 37 -130 -411 167 -154 -8 -58 -41 270
5779 270 171 -166 -291 41 -44 -114 -33 -297 164 80 -170 -270 -83 -48 67 41 -282 -40 94 -154 -170 -194 -155
5802 -155 -366 -28 -121 -141 368 301 74 -317 -286 52 141 -82 23 3 31 21 -9 -322 82 171 -137 -268 -76
5825 -76 44 76 76 -392 -131 241 -194 -233 -86 180 114 145 171 282 183 109 -210 -137 141 450 -63 -303 173 -44
5849 -44 106 145 -27 -43 319 -118 -5 120 408 327 -178 -154 106 476 229 67 -223 -75 242 203 -37 92
5871 92 526 177 -19 -204 109 300 105 -48 -129 4 96 -255 103 477 174 11 -127 -403 36 227 270
5892 270 -181 68 315 -118 -66 35 121 254 67 -60 -56 -130 160 -210 -35 -24 237 162 119 -149 -115 272 313
5915 313 199 24 35 -59 -120 -308 227 462 57 -242 -343 390 365 -60 23 0 309 202 44 33 148 195 87
5938 87 -197 -42 1 385 -108 -225 119 -85 -28 -161 -57 341 156 256 9 65 295 244 -230 -111 -31 478
5960 478 -41 -123 -395 -60 204 71 -396 129 312 -153 -190 -301 -186 150 -54 -207 -420 32 105 -29 -283
5981 -283 -20 31 -272 -251 -617 -142 28 -58 -222 -311 -121 -206 -270 -177 -267 -261 -156 -47 -266 -209 -36 -507 -378 -222
6005 -222 -31 -328 -657 -535 -116 30 -230 -298 -394 -152 17 -341 -235 -342 22 -211 -787 -134 -112 197 -227
6026 -227 -443 -265 -345 -44 -116 -283 -93 -245 75 -411 -184 341 131 127 -223 124 175 -170 -332 -508 142 341
6048 341 94 -381 140 483 269 -122 97 462 462 270 -334 88 119 122 -31 255 554 454 132 132 59 228 495
6071 495 121 -95 -32 525 328 -33 -47 211 -47 271 140 -211 191 344 400 -193 215 500 184 329 -43
6092 -43 271 765 518 40 374 526 337 25 -108 228 282 413 292 14 257 693 561 184 156 356 412
6113 412 377 137 201 406 274 -173 202 431 231 -98 -307 306 120 -83 408 46 88 5 480 51 -435
6134 -435 -258 -31 -333 -175 -145 -54 29 -216 -238 101 205 -127 -226 -339 -58 -54 -117 -455 202 135 -49 -321 -503
6157 -503 -116 -148 -96 -242 34 58 -154 -508 -5 321 341 -92 -93 34 139 -20 101 26 -254 35 156 -19
6179 -19 -287 -225 70 -28 -449 -123 -159 -253 -177 -527 -141 -100 -73 -325 -378 -124 -94 -351 -551 -139 -213 -318 -79 -342
6203 -342 -7 360 -79 -252 -133 -367 -201 -300 -257 -217 -302 -363 -339 -25 -350 -123 97 -449 31 248 220 -249
6225 -249 27 -191 191 -165 -97 176 107 150 -170 -224 116 245 -91 -89 83 35 -271 -143 61 312 209 -430
6247 -430 184 -5 2 -60 212 -85 -244 23 281 116 -266 -284 -180 12 -39 -77 -154 104 -302 -62 10 -34 150
6270 150 70 -5 147 45 127 -212 183 -66 -60 -131 -6 408 146 19 -290 98 141 455 78 193 256 83 321
6293 321 -156 93 235 276 388 79 87 -394 524 136 104 238 397 218 -113 -207 -87 318 101 -220 -138 157
6315 157 491 -69 0 -42 -31 137 92 86 -226 -38 28 -151 70 50 -27 48 -48 137 246 260 -164 -121 213 -26
6339 -26 128 -253 -80 -227 47 -127 73 -72 -180 26 -133 93 249 -7 -196 -85 2 134 159 -104 -251
6360 -251 -18 188 195 -375 -222 81 178 -15 -168 86 -187 19 -38 -411 181 1 176 -149 130 241 -96
6381 -96 -241 -223 -392 72 40 91 -53 60 26 -171 49 163 -12 22 348 -116 -62 378 281 -231 112 69 574
6404 574 95 249 205 -199 37 -131 53 73 113 144 -6 267 170 215 414 176 3 266 348 -91 233 91
6426 91 190 -122 33 111 138 133 6 169 161 -34 -265 -102 -198 -113 -48 78 -15 173 183 253 70 -176 609 -24 -155
6451 -155 -67 -255 23 -112 126 -66 -96 -75 201 19 -32 -34 -253 -105 -172 -181 -251 -245 -19 63 52 151 -343 -203 -84
6476 -84 -24 -159 143 -183 -346 -286 -521 -50 -385 184 -41 -440 -14 -99 -189 -265 -312 -547 -325 -123 -527 -477 -248
6499 -248 -119 -545 -483 -266 90 -613 -57 -268 -343 -259 -301 -320 -174 -230 87 -465 -537 89 -95 -210 -325 -192
6521 -192 -293 283 50 2 -257 -82 -23 -216 -187 136 -109 2 -352 46 229 98 53 -56 240 260 160 442
6543 442 -419 -26 254 150 -119 18 -32 217 24 288 52 125 71 31 -5 167 569 112 62 166 264 241 -79
6566 -79 -40 451 728 377 -65 71 135 547 316 68 222 237 247 430 58 131 366 569 199 299 205 380
6588 380 71 543 139 324 382 154 46 322 626 315 -47 43 638 496 176 76 327 408 410 125 353 428
6610 428 448 -143 96 383 359 83 43 -48 -103 273 270 115 0 -66 493 -158 -54 58 84 62 -87 196 361
6633 361 34 151 28 -113 -8 46 -197 -356 57 180 318 -371 -45 302 255 -80 -191 81 315 127 -168
6654 -168 -370 -78 155 -30 -248 -145 -118 190 -16 -410 32 233 -98 -366 -289 -189 -310 -375 -367 -243 49 -247
6676 -247 -274 -470 -273 -14 -327 -463 -115 -161 -238 -475 -504 -437 75 234 -200 -520 -45 -127 -173 -600 -20 225
6698 225 150 -164 -580 -96 -104 24 -259 22 -22 -133 -65 -236 168 105 193 -334 -300 -195 369 49 -687 -69 -2
6721 -2 24 -85 -189 57 -40 126 -10 -781 -15 89 -190 -346 -177 0 227 -65 -428 -147 165 93 -502 -61
6743 -61 -6 3 -563 -382 -272 200 -160 -325 -319 172 171 -73 133 -21 130 209 274 69 436 116 -1 131 95 365
6767 365 347 109 8 165 0 418 -85 -230 430 -14 133 -235 -20 356 314 -244 -415 -317 47 183 159
6788 159 -184 105 315 -341 -232 -355 276 56 -227 -130 -150 4 325 -206 -368 136 158 -246 13 281 221
6809 221 158 -281 389 47 239 -180 -9 128 331 269 -79 -172 110 406 321 -163 -256 277 508 39 -272 286
6831 286 283 283 347 -177 112 356 -94 -279 349 35 246 -116 -427 97 -246 209 4 -237 -57 356 -332 -345
6853 -345 -463 -111 -334 -475 -213 -11 -29 171 -555 -6 180 250 -158 -258 251 12 239 -69 128 -187 268
6874 268 259 211 -70 397 102 -201 -290 -188 155 232 38 -56 232 -129 -224 9 363 -346 -20 -145 -114 -295 277
6897 277 28 -224 -175 143 -222 -61 45 175 110 49 -110 -343 255 121 -551 -196 9 77 -188 -38 84
6918 84 -199 342 18 -275 -55 -97 173 34 -126 -39 88 -206 82 134 264 -145 -34 126 -149 27 -27 -69
6940 -69 -5 126 -34 88 -194 -87 -154 183 -1 -161 -164 -311 -220 129 -327 -191 -54 149 62 52 104 139 -273
6963 -273 -145 -211 -268 467 -196 -495 -145 235 -150 -93 -313 130 -250 -104 260 -244 -213 -230 0 -248 336 -13
6985 -13 -272 -263 83 -207 -97 128 -316 -49 213 -105 103 -335 -176 -178 77 -32 -163 -65 172 -39 26 -21 -65
7008 -65 116 85 41 147 -172 228 -63 -34 -181 87 -190 -187 -50 -326 -52 -168 -286 -247 -165 -81 -141 246 -287
7031 -287 -36 -234 65 -148 190 116 31 92 52 218 -44 31 -63 118 104 -98 108 294 -53 245 148 -105 -278
7054 -278 153 48 14 285 -93 322 -15 64 183 358 80 193 -5 470 -183 240 440 213 198 155 275
7075 275 428 -208 222 280 42 36 288 92 147 162 240 81 155 374 189 232 373 389 -61 191 -67 192 -29
7098 -29 25 204 271 38 51 218 341 17 42 9 -205 86 321 -107 -177 240 607 71 -167 111 -126 -22
7120 -22 0 -70 -86 -228 77 30 327 79 -121 -58 -60 -349 155 58 -32 -184 -307 -60 148 187 -293 90 -422 -117
7144 -117 -111 -159 63 136 -162 -11 -180 -276 -195 -253 -326 47 -129 -346 -172 -163 -270 -60 -273 -364 182 -165 -51 -107
7168 -107 -192 -388 -43 -169 196 -109 -398 -231 -383 -256 -91 -263 -180 -117 -122 -12 -19 -14 -338 75 -64 -144 128
7191 128 -111 -340 -149 -24 -113 -164 38 -494 -223 102 -70 -399 -126 -37 -420 87 -101 -227 -218 -218 86 -200
7213 -200 -310 -230 -26 76 26 -176 -32 -55 -297 -21 46 -37 -135 -231 -105 40 209 -236 301 483 58 168
7235 168 -23 107 433 128 281 139 37 142 49 240 -18 118 -136 108 -260 -145 35 106 96 -208 317
7256 317 62 103 -123 120 -14 -250 34 -63 47 293 244 161 -116 156 372 142 11 8 302 -190 -183 -22 -154
7279 -154 -200 2 134 103 3 469 313 -110 254 289 106 460 -136 182 156 159 61 -17 350 152 80 342 184
7302 184 270 13 207 313 208 192 220 -18 -98 98 22 -231 233 91 -117 192 -21 -26 117 -172 -48 -120 292
7325 292 309 -184 -342 -114 -55 -305 148 -132 121 431 22 -162 247 151 144 259 -50 130 135 -69 3 217 -60
7348 -60 109 -205 89 3 -99 -195 67 -91 462 475 -161 -47 -250 -9 106 165 55 -97 188 -76 62 102
7370 102 -222 -302 3 -142 -337 -229 -210 -423 -296 -473 -90 -61 -176 -267 -132 214 -213 -45 -160 -165 84 211
7392 211 -209 73 -178 -175 96 -139 0 82 -108 -355 237 -336 232 119 -18 172 442 211 -378 -293 -93
7413 -93 224 168 -320 -119 184 440 42 -216 139 400 303 -310 183 -59 14 182 -87 -351 196 37 -193
7434 -193 -146 -166 152 -65 -426 -68 -74 109 -403 -227 -341 244 -90 -209 -186 -153 55 -72 -144 -150 227 18 -250
7457 -250 -498 -212 55 191 -446 200 -295 125 116 -114 -57 158 33 -171 119 158 -269 58 -6 42 365 225
7479 225 -107 -20 252 194 46 -1 -52 -221 319 -141 -375 -69 283 337 -74 -459 -25 1 -309 -343 -26 -273
7501 -273 -271 -96 -183 9 344 327 -346 -247 -270 -307 -54 -182 -517 -163 -47 -369 -170 123 105 44 -8 -72 53 38
7525 38 71 -10 43 -109 -79 -80 59 357 227 179 27 76 443 -32 129 55 56 307 -132 25 -17 -79 65 215 -11
7550 -11 -40 78 -5 190 152 107 419 58 43 14 342 168 217 -191 5 277 197 -274 232 53 515 91 -106
7573 -106 -134 28 -7 223 -32 -80 125 63 374 336 182 244 159 -8 -31 292 150 -251 187 234 591 456 158
7596 158 -79 236 12 9 -146 8 303 78 19 419 120 94 193 19 221 -24 -6 -9 45 426 123 -218 -183
7619 -183 218 -52 81 161 227 -186 84 -153 0 55 220 27 -151 -309 -129 -196 116 -75 -50 -13 -264 -142
7641 -142 -95 203 13 -272 -165 -116 -148 201 33 -31 -429 -382 -175 61 -186 -50 -705 -118 -59 -268 -78 -232
7663 -232 -316 -251 -355 -102 -198 -162 -192 -180 13 -148 -328 -410 -316 -142 -13 113 -271 -127 -95 -22 21 -235 164 -408
7687 -408 -168 -115 -152 -290 -243 17 -296 23 16 -273 -379 152 -237 61 -499 -231 -128 -173 71 -112 -177 -143 -214
7710 -214 -324 -395 208 278 93 -89 113 92 -176 67 -198 -62 169 424 -69 155 49 -67 327 416 369 49
7732 49 249 284 -56 283 287 151 -116 142 36 300 148 -70 242 160 370 152 -65 -70 470 50 104 146 38
7755 38 73 304 -79 386 402 176 318 352 143 -6 -51 14 170 199 242 239 -230 101 113 34 207 134 -213 429
7779 429 387 43 41 221 13 268 416 410 178 123 39 -46 75 417 -234 274 131 245 231 57 143 533 155
7802 155 282 244 62 24 12 -283 -80 260 -6 -46 -64 -121 -186 -291 88 33 85 102 -122 198 185 -211 -304 245
7826 245 2 -33 -152 -22 -224 55 -21 -308 -127 -80 36 -79 157 -97 -175 -74 -251 117 -217 -330 -115
7847 -115 213 -66 150 -13 -340 -132 -6 -68 -215 165 97 -107 -47 162 -143 278 131 -172 -117 254 -150
7868 -150 -126 193 -103 106 -230 72 62 46 -226 -155 301 379 109 -223 -62 212 -4 -261 -237 -79 -270 43
7890 43 -2 -108 -65 275 153 115 -151 -39 53 83 -41 -145 96 -88 -305 45 401 -266 36 -27 92 -279
7912 -279 -169 -92 78 83 271 -125 -139 -337 -390 -237 -18 -15 -163 123 95 -302 -268 -279 -288 71 -290 -166 52 19
7936 19 -226 -281 -364 258 -405 72 -234 -362 119 -107 -61 -59 196 -23 -79 -14 -196 163 -214 -192 159 32 11
7959 11 47 -97 -159 238 252 -118 -111 -134 16 -67 -380 318 -319 319 -54 80 3 36 0 36 -117 365 132 117
7983 117 43 244 196 -121 229 -336 -32 79 155 -503 -144 283 114 214 250 46 188 44 -40 -167 27 265
8005 265 -10 351 345 247 113 257 499 325 353 109 251 189 214 250 98 -93 279 215 160 20 102 284 238 366
8029 366 -158 290 -36 212 242 -24 266 275 52 16 173 133 36 -231 -54 -280 26 283 -285 -6 95 44
8051 44 108 152 243 100 2 97 220 433 -167 26 77 -44 203 -19 -310 -460 205 69 -98 108 74 -296 189
8074 189 -133 105 -167 -195 -342 -219 -208 -50 117 -115 -256 50 138 -260 14 -374 240 9 25 -122 283
8095 283 -279 117 -163 -452 -193 118 -116 121 -211 -251 14 61 -193 124 -271 118 -200 -195 -173 29 -12 -103
8117 -103 -247 -158 67 -364 62 -139 -82 201 37 -22 73 95 -10 -432 -297 236 31 -230 -13 108 227 -3
8139 -3 -37 -74 90 121 -68 -219 -217 -89 222 73 -277 -262 -71 -175 -269 -448 -108 160 -264 -133 -208 -4 -279
8162 -279 -175 -119 -99 -79 -29 -125 -167 -371 -168 20 -284 -221 -246 12 46 27 86 -27 25 -83 -163 63 210 67
8186 67 -295 61 302 -137 -52
8191e2
##END NTUPLES=NMR FID
##END=
