##TITLE=1H_CG-1102-2
 CDCl3, 8 sc, 
 10.4.2019
##JCAMPDX= 6.0         $$ Bruker NMR JCAMP-DX V2.0
##DATA TYPE= NMR FID
##DATA CLASS= NTUPLES
##ORIGIN= UXNMR, Bruker Analytische Messtechnik GmbH
##OWNER= root
$$ XWIN-NMR		Version 3.5
$$ Wed Apr 10 13:49:08 2019 Russian Standard Time (UT+4h)  she@DPX200
##.OBSERVE FREQUENCY= 200.1315
##.OBSERVE NUCLEUS= ^1H
##.DELAY= (6, 6)
##.ACQUISITION MODE= SIMULTANEOUS
##.ACQUISITION SCHEME= undefined
##.AVERAGES= 8
##.DIGITISER RES= 18
##SPECTROMETER/DATA SYSTEM= spect
##.PULSE SEQUENCE= zg30
##.SOLVENT NAME= CDCl3
##.SHIFT REFERENCE= (INTERNAL, CDCl3, 0, 15.7039)
##AUDIT TRAIL= $$ (NUMBER, WHEN, WHO, WHERE, WHAT)
$$ ##TITLE= Audit trail, XWIN-NMR		Version 3.5
$$ ##JCAMPDX= 5.01
$$ ##ORIGIN= Bruker BioSpin GmbH
$$ ##OWNER= she
$$ F:/spectra/data/she/nmr/H-F/1/audita.txt
$$ ##AUDIT TRAIL=  $$ (NUMBER, WHEN, WHO, WHERE, WHAT)
(   1,<2019-04-10 13:47:50.10 +0400>,<she>,<DPX200>,
      <created by zg, POWCHK disabled, PULCHK disabled
       configuration hash MD5:
       00 E9 B6 7A A2 85 ED C7 34 08 36 98 17 FE 4E 26
       data hash MD5: 16K
       90 66 33 F1 E2 F4 CD F2 42 1A 2E BC C1 D2 EE B4>)
$$ ##END=
$$ 
$$ hash MD5
$$ 3F E7 51 7D 23 68 AF 55 CC 13 1D 9D 50 92 72 18
##$RELAX= 
##$RELAX= 
##$RELAX= 
##$RELAX= 
##$RELAX= 
##$RELAX= 
$$ Bruker specific parameters
$$ --------------------------
##$DU= <F:/spectra>
##$EXPNO= 1
##$NAME= <H-F>
##$PROCNO= 1
##$TYPE= <nmr>
##$USER= <she>
##$AMP= (0..31)
100 100 100 100 100 100 100 100 100 100 100 100 100 100 100 100 100 100 
100 100 100 100 100 100 100 100 100 100 100 100 100 100 
##$AQSEQ= 0
##$AQ_mod= 1
##$AUNM= <au_zg>
##$AUTOPOS= <>
##$BF1= 200.13
##$BF2= 200.13
##$BF3= 200.13
##$BF4= 200.13
##$BF5= 200.13
##$BF6= 200.13
##$BF7= 200.13
##$BF8= 200.13
##$BYTORDA= 1
##$CFDGTYP= 0
##$CFRGTYP= 5
##$CHEMSTR= <none>
##$CNST= (0..31)
1 1 145 1 1 1 1 1 1 1 1 1 1 1 1 1 1 1 1 1 1 1 1 1 1 1 1 1 1 1 1 1 
##$CPDPRG= <>
##$CPDPRG1= <>
##$CPDPRG2= <>
##$CPDPRG3= <>
##$CPDPRG4= <mlev>
##$CPDPRG5= <mlev>
##$CPDPRG6= <mlev>
##$CPDPRG7= <mlev>
##$CPDPRG8= <mlev>
##$CPDPRGB= <>
##$CPDPRGT= <>
##$D= (0..31)
0 1.2 0 0 0 0 0 0 0 0 0 0.03 0 0 0 0 0 0 0 0 0 0 0 0 0 0 0 0 0 0 0 0 
##$DATE= 1554889669
##$DBL= (0..7)
120 120 120 120 120 120 120 120 
##$DBP= (0..7)
150 150 150 150 150 150 150 150 
##$DBP07= 0
##$DBPNAM0= <>
##$DBPNAM1= <>
##$DBPNAM2= <>
##$DBPNAM3= <>
##$DBPNAM4= <>
##$DBPNAM5= <>
##$DBPNAM6= <>
##$DBPNAM7= <>
##$DBPOAL= (0..7)
0.5 0.5 0.5 0.5 0.5 0.5 0.5 0.5 
##$DBPOFFS= (0..7)
0 0 0 0 0 0 0 0 
##$DE= 6
##$DECBNUC= <off>
##$DECIM= 24
##$DECNUC= <off>
##$DECSTAT= 4
##$DIGMOD= 1
##$DIGTYP= 9
##$DL= (0..7)
0 120 120 120 120 120 120 120 
##$DP= (0..7)
150 150 150 150 150 150 150 150 
##$DP07= 0
##$DPNAME0= <>
##$DPNAME1= <>
##$DPNAME2= <>
##$DPNAME3= <>
##$DPNAME4= <>
##$DPNAME5= <>
##$DPNAME6= <>
##$DPNAME7= <>
##$DPOAL= (0..7)
0.5 0.5 0.5 0.5 0.5 0.5 0.5 0.5 
##$DPOFFS= (0..7)
0 0 0 0 0 0 0 0 
##$DQDMODE= 0
##$DR= 18
##$DS= 0
##$DSLIST= <SSSSSSSSSSSSSSS>
##$DSPFIRM= 0
$$ [...]
##$SUBNAM2= <"">
##$SUBNAM3= <"">
##$SUBNAM4= <"">
##$SUBNAM5= <"">
##$SUBNAM6= <"">
##$SUBNAM7= <"">
##$SUBNAM8= <"">
##$SUBNAM9= <"">
##$SW= 24.9337058887773
##$SWIBOX= (0..15)
0 0 2 0 0 0 0 0 0 0 0 0 0 0 0 0 
##$SW_h= 4990.01996007984
##$TD= 16384
##$TD0= 1
##$TE= 0
##$TE2= 300
##$TE3= 300
##$TEG= 300
##$TL= (0..7)
0 120 120 120 120 120 120 120 
##$TP= (0..7)
150 150 150 150 150 150 150 150 
##$TP07= 0
##$TPNAME0= <>
##$TPNAME1= <>
##$TPNAME2= <>
##$TPNAME3= <>
##$TPNAME4= <>
##$TPNAME5= <>
##$TPNAME6= <>
##$TPNAME7= <>
##$TPOAL= (0..7)
0.5 0.5 0.5 0.5 0.5 0.5 0.5 0.5 
##$TPOFFS= (0..7)
0 0 0 0 0 0 0 0 
##$TUNHIN= 0
##$TUNHOUT= 0
##$TUNXOUT= 0
##$USERA1= <user>
##$USERA2= <user>
##$USERA3= <user>
##$USERA4= <user>
##$USERA5= <user>
##$V9= 5
##$VALIST= <valist>
##$VCLIST= <CCCCCCCCCCCCCCC>
##$VD= 0
##$VDLIST= <DDDDDDDDDDDDDDD>
##$VPLIST= <PPPPPPPPPPPPPPP>
##$VTLIST= <TTTTTTTTTTTTTTT>
##$WBST= 1024
##$WBSW= 4
##$XGAIN= (0..3)
0 0 0 0 
##$XL= 0
##$YL= 0
##$YMAX_a= 466638
##$YMIN_a= -713550
##$ZGOPTNS= <>
##$ZL1= 120
##$ZL2= 120
##$ZL3= 120
##$ZL4= 120
##$ABSF1= 10
##$ABSF2= 0
##$ABSG= 5
##$ABSL= 3
##$ALPHA= 0
##$AQORDER= 0
##$ASSFAC= 0
##$ASSFACI= 0
##$ASSFACX= 0
##$ASSWID= 0
##$AUNMP= <proc_1d>
##$AZFE= 0.1
##$AZFW= 0.1
##$BCFW= 1
##$BC_mod= 2
##$BYTORDP= 1
##$COROFFS= 0
##$CY= 11.3945322036743
##$DATMOD= 1
##$DC= 2
##$DFILT= <>
##$DTYPP= 0
##$F1P= 18.9103706918063
##$F2P= -1.10871071338519
##$FCOR= 0.5
##$FTSIZE= 0
##$FT_mod= 4
##$GAMMA= 1
##$GB= 0.15
##$INTBC= 1
##$INTSCL= 1
##$ISEN= 128
##$LB= 0.24
##$LEV0= 0
##$LPBIN= 0
##$MAXI= 10000
##$MC2= 0
##$MEAN= 0
##$ME_mod= 0
##$MI= 1.114404
##$NCOEF= 0
##$NC_proc= 0
##$NLEV= 6
##$NOISF1= 3.799351
##$NOISF2= 2.8
##$NSP= 1
##$NTH_PI= 0
##$NZP= 0
##$OFFSET= 15.70392
##$PC= 1
##$PHC0= -8854.761
##$PHC1= 18.80026
##$PH_mod= 1
##$PKNL= yes
##$PPARMOD= 0
##$PSCAL= 0
##$PSIGN= 0
##$REVERSE= no
##$SF= 200.130013532006
##$SI= 16384
##$SIGF1= 3
##$SIGF2= 2
##$SINO= 400
##$SIOLD= 16384
##$SREGLST= <1H.CDCl3>
##$SSB= 0
##$STSI= 0
##$STSR= 0
##$SW_p= 3612.71676300578
##$SYMM= 0
##$S_DEV= 0
##$TDeff= 0
##$TDoff= 0
##$TI= <>
##$TILT= no
##$TM1= 0
##$TM2= 0
##$TOPLEV= 0
##$USERP1= <user>
##$USERP2= <user>
##$USERP3= <user>
##$USERP4= <user>
##$USERP5= <user>
##$WDW= 1
##$XDIM= 8192
##$YMAX_p= 0
##$YMIN_p= 0
$$ End of Bruker specific parameters
$$ ---------------------------------
##NTUPLES= NMR FID
##VAR_NAME=  TIME,          FID/REAL,        FID/IMAG
##SYMBOL=    X,             R,               I
##VAR_TYPE=  INDEPENDENT,   DEPENDENT,       DEPENDENT
##VAR_FORM=  AFFN,          ASDF,            ASDF
##VAR_DIM=   8192,          8192,            8192
##UNITS=     SECONDS,       ARBITRARY UNITS, ARBITRARY UNITS
##FACTOR=    0.0002004,     1,               1
##FIRST=     0,             0,               0
##LAST=      1.6414764,     0,               0
##MIN=       0,             -713550,         0
##MAX=       1.6414764,     466638,          0
$$ Real data points
##PAGE= N=1
##DATA TABLE= (X++(R..R)), XYDATA
0@%%%qJ6j6J6k4M0m9O5q8J05j29J60j93K33k79L29l88M58n34O21p21Q27r47J086
27E80j237J401j585J789k012K258k531K828l151L508l902M333m805N322n895O528
43C429p225Q004q874R850j0958J2225j3688J5401j7440J9914k2991K6947l2243
56a7649L9748n1310P1645j17919M08998N8752o69441J71142L88939J83733k29746
67B36892q0656P1070K5300j96975n9211J45896J10741j63995j00776J71909J87200
78C47395k06309l63765l3636L65190K45763j72214l08371o804J95829K6866j79981
89i0037m9966J61943J15143q7849j21303j3353J0121o9509k3606J61645J83988
100A77217r3935l06998j20566K10864K17984n3407j78609k2426J27127M7499j13312
$$ plain form
0 0 0 0 0 -8 8 -8 8 -16 24 -25 40 -48 57 -72 88 -105 128 -151 178 -210 248 -286 335 -386 441 -506 580
27 580 -657 744 -841 948 -1064 1194 -1337 1491 -1660 1848 -2054 2279 -2526 2796 -3099 3429
43 3429 -3796 4208 -4666 5184 -5774 6451 -7237 8164 -9276 10638 -12353 14594 -17649
56 -17649 22099 -29211 42434 -75485 333513 392265 -277176 -106034 282905 466638 236892
67 236892 156236 227306 252606 55631 -3580 142316 253057 89062 -11714 160195 347395
78 347395 141086 -222679 -256315 108875 354638 182424 -125947 -132751 63078 89944 -90037
89 -90037 -140003 21940 137083 49234 -72069 -85422 -75301 -144810 -168416 -6771 177217
100 177217 83282 -223716 -344282 -133418 84566 31159 -147450 -169876 -42749 4750 -108562
111a08562r7605N7513J08786J4667l3654R916n528q7977p0337P2277J52028M8923
123F0447j14342j26889K1684J10998J8503q1824j8075R0874N9752o1042r1249
134a31163m39P6084M3296k4360r856M6558J4412o3222l9366N4167O8070l093l3009
147a921Q588L2613j3101o3893j9849Q2935R1214k4212r8106l5930N0765M9732
159E8835m600k4764J048K4099p81l0056m045L3301P646k8637L586M7711J5022
172I8365n0941n0488J7989O6373K7287m7865m8029J9668L6721j4912l4815M842
184B4195K7769Q253j3030j3232p004p006r359Q030L9596K4312m0756o2130j163
197b1525N6515M1849j3375m7109k6651K3969L7119m828l2388j4340N575R998J6690
$$ plain form
111 -108562 -206167 -148654 -39868 -25201 -58855 -48939 -54467 -142444 -212781 -140504 11524 60447
123 60447 -53895 -180784 -159100 -48102 -29599 -111423 -129498 -38624 21128 -39914 -131163
134 -131163 -131602 -55518 -12222 -36582 -46438 120 14532 -48690 -88056 -33889 34181 31088 -1921
147 -1921 6667 39280 26179 -37714 -57563 25372 116586 92374 -5732 -41662 9103 58835
159 58835 54235 29471 30519 54618 53837 23781 19736 53037 60683 32046 35632 83343 98365
172 98365 47424 -3064 14925 81298 108585 60720 12691 32359 69080 54168 19353 24195
184 24195 51964 60217 47187 33955 26951 19945 10586 18616 58212 82524 41768 -20362 -21525
197 -21525 34990 76839 63464 16355 -10296 13673 50792 45964 13576 -764 4811 14809 31499
210C1499Q176k8487m7272j4431L9469N6963P875o5146o7625J5010O9383L1229
222C6643l1387m5167j4324K3568L4806J528l5077k8526N840L1838L4381o24n4509
235d1010n6085J2080O8210M6648k3525p1019m4693L3940O6414J0995m9299l4795
247h2139J4207L7127K1394j6611m2008j9566K9949N0523K4215k6825o2268l4078
259a06080M4048P3934J2996n2630m8730L981M6023L3969k0375m8502r288M0038
271c0616L9505J727l4173m2966p384M8302N7054Q393m1013m7309o069M8012N3346
284D6809l635m4927j8305K4777L0343O441j9971k5957J315L2595K7381j632k5035
297C0199l1650r735L3282M4336K938l3919k7781K50K3999K4396l322k3603o199
$$ plain form
210 31499 39675 11188 -36084 -50515 -11046 45917 53792 -11354 -78979 -63969 5414 36643
222 36643 5256 -39911 -54235 -30667 4139 5667 -29410 -57936 -52096 -20258 14123 13499 -41010
235 -41010 -97095 -85015 -16805 29843 6318 -64701 -109394 -75454 -9040 1955 -47344 -82139
247 -82139 -67932 -30805 -9411 -26022 -68030 -87596 -57647 -7124 17091 -9734 -72002 -106080
259 -106080 -62032 11902 24898 -27732 -76462 -72481 -26458 7511 -12864 -61366 -70654 -30616
271 -30616 8889 10616 -23557 -66523 -73907 -25605 31449 39842 -1171 -48480 -54549 -6537 46809
284 46809 43174 -1753 -20058 4719 35062 41503 21532 -4425 -3110 29485 56866 55234 30199
297 30199 -1451 -11186 22096 66432 69370 35451 7670 7920 31919 56315 52993 29390 23191
310B3191J7431J3535k739j1648j6653m822K0376K4515j15k3758k8458j1967K3012
323B1900L5140k16l4927k3252Q931K0684J0427j1099k3899n728K0707J8386l125
336C3929j7912k1534q311K3517L2756r19l3813k7684K217K6410K3224j1215l6175
349a5510j4169K0197J8261n255k0858j8826j81K1051J4507j1386k0848j0609K592
362d1034J7405J7165q263k5664o559J6554J3812j890j3248j2548P354J8821O14
375a7481j7399p488O900O773K702j492q628l414Q753M596n416l240J230L107R820
390b0677N712j0725j0599J0820J8107M547q282j3047j755J9429J9035j0818k4380
403b2633k436J7787J7729L144j7678k2418M200K8703J7099j0701k3689j4117J4486
$$ plain form
310 23191 40622 54157 51418 39770 23117 18295 38671 63186 63071 39313 10855 -1112 21900
323 21900 57040 56824 21897 -1355 7576 28260 38687 27588 3689 -2039 18668 37054 33929
336 33929 16017 -5517 -13828 9689 42445 41526 7713 -19971 -17754 8656 31880 20665 -15510
349 -15510 -29679 -9482 8779 3524 -17334 -36160 -36341 -15290 -783 -12169 -33017 -43626 -41034
362 -41034 -23629 -6464 -14727 -40391 -46950 -30396 -16584 -18474 -31722 -44270 -36916 -18095 -17481
375 -17481 -34880 -42368 -35468 -28695 -25993 -27485 -36113 -39527 -30774 -26178 -31594 -34834 -33604 -30497 -20677
390 -20677 -14965 -25690 -36289 -25469 -7362 -2815 -11097 -24144 -25899 -6470 12565 1747 -22633
403 -22633 -25069 -7282 10447 13591 -4087 -26505 -22305 6398 23497 12796 -10893 -25010 -10524
416a0524L6207J4319k8798l2015O629L6160K8553o253l6761k4024K5355M5136
428E3984J1263k9645l4456n553L2772L9229l633m4336k9955J6252M0852K4580
440G1354k0295m8237j9088L7124M5911M27m0024l6224M190M3662L3903j9361m7716
453E626j9550K5468L8308J3346k9094m4755o629L8016L1019j0829l7586k8264
465b4924Q719L8188J9739k6773l9056p288K5177K8881L842l0091l1765O668L3166
478D483J7624j2613k7327j6977J2408K9541Q481k4483k4418k5J6964J6722r93
491f13k3019k0242O854J8768O744o868j5004j2686N876J8598N337j0411r614j752
505c8032N084J2199N527r454q295L503N816M288M413k482r744j704P184O304L975
$$ plain form
416 -10524 25683 40002 11204 -20811 -14182 21978 50531 44278 7517 -16507 8848 53984
428 53984 65247 35602 1146 -4407 28365 67594 63961 19625 -10330 5922 46774 71354
440 71354 51059 2822 -16266 20858 66769 67196 27172 -9052 -4862 38800 72703 53342 5626
453 5626 -13924 11544 49852 63198 34104 -10651 -17280 20736 51755 40926 3340 -24924
465 -24924 -16205 21983 41722 14949 -24107 -31395 -6218 22663 26505 -3586 -35351 -28683 4483
478 4483 22107 9494 -17833 -34810 -22402 7139 15620 -8863 -33281 -33306 -16342 380 -613
491 -613 -23632 -43874 -37020 -18252 -11508 -18376 -33380 -46066 -40190 -21592 -16255 -26666 -36280 -38032
505 -38032 -32948 -20749 -15222 -24676 -32971 -29468 -23652 -19364 -14951 -17433 -27177 -28881 -21697 -15393 -11418
520a1418p77r583o735Q669J2198J918m594n975l877P354J5176K367j0220n201
534a0698M448R378J1575K105j3575r151R060J3917O286l768j3836q745J0615J7461
548B5072q49j2746q185P77J0044J3152k299j6843o822J0560J4023N945o464j4232
562A1133n345J4425J5948o52j0419p765j331J0235J3614m035j5607n467O312P517
576B8563M670m421j4610o882Q646R607K51n336r062o167O749J0443k332p981l551
591H587j272O59O701J741r448p309J761L141L698O35r675j0840J319O931J804
606a567j578o525j0785r48J0687M696p767p268j634K241Q134N921p744j2332j51
621b6620Q751R533K395j0593j4213K491J3816N238o155p582p204J821J2612O048
$$ plain form
520 -11418 -12195 -21778 -28513 -19844 -7646 -5728 -10322 -16297 -20174 -12820 2356 4723 -5497 -10698
534 -10698 -6250 3128 14703 16808 3233 -5918 3142 17059 23345 19577 5741 -3004 7611 25072
548 25072 24223 11477 3292 4069 14113 27265 24966 8123 1301 11861 25884 31829 25365 11133
562 11133 5788 20213 36161 35509 25090 17325 15994 26229 39843 35808 20201 14734 21046 28563
576 28563 33233 28812 14202 7320 15966 25573 25824 20488 11426 5259 12008 22451 20119 12138 8587
591 8587 7315 7974 14675 16416 6968 -341 1420 4561 8259 8894 -781 -11621 -10302 -3371 -1567
606 -1567 -3145 -9670 -20455 -21403 -10716 -6020 -13787 -21055 -22689 -20448 -12314 -6393 -14137 -26469 -26620
621 -26620 -17869 -8336 -5941 -16534 -30747 -28256 -14440 -9202 -15357 -22939 -30143 -28322 -15710 -9662
635i662j3169j3733K299J1209R570O24j2672j1879N161J4481P047j886p828q623
649b9061N350J6064L963j1036p327L501O701Q281K349j0355r606L949J1022O915
663G10K28p051p608L403J0719K383k400J238j089q94P372O282l414m459K332M603
679A2355N419N945l299q652k333N852O137N558k378j1164n512Q445P655j690l001
694A9337m517m587O063J2558L73j3472q669N698J3917R457q162j6779l093J2779
708B0903R594m85o680j1684m367J2858J3035q105j9296p729Q135J4949N425j5141
722A1412k1400j363J6949J2244l022j6935j4749M230J9935P434j4550j6046k799
735a8660Q636J4283M113j6687k0187J971J8164R735p708j7636r008J0904J4849
$$ plain form
635 -9662 -22831 -36564 -34265 -23056 -13486 -12862 -25534 -37413 -32252 -17771 -10724 -12610 -20438 -29061
649 -29061 -23711 -7647 -3684 -14720 -22047 -18546 -11845 -3564 -1215 -11570 -21176 -17227 -6205 710
663 710 938 -6113 -13721 -10318 401 2784 384 1622 533 -361 7011 13293 9879 5420 7752 12355
679 12355 17774 23719 20420 11768 9435 15287 21424 26982 24604 13440 7928 16373 24028 22338 19337
694 19337 14820 10233 16296 28854 29227 15755 7086 12784 26701 36158 27996 11217 8124 20903
708 20903 30497 30012 23332 11648 7281 20139 33174 25069 5773 -1956 6179 21128 26553 11412
722 11412 -9988 -11351 5598 17842 14820 -2115 -16864 -12634 7301 14735 185 -15861 -18660
735 -18660 -10024 4259 8372 -8315 -28502 -26531 -8367 1368 -6340 -23976 -32984 -22080 -7231
748g231m313j4927n227M673P805O657k465j4893n618J2998J3640j64r675q623
762b7363J969J3947P682r003j0488J443Q898Q310L99j2054j1155R088J6397O90
776a240j1266o025K669P435O640l284q950K00R937P512n07p262q183N245J7668
791A0589O717j1370j0475J982R658R516Q34j3292r944J0239J6976J144j4556j2017
805c999K583J8247J3655r044j8384m289J1526J3752O925r044j8483j954K1269
818B2760J5876q553j9180r522J1279K1314O236j8268j9940J087J5085J3534j427
831C0281j9239j6313Q634K1236L784j6193j4391q80J3736J6083l135k1306j1879
844i582J1198J8410O341j2903k0104l433J9419J4040p946j6837r578L971J4289
$$ plain form
748 -7231 -11544 -26471 -31698 -27025 -19220 -12563 -15028 -29921 -35539 -22541 -8901 -9065 -18740 -27363
762 -27363 -25394 -11447 -3765 -12768 -23256 -21813 -12915 -4605 -4206 -16260 -27415 -18327 -1930 -1240
776 -1240 -12506 -18531 -15862 -8427 -1787 -5071 -14021 -13821 -3884 3628 3121 -4141 -12324 -7079 10589
791 10589 17306 5936 -4539 -2557 7101 16617 17451 4159 -5785 4454 21430 22574 8018 -3999
805 -3999 -1416 16831 30486 21442 3058 -1231 10295 24047 30972 21928 3445 1491 22760
818 22760 38636 30083 10903 1381 12660 33974 40210 21942 2002 3089 18174 31708 30281
831 30281 11042 -5271 3363 24599 28383 12190 -2201 -3081 10655 26738 23603 2297 -9582
844 -9582 1616 20026 26367 13464 -6640 -10073 9346 23386 15440 -1397 -10975 -7004 7285
857G285J0698j1159k2049n084J4488J2524j752j4615j2646L781J5078N029j0265
870h687j0045k122O734J1446J352j4388j0793P201J1336R60o096q204l916O157
884a9065Q621k758r212m532K097P383N895n475j2386r38J0937N567k034l395l130
899b2425J56P210M237m352l312L837L642K582J66o022l057P285N660j883k908
914i184q63k028K494O902m27o170M89N938K208q9j187k156J806O678K554j992
930D973K33M66q81M137N026k688k896M296K640k439o71Q45q93J852L572j478k234
947A3860J321M01l68K979J881k403Q74K784j641j474L608Q86l383J305K406j528
963B1508o68Q62k567k404J735J056j679k96k810n647N99N206j912m975p41j33
$$ plain form
857 7285 17983 6824 -15225 -20309 -5821 6703 4951 -9664 -22310 -18529 -3451 1578 -8687
870 -8687 -18732 -20854 -14120 -2674 -1322 -15710 -26503 -19302 -7966 -7006 -13102 -21306 -25222 -19065
884 -19065 -10444 -13202 -22414 -26946 -24849 -17466 -11571 -17046 -29432 -30370 -19433 -13866 -15900 -19295 -22425
899 -22425 -22269 -15059 -10822 -15174 -18486 -14649 -11007 -8425 -8259 -14281 -17338 -10053 -4393 -6276 -9184
914 -9184 -10047 -12075 -9581 -2679 -3106 -9276 -8787 -2849 -641 -730 -1917 -4073 -2267 4411 6965 4973
930 4973 5206 5672 4791 8928 13954 11266 8370 12666 15306 12867 12196 13041 12148 14000 17572 16094 13860
947 13860 15181 15582 15214 18193 20074 17671 18545 21329 19688 18214 21822 22708 19325 20630 23036 21508
963 21508 20840 21702 19135 16731 18466 19522 17843 17547 14737 9090 9689 14895 12983 8008 7267 7134
979G134k87K443m28o107k233M523K900j153k408n493k787M544M598l691n343q69
995d657j314R24L229l554p826j46N211O24l265l816m402J73O318J356n188k860
1011a9193M69L27K770K121m710l727M048M332k063l303k417j392L868N165k523
1026a6228o472MK671J491N67m70l553K125M931n03k918J171K017O66L894L063
1042g544l650j679M382L327J111K64j341m99M763L621m701k953L950L683J005
1057C739L6k882k330N086O056j884l364J259J480L022M266q59n210R58O325K859
1073A8557l3j658m329M58Q098L119n547m316J604K543K573P54n815l529M790M810
1089B2079k784k875j379k22L480M447l768n538R41M465O06j156k730m612J866
$$ plain form
979 7134 6847 9290 8862 2755 522 5045 7945 6792 4384 -1109 -3896 648 5246 1555 -3788 -4657
995 -4657 -5971 -5047 -1818 -5372 -13198 -13344 -8133 -7509 -10774 -14590 -18992 -18819 -12501 -11145 -16333 -19193
1011 -19193 -18724 -18397 -15627 -13506 -18216 -21943 -17895 -13563 -15626 -18929 -21346 -22738 -18870 -13705 -16228
1026 -16228 -22700 -22696 -20025 -18534 -17967 -18437 -21990 -19865 -14934 -15437 -18355 -17184 -15167 -14501 -10607 -7544
1042 -7544 -11194 -12873 -8491 -5164 -4053 -3789 -5130 -5629 -866 2755 -1946 -4899 -949 2734 3739
1057 3739 3775 893 -1437 3649 9705 7821 4457 5716 7196 10218 14484 13625 8415 9373 15698 18557
1073 18557 18524 16866 12537 12995 21093 24212 18665 14349 15953 18496 21069 21823 16008 12479 17269 22079
1089 22079 19295 16420 15041 14819 18299 22746 18978 13440 14381 18846 19452 18296 15566 10954 12820
1104A2820N939j141o744l670J191K149J662k755q185k546O297K699m862n453l584
1119f183R55O337K908q238p821K095O655L448k171q993o592O896J0775j886j1096
1134a2911o836Q32Q380P854n542j5217l878R816R441n80r537j1383J72J5121R568
1149d700q499j4531l955Q495J5172N453j4110j5877L384J8365R663n597j5014
1162b1751r641R392J9509M221j5307j3788J408J3744J4644j465j8370j0163J1253
1175a6314J8059N205r084j4292l383J6119J7864l464j6212p817P607J6652R427
1188B0367q314j7471k059J6215J3536j400j3136j1493L798J8237R990j1523j4907
1201A840j134J0714J3225K015j2147j2333N344J4837N981n613j0359n777P754
$$ plain form
1104 12820 18759 17618 10874 7204 8395 10544 12206 9451 1266 -1280 5017 7716 2854 -2599 -6183
1119 -6183 -5228 1109 4017 -4221 -12042 -9947 -3292 156 -2015 -11008 -17600 -10704 71 -1815 -12911
1134 -12911 -19747 -18915 -10535 -2681 -8223 -23440 -27318 -17502 -8061 -8641 -18178 -29561 -29389 -14268 -4700
1149 -4700 -13199 -27730 -31685 -23190 -8018 -2565 -16675 -32552 -29168 -10803 -1140 -6737 -21751
1162 -21751 -31392 -22000 -2491 1730 -13577 -27365 -25957 -12213 2431 966 -17404 -27567 -16314
1175 -16314 1745 6950 -2134 -16426 -19809 -3690 14174 10710 -5502 -13319 -5712 10940 20367
1188 20367 12053 -5418 -7477 8738 22274 20874 7738 -3755 43 18280 28270 16747 1840
1201 1840 706 11420 24645 26660 14513 2180 7524 22361 28342 22729 12370 6593 14347
1214A4347J3524Q25j2149p366L232Q207N726l295j1663m999Q738P710l263p349
1228A2225m826Q66O944L604p063p432J693N010K452j330n071n637L188P473j740
1243A0356p166l492R23L055K858m099q869j758O615L273l569o575n373J179Q322
1258d320K448r571p119K577N348K810n76p385n592N434Q780L98o849o119p19O408
1274a4047Q019k820j0597l193N271N421K780l040r989k004R784Q061l777p768
1288a7899l903K185R625O586n014r143q13O405O612M000m250q740N58R723N444
1303A376k136m379m068oP801P107l600p217k331K919P326N325l297q635Q91O901
1319C977M307J614j637o205r19Q900O620k478n505k503Q13P275O726k810q708
$$ plain form
1214 14347 27871 28696 16547 9181 12413 20620 26346 23051 11388 6389 15127 22837 19574 12225
1228 12225 7399 8265 15209 18813 11750 4318 6011 11021 13473 12143 7072 1435 4623 12096 10356
1243 10356 3190 -302 621 3676 6534 2435 -6434 -8192 -1577 1696 -1873 -8448 -13821 -12642 -4320
1258 -4320 -1872 -11443 -18562 -15985 -10637 -7827 -8403 -15788 -21380 -15946 -7166 -6768 -13617 -19736 -20455 -14047
1274 -14047 -6028 -8848 -19445 -22638 -17367 -11946 -9166 -12206 -22195 -24199 -14415 -6354 -10131 -17899
1288 -17899 -21802 -19617 -9992 -3406 -8420 -17563 -18376 -11971 -5359 -1359 -5609 -14349 -13791 -4068 1376
1303 1376 -760 -5139 -9207 -9213 -1412 5695 2095 -5122 -7453 -4534 2792 8117 4820 -3815 -2924 3977
1319 3977 8284 9898 8261 2056 1137 10037 16657 14179 8674 6171 6984 14259 20985 18175 9467
1334I467k632L499P018N150l937j1320k234R617O896j939n589n987r28Q888Q154
1349B4123l453j0232l520L479Q595M978o161j1312j389P871N880L2o116j0545
1363B230q33J1357O845p599j0521m083M637Q271L227p971j0819l88P027N465J250
1378H095p510r928O05J0476M402n744p070m635Q96P335M459p175q771j159M219
1393a1505L962O46n683o159J115M411L25p37r52m514j557O339L508m681l499P47
1409a8234K071K156K053j782l272L28J577J250L509l52n586k282M905L323K95
1424a0041K79l170m305M038Q710J060n188l656L86N222O961J482o043m345K732
1439e878N068O870J856q492o622O585J0748J145n633n090k306O656R411k41q658
$$ plain form
1334 9467 6835 10334 17352 22502 18565 7245 5011 14628 21524 19585 13996 8009 7081 15969 24123
1349 24123 20670 10438 6918 10397 18992 23970 17809 6497 5108 12979 18859 18891 12775 2230
1363 2230 1397 12754 19599 12000 1479 -2604 2033 10304 13531 5560 -5259 -5647 1380 6845 8095
1378 8095 585 -9343 -8738 1738 6140 396 -6674 -11309 -10413 -3078 1381 -5794 -14565 -15724 -11505
1393 -11505 -7543 -6897 -12580 -18739 -17624 -13213 -12888 -13625 -14577 -19091 -20648 -14309 -10801 -15482 -18981 -18234
1409 -18234 -16163 -14007 -11954 -13736 -17008 -16680 -15103 -13853 -10344 -10696 -16282 -18564 -13659 -10336 -10041
1424 -10041 -9762 -12932 -17237 -13199 -4489 -3429 -8617 -12273 -11887 -6665 296 1778 -4265 -8610 -5878
1439 -5878 -810 6060 7916 -576 -7198 -613 10135 11280 5647 557 -1749 4907 14318 14077 5419
1454E419n504L501Q336O991k843j0826k688Q619Q279J51l699o277k810P189J0253
1469B4091j760r439l844K827P017M532m320q660j088N483L270j022k646m986j765
1484G690O512K798n145l540J275O64M20J867j847l606l19J387l60K95j006l514
1500C571n73K349k071k556K166N59n628l129K856K244J32j952n424m619M145P332
1516e98q5o541p045k071P823Q926l074j1767m745N014O990M563m323j2181n455
1531b4569J0026J0925r10j0925j0227Q02J3425R853o771j4534m704Q461J3030
1544f118N805j0893j6743R98J7826J2517n557j4599r197O258J8476Q557j0557
1557c227j6234k633J1609J5756L650j5434j5508N681J9135Q648p241j3604p559
$$ plain form
1454 5419 -85 3416 11752 18743 15900 5074 2386 11005 19284 19435 15736 9459 6649 13838 24091
1469 24091 22331 12892 9048 11875 18892 23424 19104 10444 9356 14839 18109 17087 14441 9455 7690
1484 7690 14202 17000 11855 8315 9590 10254 10674 12541 10694 7088 6769 8156 7796 8091 7085 3571
1500 3571 2998 5347 3276 720 2886 3445 -2183 -5312 -2456 -212 -80 -2032 -7456 -12075 -7930 -598
1516 -598 -683 -7224 -14269 -16340 -8517 409 -2665 -14432 -19177 -14163 -7173 -2610 -6933 -19114 -24569
1531 -24569 -14543 -3618 -4528 -15453 -25680 -24878 -11453 -1600 -8371 -22905 -27609 -19148 -6118
1544 -6118 -313 -11206 -27949 -26951 -9125 3392 -2165 -16764 -25961 -19703 -1227 7330 -3227
1557 -3227 -19461 -22094 -10485 5271 8921 -6513 -22021 -16340 2795 11443 4202 -9402 -16961
1570a6961R660J8722M857j3819j3532K348J4588J2660k420j5873q539J0647J5011
1583A7349L566p899j2237m430J2125J5629j302j4393q758L983J0825Q505l649
1596A9314j2365m599P356R461J877n522q747j255R914P512m657p739j652J607
1610A0505M474L366k204o632j284L709J244p17k103l535k0L712o31l825o42K30
1626E647j806l29K071j564j790Q98j743l797M52M247N69k437l661l839J389N051
1642f42O37n627l741r1J251L399J047o831o155L662O756R48m346o405l180N133
1658a4185Q362p09p209m580P19N126O664j335j0036l982O635P785O03m618p765
1673a8525l402Q003J0183o65q482o235j93P731Q952j046r282l931M698O775M117
$$ plain form
1570 -16961 -7301 11421 16278 2459 -11073 -8725 5863 18523 16103 230 -8309 2338 17349
1583 17349 20915 13016 779 -3651 8474 24103 22801 8408 -350 3633 14458 22963 19314
1596 19314 6949 2350 9706 19167 21044 15522 6775 5520 15434 22946 18289 10550 8898 10505
1610 10505 14979 18345 16141 9509 8225 11934 13178 12461 10358 6823 6803 10515 9884 6059 5417 5647
1626 5647 3841 3512 5583 4019 2229 3127 1384 -2413 -1961 2286 2855 418 -3243 -7082 -5693 -642
1642 -642 -5 -5632 -9373 -9464 -8213 -4814 -3767 -10598 -16753 -13091 -6335 -5387 -9733 -16138 -19318 -14185
1658 -14185 -5823 -6532 -13741 -18321 -17602 -12476 -5812 -7147 -17183 -21165 -14530 -6745 -6142 -10760 -18525
1673 -18525 -21927 -13924 -3741 -4406 -12888 -19123 -19316 -11585 -2633 -3679 -12961 -16892 -12194 -5419 -1302
1688a302j678p310l059O928Q878N66n309n216r58O933Q833k38p455m491J710N986
1704B818P157q01q483m020O377P641J647l146o730l121P508J0846L34p701o411
1719C915j48P378R780m44r861n936L151P977N074j914j0013o001O922J0801Q40
1734B1521p893q664j929Q193J0367j565j1093o431K066Q249O498k765j1399n591
1748d36O888Q942J625o968r598l744Q583J0562k660j1310p729J304Q388P148m031
1763F964j1643n042N826N663J732l836q296l310O422O448j800o357n421m35O367
1778f718O332k718r315l380L627M212K972l161o622k685M666L777n44k064l555
1793a5176k565L350N979k55m656l064o69L418O730P63o229m572J721M353M710
$$ plain form
1688 -1302 -2980 -10290 -13349 -6421 2457 3023 -2286 -7502 -8460 -1527 7306 7068 -387 -4878 -3168 2818
1704 2818 9975 9174 691 -3329 3048 10689 12336 9190 2460 -661 6847 17693 18027 10326 3915
1719 3915 3767 11145 20925 20481 10620 4684 7835 15812 20886 18972 8959 2958 9880 20681 21521
1734 21521 13628 4964 3035 11228 21595 20030 8937 2506 4572 12821 19319 16554 5155 -436
1748 -436 6452 15394 17019 10051 453 -3291 5292 15854 13194 1884 -5845 -4541 3847 10995 6964
1763 6964 -4679 -9721 -3895 1768 3500 -336 -8632 -11942 -5520 928 -872 -7229 -12650 -13085 -6718
1778 -6718 -386 -3104 -12419 -15799 -12172 -7960 -4988 -8149 -14771 -17456 -12790 -9013 -9557 -11621 -15176
1793 -15176 -17741 -14391 -8412 -8667 -13323 -16387 -17056 -13638 -6908 -6145 -12374 -16946 -15225 -10872 -6162
1808f162J623m925n901J951O570L334o39m401m849K350Q880L489m923o028r77
1823a0608M416Q975L326p202p984K196Q144O593Q17p355o939L665J0827M281n217
1838G935p230k601O248J0279J836r307p724K746Q276O800o96q949p023N247J0055
1853A5892K807m893o288k827N684Q791o69q097m705L294N889M285k382q644l947
1868D190N828O168n03m447m373k026M131M617k507m541j526J453P31J800j421
1883G574m436j182K614J133r75J2k211l055Q34J352q55N19L17l501l917Q78K751
1900b148P63k04l885n218J217O119N49m753m462j315L055O492Q96q912o352K560
1916a5598P435M737j478r541o226M979J0484K248o952q095k053P558J0582j627
$$ plain form
1808 -6162 -4539 -9464 -15365 -13414 -6844 -3510 -4149 -8550 -13399 -11049 -2169 1320 -3603 -9631 -10608
1823 -10608 -6192 2783 6109 -1093 -9077 -6881 1263 7856 8673 1318 -5621 -1956 8871 13152 7935
1838 7935 705 -1896 4352 14631 16467 7160 -564 2182 10458 17258 16562 7613 590 5837 15892
1853 15892 18699 13806 7518 4691 10375 19166 18497 10400 5695 8989 14878 19163 16781 8137 4190
1868 4190 10018 16186 15683 11236 6863 4837 8968 13585 11078 6537 5011 6464 7195 8995 7574
1883 7574 3138 1956 4570 5703 4728 4740 2529 -526 308 1660 805 1324 1641 -1860 -5777 -4899 -2148
1900 -2148 -1385 -1589 -5474 -10692 -9475 -3356 -2807 -7560 -12022 -13337 -10282 -3790 -2894 -11806 -18158 -15598
1916 -15598 -8163 -3426 -4904 -14445 -20671 -15692 -5208 -2960 -9912 -18007 -20060 -12502 -1920 -3547
1930c547j2183o673N681J0677O131n379j2728m565J0622J2869M1q944r510L46
1944a7162J2321J0192m231j2946m024P316J1622N239p434j3882o80J3181J1539
1957A1051k320j0463q712L036J3491Q574o403j1939k456P719J0709L869q709j0963
1971c516J842J2331P194k853q697o741L327J1677N416o514q730j790N529Q059
1985A6534J691p452o858K622O864L110j419n876m843K726P860J800n073m604p28
2000F354J889M401J177l821l894L59J589J207P57k591m125L84K505j49r91n87
2016D464l238k280K863K172r73k326k313j703J084L347r5l710k006j234N34L849
2032a565J116n754m224K460L302P83j134m591m078K576N813P76m357m736j750
$$ plain form
1930 -3547 -15730 -22403 -16722 -6045 86 -5293 -18021 -22586 -11964 905 946 -7998 -17508 -17162
1944 -17162 -4841 5351 1120 -11826 -15850 -8534 3088 8327 893 -12989 -13669 -488 11051
1957 11051 8731 -1732 -10444 -7408 6083 14657 8254 -3685 -6141 1578 12287 16156 7447 -3516
1971 -3516 -1674 10657 17851 14998 6301 -440 2887 14564 19980 13466 4736 2946 8475 16534
1985 16534 18225 10773 3915 6537 13401 16511 15092 9216 4373 7099 14959 16759 11686 7082 6354
2000 6354 8243 12644 13821 10000 6106 6465 8054 9261 10018 7427 3302 3686 6191 6042 5051 4464
2016 4464 1226 -1054 1809 3981 3008 682 -1631 -3334 -2250 1097 1002 -2708 -4714 -5948 -5414 -1565
2032 -1565 -449 -6203 -10427 -7967 -4665 -3882 -5016 -9607 -13685 -11109 -5296 -4520 -8877 -13613 -15363
2047a5363L218O354K29o785l671J784L824L594O76o009n407L726O995K513l726
2062h048n349k467M763O684P02n260l348n0L675O024L86n814l830L557M866J891
2078a618m80l192l265L210O707J783k795m170r14L950O180J198n325k767J781
2093B83L644L871J451m320n098K619O221K719j832m313k661K554O685K724l961
2108A0586m747j333L198O974K332o346o069K217N526L373q82m468n404J752P367
2123A4076K636m434o071k721M227P445P17p611n359O03M395M573P77p210o618
2138e75K334P241J811l685n351l115K770N634R23n776n125j046L416M955k44o942
2154b775m942K930L646n9j164k718l745J329M213R7l250k774q64J605L879n86
$$ plain form
2047 -15363 -12145 -5791 -5562 -12347 -16018 -14234 -10410 -6816 -6140 -12149 -17556 -13830 -6835 -4322 -8048
2062 -8048 -13397 -15864 -11101 -4417 -3715 -8975 -12323 -12373 -8698 -2674 -2288 -8102 -11932 -8375 -3509 -1618
2078 -1618 -2098 -5290 -8555 -5345 1362 3145 350 -3820 -4734 -784 5396 6594 1269 -1498 283
2093 283 3927 7798 9249 4929 -169 2450 8671 11390 9558 5245 2584 5138 11823 14547 10586
2108 10586 5839 4506 7704 14678 17010 10664 4595 6812 12338 15711 14829 10361 4957 6709 14076
2123 14076 16712 12278 6207 3486 7713 15158 15875 8264 2905 3508 7903 12476 13253 6043 -575
2138 -575 1759 9000 10811 7126 1775 -1340 1430 7064 7987 2211 -2914 -3960 -544 4411 4167 -2775
2154 -2775 -7717 -4787 -1141 -1200 -2364 -5082 -8827 -7498 -3285 -3188 -6438 -9212 -10076 -8471 -4592 -5178
2170e178m028k698J017J796J755J359l229m773J112L898J187j200j381k499j039
2185a3901L461K815n12k684l007k3N013M437k643m517r68K081L311L949o30o099
2201i917k316N317M660J029k622m292r26O075N561k098m104k818J131O563N600
2216F843l243q443j287P352N921P63l750n804n2P426O484k250o515l369L091Q046
2232A1213M127n777p509Q27N864M751J319m599o779M59Q258M135l247n886k458
2247D698L645O238R03o004m623K105M102L205p31n376m551L260N638J54m135k912
2263E616r12J376L193J84m326k172Q50J135J740r82l610k174K510J359k314q32
2279F41L35q04j499K55o29p53J274J76k990j811J158P27Q51q97m314j503L551
$$ plain form
2170 -5178 -9206 -11904 -10887 -9091 -7336 -5977 -9206 -13979 -12867 -8969 -7782 -8982 -10363 -12862 -13901
2185 -13901 -10440 -7625 -8137 -10821 -13828 -13851 -8838 -4401 -7044 -11561 -12529 -10448 -7137 -3188 -3818 -9917
2201 -9917 -12233 -6916 -2256 -1227 -3849 -8141 -9067 -2992 2569 471 -3633 -6451 -5320 1243 6843
2216 6843 3600 -4843 -6130 1222 7143 7906 4156 -1648 -1700 5726 12210 9960 3445 76 3167 11213
2232 11213 15340 9563 2054 2881 8745 13496 14815 10216 3437 3896 12154 16289 13042 7156 4698
2247 4698 8343 14581 15484 9480 4857 6962 11064 14269 13538 8162 3611 6871 12509 12663 8528 5616
2263 5616 4704 6080 9273 9457 5131 2959 3809 4944 6684 5702 2092 -82 2428 3787 1473 641
2279 641 976 172 -1327 -1072 -1701 -2454 -1180 -1004 -3994 -5805 -4647 -3920 -3069 -3966 -8280 -9783 -6232
2296f232K200k270k922j596l03L102L559k263o079j325L949L966R68m149n777
2311a5172P19O287L677k711m512l392K349P059L512o140o829R11O749M857o39
2326c275o267n515L292Q746L135m091n952k060N378Q447O81p393m703K948O466
2341a63M804j168p158m366N999Q488J476n434o020n68P564P294j998o994l337
2356a581L447N625M324j973p240k206O062O180k32m501l528l41N571N182j907
2371A2882n409j779J639M368K779l052n355k20M541J700r41k046k424n48L771
2386I906K298k914l067m80N02K115J636k335l960M69J496K30L02m35k861j304
2402A598K029L66j493j063m60j336K84J556j306j801p02j093l38K077M76k551
$$ plain form
2296 -6232 -4032 -6302 -9224 -10820 -11123 -8021 -4462 -6725 -12804 -14129 -10180 -6214 -5246 -9395 -15172
2311 -15172 -14453 -8166 -4489 -7200 -11712 -15104 -12755 -5696 -2184 -8324 -15153 -14242 -7493 -2636 -3275
2326 -3275 -9542 -15057 -11765 -3019 116 -3975 -9927 -11987 -6609 1838 2519 -4874 -9577 -6629 -163
2341 -163 4641 3473 -3685 -8051 -2052 6436 7912 2478 -3542 -4110 3454 10748 8750 1756 -1581
2356 -1581 1866 7491 11815 9842 2602 396 6458 12638 12406 7905 4377 4036 9607 14789 12882
2371 12882 7473 5694 7333 11701 14480 11428 6073 5853 10394 12094 11153 9107 6683 6135 9906
2386 9906 12204 9290 6223 5743 6245 8360 9996 7661 3701 4170 5666 5896 6198 5763 2902 1598
2402 1598 3627 3993 2500 1437 977 -359 -75 1481 175 -1626 -2328 -3421 -3759 -1682 -1206 -3757
2418c757j467J14m83J12J376j057k932L43J307K5l42r38k154l27K961O62j983
2435h540j514p56MJ941J835j667k685N13J054P24J134k59k148j68K972Q35n26
2452g251n69j634j15L529J684j509j268M76rJ217K743l27j642Q5J234R76R06O52
2470h22j261j053K197K808l4o13r91n99K515L470m40k360O6N99J290K505M20k807
2488D890r57J940K067R87p84k379j454L313M049q37l184j799m5K544M453j041
2504A1763m504j880K431K414J214j343l878j351M018K857j694k671k245m52L123
2519G802K848j908m811j033J371J717J818j805m199j015L487J399k084k096j880
2534c89l84K915J386k776l362J96K59J152J530j537l779k13J740q8k03q64k026
$$ plain form
2418 -3757 -5224 -5110 -5593 -5481 -4105 -5162 -8094 -7751 -6444 -6419 -6761 -7699 -9853 -10180 -7219 -6557 -8540
2435 -8540 -10054 -10810 -10806 -8865 -7030 -8697 -11382 -10869 -9815 -9091 -7957 -8216 -10364 -10532 -7560 -6725 -7251
2452 -7251 -7820 -9454 -9569 -6040 -4356 -5865 -7133 -6657 -6666 -5449 -2706 -3033 -4675 -4590 -3356 -2380 -1474 -822
2470 -822 -2083 -3136 -939 1869 1835 1222 231 -368 2147 5617 5177 2817 2883 3482 4772 7277 7697 4890
2488 4890 3933 5873 7940 8927 8143 5764 4310 7623 11672 10835 7651 5852 5807 8351 12804 11763
2504 11763 7259 5379 7810 10224 11438 10095 6217 4866 8884 11741 10047 7376 5131 4679 7802
2519 7802 10650 8742 3931 2898 4269 5986 7804 5999 1800 785 4272 5671 3587 1491 -389
2534 -389 -773 2142 3528 752 -2610 -2414 -2155 -1003 527 -1010 -4789 -5002 -3262 -3350 -3553 -4417 -6443
2551f443l77J985O10k369o84l66m49J192J511j333k165l7O09m03J583N90k225
2568h771j443J378P33K70M24p92k124R38K967K39j047j039j352J082L894N70k732
2585f805j662O70J872K819R92k840k606K208L430J126q89j490k110K687M549L14
2601B265l212j546M75K664L831O92m691k202L450L906R67j587l141n08L926L880
2617I169j163l517o13J331K773L278k340m483J32L976K570M1k562l342P55M228
2633A0233K309l151l421K10J992L199L04l961l316K144M033l25j597k693j802
2648D158J682L680q34l601j711R04K035P36j874l627o18L436J573k523k511k388
2664a483O26K896J333l758l601R66K311O75j254l221k212K217L862j422l840k193
$$ plain form
2551 -6443 -6820 -4835 -4225 -6594 -7278 -7644 -8093 -6901 -5390 -6723 -8888 -8925 -8316 -8719 -7136 -6546 -8771
2568 -8771 -10214 -8836 -8103 -7833 -7409 -8201 -10325 -9387 -6420 -6181 -7228 -8267 -9619 -8537 -4643 -4073 -6805
2585 -6805 -8467 -7797 -5925 -3106 -2114 -4954 -7560 -5352 -1922 -796 -1685 -3175 -5285 -2598 1951 2265
2601 2265 -947 -2493 -2018 646 4477 5169 478 -1724 1726 5632 6599 5012 1871 1363 5289 9169
2617 9169 8006 4489 3876 5207 7980 11258 8918 4435 4567 8543 11113 11154 8592 5250 6005 10233
2633 10233 12542 9391 5970 6180 8172 11371 11675 7714 4398 6542 10575 10250 8653 5960 4158
2648 4158 5840 9520 8686 5085 3374 4278 6313 7049 5175 1548 930 4366 5939 3416 905 -1483
2664 -1483 -857 2039 3372 -386 -3987 -3021 -710 -35 -1289 -4510 -6722 -4505 -643 -2065 -5905 -8098
2680h098j66L125K856k170n381p03L623K366p80k467k936j99M003K354k855l858
2696a1286n82J931M023J473m172m365J835M661J135q44k886j850J951M905L30
2711c741l712k991K180L025L297r45m626j388L851L653M44j524k927j074M267
2726b211M595j352l923j113K526L314K700k076m256j7M436K663J07k177k578K75
2742I13M374K346k337k434P59J391J734J671j911k673P51L570J073r13j512j660
2758E142J260L116k26j406j036L27J27J355J012k647j808K045J442l06j233q26
2774F338o28K36J424o95q55n82o51l9J245j52k143n79J353j42j138M78q45j633
2792I92N02J253j200j296l12o76J23R89j385j043M7p5j618R87R14k095j574R56
$$ plain form
2680 -8098 -8264 -5139 -2283 -4453 -9834 -10537 -6914 -4548 -5328 -7795 -10731 -10930 -6927 -4573 -7428 -11286
2696 -11286 -11868 -9937 -5914 -4441 -8613 -12978 -11143 -6482 -5347 -6191 -9077 -10927 -8976 -4071 -3741
2711 -3741 -7453 -10444 -8264 -5239 -1942 -2887 -7513 -8901 -5050 -1397 -953 -2477 -5404 -6478 -2211
2726 -2211 2384 1032 -2891 -4004 -1478 1836 4536 2460 -1796 -1813 2623 5286 5393 3216 638 913
2742 913 5287 7633 5296 2862 3621 5012 6746 8417 6506 3833 4584 8154 9227 8314 6802 5142
2758 5142 6402 9518 9292 7886 6850 7177 7304 8659 9671 7024 5216 7261 8703 8397 7164 6338
2774 6338 5710 5946 7370 6675 5820 5238 4587 4548 5793 5641 3498 2919 4272 4130 2992 3470 2625 992
2792 992 1494 2747 1547 251 -61 -737 -614 375 -1010 -2053 -2006 -2081 -3699 -2712 -1798 -3893 -5467 -4511
2810d511P09j274J81m6j102j06Q81r64m91Q41p00j205J110p5j336N0J898r25j375
2829h440P72N14q78R36Q13j017p73O79O29O24L71j309p45J870J400r36m50R51
2847d989j45j11J807M54j531J82J536P69j46L29o90L50K003O09n42J71K19J00
2865C75J384J827j637j378J755K111o68o9Q86r65J01J946O74m40k81l01J99J665
2883G184P38j943m32J736O73q47Q35K0j746J140J797r14j019K35k5l85R45n16
2901G476p32K1r4p17Q63P42j085k115J121L11j220K59L54j895q49N12P20k76n27
2920B869j478j245Q75J249j038j215n10j401j47K679k71l125j179R90N63L03o12
2937b693k017j403J601J337j036j067j375o01J289K288j669l420M10J566P08M60
$$ plain form
2810 -4511 -3802 -5076 -4895 -4941 -6043 -6149 -5268 -6232 -6723 -5882 -6582 -7787 -6677 -6752 -8088 -8038 -6140 -7065 -8440
2829 -8440 -7668 -7154 -8032 -7096 -6283 -7300 -8073 -7394 -6765 -6141 -5770 -7079 -7824 -5954 -4554 -5490 -5940 -4989
2847 -4989 -5134 -5245 -3438 -2984 -4515 -4333 -2797 -2028 -2174 -1845 -2535 -2185 -182 427 -115 56 275 375
2865 375 1759 3586 1949 571 2326 4437 3769 3700 4586 3621 3722 5668 6342 5902 5621 5320 5519 7184
2883 7184 7922 5979 5547 7283 7956 7109 7944 7964 6218 7358 9155 8241 7222 7457 7432 7047 7992 7476
2901 7476 6744 6765 6671 5954 6817 7559 6474 4359 5480 5791 4571 4830 5184 3289 2440 2952 3672 3396 2869
2920 2869 1391 146 1021 2270 1232 17 -493 -1894 -2041 638 367 -2758 -3937 -2947 -2384 -2081 -2693
2937 -2693 -4710 -6113 -4512 -3175 -4211 -5278 -6653 -7254 -5965 -3677 -5346 -8766 -8356 -6790 -6082 -5622
2953e622r98k661l51K926J808j025k371j806J034L440J447k749k591Q01K038J729
2969d951R12j901k814J396L545J184j798j763k44J485K724J131k731j553J072
2984d306K215K121M64l093j618L230L326n79j768k54N8J583K908m51k473N5J601
3001C019J703J042q28k214R03K908L57j087l18j33L42J789J025k142j202J336
3017F500K104Q4q44j275p96K033J563q64j900l08L79R55J420j324k526m9K728
3034G880K72k099r29k81K7J731k4k319j469J260J86P86q03k735j645K155K280
3051D273j594k240j472k54J717K159k147l924p14K150J833m33k418k838O7L404
3067b431M72j921j821o79L86J918J077k799k795Q15J784J300l54k212k391J345
$$ plain form
2953 -5622 -6620 -9281 -9632 -6706 -4898 -5923 -8294 -10100 -9066 -5626 -4179 -6928 -9519 -8718 -6680 -4951
2969 -4951 -4039 -5940 -8754 -7358 -3813 -2629 -4427 -6190 -6434 -4949 -2225 -1094 -3825 -5378 -4306
2984 -4306 -2091 30 494 -2599 -4217 -987 2339 1760 -8 -262 -204 1379 4287 3836 1363 1418 3019
3001 3019 4722 5764 4936 2722 3625 6533 6890 5803 5485 5352 5694 7483 8508 6366 5164 6500
3017 6500 8604 8688 7844 6569 5773 7806 9369 8505 6605 6297 6676 7631 9051 7727 5201 5152 7880
3034 7880 8152 6053 5124 4843 4870 6601 6577 4258 2789 4049 4235 5021 4218 1483 -162 1993 4273
3051 4273 2679 439 -1033 -1287 430 2589 442 -3482 -4196 -2046 -213 -646 -3064 -5902 -5835 -2431
3067 -2431 -1959 -3880 -5701 -6380 -5994 -4076 -2999 -5798 -8593 -7778 -5994 -4694 -5048 -7260 -9651 -8306
3083h306K941K94k279r83k20O04K466N33k939j187J744J106P25j55j331j154J539
3100f602K240q0q77n85l48J408K484n89k322P42J590J99N45J286j335n58J643
3117a159J334n46L84R5o88R61J891O5p79K24j5L02J397J445j206l80J026m90M31
3136D292J619Q3j536P9J423M33L52L11j659n58K028R91q58n01k98o05Q46K146
3154H588j118j708l04M53P74Q76j63l079l82K133J361j009q09j938p25K189J574
3171F713j912k372k86K34O94J394r79k946n64J718J046p67r86k544l18K453J026
3188A604k076j967q51l4K009J080j907k650j56J381M34L83j645k225J71J913Q75
3205c661j084j513j107J9J977J707j771k452J72O75J203J277j135k724J11K271
$$ plain form
3083 -8306 -5365 -5071 -7350 -8333 -8553 -7949 -5483 -4950 -7889 -9076 -7332 -6226 -5501 -5656 -6987 -8141 -6602
3100 -6602 -4362 -4442 -5319 -5904 -6252 -4844 -2360 -2949 -5271 -4529 -2939 -2740 -2195 -909 -2244 -2802 -1159
3117 -1159 175 -371 13 108 -580 381 2272 2337 1558 1782 1767 2069 3466 4911 3705 3325 4351 3861 4292
3136 4292 5911 5994 4458 4537 5960 6393 6745 7056 5397 4839 6867 7858 7000 6499 6201 5596 6442 8588
3154 8588 7470 5762 5458 5911 6685 7561 7398 4319 3937 6070 7431 6422 5613 3675 2950 5139 6713
3171 6713 4801 2429 2143 2377 3071 4465 3486 540 -24 1694 2740 1973 987 -1557 -1875 578 1604
3188 1604 -472 -2439 -3290 -3324 -1315 -235 -2142 -4792 -4948 -3567 -3133 -2750 -4395 -6620 -6449 -4536 -3661
3205 -3661 -4745 -6258 -7365 -7346 -5369 -3662 -5433 -7885 -7713 -7038 -5835 -4558 -5693 -8417 -8306 -6035
3221f035P16l31p42j438l33L102J029j707j251N78J19J947J357j154k098N51J775
3238c915Q97Q49j023j072J78K867P22r12p55K56Q95J798Q74j728j017R23J487
3255A324N11R98l76j202L70J818Q26r33O7j18J35K344L88j809q39J443N90M92
3273F029O42r50p18R00Q68o57J41P33p65O1Q42k71q46Q03K79r81M8L54j13m8N2
3294F403p10j185J115R70r89q49q79o30Q01J485p93k186o60O19K65N36p0k438
3312H05j133J331J071r74j050j604j004K072J852k078l013n97J343J207N80j680
3328b872k925L10J862O21r24j307k163J40K681J662k516k678q7J807J898Q96k700
3345f295l103R17L565P29j129j743j431J340K958O09k312j594L54J462K469O89
$$ plain form
3221 -6035 -5319 -5650 -6392 -7830 -8163 -5061 -4032 -5739 -6990 -6412 -6293 -4346 -2989 -4143 -6241 -5690 -3915
3238 -3915 -3018 -2169 -3192 -4264 -4086 -1219 -497 -1409 -2164 -1908 -1013 785 1659 -69 -1086 -163 1324
3255 1324 1835 2833 2457 1255 1625 3443 4269 3336 3403 3285 3420 5764 6152 4343 3504 4947 5537 6029
3273 6029 6671 5721 5003 5903 6771 6114 6255 6988 6223 6284 7126 6855 6009 6812 7091 6110 6158 6512 6399 6351 6403
3294 6403 5693 4508 5623 6593 5604 4755 3876 3246 4047 5532 4739 2553 1893 2512 2777 3313 3243 805
3312 805 -328 1003 2074 1100 50 -1554 -2558 -486 1366 -712 -3725 -4322 -2979 -1772 -1192 -2872
3328 -2872 -5797 -5487 -3625 -3004 -3928 -5235 -7398 -7258 -4577 -2915 -5431 -8109 -8196 -6389 -4491 -3595 -6295
3345 -6295 -9398 -8481 -4916 -4187 -5316 -7059 -8490 -7150 -4192 -3583 -5895 -7489 -7135 -5673 -3204 -2515
3361b515k775k372J625K899J300K4k675j678K171L545jj667p05J85J433K572J58
3378A524k547o81J200J916R35K55j386j161J479K313j84k75q23j77M43K151L2
3395E014j241QL10N07J066N41j333j074J287J173J72R4j022j149O61J346N5o10
3413E805P6p80o44J705P61j310j282K07K69P69Q57j274k361j01J884J63L6j209
3431C571j867l41K039N52j393j068o95r65J641J553j966k473n11J671P89L95j748
3448h16l098N85K517M83j134j919j248n1K652P98k338k427N03Q29Q98M61j714
3465e019k204L53K424N67q46j368j539P20K674j25j677p63K86P36J040Q16j773
3482e698j572J192J881K17m74j064m27R64J891J98j555j30J40O10J513L97j548
$$ plain form
3361 -2515 -5290 -7662 -6037 -3138 -1838 -1814 -4489 -6167 -3996 -451 -452 -2119 -2824 -2639 -1206 1366 1524
3378 1524 -1023 -1704 -504 1412 2347 2602 1216 55 1534 3847 3663 3388 2565 2388 2831 4982 5014
3395 5014 3773 3781 4091 4598 5664 6205 4872 3798 5085 6258 6430 6524 5502 4353 5014 6360 6415 5805
3413 5805 5881 5101 4457 6162 6923 5613 4331 4538 4807 5576 6433 5159 2798 2697 4581 4744 4780 3571
3431 3571 1704 1363 3402 3954 2561 1493 798 -167 1474 3027 1061 -1412 -1923 -252 537 932 -816
3448 -816 -3914 -3329 -812 -329 -1463 -3382 -4630 -4681 -2029 -1231 -3569 -5996 -5493 -4664 -3766 -3305 -5019
3465 -5019 -7223 -6870 -4446 -3879 -4725 -6093 -7632 -6912 -4238 -4363 -6040 -6803 -6517 -5781 -4741 -3925 -5698
3482 -5698 -7270 -6078 -4197 -3980 -4454 -5518 -5945 -4981 -3090 -2892 -4447 -4577 -4437 -3827 -2314 -1917 -3465
3499c465k82J743Q74j23J98k0n81O63J220O8o7K95j54K18J136L02j30Q20J12j047
3519A780L01J833K45o53M29k3j77Q54Q02j94k34j81J65L32J138n24j484O03J264
3538F276J35j76J36j183q01J916J229j376j587J54K1J474Q43j770j900O76J032
3555E099K60K87j334k236k14K683P08j686j617j143O71J417P31k133k131J96O33
3572A91J555j9k512k324R48K583k82j452j396j352O40K285P81k966k513O38J485
3589c710J673k47k750j944J279J807J171r64k255k078J274L522L51k830k049M68
3605g282J511J812M73k653j682J423K028J291j298j788j101K037K592k24k119
3620d980n50R3J250K462N98l131j227J918K408P52k37k737o91K459K518J19j164
$$ plain form
3499 -3465 -3747 -2004 -1130 -1253 -1055 -1075 -1656 -993 227 295 228 523 369 587 1723 2025 1895 2715 2827 1780
3519 1780 2081 3914 4159 3506 3935 3912 3735 4589 5391 5197 4963 4782 4947 5279 6417 5893 4409 5012 6276
3538 6276 6411 6235 6371 5188 4387 6303 7532 6156 4569 4723 4744 6218 7061 5291 3391 4067 5099
3555 5099 5359 5646 4312 2076 1862 4545 5253 3567 1950 807 1478 2895 3626 1493 -638 -442 191
3572 191 1746 1727 -785 -3109 -2161 422 140 -1312 -2708 -4060 -3420 -1135 -354 -3320 -5833 -5195 -3710
3589 -3710 -2037 -2284 -5034 -6978 -5699 -3892 -2721 -3685 -5940 -8018 -6744 -3222 -2871 -5701 -7750 -7282
3605 -7282 -5771 -3959 -3486 -6139 -7821 -6398 -4370 -3079 -4377 -6165 -7266 -5229 -2637 -2861 -4980
3620 -4980 -5530 -5437 -4187 -1725 -1127 -4258 -5485 -3567 -1159 -407 -644 -3381 -4072 -1613 905 1024 -140
3637a40j398m98K265L073q15k414k43J316J542P77l3j809m49J846J698k95o55
3654C768q45j12J740J700q79j646K22O18M03J109K3j874m73J771P09M3r33r59
3672D385l29J098P65p05K4m06r22K38R94j09j039o50N84m12Q9O17j158o23L7j25
3692B353L3K7n85r62%M99o53j69J22q91j238J124N22j054r40j42O9J76M08j045
3712b346j512Q6N18N22o1p43j216k21J625qo85j007n11O1N72J519q78j944QP00
3732e521O91P75p66j457N35J223N47l51j03p49k91J413J223j447o34M54O89L23
3750c446Q68k5j105K47R89O83K15k90l79o6J896K61p19K13K29j17N77J043J73
3769A247m96K61K38p5J476K42o77j36Q12n4M42O75m45j299J451J074J96o98k42
$$ plain form
3637 -140 -1538 -2036 229 3302 2487 73 -170 1146 2688 3465 3432 1623 1174 3020 4718 4423 3768
3654 3768 2923 2811 4551 6251 5372 3726 3948 4566 4969 6078 6101 4227 3754 5525 6234 6277 5344 4385
3672 4385 4056 5154 5919 5214 5238 4832 3910 4148 5142 5033 3994 3344 3928 3516 3605 4222 3064 2441 2478 2353
3692 2353 2386 2413 1828 866 866 1365 712 543 665 -226 -1464 -340 182 -872 -1812 -1954 -1885 -1709 -1301 -2346
3712 -2346 -3858 -3772 -3254 -2732 -2793 -3536 -4752 -4973 -3348 -3356 -4041 -5048 -5559 -5498 -4926 -3407 -4285 -6229 -6221 -5521
3732 -5521 -4830 -4055 -4821 -6278 -5743 -4520 -3973 -4324 -4427 -5176 -5467 -4054 -2831 -4278 -4912 -4458 -3769 -3446
3750 -3446 -2578 -2603 -3708 -3461 -2472 -1789 -1574 -1864 -2243 -2309 -413 -152 -871 -658 -429 -546 31 1074 1247
3769 1247 751 1012 1250 1175 2651 2893 2216 2080 2892 2838 3280 3955 3510 2211 3662 4736 4932 4234 3992
3788C992k63K85J077M46m63j185K09P3J418Q63j411j837J014J076J89K35r66j731
3806C021L25K145L69j689j167m06M80J521O90k305j613J83O61R72N49k251k117
3823f32R62K316K64j860j460r27R12K041J9k238k059L17J628J263n78k554k097
3840d683J450K209k5j503j781j221J822K360m80k899j281M18J723J508o24k416
3856e423j299J410J922K41j035k310j47J725K629j392j760p48L71J939J799j031
3872c109k853j19K201J303K40p56k111M47K230J461p74j332n95J004J654J393
3888B84j036j950M01J576J229O69j031j532O84J944J022o35q25m09M30J927N74
3905C322q96j219R61Q04N60K91l58j201O31J609J38n77j47m28L97J372k01j522
$$ plain form
3788 3992 3729 4014 5091 5537 5074 3889 4098 4171 5589 6452 5041 3204 4218 5294 5483 5718 4752 3021
3806 3021 3346 5491 5860 4171 3004 2598 3078 4599 5289 2984 1371 1554 2215 3187 3736 1485 -632
3823 -632 330 2646 2910 1050 -410 -1337 -425 1616 1635 -603 -2662 -2345 -717 546 -32 -2586 -4683
3840 -4683 -3233 -1024 -1049 -2552 -4333 -5554 -3732 -1372 -1852 -4751 -6032 -5614 -3891 -2383 -3007 -5423
3856 -5423 -6722 -5312 -3390 -3149 -4184 -6494 -6641 -4916 -2287 -3679 -5439 -6187 -5816 -3877 -2078 -3109
3872 -3109 -5962 -6081 -3880 -2577 -2337 -3093 -5204 -4757 -2527 -1066 -1840 -3172 -3767 -2763 -1109 284
3888 284 -752 -2702 -2301 -725 504 1173 142 -1390 -706 1238 2260 1625 800 391 821 2748 3322
3905 3322 2426 1207 2168 2972 3532 3823 3465 2264 2895 4504 4642 4065 3918 3490 3887 5259 5058 3536
3923C536P1J152N5O3j5q75m3P46O14j043k90L97l18K22O24j107q36P47N29n99
3943C630n76K9p28N16N11l43j231j03K38m9J57n78j631J08R78P57j758n83l35
3962i91j61R01M22j661j224L46P54K53j1j314j419M94J248P8j112o84j149P41
3980d489J377J77j988q64N48P73O44Kj631j091J313J357j21r28o95m13J234J601
3998c194j60j907m31R28Q81R59j1j582n74J493J717m34o0r73m01J493J933m83
4016h06j577r5P32J024J355j92j855j06K239R69K50m07j309m06J931J565m83r82
4034A847J35o26J727J844o78j892l03J493Q41J066l38k121M1J415J378n99l97
4051D833r13k79J306J242m48j433m35L79Q48L99k45j980m01J520R05l7j048j179
$$ plain form
3923 3536 3607 4759 4814 4877 4862 3987 3944 4690 5304 4261 3971 4368 4050 4272 4896 3789 2953 3700 4229 3630
3943 3630 3054 3083 2355 2871 3382 3039 1808 1705 1943 1894 2051 1473 -158 -50 928 1685 -73 -656 -991
3962 -991 -1152 -251 171 -1490 -2714 -2368 -1614 -1361 -1372 -2686 -4105 -3611 -2363 -2285 -3397 -4081 -5230 -4489
3980 -4489 -3112 -2935 -4923 -5787 -5239 -4466 -3822 -3820 -5451 -6542 -5229 -3872 -3993 -4921 -5616 -6029 -4795 -3194
3998 -3194 -3354 -5261 -5692 -4764 -3883 -2924 -2935 -4517 -5091 -3598 -1881 -2315 -2375 -3348 -3749 -2256 -323 -806
4016 -806 -2383 -2478 -1746 -722 633 441 -1414 -1520 719 1688 1938 1531 222 -184 1747 3312 2829 1847
4034 1847 1982 1356 3083 4927 4249 2357 2054 3547 4388 5454 5116 2995 3036 4451 5829 5230 4833
4051 4833 3920 3641 4947 6189 5741 4308 3873 4252 5100 5499 5254 3274 2873 4393 5298 5261 4213 3034
4069C034n39J127J403q23j789n8l18N71Q96j050j540k44R44J17K16j044j413m40
4087i50K060K85j260j396j09j75N91J232j529j533j49P05O9p6n98j163J3J481
4105b502J53q17r83n24k05J434O84j282j003M22j08P70J99o92n71j3J038j13K6
4124d087o35k71J1J598L16j372j46O96n5M64M54n13m56R81O88m51J95J94q9P46
4144a732N45n76j98J034J91O0O37K22p45q8J490K32l63k88K00P75P40O8r55k86
4164I63J515L70O1J74k99l81O72J086n37n12J49N84K39N86l71j098L10Q66N35
4183D912k09l19j233J75J920J41j407p04J17L17N53P54j074j498L51J291L39p19
4201C707j028j183M42J790J2j480q43j92j53J347K92k185j387J175P04J69q96
$$ plain form
4069 3034 2495 3622 5025 4202 2413 2355 2037 2608 3504 2454 914 670 1614 1731 1947 903 -510 -950
4087 -950 1110 1395 135 -1261 -1370 -1545 -954 278 -1251 -2784 -2933 -2228 -2159 -2235 -2833 -3996 -3983 -2502
4105 -2502 -2349 -3166 -4149 -4673 -4878 -3444 -2760 -4042 -5045 -4623 -4731 -3961 -3762 -4454 -5025 -5038 -4000 -4113 -4087
4124 -4087 -4722 -4993 -4982 -3384 -3068 -4440 -4586 -3890 -3945 -3481 -3027 -3540 -3996 -3015 -2327 -2778 -2583 -2389 -2478 -1732
4144 -1732 -1187 -1763 -1961 -927 -736 -676 -39 183 -562 -650 840 1072 709 421 621 1396 2136 2204 1249 963
4164 963 2478 2848 2909 3083 2784 2403 3075 4161 3624 3112 3261 3845 4084 4670 4299 3201 3511 4377 4912
4183 4912 4703 4384 3151 3326 5246 5387 3980 3276 3393 3710 4263 5017 3943 2445 2796 4087 4426 3707
4201 3707 2679 1496 1938 3728 3740 2260 1417 1225 1072 2419 2711 526 -861 314 1018 1187 291
4218B91j139r07Q36J588k35j575j128m21O97J598k07k411q37J264K49M89l56j636
4236c840j104J748J424n94j410j151j60J785J361j188j804j12J016Q89M79p85
4252c446j872j5K192J470j217j435k43L14J238J392j066j675N02Q50J566P79j297
4269a963j844P27K101M52p58m25j08m6J792J058j252p25P3J170J157J17j077r64
4287e15J145J353q2l73j2o17M13J810k3j304J34N26N32O11k5n86j44O50L78J45
4307D016Q9m01r23Q88J102o06q80O91J75n5J78k67K2o90O35j75l5l74l25J71K64
4328C500J65j108M5K46m11m75L75j76o84J74K85l66o91n5l0O1k80k89o71M37k07
4349a55r78M07l88K8o19P19k84j322P2J76J16j79j25j76q27L29m2m7Jk91o75j4
$$ plain form
4218 291 -848 -1755 -919 669 434 -1141 -2269 -2690 -1993 -395 -602 -3013 -3850 -2586 -2337 -1848 -2204 -3840
4236 -3840 -4944 -3196 -1772 -2366 -3776 -4927 -5087 -3302 -1941 -3129 -4933 -5045 -4029 -3140 -2661 -3446
4252 -3446 -5318 -5333 -3141 -1671 -2888 -4323 -4566 -4252 -3014 -1622 -2688 -4363 -3861 -3011 -1445 -666 -1963
4269 -1963 -3807 -3080 -979 -527 -1285 -1710 -1818 -1864 -72 986 -266 -991 -918 252 1409 1526 449 -515
4287 -515 630 1983 1901 1528 1516 899 1312 3122 3099 1795 1929 2455 2987 3598 3573 2987 2843 3493 3871 4016
4307 4016 4105 3704 2781 3669 4771 4165 3285 3976 4151 4096 4274 4007 4029 3339 3974 3799 3764 3390 3065 3236 3500
4328 3500 3665 2557 2602 2848 2437 1962 2337 2161 1477 1651 1936 1570 879 824 794 855 575 286 -385 52 -155
4349 -155 -1133 -726 -1114 -1086 -1705 -986 -1270 -2592 -2520 -2344 -2228 -2407 -2532 -2708 -3535 -3206 -3248 -3295 -3294 -3585 -4260 -4274
4371d274J094k91q84K57K6l06L84M10o90l64J2N26K49J46q5n36P97R2O1k61N62
4392c075o71J87J202J06q96J02P54K00M98K47k79n77Q17O32K92O2l35k70M03J607
4412A006j86q22L70K30J52P97Q28p45j059J043J057L30L58j314o60J402R53Op49
4431B997j91n68J066J489l12j522m44R00Q69L60l17j016o11J020R39N5p35j040
4449B939m42J482R15q08j642L5N68L24N21l87j394o42R42R26o33r00q24j72J142
4468A950Q17j318r94m09K80M31N26q68j604J23Q63N42r07n14n74p09J355M21r75
4487a564j033l76L87P70N04j120j455L92N34K68j02l54p02l82J167N67r97m37
4505c933k78j30J024J89p92n77P13K32j26M53l04o80P79M10J95l94K91M2Q8O92
$$ plain form
4371 -4274 -3180 -3471 -4355 -4098 -4072 -4378 -3994 -3584 -4274 -4638 -4626 -4100 -3851 -3705 -3790 -4326 -3529 -3437 -3376 -3637 -3075
4392 -3075 -3746 -3559 -2357 -2251 -3147 -3045 -2291 -2091 -1593 -1346 -1625 -2202 -1385 -753 -461 -399 -734 -1004 -601 1006
4412 1006 820 -2 368 598 750 1547 2375 1630 571 1614 2671 3001 3359 2045 1385 2787 3740 3746 2997
4431 2997 2806 2238 3304 4793 4481 2959 2515 3415 4284 4644 4327 3311 2700 3720 4659 4714 3979 2939
4449 2939 2497 3979 4894 4086 2444 2479 3047 3371 3892 3505 2111 1469 2411 3337 2704 1804 980 808 1950
4468 1950 2767 1449 455 46 326 757 1283 415 -1189 -1066 -203 339 -568 -1082 -1656 -2365 -1010 -589 -1564
4487 -1564 -2597 -2973 -2586 -1816 -1312 -2432 -3887 -3495 -2961 -2693 -2795 -3149 -3851 -4233 -3066 -2499 -3496 -3933
4505 -3933 -4211 -4341 -3317 -3128 -3920 -4497 -3784 -3552 -3678 -3225 -3529 -4209 -3430 -3020 -2825 -3219 -2928 -2886 -2798 -2106
4525b106K12m14l08K68K69J032j54l89q9R60L16K7j90O01n92J79Q02J08m13M28
4545E47P65l07L96K69l07k4P23M46m14K94o6q2L92O84n64l41P42L66n66O69j96
4566C426m70N06K97l31l12N74k33n2N75q3j029o7J245l02l89j62n36J99O85k35
4586C306p95l84J57j09O29J72q16j085M06P99j61p03o71n73N67J002j57j367o91
4605d74J99L53J41J6j489o57P40N98m8n61p77o89P83R00m50j168l96r4L74R83
4625a716m99j800l79J599K98l0q29o14m09J596M25o69j051J97PP65P30r76j101
4644d456R1J067M66K94n08r43J13J840J52l05p77j96K76J014Q11r76p10Q86N55
4663a306N19L39q4j095N92J164q1j03nj8P7Q38P01n46k38L48K79K07Q66p04l26
$$ plain form
4525 -2106 -1894 -2308 -2616 -2348 -2079 -1047 -1201 -1590 -1679 -719 -403 -376 -566 35 -557 -378 424 532 119 547
4545 547 1312 1005 1401 1670 1363 1339 2062 2508 2094 2388 2322 2240 2632 3316 2752 2411 3153 3519 2953 3622 3426
4566 3426 2956 3462 3759 3428 3116 3690 3457 3405 3980 3897 2868 2801 4046 3744 3355 3193 2657 2856 3541 3306
4586 3306 2511 2127 2284 2175 2804 2976 2160 1075 1481 2280 2119 1416 745 172 739 1741 1584 217 -474
4605 -474 -275 78 219 235 -1254 -1911 -1171 -573 -621 -1182 -1959 -2648 -1865 -965 -1415 -2583 -2979 -3073 -2699 -1716
4625 -1716 -2215 -4015 -4394 -2795 -2497 -2527 -3356 -3970 -4379 -2783 -2358 -3027 -4078 -3881 -3874 -3109 -2379 -3355 -4456
4644 -4456 -4365 -3298 -2832 -2538 -3046 -3989 -3876 -2036 -1884 -2189 -2966 -3162 -2886 -1872 -1061 -2037 -2747 -1861 -1306
4663 -1306 -787 -448 -532 -1627 -1035 129 48 -55 -60 -78 -1 837 1538 992 754 1102 1381 1588 2454 1750 1424
4684A424N63P63k26K95j7n45K7J284K6o71K95k16j81M05P32l5q93N75m11J70P49
4705D113k76j151k12Q71L48j81n10l66l84N59O91p63q46K70k62Q3P39l78j251
4724A094j67M58K66J61p90n78p43J169J26m49m09p57l29P59N00n51j412Q1K92
4743a279L46l9o77q71k76Q87J82n97o3k11k72L29L27r12m04J68J38lK48o6o10
4764c655M73L36r6q25N17j13K2K81L65m27l2L70k01L70L89m61k96Q20K01o09n0
4785b621R22k84n7O80mk86R22N5k48J64Q8J93L23M84n11m66J407N51l11j98J1
4806H14N4O89L11L29j066J66N94O27J97pq11k64J419M36n82M58r19p2O30J039
4826D042m87r04L53n6L55J18K09r87K34P84p0k95M7q54j45Q12L03q97k4k56K11
$$ plain form
4684 1424 1987 2750 2524 2819 2802 2257 2284 3568 3594 2923 3218 3002 2821 3226 3958 3923 3030 3605 3194 3364 4113
4705 4113 3837 2686 2474 3345 3693 3512 3002 2636 2252 2811 3502 2739 1893 2163 1901 1984 2723 2345 1094
4724 1094 927 1385 1651 1812 1022 444 -299 870 996 547 138 -619 -948 -189 311 -240 -1652 -1571 -1279
4743 -1279 -933 -972 -1649 -2520 -2796 -1909 -1727 -2324 -2387 -2598 -2870 -2541 -2214 -3126 -3530 -3362 -3224 -3227 -2979 -3045 -3655
4764 -3655 -3182 -2846 -2942 -3767 -3250 -3363 -3341 -3060 -2695 -3122 -3154 -2784 -2985 -2615 -2226 -2687 -2983 -2163 -1962 -2571 -2621
4785 -2621 -1699 -1983 -2040 -1360 -1364 -1650 -728 -673 -921 -757 -669 -476 -153 331 -180 -646 761 1312 1001 803 814
4806 814 868 1557 1868 2197 1131 1297 1891 2518 2715 2708 1897 1633 3052 3488 2906 3364 2445 2373 3003 4042
4826 4042 3555 2651 3004 2948 3303 3421 3630 2643 2877 3661 3591 3296 3343 2489 2344 3156 3459 2562 2538 2282 2493
4847B493r5K79n50q58k9P60j85k54k10p00j74M40O9o66m25j20l88M71L55m13r74
4868a174m9K41j39K73o33q40L43L17J15n59J37o00m54P20L84n56o25m1j43M25
4888b858N06j69j457K94N24M68l0j53p46k7Q54L40n49k0k34k58Q84P18m47o74
4908c034k9N55N11N17l62p82L43R35M43m67J43n74J61J334O39q90n09P49j6P72
4928D39N2j67n61M24R29K83O7n78j54L22J145L8j141M11O13JJ71Q17j080k89Q33
4949B575N80k44J1l82j60M64J64O8q6L18o46Q4O26L51j163j49Q20j13j57k1R3
4970C033n23P3M66m02l96J82k45l72N75k59n3l59L1r58K01M84j98n52J00k23j10
4991D95J91J5l69q47J27M2J05K16p13q09L58J71p3n37L0l73l0O77j93p05p80N76
$$ plain form
4847 2493 2398 2677 2127 1269 1240 2000 1815 1561 1351 651 477 917 986 320 -105 -225 -613 -142 213 -200 -1174
4868 -1174 -1223 -982 -1121 -848 -1481 -2321 -1978 -1661 -1546 -2105 -1968 -2568 -3022 -2302 -1918 -2474 -3099 -3140 -3283 -2858
4888 -2858 -2352 -2521 -3978 -3684 -3160 -2692 -2722 -2875 -3621 -3648 -2794 -2454 -3003 -3023 -3257 -3515 -2631 -1913 -2360 -3034
4908 -3034 -3063 -2508 -1997 -1480 -1842 -2624 -2281 -1346 -903 -1370 -1227 -1801 -1640 -306 333 -557 -1066 -317 -333 439
4928 439 491 324 -237 187 1116 1399 1466 888 734 1056 2201 2239 1098 1509 2122 2123 2294 3111 2031 1742 2575
4949 2575 3155 2911 2922 2540 2380 2844 3008 3076 2990 3308 2662 2746 3372 3723 2560 2411 3231 3118 2961 2940 3033
4970 3033 2510 2583 3049 2647 2251 2433 2188 1816 2391 2132 2079 1720 1751 793 994 1478 1280 728 828 605 495
4991 495 686 701 332 -515 -388 -346 -241 -25 -738 -1547 -1189 -1018 -1091 -1628 -1598 -1971 -2001 -1324 -1517 -2222 -3002 -2426
5013b426O7M13n10o87J57M07K82m00k29j01o60N58R80n83j015O9N61Q0M24p0o07
5034c290R6N00K42j63K26k81k5M12Q08q13j79R95k90J38M20n6m68L03R78q3nN2
5056d83J47M20J61K53p49P74M65l33o8O03M6k08L30M39l84J39R86k82J11R6n29
5077A934Q08k5K72o36L71J13l12M74K50o77l15P18M96n51j87l1N7K06K62l81p02
5098B144J47L60l8J94j75j023n5J070j79k70m77o73Q0N56p1n19q88N30l8K58J75
5119A108p09p59J41N93r4l66n18n14k82J108l5q58p46O44L2o3k04m11k48L80L61
5140a440o55n5k71m51M36M38l86o18oN12J08j55Qm39M4L93q6j16L41l65j35L40
5162b558J91l32L40Q0J10m13N07K83k4j75J98J7K69K28P2l69J98M30k07L24M82
$$ plain form
5013 -2426 -2359 -1946 -2456 -3143 -2986 -2579 -2297 -2697 -2926 -3027 -3687 -3129 -2149 -2732 -3747 -3678 -3117 -3037 -2613 -2683 -3290
5034 -3290 -3194 -2694 -2452 -2615 -2389 -2670 -2695 -2283 -1475 -2288 -2467 -1472 -1762 -1624 -1204 -1260 -1728 -1425 -447 -530 -535 -483
5056 -483 -336 84 245 498 -251 523 988 655 587 1190 1236 1028 1358 1797 1413 1552 2538 2256 2367 2463 1934
5077 1934 2742 2717 2989 2353 2724 2837 2525 2999 3249 2572 2257 2975 3471 2920 2733 2702 2759 2965 3227 2846 2144
5098 2144 2291 2651 2613 2807 2632 1609 1554 2624 2445 2175 1698 1025 1105 1661 1590 1071 183 713 675 933 1108
5119 1108 399 -360 -219 374 280 -86 -604 -1118 -1400 -292 -327 -1185 -1931 -1287 -1255 -1318 -1522 -1933 -2181 -1801 -1440
5140 -1440 -2095 -2150 -2421 -2872 -2436 -1998 -2384 -3002 -3008 -2496 -2388 -2543 -2535 -2974 -2930 -2537 -2623 -2739 -2398 -2763 -2898 -2558
5162 -2558 -2367 -2699 -2359 -2279 -2169 -2582 -2075 -1792 -1816 -1991 -1793 -1776 -1507 -1279 -1207 -1576 -1378 -948 -1155 -831 -349
5183c49o03K77R54N4l78K58K67n49O23Q92j12q07J18J82N19O99l94o48K86J016
5203B305l2J20Ro03k94J319M46o79n51J89L42JR91q23o18M13O62j43l8l70p89
5224A857N25J070l82o75m71L56K06J52K9r26q63J024L12o8l34m00o76M44N06m74
5244A212o83J5j16j37M05j67q23k88P26j01o22j0l02j66J56K42o77j80R3k72o
5265a701N5j41n94M79L0j94N9o5j93k20M10m71j24J04K73o06%K82l0k43P14J08
5287b068q78J85L71k5K6k4l41K8M21O13n43K0L40K94R8R3n8n19O39M32k08J60
5309i44J15k57K47J141o79j70M08K03k2O71j47n00K09P32K77o01M24n9k57J048
5329A839L27o38k49N84J77j17O94m37l58M27N07k00l48K56l45J10K68K21p81Q8
$$ plain form
5183 -349 -952 -675 279 333 -45 213 480 -69 554 1446 1334 527 645 827 1346 2045 1651 1003 1289 2305
5203 2305 2273 2393 2402 1799 1505 2824 3270 2591 2040 2229 2571 2572 3563 2740 2122 2535 3197 3054 3016 2646 1857
5224 1857 2382 3452 3070 2395 1924 2280 2486 2638 2667 1741 878 1902 2214 2146 1812 1412 736 1180 1686 1212
5244 1212 529 544 428 291 696 529 -294 -582 144 43 -579 -589 -891 -1057 -901 -659 -1336 -1516 -1423 -1695 -1701
5265 -1701 -1646 -1787 -2381 -1902 -1872 -2066 -2007 -2072 -2265 -2485 -2075 -2546 -2670 -2566 -2293 -2899 -2899 -2617 -2647 -2890 -2176 -2068
5287 -2068 -2946 -2761 -2390 -2415 -2389 -2413 -2754 -2726 -2305 -1692 -2235 -2215 -1875 -1581 -1483 -1390 -1448 -1967 -1328 -896 -1104 -944
5309 -944 -829 -1086 -839 302 -377 -547 -139 64 42 713 566 66 275 1007 1284 683 1107 1048 791 1839
5329 1839 2166 1528 1279 1863 2040 1923 2617 2180 1822 2249 2756 2556 2208 2464 2119 2229 2497 2718 1937 2025
5349B025M97KJ75j46N3n67N24Om62J28K72p47M63J06p53o0K00L72n93Jj76j56
5371A164k80M24o04K0j85J45n06l93L22p26M19J64l33q74K23K21o7k12K19q66
5391a725j55R45r3j081L68m83r1O95L90j182n59Q26R7M7n44K34o10rJ151l23n14
5412b616j23P9m4O30k51n60q9O82R6NK51q81K66Q20M70m85k18R8Q5L49L49k70
5434a357l54O51N95r1MJ24l34n4J029l6n60L6N91M7P06k0p18J42J110l5k68N09
5456A717k31n02L23J043o25l14L68n2M82J19J24n71K78P46o93L1K91k65M6K32
5476B547J21l89R4r1K40j97j88P6P7M62m47m31R2R9n6o5J1m41m00O97l94m20r2
5499I05J75k39K63J83o56m48J26K45j54J48n19o31K53N06o37k63n41J11L60j9
$$ plain form
5349 2025 2522 2524 2699 2553 2606 2039 2563 2569 2107 2235 2507 1760 2223 2329 1576 1516 1716 2088 1495 1496 1320 1164
5371 1164 884 1308 704 724 539 684 178 -215 107 -619 -200 -36 -369 -1243 -1020 -799 -866 -1078 -859 -1725
5391 -1725 -1880 -935 -1028 -2109 -1741 -2224 -2315 -1620 -1230 -2412 -2971 -2145 -2048 -2001 -2545 -2311 -2921 -2930 -1779 -2102 -2616
5412 -2616 -2739 -2660 -2704 -2074 -2325 -2885 -2974 -2292 -2196 -2191 -1940 -2821 -2555 -1735 -1265 -1750 -1968 -1870 -1785 -1436 -1087 -1357
5434 -1357 -1711 -1060 -465 -556 -552 -428 -762 -816 213 177 -383 -347 244 291 997 977 259 401 1511 1476 1208 1717
5456 1717 1486 984 1307 2350 1725 1411 1779 1727 2209 2328 2452 1881 2159 2905 2212 2243 2534 2269 2315 2547
5476 2547 2668 2279 2373 2282 2522 2325 2137 2213 2290 2752 2305 1874 1966 2065 2009 1944 1955 1514 1114 1811 1417 997 905
5499 905 1080 841 1104 1287 631 183 309 554 400 548 29 -602 -349 157 -480 -743 -1284 -1173 -813 -832
5519h32K74j120M3J91L59o05k9l80m0L32L70l49r19M15L36k3J28l30p55K78N64
5540b092L00o51J45n06K93M51J44k54l74M48J80Q4J05k49m85M45M61P2m23M18
5560a488J1K80L12l85O4J45M49M1J22k9J7K71L31j36k26L82L67j51j64K99l4K6
5582E04N03K16j85j76M40j54K50K28k82k61R29L61n72k04P80n88M18M14m86m70
5602A665L13M78j8L48o62j28J28M04Rm59m69j81P44J35K18o35p85P98k01L16m78
5623A540n22k37O56L05m86m18r3j87P6M81%j312R4P40l7k59m36m44k52Q67r2l95
5645d11n20m2j16K56Q6o60m20J84M74m37k62J10j95J62J91r6m67P5M1K39j42j41
5667b091o80Q9P95n01O2L91m15l59M94N00n12j05L56l1j5L99j84j15K47Q7Q9l92
$$ plain form
5519 -832 -558 -1678 -1635 -1444 -1085 -1690 -1719 -2099 -2139 -1807 -1437 -1786 -2705 -2290 -1954 -1977 -1849 -2179 -2934 -2656 -2092
5540 -2092 -1792 -2443 -2298 -2804 -2511 -2060 -1916 -2170 -2544 -2096 -1916 -1832 -1727 -1976 -2461 -2016 -1555 -1483 -1906 -1488
5560 -1488 -1477 -1197 -885 -1270 -1206 -1061 -612 -571 -449 -478 -461 -190 141 5 -221 161 528 377 213 512 478 504
5582 504 1007 1223 1038 862 1302 1148 1398 1626 1344 1083 2012 2373 1801 1597 2377 1789 2207 2621 2135 1665
5602 1665 1978 2456 2438 2786 2124 1996 2124 2528 2537 2078 1609 1428 2172 2307 2525 1890 1105 1903 1702 2018 1540
5623 1540 1018 781 1437 1742 1256 838 745 558 634 1115 1115 -197 -103 637 600 341 -95 -539 -791 76 -16 -411
5645 -411 -931 -973 -1089 -833 -747 -1407 -1827 -1643 -1169 -1606 -1868 -1758 -1953 -1791 -1600 -1696 -2163 -2088 -2047 -1808 -1950 -2091
5667 -2091 -2771 -2682 -1887 -2388 -2326 -1935 -2350 -2709 -2215 -1715 -2227 -2332 -1976 -2007 -2022 -1623 -1807 -1922 -1675 -1588 -1499 -1891
5689a891P70l72L72L75m78m53R62K63k39q0O0K73J87M29K23o79K36K93J06N32
5709H89k68k04J00O34K8Q6k11K60l33O66N99m52m63J14N87K24k61K1n36O32O16
5730B728k40p11NJ49J07M55M49j105k97R09J37m71r6k13l10N41L60l17k61j27
5750A692l85J22Q54n70r01J81L25k47l13L67p18K04O8l3l81J03n17j35K65J50
5770A31n72nR5l10m04O38J0l60m29rqk61K9L11p68L05j70j37L90l29l47j57N62
5793a795J83j40j92k55l86M53O06p6j052L40O41j97K44n83l32K16L44N05m35J19
5813a792Q9j82Q50O2m61p11N66N81L35K4l40k28L51M18O57n87m05J05K31J134
5833F97k84q76L49K81L13K64M67r04J05N43O34L1n52j57R5N41N53m99l42Q2R7
$$ plain form
5689 -1891 -1121 -1493 -1121 -746 -1224 -1677 -715 -452 -691 -771 -711 -438 -251 178 401 -278 -42 251 357 889
5709 889 621 417 517 1151 1179 1265 1054 1314 981 1647 2246 1794 1331 1445 2032 2256 1995 2016 1480 2112 2728
5730 2728 2488 1777 1782 1931 2038 2493 2942 1837 1540 2449 2586 2115 2019 1806 1496 2037 2397 2080 1819 1692
5750 1692 1307 1429 2283 1713 812 993 1318 1071 758 1125 407 611 679 646 265 368 -149 -284 -19 131
5770 131 -441 -446 -351 -661 -1065 -427 -417 -777 -1206 -1215 -1223 -1484 -1455 -1144 -1912 -1607 -1777 -1914 -1524 -1853 -2200 -2357 -1795
5793 -1795 -1612 -1752 -1944 -2199 -2585 -2132 -1526 -1602 -2654 -2314 -1673 -1870 -1626 -2209 -2541 -2325 -1981 -1476 -1911 -1792
5813 -1792 -1703 -1885 -1035 -973 -1434 -2145 -1579 -998 -663 -639 -979 -1207 -856 -438 219 -368 -773 -668 -437 697
5833 697 413 -463 -114 167 480 744 1211 307 412 955 1589 1620 1068 911 1006 1547 2100 1601 1259 1341 1438
5854A438M56L88O4r05K8J029Nm28P0m12n7M86J75l85j97j9M78j55j37K03o28j01
5876A396K59l8M1p3j78j54J00K28m32J81n5m14n4K29j67m93K29m1p20L70J05j84
5898A35o19P3J66k08N59p51o79j19N46N28j3j039l03J81O84j01p58j49j25mO72
5919a324k8m39l76JN58P9l26k14m36K64N91O5n53k08lJ59P36J4p42k70P25N68
5941a159k03l65n3J19L57L78J15m86p6K36K64L73l30n37N06P01K06m01K98k99
5961c56n7O39M28o04NM50L6J43J53R3k41L71J10l08J31Q6N03j31K64M4p22N49
5983A586L73Q6k10k29R0L34N37m78l31k06J94P52o09J94p58J79Q04L74q61o78
6003A143K94K22M75j13k58j036N05N81O0o76m49m70P63O27m12o01o35J96K77L23
$$ plain form
5854 1438 1894 2282 2346 1441 1469 2498 2503 2075 2145 1733 1676 2162 2337 1952 1755 1736 2214 2059 1922 2125 1497 1396
5876 1396 1655 1617 1658 1585 1407 1253 1353 1581 1149 1330 1275 861 807 1036 869 376 605 564 -156 214 319 135
5898 135 -484 -411 -245 -453 106 -645 -1324 -1443 -897 -369 -382 -1421 -1724 -1543 -859 -960 -1718 -1867 -1992 -1996 -1324
5919 -1324 -1352 -1791 -2167 -2166 -1608 -1529 -1855 -2069 -2505 -2241 -1650 -1585 -2138 -2346 -2349 -2190 -1454 -1440 -2182 -2452 -1727 -1159
5941 -1159 -1362 -1727 -1780 -1661 -1304 -926 -811 -1297 -1373 -1137 -873 -500 -830 -1367 -861 -160 46 -355 -57 -356
5961 -356 -413 226 654 50 55 505 541 684 837 930 689 1060 1170 862 993 1079 1582 1451 1715 1759 1037 1586
5983 1586 1959 2045 1835 1606 1696 2030 2567 2089 1758 1552 1746 2498 1889 2083 1325 1504 2308 2682 1821 1143
6003 1143 1437 1659 2134 2021 1763 727 1232 1813 1873 1197 748 278 1041 1668 1256 655 20 216 493 816
6023H16j05r33o48R45M56l80l51m48l41K85P16n78p49j66O03N5K64o06n20j27
6043a812M66M47j64m82n32L31L62J5l67l95k17N28J53L23m81l08J57M62j35L77
6063a272n68l58K21O37p4j86j76K63n31O82K97n56L26j13J85J79K95n4n4L2L31
6084d94j49K23K55m86J33L88L48p0O5K38m23M9Q47qm42J99m4p0P97J40p63R7L47
6107A177K27P3R5l47M9N79J09K35n47n8j28K71N06J01q64j79L89N65J52j93n46
6128A666m94M99P07m91o79K29j63M20J70j95r40J54L01J02O7l50m34j38M56L12
6148A199m91j92n97L08M63k22o69l21K96K9j5J18k20n37k9M80j62j1o27K09m05
6169a396M34r0n46j34M50l85r9L99k94m91L55P3m6l8N4J7m93K45j7K97L9k57k77
$$ plain form
6023 816 711 -222 -870 75 531 151 -200 -648 -989 -704 12 -566 -1315 -1481 -878 -823 -559 -1165 -1685 -1812
6043 -1812 -1346 -899 -1063 -1545 -2077 -1746 -1384 -1369 -1736 -2131 -2348 -1820 -1667 -1344 -1825 -2133 -1976 -1514 -1649 -1272
6063 -1272 -1840 -2198 -1977 -1340 -1414 -1600 -1776 -1513 -2044 -1362 -1065 -1621 -1295 -1408 -1223 -1044 -749 -803 -857 -825 -494
6084 -494 -643 -420 -165 -651 -518 -130 218 148 213 451 28 77 924 916 474 673 629 559 1356 1496 733 830 1177
6107 1177 1404 1477 1572 1225 1274 1853 1962 2197 1650 1592 1464 1735 2241 2342 1478 1299 1688 2253 2405 2212 1666
6128 1666 1172 1671 2378 1887 1208 1437 1274 1694 1864 1669 729 883 1184 1286 1353 1003 569 431 887 1199
6148 1199 708 516 -81 227 690 468 -201 -522 -226 -197 -212 -94 -314 -851 -880 -400 -562 -573 -1200 -991 -1396
6169 -1396 -962 -1052 -1598 -1732 -1282 -1667 -1766 -1367 -1661 -2152 -1797 -1724 -1770 -1808 -1754 -1737 -2230 -1985 -2002 -1705 -1666 -1923 -2200
6192b200m1N73K17k21J31j90k79N26K60j38m55J13L70J94J22L5l80L26L33J53
6212e51L2j68k85M21L92N34n66N2j33J86O16J07m23m70R24L88J7j52n2j95o3R04
6234A515l89j83K69r6K51L66n5k23j67L54J41j67J32p9q6K40O5k7m05J34J8Q9
6256A697M57m49k4k32M43m6q07J180m42l56k39J05n93L12O87r33J27r4%K52Nn08
6278E42o34L39N47l79r1l66k78R6N24O6j056j9L21j4M3L53q68o96Q32L83l63m34
6300a152l73k86N52Q51n63q88l10O31L39L18m18r73n28J223O25j45p95m47L80
6319a959O51N31o34r18L82J56L61K94k99j047O53R73N68r74l51PM59P00K01p50
6339i96m33k2Q34O62j63p73k35Q43O28j30k71l48L32K57O88r8n82k9M18L39L79
$$ plain form
6192 -2200 -2241 -1668 -1451 -1672 -1541 -1731 -2010 -1484 -1224 -1362 -1817 -1704 -1334 -1140 -1018 -983 -1363 -1037 -704 -551
6212 -551 -519 -687 -972 -551 -159 375 -191 -139 -272 -86 530 637 214 -256 668 1056 1073 921 869 674 611 1515
6234 1515 1126 943 1212 1116 1367 1733 1678 1455 1288 1642 1783 1616 1748 1669 1583 1823 1888 1861 1456 1590 1608 1697
6256 1697 2154 1705 1681 1449 1892 1846 1039 2219 1777 1421 1182 1287 694 1006 1693 760 887 793 793 1045 1050 542
6278 542 -92 247 794 415 324 -42 -320 -224 300 366 -690 -709 -388 -402 -359 -6 -874 -1570 -738 -355 -718 -1152
6300 -1152 -1525 -1811 -1259 -408 -971 -1859 -2169 -1538 -1199 -881 -1299 -2272 -2800 -1577 -952 -1097 -1892 -2339 -1959
6319 -1959 -1308 -777 -1411 -2329 -1947 -1791 -1430 -1136 -1435 -2482 -1829 -856 -288 -1262 -1613 -1606 -1147 -447 -246 -996
6339 -996 -1429 -1451 -617 45 -118 -891 -1126 -283 345 215 -56 -404 -72 185 873 775 193 164 582 921 1300
6360A300j7q07K23M24k6q1j45M38n54N55K00jm23L93K85m38M17k66l39M77K04
6381A819j38j06K85j25o1k98P5p5K20L10q19l3J25M86k11k45j79m36N07J17q2
6402A136n45k41Q5J18K87J1o98m06P35l15j25J42n66P1K43M92n34o12N9l74O58
6423c79K03p34m02q6J121l75r3n53k85r5Q10O9n57o75L61J63R6O39j108q8K13
6444a755K50j85J79q5n86M76P24k53k28l3K10k18P32k50k79jK93j60mK65P7k59
6466a090N18j54j35r3N92j27l93N68J53P3mM50l37n2J52K30J02K94l22k42N32
6487G15K98l45k08L05Q4K9N54j56n64k96Q26J87K08m47m28L25N44L9j95o6k36
6508A173K54K85L28p37o20M10P59r6k4m20n92M52O40r1o14j03J4K01K34j77n43
$$ plain form
6360 1300 1283 476 699 1123 1097 1016 871 1309 755 1310 1510 1509 1086 1479 1764 1326 1743 1477 1138 1615 1819
6381 1819 1681 1575 1860 1735 1674 1376 1451 1376 1596 1906 1087 1054 1179 1665 1454 1209 1030 594 1101 1218 1136
6402 1136 591 350 435 553 840 851 153 -253 482 167 42 184 -382 -311 -68 424 -110 -722 -663 -1037 -379
6423 -379 -176 -910 -1312 -1398 -277 -652 -745 -1298 -1583 -1678 -868 -799 -1356 -2031 -1670 -1507 -1411 -772 -1880 -1968 -1755
6444 -1755 -1505 -1690 -1511 -1596 -2182 -1706 -982 -1235 -1463 -1496 -1286 -1504 -772 -1022 -1301 -1302 -1009 -1169 -1173 -908 -831 -1090
6466 -1090 -572 -726 -861 -954 -362 -489 -882 -314 -161 -88 -92 358 21 -31 121 351 453 747 425 183 715
6487 715 1013 668 460 765 849 878 1432 1276 712 416 1242 1429 1637 1190 762 1087 1631 1670 1475 1409 1173
6508 1173 1427 1712 2040 1303 683 1093 1852 1756 1732 1312 720 1172 1812 1721 1107 1004 1018 1219 1453 1276 733
6529G33k55K86N11j74m98k37j67L92K31j18n68o2l82L87N46m49n19O5J03k08L3
6550c50J95p11l76M06K58k58k86J31k37L57K04k96l29J43k17j44N31m19n5l70
6570a823L59p7N8J75k19m54L58M19r5j35j48J77k21O00J62q14K90j40L32J38J87
6591h71l62m71Q06M27k66j11J28k34K79O79ok08n69Q4O65N00L9m62l11M86M94
6612G16k00J24l59M5K40P64n99k52J03K36M29N92n65m68R7R9N02M2k47k45l57
6633F97O92N57l55n03l0K75K59P6m43J30l14N11j78J10l21j85J78M07k47m16M16
6654A316l51J75m4p0l72j13M13q4k58J7m03K56J10l07m24J08r0K31K39m59j59
6675b69k31M66Q0m20m46j42M32K66l33k58p16M72M54J59n84p73M30L01N67j94
$$ plain form
6529 733 478 764 1275 1101 603 366 199 591 822 704 136 74 -308 79 625 176 -343 -278 -175 -383 -350
6550 -350 -155 -866 -1242 -836 -578 -836 -1122 -991 -1228 -871 -667 -963 -1292 -1149 -1366 -1510 -979 -1398 -1453 -1823
6570 -1823 -1464 -1541 -1483 -1308 -1527 -1981 -1623 -1204 -1299 -1434 -1582 -1405 -1626 -1026 -864 -1678 -1388 -1528 -1196 -1058 -871
6591 -871 -1233 -1704 -898 -471 -737 -848 -720 -954 -675 4 -2 -210 -779 -695 -30 470 509 47 -264 222 716
6612 716 516 640 281 326 566 1330 731 479 582 818 1247 1839 1274 806 903 1002 1504 1546 1299 1054 697
6633 697 1389 1946 1591 1088 1058 1333 1592 1668 1225 1355 1041 1552 1374 1484 1163 978 1156 1563 1316 900 1316
6654 1316 965 1140 1096 1026 654 541 954 870 612 629 226 482 592 285 -139 -31 -121 110 349 -110 -269
6675 -269 -500 -34 46 -374 -820 -962 -530 -264 -597 -855 -1571 -1099 -645 -486 -1070 -1843 -1413 -1112 -545 -739
6695g39j067k38P61L09M8l07m61m27O87M02L5q63p7J48Q40J25l80o92j74Q77J82
6716a011O0n53l28M39O23M10l92n21j02L54J151k51n81l53M83M47K20q4k39n09
6736g37O25O89K58n19o59L35O18N50l57o40J96K29N11j47R7m31j16M64M32l50
6756A048n2j55L20L17J32J8m99J18M95k72j2K27m95nJ91L62m11J73n4j92j47L58
6778A465j05l68L54k09j68J36M58n82m36K75N2l28O87n22l15P7J05n05O65k88
6798D48k37m99M17L8n9r7m79KL23L37m75m26r8J72K15n9J6p90k30R15K6k5n03
6821a068k37K1K54J51j63n16k72O63M53N7p44l21J03L76N33j96m81j36j30N58
6841a095M54o13j53J90J79K90l0m05k66O06K17p0l31K77l64K82O72k10l79m3J86
$$ plain form
6695 -739 -1806 -2044 -1283 -974 -926 -1233 -1694 -2121 -1434 -1032 -997 -1860 -1937 -1789 -949 -824 -1204 -1896 -2070 -1193 -1011
6716 -1011 -951 -1504 -1832 -1393 -770 -360 -752 -1273 -1375 -1021 130 -121 -702 -1055 -572 -125 95 11 -228 -737
6736 -737 -112 577 835 316 -343 -8 610 1160 803 163 359 588 1099 952 1049 618 502 966 1398 1048
6756 1048 996 841 1161 1478 1610 1628 1129 1247 1742 1470 1458 1685 1190 1185 1376 1738 1327 1500 1446 1254 1107 1465
6778 1465 1360 992 1346 1137 969 1105 1563 981 545 820 872 544 1231 709 394 471 576 71 736 448
6798 448 211 -288 129 167 108 11 -468 -466 -143 194 -281 -707 -805 -633 -418 -477 -461 -1251 -1481 -566 -540 -565 -1068
6821 -1068 -1305 -1284 -1030 -879 -1042 -1558 -1830 -1167 -714 -657 -1401 -1722 -1619 -1243 -710 -906 -1387 -1523 -1653 -1095
6841 -1095 -641 -1254 -1407 -1217 -1038 -748 -778 -1183 -1449 -843 -626 -696 -1027 -750 -1114 -832 -160 -370 -749 -792 -606
6862f06o9J81J81p8L44o6K0M79Q0l85m13O75J82j64mK14j63j24O46N6l3j72P7
6885H58j97L31K4J39j49L3n67M32L98J27k83m36K03M89M5j7j77m44P9N12l3N7
6907A424n71J84k76N80K40q24J39j16K50L40j09q09l7K67L52n23k27k49lL23L32
6928F87j46l98j72j34J19M84o24l45O5M42l44M57p41n06L27j14K66K59n56j37
6948a111J78J08No4j78j10L30n52Q9R2l3j29Q4N69n80j70J27j37R5N30j62k73
6970a292j64J64K56J26N8l16j67J74J83L24O0p5l04K42L52lk48K19m88L95O25
6991A21J61n24m78P47K86L40l12l25o6J07J004k92k49n39J34N47O60K7q12m38
7011I9N66K30N67n23l38n9Q16K62mo15l22p1Q97N45m95o93P4M19J40Q56j215l12
$$ plain form
6862 -606 -675 -494 -313 -391 -47 -113 -93 386 466 81 -332 343 525 361 357 571 408 284 930 986 953 781 858
6885 858 661 992 1016 1155 1006 1039 472 904 1302 1429 1146 710 913 1402 1447 1430 1253 809 888 1400 1367 1424
6907 1424 853 1037 761 1341 1581 757 896 780 1030 1370 1261 452 415 682 1034 511 284 35 32 355 687
6928 687 541 143 -29 -163 -44 440 -184 -529 -464 -22 -366 91 -650 -1156 -829 -943 -677 -418 -974 -1111
6948 -1111 -933 -825 -820 -884 -1062 -1172 -842 -1394 -1305 -1213 -1246 -1375 -1291 -722 -1302 -1472 -1345 -1482 -1387 -857 -1019 -1292
6970 -1292 -1456 -1292 -1036 -910 -852 -1168 -1335 -1161 -978 -654 -594 -669 -973 -731 -379 -382 -630 -411 -899 -504 121
6991 121 282 -242 -720 27 313 653 341 16 -50 57 1061 769 520 -19 115 662 1322 1349 537 99
7011 99 665 895 1462 939 601 542 1358 1620 1616 1001 679 608 1505 2050 1555 862 936 1355 1495 2351 1136 824
7033H24K4M74L06l37n79L9J45N84L18j166l06L07J27k7K83l60n12K53L65k58O3
7054E67j80j65K70L7k03m38n5J16j08Q4K2p77M17K18j89k10k53N42l36q2K00n81
7076a104J55L65k7l95j75N70m09K93k97O5m30j68O29k0r3M9n24L40N84k88l32
7097a212j85R5J85M07l16k36m30R60J24K92m91n31N39J88L05l72r1k90L15M01
7117c43R7j54m82L16N52J63k38k97k25N08Q17l07l33Q0j98M04K35L10p46l96P97
7138E60L16N0l64j46L97o8L03L43m85Nn4J17M04k23k08J21lr3M32J56p00l32N26
7161A054O9j1k26N4J24m75K28L61j09j00k26K75k80K20j27k78J05k00oJ20K43
7182H15p05r0J49K69J06k53p26K25L11L75o64J04p13L71k6O11j54p82J45J5J74
$$ plain form
7033 824 848 1322 1628 1291 712 751 896 1480 1798 632 326 633 760 733 1016 656 144 397 762 504 567
7054 567 387 222 492 529 326 -112 -167 -51 -159 -75 -53 -830 -413 -195 -384 -594 -847 -305 -641 -723 -523 -1104
7076 -1104 -949 -584 -611 -1006 -1181 -611 -1020 -727 -1024 -959 -1389 -1557 -928 -948 -1041 -992 -1516 -1176 -592 -880 -1212
7097 -1212 -1397 -1302 -1117 -710 -1026 -1262 -1692 -732 -608 -316 -807 -1338 -799 -611 -306 -678 -769 -1059 -744 -343
7117 -343 -246 -400 -882 -566 -14 149 -89 -386 -611 -103 714 407 74 154 -44 360 595 905 159 -237 560
7138 560 876 926 562 416 813 745 1048 1391 906 911 857 974 1378 1155 947 1068 1065 972 1404 1560 860 528 1054
7161 1054 1123 1112 886 940 1064 589 817 1178 1069 969 743 1018 738 958 831 553 658 458 452 572 815
7182 815 110 20 169 438 544 291 -435 -210 101 476 -188 -84 -797 -426 -452 159 5 -777 -632 -617 -443
7203d43J49l67k39j33J85M16p9o02m81K38O62J04m63n19n8L93N23J55o23m69O3
7224a588Q99J06l40l56m89M22O70M30n23o84R7N89L43K07o51n03N7J292l45k37
7244f04N3j13K54J62L18n47J36l05N00J0M99l24l77L46M38P5k31j75l60M26L92
7265E73J98Rl77L28M8L19k2m73q3O66RK8j34k26j28L83k1j86K68l52K08k11L25
7288A149J27J44o84K13o3L81P8k42o98M19J49j03M55k11o47Q1L66L7m18J79j07
7309F05k5j52K05m07k78k36K37J02K40l32j19j62O00j51j41j49l1m92N48l1j29
7330b98l99J31j06j16J96N7m58L44J81n31K11l37j6K08RL8r4m0qj62K13J96l37
7353a118J24J22j00j6L30LJn19M35n03L90L14Ml78J41o0P06o3m08k61j32O45M61
$$ plain form
7203 -443 -294 -661 -900 -1033 -848 -432 -511 -1113 -1594 -1356 -694 -590 -1053 -1572 -1630 -1237 -714 -559 -1182 -1651 -1588
7224 -1588 -689 -583 -923 -1279 -1768 -1346 -676 -246 -769 -1453 -1356 -767 -424 -217 -868 -1371 -1314 -22 -367 -604
7244 -604 -551 -664 -410 -248 70 -477 -341 -646 -146 -136 363 39 -338 8 446 521 290 115 -245 181 573
7265 573 771 780 403 731 779 1098 1076 603 520 1186 1195 1223 1089 863 735 1118 1097 911 1179 827 1035 824 1149
7288 1149 1276 1420 736 949 886 1267 1345 1103 405 824 973 870 1325 1114 467 548 914 951 533 712 605
7309 605 580 428 633 226 -52 -288 -51 51 291 -41 -160 -322 278 127 -14 -163 -194 -686 -138 -169 -298
7330 -298 -697 -566 -672 -788 -592 -535 -993 -649 -468 -999 -788 -1125 -1141 -933 -924 -886 -980 -1020 -1028 -1190 -977 -781 -1118
7353 -1118 -994 -872 -972 -988 -658 -655 -654 -1173 -738 -1241 -851 -537 -533 -911 -770 -830 -124 -187 -595 -856 -988 -343 118
7376A18j51k61k31j57J027ll69k19r2K78M04K30m86n75K44N44Q14k05j017q4O76
7397D85O48J33p09k62m8Q46R5J0l66n97K07J027N8o55n45r9Q70O31q7p92m35Q9
7419E04N97O30m95q66l44O26O02P9q27j81j40K61P02n7p74n7K75J00N8j21l27
7440B45r9R8K94K06n42m33j68M69M85n03l18j47L57o7K47k00k37j80N8P3R5k85
7462e52l13o1L62L7K94m31j65l04R8N68j4j05l48J19J10M7K10n42l9j50L43l6
7484h72L15m6p72J69M62J72k07k26k22N34K15K68q12L63j38K81j33O77l49k60
7504e81J9M51j79N10p16o4l4Q50K65l74m70j55P16O65j84l59k26K62L50Nj38k31
7526C82N4P8O85k23m32k86K32L50L36j16m31j49L58K36j12l05l22J43M24M04l30
$$ plain form
7376 118 -33 -294 -525 -682 345 342 -27 -246 -338 -60 344 574 88 -487 -243 301 1115 910 -107 -191 485
7397 485 1133 1266 557 295 247 1093 1188 1198 832 235 442 1469 1527 872 327 228 1098 1729 1642 850 415 504
7419 504 1101 1731 1236 370 26 652 1254 1333 506 325 185 446 1148 1091 317 260 535 635 693 572 245
7440 245 146 244 538 744 202 -231 -399 70 555 52 -266 -413 -56 -123 124 -76 -313 -493 -435 -362 -267 -552
7462 -552 -865 -926 -564 -527 -233 -664 -829 -1133 -1035 -467 -481 -586 -934 -815 -705 -658 -448 -990 -1029 -1179 -836 -872
7484 -872 -557 -603 -1375 -1206 -744 -572 -779 -1005 -1227 -693 -478 -210 -1022 -659 -797 -516 -649 28 -321 -581
7504 -581 -562 -111 -290 220 -496 -560 -594 256 521 147 -323 -478 238 903 719 360 134 396 746 751 613 382
7526 382 436 514 1199 976 544 258 490 840 1176 1060 629 480 838 1074 962 657 335 478 902 1306 976
7547I76q8p8j56K24L51l74m29M74J26j69r7J00l61M08j20l11J96j58j9j37J54
7568E12m5k35J52Q5k88J90m73N94o17M4K64n32Q8K38P1l65l0k05r1K45L83m51
7590d66m44J82J72L24j73n57K07J23K08k41r2m83m1L21Q42o45k18l92J61L81K46
7611e85p0j43p57Q04N20k14j72m38j26K80K73j2n77k5L58L56q9%q7j76O04L11
7633C5k06j84ol25K34L82n1k46K07L02J41K24j32j99m79O07J50J67j00l04l4N04
7655F87L4nJ7o23K84L98P1j72J07l70K48L60K02j14k32n64P16K59j9j46m61k81
7677C96M19N78k83n03K7j95M08O35l34l06n17M43L28p9k60m07l40O24J74%m30
7698C78o39J52O60m4p8q43j26N78J40j40j53k04j89L58Q6J20n36J0l73N47M7j75
$$ plain form
7547 976 888 810 654 878 1229 855 426 900 1026 857 760 860 499 907 787 476 672 514 495 358 512
7568 512 467 232 384 469 181 371 -102 492 -125 -81 183 -349 -261 -23 48 -317 -347 -552 -643 -398 -15 -466
7590 -466 -910 -728 -556 -232 -405 -962 -755 -632 -424 -665 -757 -1240 -1281 -960 -118 -763 -981 -1373 -1212 -831 -585
7611 -585 -655 -798 -1555 -751 -231 -445 -617 -1055 -1181 -901 -628 -640 -1217 -1242 -884 -528 -617 -617 -704 -880 -276 35
7633 35 -171 -355 -361 -686 -452 -70 -121 -367 -160 142 283 507 375 176 -303 304 454 621 521 217 183 687
7655 687 721 716 733 110 394 792 863 691 798 428 676 1036 1238 1124 892 328 1044 1303 1284 1138 677 396
7677 396 815 1393 1110 607 634 439 847 1482 1148 842 325 768 1096 1017 757 350 10 634 808 808 378
7698 378 -261 -109 551 507 429 -414 -540 38 178 38 -115 -319 -508 -150 -64 56 -480 -470 -843 -296 -249 -424
7720d24l67j48N33o0k07J9n65L88J30K54l93J93j30k16L10o3k94j18K04K29R9
7741f26J46j07n15M16l38M88l38K50j36MN26l47j35K48l70R7K17K42n0k97K30
7762c95j68K44K96k61M04j50o3q7N05r7k18Q2q4J60M18m33r7K67j83N60P2p1m04
7785B97K82k7J37M18r91K17K90J8J09k7p4q1j63Q05j05j36l00j76Q2P01k36o08
7807D32J2J77M26j37J48n50M1J22M4J25k64j62J62l1N41k37n44p9J97k30M10j11
7829D92k59q7n4K87J39o19k8J60J0k13j08J5j41J71J37m8p8k39O9O5j71m08N96
7852c12J02k01k68R4l72M10k03K66k98M0R9p7j06L25m97J97n8R2l00P2K38j04
7874h61n8L71m50j48L06L34J0km04p0K84L50K7j21k63J32L57K34O8j020K82N33
$$ plain form
7720 -424 -791 -939 -406 -466 -673 -654 -1219 -831 -701 -447 -840 -647 -777 -993 -683 -746 -1040 -1158 -954 -725 -626
7741 -626 -480 -587 -1102 -686 -1024 -536 -874 -624 -760 -756 -230 -577 -712 -464 -834 -737 -520 -278 -328 -625 -395
7762 -395 -563 -319 -23 -284 120 -30 -93 -180 325 228 10 92 8 168 586 153 56 323 140 700 772 701 297
7785 297 579 552 689 1107 116 333 623 641 750 723 649 568 405 1210 1105 969 669 493 575 1276 1040 432
7807 432 444 621 1047 910 1058 508 549 671 715 840 576 414 576 545 1086 849 305 226 423 193 603 492
7829 492 233 146 92 379 518 -101 -129 31 41 -172 -280 -265 -406 -235 -98 -146 -224 -463 -394 -329 -500 -908 -312
7852 -312 -210 -411 -679 -585 -957 -547 -750 -484 -782 -742 -643 -720 -826 -501 -998 -801 -859 -767 -1067 -995 -757 -861
7874 -861 -919 -548 -998 -1146 -840 -506 -496 -498 -902 -972 -688 -338 -311 -432 -695 -563 -206 28 96 -924 -642 -109
7896a09R6OK90p38j0L66L96j90j77q0j13P80L3K50q16j8J016o02K06m3m73K31
7918C01M10K5J83l48J3k9O44N0n98j47Q1J7J61Q3k34l0M4K08m6l64K93l56J87
7941E48j4L57j21m81K54J44M5J25k80l55l6J97L12m43k8j43O6L72k28m5p7k8k24
7964h3J05M69k70l46K28k71Q5J23J73k96l02J21j06J23j56j86K9N6Q1l3j02l01
7986h59q5M01O5r3l6m20J03N06J46k99m50L3L89j49K07n00J38L0J88N31o71j34
8008i59pM67M7M1J37o74J0M59N6J5o0J13l40P78j6o76L07l16M67J51o4j68O4K84
8032A16J52j41J09k29j23J10J45J65k08K44j67L51K71l80k92N03N3J25k33J46
8052G17j69J14M46k54k30j88K27M06m56p5N87m76K07j17J59l38L93L3n20J18K07
$$ plain form
7896 -109 -13 -7 283 -455 -465 -99 297 107 -70 -150 -263 517 550 800 -16 -34 982 380 586 543 70 301
7918 301 711 736 919 571 584 555 1199 1249 651 504 585 602 763 846 612 582 626 834 788 424 717 361 548
7941 548 534 891 770 289 543 687 732 857 577 222 186 383 695 252 224 81 147 519 291 246 169 141 -83
7964 -83 22 491 221 -125 103 -168 -83 40 213 -83 -385 -264 -370 -247 -403 -589 -560 -504 -423 -456 -558 -859
7986 -859 -944 -543 -478 -571 -607 -1027 -924 -418 -272 -571 -1021 -988 -599 -748 -541 -1041 -903 -873 -685 -154 -825 -959
8008 -959 -966 -499 -452 -411 -274 -948 -938 -479 -423 -408 -468 -355 -695 83 67 -609 -302 -618 -151 0 -64 -232 -168 116
8032 116 268 127 236 7 -116 -6 139 304 96 340 173 524 795 415 123 626 679 804 571 717
8052 717 548 662 1108 854 624 436 663 1069 613 538 1125 649 856 739 898 560 953 986 466 584 791
8073G91l13L26J87ol62J63j77m7L01j55l21j83N48m67R7n2j94j00L68o0j25m60
8095b41N61m25L71k30j66j60K87N8l17j51j54J91j83M53r0m29J87l0k25M9K15
8116d29j7n76L44L7kk03P7K22P3j23m08K67j71m7L26l16m8M58j80J21m81J65M6
8139h65K25K9r2j45K42M4L25m98Q8J27L82j05Q6k87j28K08N02j83o8o6j09K38
8161e0L49M5l57k0J36M14j15J98j04r6J73L12k42J0n2QJ79K31k42n32P0M93K6
8184H34j44n3n74L51K10M25o39
$$ plain form
8073 791 478 804 991 985 623 786 609 562 863 708 387 204 752 285 382 330 136 36 404 344 219 -241
8095 -241 320 -105 266 36 -130 -290 -3 55 -262 -413 -567 -376 -559 -106 -196 -625 -438 -468 -693 -644 -429
8116 -429 -446 -1022 -678 -641 -643 -846 -769 -547 -474 -597 -1005 -738 -909 -956 -630 -946 -994 -536 -716 -595 -1076 -911 -865
8139 -865 -640 -611 -703 -848 -606 -562 -237 -735 -647 -520 -138 -243 -157 -444 -572 -364 138 -45 -113 -179 -288 -50
8161 -50 299 344 -13 -33 103 517 402 600 496 400 573 885 643 653 601 609 788 1019 777 245 315 808 834
8184 834 690 637 63 414 624 1049 410
8191D10
$$ Imaginary data points
##PAGE= N=2
##DATA TABLE= (X++(I..I)), XYDATA
0@%%%Kk%qJ6j6J6k4L2m0M8n6P2q8J04j25J49j73K02k35K67l06L54m03M57n20N87
30C10o60P43q35R33j036J153j286J428j584J756j945K154k384K641k927L245l607
47a901M022m493N043n696O480p443Q660j0260J2459j5681K0883l0670N5361k29411
61a92647n20903L49507N20541Q0864l25894j42250J05488M7538j41996k4182J76228
72f7706J00565j54659j00055J55205J28284k13710k75298J07245M01274J55088
82B36233k78176l05236O8772K55723L4248j73644k4449J79744Q6896j32279j31201
93a83369K7591P2487n741J2620J30740R6390j53338k66601j0599K82803J92921
104A95904j25445k07426M289J48224L6240j17562o7827R6545J18153j2296p3422
$$ plain form
0 0 0 0 0 2 0 0 -8 8 -8 8 -16 16 -24 24 -32 40 -48 56 -69 80 -93 109 -126 141 -165 189 -214 243 -277 310
30 310 -350 393 -442 491 -545 608 -678 750 -834 922 -1023 1131 -1253 1388 -1539 1706 -1901
47 -1901 2121 -2372 2671 -3025 3455 -3988 4672 -5588 6871 -8810 12073 -18597 36764 -192647
61 -192647 -713550 -364043 156498 237362 -88532 -230782 -125294 -77756 -219752 -243934 -67706
72 -67706 32859 -121800 -221855 -66650 61634 -152076 -427374 -320129 81145 236233
82 236233 -41943 -347179 -278407 -22684 11564 -162080 -186529 -6785 80111 -52168 -183369
93 -183369 -155778 -83291 -89032 -76412 54328 150718 -2620 -269221 -279820 2983 195904
104 195904 70459 -136967 -132678 15546 51786 -65776 -133603 -37058 81095 68799 -4623
115d623j3597L881m8284j7339J01586J24729j2710j45426r7765O8368J29174R601
127I7595q9987j6016Q5681L4122q4321q1240L1212R0556L0747m6395k9496K9767
139E2225O788n6733k2605O7814O2395k5082n1024J739K8451j2570m3775N604Q2468
152I5695N8608n9741j04794j0337P7747M9707k4054l9042k700J8845m570l0017
164B5347l436L0776N972l1212k858L5490j59n4630l3552L7827O1796M621o1403
177A4579m4046K8974M0857j8291l8247P888K8811k664k5865j7384l346Q20j04
190b8018R007K2626J322m8816m8448K0977O4092K4050l8261m9237r396L7312L5693
203g097j2529l5188m652K1706J5769O541m022k8065k9301J0614M9383L6831k1303
$$ plain form
115 -4623 -18220 -14339 -62623 -79962 21624 146353 133643 -11783 -109548 -41180 87994 97595
127 97595 7608 -8408 77273 111395 27074 -54166 -22954 67602 98349 51954 22458 52225
139 52225 59013 2280 -20325 47489 109884 84802 33778 35517 63968 51398 7623 13227 95695
152 95695 154303 94562 -10232 -20569 57178 106885 82831 43789 41089 59934 55364 25347
164 25347 21911 52687 58659 27447 24589 60079 59920 5290 -28262 9565 71361 75982 14579
177 14579 -29467 -493 40364 22073 -16174 -8286 20525 17861 -8004 -25388 -28734 -27914 -28018
190 -28018 -19011 3615 4937 -43879 -92327 -71350 -7258 16792 -21469 -70706 -80102 -42790 -7097
203 -7097 -19626 -54814 -59466 -37760 -21991 -15450 -19472 -47537 -76838 -66224 -16841 19990 -1313
216a313o9824m2505M3300P5693J1203n3970m2263O826L7358K8787r970l6359j4667
229f7704K5518L6616J6260j8637m8168k5858M2618P2609K0871m9858o4913j1289
241g1935N8913O3243r012o0607k4933L3441L9252M997k7793l2594K172M4273M2408
254F1825k143m2973m6261L3O4048O2946j3733o7584l4382L0453N2986J8573l3790
267D9998m3570O177M8054K5922k4086m3485k6188J5784N1951L4680k4733n8747
279A1757l3599J8977N3844L4504k6957n3307r582L5554K7133q642k6576j7567
291E539J2426L2729J3829k1621l3106j8555R162L6699K8711j8902m6664k1203
303b0956J5765K7286J2766j5121k7816m448J9879Q601j2173j4175p977M740K1668
$$ plain form
216 -1313 -71137 -113642 -70342 5351 16554 -37416 -79679 -72853 -35495 -6708 -16678 -53037 -67704
229 -67704 -42186 -5570 10690 -7947 -56115 -81973 -39355 33254 54125 4267 -60646 -71935
241 -71935 -13022 50221 41209 -19398 -44331 -10890 28362 33359 5566 -27028 -24856 19417 61825
254 61825 59682 16709 -29552 -29519 34529 97475 83742 16158 -18224 12229 65215 83788 49998
267 49998 6428 12605 60659 86581 62495 19010 -7178 8606 60557 95237 70504 11757
279 11757 -21842 -2865 50979 85483 58526 5219 -4363 31191 58324 49682 23106 5539
291 5539 17965 50694 64523 42902 9796 -8759 403 37102 65813 46911 247 -20956
303 -20956 -5191 22095 34861 19740 -8076 -12524 7355 15956 3783 -10392 -18369 -13629 8039
316H039J5719j3561k9339j6770P066K8698K4560j4639m1138j5866K0252K2129
328d850q84j8368k0516J128K2473J2095j5021k2456j0560O622K6573K2046j4142
341a5860l6703j4384K0896L2182J4304j9136l1808m06L1263J8546j2572k0764
353c4442p866J1046K1967Q011j8311k0608k64J3592J7084P954j3479k2439J757
366c5998K3457J2732p518j2791l908J2788J8401j416j8135k118J4601Q999J63
379I257k549n073l65R949N416o630l960M323M023M363J323j0699p472J3169J7020
394C2095k095j2834p412O090J9391J2675j4961k1724N960K3773J1810q283j9612
407B4873j3856J2125K7385N859k2981k3893l078K0027K6028k538l7667k6770J8150
$$ plain form
316 8039 23758 10197 -19142 -35912 -28846 -148 24412 9773 -31365 -47231 -26979 -4850
328 -4850 -5734 -24102 -44618 -43490 -21017 -8922 -23943 -46399 -56959 -50337 -23764 -1718 -15860
341 -15860 -52563 -66947 -46051 -13869 435 -18701 -50509 -50915 -19652 -1106 -13678 -34442
353 -34442 -42308 -31262 -9295 -1284 -19595 -40203 -40467 -26875 -9791 -1837 -15316 -37755 -35998
366 -35998 -12541 191 -7327 -20118 -24026 -11238 7163 5747 -12388 -14506 95 9094 9257
379 9257 6708 1635 1270 11219 16635 10005 6045 10368 14391 18754 20077 9378 1906 15075 32095
394 32095 30000 17166 9754 15844 35235 47910 32949 11225 17185 40958 52768 44485 24873
407 24873 11017 23142 50527 56386 33405 9512 6434 26461 52489 49951 12284 -14486 3664
420C664L6261J0621k4580l6900r823L4265L7703q115m0951k5414J3549L7457K3801
433E1538k1221m6912j5792L2680L7814K423l5655m1980m40M4938L4153k1701m8731
446b8886k2148K3298M2843J5679l5501m6380j138L9716L2202o283l7558l3066
458e7222J3240M5177K0988k6923l8487j1399K4930L5542N093l7454l3795Q658
470e1652L4183J9295j2264l4094k0175J9564L5670P278k4358k5052j549K3505
482b9649K7467r25k8482j6629J5045K4384J1528p978k1229q926J7619K2738J415
495F378j3534j2237l363J2487J7416N41j5897q164M885R422R124J467j0033o044
509g552Q726R517K716J175k853o143K040J0935O378o19l593o608k392J1252J1352
$$ plain form
420 3664 39925 50546 25966 -10934 -20757 13508 51211 43096 2145 -23269 -9720 27737 51538
433 51538 30317 -16595 -32387 293 38107 40530 4875 -37105 -37545 7393 41546 19845 -28886
446 -28886 -51034 -27736 15107 30786 -4715 -51095 -52233 -12517 19685 13402 -24156 -57222
458 -57222 -43982 1195 22183 -4740 -43227 -54626 -29696 5846 10939 -26515 -60310 -51652
470 -51652 -17469 1826 -10438 -44532 -64707 -45143 -9473 -2195 -26553 -51605 -53154 -29649
482 -29649 -2182 -3107 -31589 -48218 -33173 -8789 2739 -5239 -26468 -35394 -17775 4963 6378
495 6378 -7156 -19393 -22756 -10269 7147 7688 -8209 -16373 -11488 -2066 7058 8525 -1508 -7552
509 -7552 1174 10691 13407 14582 11729 5586 7626 18561 24939 24320 20727 14119 11727 22979 34331
524C4331l557r081m347L66P513J0743k974j3946m026Q105Q592M824l654j3123
538A9766n028J3576J3961n80j0015j0383k706J3052J4038o601j7352n556O120
551B2292Q359N164q800j8077m460J3606R336n021j2878j2946r26J4602J0304r380
565A1175j5571n408M371R818P789q047j6634j056J1096P208j841q487j1428k691
579a9706J1639P513n915r896p520j942P959Q293n021j1664j268L215K325M127
593a7861M30q483m394O105O530K202j845o496o072O552J0442Q37n173m542n498
608b7266K940J1545K509r978o591K795M834N993K602q177r284N894J3030P053
622b101k499r340p480Q615J7217L615r292n759O06O885J1898L077j3379r482Q475
$$ plain form
524 34331 30774 21693 17346 17712 25225 35968 32994 19048 15022 23127 31719 36543 32889 19766
538 19766 14738 28314 42275 41695 31680 21297 18591 31643 45681 39080 21728 16172 22292
551 22292 30651 35815 27015 8938 4478 18084 27420 22399 9521 -3425 -4351 10251 20555 11175
565 11175 -4396 -9804 -5433 4385 12174 4127 -12507 -13563 -2467 4741 2900 -5587 -17015 -19706
579 -19706 -8067 -554 -6469 -16365 -23885 -25827 -17868 -9575 -14596 -26260 -27528 -24313 -21988 -17861
593 -17861 -17431 -25914 -30308 -24203 -17673 -15471 -17316 -23812 -29884 -23332 -12890 -12053 -17226 -21768 -27266
608 -27266 -24326 -12781 -10272 -20250 -26841 -24046 -19212 -13219 -10617 -18794 -28078 -22184 -9154 -2101
622 -2101 -4600 -13940 -21420 -12805 4412 8027 -1265 -7024 -6418 467 12365 15442 2063 -7419 1056
637A056J3911M716n828j2883o914R515J4777J997q727q491l395Q740J4431J05
651B3010j3331n426R231Q919L465j960r586o295Q594J2038J839n678q005m914
665A1901N748J0090N7p169j475K12j191M232L509n749n853L645N289K591R01m300
681B2438p779J353Q753N154k19n145r587k687R777O587o643p592l243k321M318
696A3164P521n581j5653n606Q903J1310P05j3649j5762J390J5877O178p699j0125
710i027o573Q32J3253Q682j2668j8317M91J4360J1255k990j8294j6121O245J9690
724i182O945j2792j6710p391J0338J9179J258j9156j3443P034J4413R767k338
737a2078j6605j3367J1234K1515N174j3344j4651o45J5804J3291p229j5843o52
$$ plain form
637 1056 14967 19683 13855 972 -5942 3573 18350 20347 11620 3129 -266 8474 22905 23010
651 23010 9679 4253 13484 22403 25868 23908 14322 8027 16621 28659 30498 24820 16815 11901
665 11901 17649 27739 27796 20627 19152 19364 18173 22405 25914 20165 14312 17957 23246 25837 26738 22438
681 22438 14659 16012 24765 29919 29700 24555 14968 12281 22058 28645 22002 14410 11167 8846 13164
696 13164 20685 15104 -549 -6155 2748 14058 14763 1114 -14648 -13258 2619 8797 1098 -9027
710 -9027 -15600 -14768 -1515 7167 -5501 -23818 -23327 -8967 2288 -702 -18996 -35117 -28872 -9182
724 -9182 -2237 -15029 -31739 -39130 -28792 -9613 -8355 -27511 -40954 -33920 -19507 -9740 -12078
737 -12078 -28683 -42050 -30816 -9301 -4127 -17471 -32122 -32767 -16963 -3672 -10901 -26744 -27396
750b7396J0595P409J169o033j1570j201J5636J1357o321j1501l594P887J4057
763D94M462j0444p752P409J2150N214l340r985m319J2653J5758l182j3957l393
777A768P401P593L166n193q226J785J0176L933n437q309l770P672J4248J597j5750
792A2654q715P969J1678M817l739j2100n550J2744J4019n780j7377p523Q798J5909
806B7804N014j5857j8614J431J6068R236l458j3316j4586L567K0836Q630j6567
819A0188j9418o46J6713J6490k754k2537j4556J0231J9134O271j0480j8786r617
832a9767J3924J8964m274k1486j1909P058J4651P271j0771k1470n121J6688J6022
845b20k253j8284j4943N304K1516R245j4730j7377n51J1739J3429L687j4113j8121
$$ plain form
750 -27396 -16801 -9392 -8223 -14256 -25826 -27027 -11391 -34 -6355 -17856 -21450 -13563 494
763 494 4956 -5488 -13240 -5831 6319 11533 8193 -1792 -6111 6542 22300 19118 5161 1768
777 1768 9169 16762 19928 14735 6509 8294 18470 22403 16966 8657 4887 12559 26807 28404 12654
792 12654 3939 11908 23586 28403 24664 12564 7014 19758 33777 27997 10620 3097 11895 27804
806 27804 32818 16961 -1653 -222 15846 25082 21624 8308 -6278 -2711 18125 26755 10188
819 10188 -9230 -9876 6837 23327 20573 -1964 -16520 -6289 12845 19116 8636 -10150 -19767
832 -19767 -5843 13121 8847 -12639 -24548 -17490 -2839 4432 -6339 -27809 -32930 -16242 -220
845 -220 -2473 -20757 -35700 -30396 -8880 365 -14365 -31742 -32293 -20554 -7125 -3438 -17551 -35672
859c5672L295J9559R902q456j5717p067R434J5308N69j3727q083M203J0147P913
873h392k143j3248n470J2870J3212j767q949m381J851R332P888m343q938k23P438
888e263O661K590p084r633L358J2673L992o515m370l60K163O636L185m702l116
903B15N342N619P76r01l169K63P991O774l948m379J114J061K589N037j565o635
919A6184L95O560N91l594k047j525K092M274J27m888j601Q43k92J891L434k987
935A9457m400L604K806l884k054J363l99r9J047k660m227Q7J21j842K34j02l609
952E443k290J767k409k741J754K05l625r08K302k038j748N65j512k244K402J150
968c927k176j642j435l654J116M428k139o437j260K005j089K03q66n514j237N530
$$ plain form
859 -35672 -32377 -12818 -2916 -11372 -27089 -34156 -24722 -9414 -8845 -22572 -30655 -26452 -16305 -8392
873 -8392 -10535 -23783 -29253 -16383 -3171 -4938 -13887 -18268 -16417 -7085 803 -3540 -12478 -12701 -5263
888 -5263 1398 3988 -3096 -12729 -9371 3302 7294 779 -3591 -3951 -1788 4848 8033 3331 215
903 215 5557 11176 11952 11051 7882 8145 16136 22910 18962 14583 15697 16758 19347 24384 22819 16184
919 16184 16579 23139 23730 20136 18089 16564 18656 22930 23057 18169 16568 17411 17119 19010 22444 19457
935 19457 15057 18661 21467 17583 15529 16892 16493 16394 17441 14781 10554 10641 10762 8920 9154 9052 5443
952 5443 3153 4920 2511 -230 1524 1729 -1896 -2804 -502 -2540 -4288 -3723 -5235 -7479 -5077 -3927
968 -3927 -6103 -7745 -9180 -12834 -11718 -7290 -9429 -15866 -17126 -15121 -16210 -16007 -16873 -22387 -23624 -18094
984a8094K660l595l421k331N46N782M205l872n158J774K653J464K644j823n147
999b1713K349P667L15m063k421m56K838N926R15o132j902L301K423K415J540l151
1015a0149j700O043N585k292k606J083K676L905M805k573n424K028N297J420k69
1030G829m43k217J629M522m38m164J136L374r4J638Q09l173j973N108L432q85
1046A6090o08j79L06M013K665m434l017N445L701j961k589k308j341L978M000
1061B3761m708n758P26K715m7R93k925n799P72N293J160m476l008k609P81O234
1077A3105J237p504m917L387L260j23j902n702k936M527K854m924n165j017M15
1092e405J397J461m219o341J701M729p12l385k119k304K241N484j264p340j705
$$ plain form
984 -18094 -15434 -19029 -22450 -24781 -24235 -18453 -14248 -18120 -23278 -21504 -18851 -17387 -14743 -16566 -21713
999 -21713 -19364 -11697 -11382 -15445 -17866 -18322 -15484 -9558 -8643 -14775 -16677 -13376 -10953 -8538 -6998 -10149
1015 -10149 -11849 -5806 -221 -2513 -5119 -4036 -1360 2545 7350 4777 -647 1381 6678 8098 7829
1030 7829 7386 5169 6798 11320 10882 6718 7854 11228 11134 12772 13581 10408 8435 13543 16975 16090
1046 16090 15482 15303 15609 19622 22287 17853 14836 20281 23982 22021 19432 17124 15783 19761 23761
1061 23761 19053 13295 14021 16736 16689 17682 14757 8958 9730 15023 16183 11707 8699 6090 6871 13105
1077 13105 14342 6838 1921 5308 8568 8445 6543 841 -2095 2432 5286 362 -4803 -5820 -5405
1092 -5405 -4008 -2547 -6766 -13107 -11406 -6677 -7389 -10774 -12893 -15197 -12956 -7472 -8736 -16076 -17781
1107a7781M479K133M88k780n513l28P452K543o822n023N32K936M899N70q169o880
1123b7264N953Q260J77m319o190j684R145R913m007j0934k013P601R192M135p030
1138i065j1900J877J4065Q303n272r749n461O087J4872N156j2139j2595L095J3100
1152C74J1146j053j5196j0520J0563J9622M749j1596j2658j469J4447J6881k021
$$ plain form
1107 -17781 -13302 -11169 -10681 -13461 -18974 -19302 -11850 -9307 -16129 -21152 -20620 -17684 -12785 -12215 -20384 -27264
1123 -27264 -21311 -13051 -12874 -17193 -23383 -25067 -15922 -6009 -10016 -20950 -22963 -15362 -6170 -2035 -9065
1138 -9065 -20965 -19088 -5023 3280 -1992 -11741 -17202 -11115 3757 8913 -3226 -15821 -12726 374
1152 374 11520 10467 -4729 -15249 -4686 14936 19685 8089 -4569 -6038 8409 25290 23269
$$ [...]
8191b05
##END NTUPLES=NMR FID
##END=
