##TITLE=1H_CG-1102-1
 CDCl3, 8 sc, 
 10.4.2019
##JCAMPDX= 6.0         $$ Bruker NMR JCAMP-DX V2.0
##DATA TYPE= NMR FID
##DATA CLASS= NTUPLES
##ORIGIN= UXNMR, Bruker Analytische Messtechnik GmbH
##OWNER= root
$$ XWIN-NMR		Version 3.5
$$ Wed Apr 10 13:56:01 2019 Russian Standard Time (UT+4h)  she@DPX200
##.OBSERVE FREQUENCY= 200.1315
##.OBSERVE NUCLEUS= ^1H
##.DELAY= (6, 6)
##.ACQUISITION MODE= SIMULTANEOUS
##.ACQUISITION SCHEME= undefined
##.AVERAGES= 8
##.DIGITISER RES= 18
##SPECTROMETER/DATA SYSTEM= spect
##.PULSE SEQUENCE= zg30
##.SOLVENT NAME= CDCl3
##.SHIFT REFERENCE= (INTERNAL, CDCl3, 0, 15.7039)
##AUDIT TRAIL= $$ (NUMBER, WHEN, WHO, WHERE, WHAT)
$$ ##TITLE= Audit trail, XWIN-NMR		Version 3.5
$$ ##JCAMPDX= 5.01
$$ ##ORIGIN= Bruker BioSpin GmbH
$$ ##OWNER= she
$$ F:/spectra/data/she/nmr/H-F/1/audita.txt
$$ ##AUDIT TRAIL=  $$ (NUMBER, WHEN, WHO, WHERE, WHAT)
(   1,<2019-04-10 13:54:44.18 +0400>,<she>,<DPX200>,
      <created by zg, POWCHK disabled, PULCHK disabled
       configuration hash MD5:
       00 E9 B6 7A A2 85 ED C7 34 08 36 98 17 FE 4E 26
       data hash MD5: 16K
       D7 D5 C5 F2 99 18 A2 21 7C 8C 3F 5B B5 36 98 44>)
$$ ##END=
$$ 
$$ hash MD5
$$ 08 14 28 10 17 3A DB 7B 59 69 EB FD E1 21 09 7F
##$RELAX= 
##$RELAX= 
##$RELAX= 
##$RELAX= 
##$RELAX= 
##$RELAX= 
$$ Bruker specific parameters
$$ --------------------------
##$DU= <F:/spectra>
##$EXPNO= 1
##$NAME= <H-F>
##$PROCNO= 1
##$TYPE= <nmr>
##$USER= <she>
##$AMP= (0..31)
100 100 100 100 100 100 100 100 100 100 100 100 100 100 100 100 100 100 
100 100 100 100 100 100 100 100 100 100 100 100 100 100 
##$AQSEQ= 0
##$AQ_mod= 1
##$AUNM= <au_zg>
##$AUTOPOS= <>
##$BF1= 200.13
##$BF2= 200.13
##$BF3= 200.13
##$BF4= 200.13
##$BF5= 200.13
##$BF6= 200.13
##$BF7= 200.13
##$BF8= 200.13
##$BYTORDA= 1
##$CFDGTYP= 0
##$CFRGTYP= 5
##$CHEMSTR= <none>
##$CNST= (0..31)
1 1 145 1 1 1 1 1 1 1 1 1 1 1 1 1 1 1 1 1 1 1 1 1 1 1 1 1 1 1 1 1 
##$CPDPRG= <>
##$CPDPRG1= <>
##$CPDPRG2= <>
##$CPDPRG3= <>
##$CPDPRG4= <mlev>
##$CPDPRG5= <mlev>
##$CPDPRG6= <mlev>
##$CPDPRG7= <mlev>
##$CPDPRG8= <mlev>
##$CPDPRGB= <>
##$CPDPRGT= <>
##$D= (0..31)
0 1.2 0 0 0 0 0 0 0 0 0 0.03 0 0 0 0 0 0 0 0 0 0 0 0 0 0 0 0 0 0 0 0 
##$DATE= 1554890083
##$DBL= (0..7)
120 120 120 120 120 120 120 120 
##$DBP= (0..7)
150 150 150 150 150 150 150 150 
##$DBP07= 0
##$DBPNAM0= <>
##$DBPNAM1= <>
##$DBPNAM2= <>
##$DBPNAM3= <>
##$DBPNAM4= <>
##$DBPNAM5= <>
##$DBPNAM6= <>
##$DBPNAM7= <>
##$DBPOAL= (0..7)
0.5 0.5 0.5 0.5 0.5 0.5 0.5 0.5 
##$DBPOFFS= (0..7)
0 0 0 0 0 0 0 0 
##$DE= 6
##$DECBNUC= <off>
##$DECIM= 24
##$DECNUC= <off>
##$DECSTAT= 4
##$DIGMOD= 1
##$DIGTYP= 9
##$DL= (0..7)
0 120 120 120 120 120 120 120 
##$DP= (0..7)
150 150 150 150 150 150 150 150 
##$DP07= 0
##$DPNAME0= <>
##$DPNAME1= <>
##$DPNAME2= <>
##$DPNAME3= <>
##$DPNAME4= <>
##$DPNAME5= <>
##$DPNAME6= <>
##$DPNAME7= <>
##$DPOAL= (0..7)
0.5 0.5 0.5 0.5 0.5 0.5 0.5 0.5 
##$DPOFFS= (0..7)
0 0 0 0 0 0 0 0 
##$DQDMODE= 0
##$DR= 18
##$DS= 0
##$DSLIST= <SSSSSSSSSSSSSSS>
##$DSPFIRM= 0
$$ [...]
##$SUBNAM2= <"">
##$SUBNAM3= <"">
##$SUBNAM4= <"">
##$SUBNAM5= <"">
##$SUBNAM6= <"">
##$SUBNAM7= <"">
##$SUBNAM8= <"">
##$SUBNAM9= <"">
##$SW= 24.9337058887773
##$SWIBOX= (0..15)
0 0 2 0 0 0 0 0 0 0 0 0 0 0 0 0 
##$SW_h= 4990.01996007984
##$TD= 16384
##$TD0= 1
##$TE= 0
##$TE2= 300
##$TE3= 300
##$TEG= 300
##$TL= (0..7)
0 120 120 120 120 120 120 120 
##$TP= (0..7)
150 150 150 150 150 150 150 150 
##$TP07= 0
##$TPNAME0= <>
##$TPNAME1= <>
##$TPNAME2= <>
##$TPNAME3= <>
##$TPNAME4= <>
##$TPNAME5= <>
##$TPNAME6= <>
##$TPNAME7= <>
##$TPOAL= (0..7)
0.5 0.5 0.5 0.5 0.5 0.5 0.5 0.5 
##$TPOFFS= (0..7)
0 0 0 0 0 0 0 0 
##$TUNHIN= 0
##$TUNHOUT= 0
##$TUNXOUT= 0
##$USERA1= <user>
##$USERA2= <user>
##$USERA3= <user>
##$USERA4= <user>
##$USERA5= <user>
##$V9= 5
##$VALIST= <valist>
##$VCLIST= <CCCCCCCCCCCCCCC>
##$VD= 0
##$VDLIST= <DDDDDDDDDDDDDDD>
##$VPLIST= <PPPPPPPPPPPPPPP>
##$VTLIST= <TTTTTTTTTTTTTTT>
##$WBST= 1024
##$WBSW= 4
##$XGAIN= (0..3)
0 0 0 0 
##$XL= 0
##$YL= 0
##$YMAX_a= 403167
##$YMIN_a= -598002
##$ZGOPTNS= <>
##$ZL1= 120
##$ZL2= 120
##$ZL3= 120
##$ZL4= 120
##$ABSF1= 10
##$ABSF2= 0
##$ABSG= 5
##$ABSL= 3
##$ALPHA= 0
##$AQORDER= 0
##$ASSFAC= 0
##$ASSFACI= 0
##$ASSFACX= 0
##$ASSWID= 0
##$AUNMP= <proc_1d>
##$AZFE= 0.1
##$AZFW= 0.1
##$BCFW= 1
##$BC_mod= 2
##$BYTORDP= 1
##$COROFFS= 0
##$CY= 11.3945322036743
##$DATMOD= 1
##$DC= 2
##$DFILT= <>
##$DTYPP= 0
##$F1P= 18.9103706918063
##$F2P= -1.10871071338519
##$FCOR= 0.5
##$FTSIZE= 0
##$FT_mod= 4
##$GAMMA= 1
##$GB= 0.15
##$INTBC= 1
##$INTSCL= 1
##$ISEN= 128
##$LB= 0.24
##$LEV0= 0
##$LPBIN= 0
##$MAXI= 10000
##$MC2= 0
##$MEAN= 0
##$ME_mod= 0
##$MI= 1.114404
##$NCOEF= 0
##$NC_proc= 0
##$NLEV= 6
##$NOISF1= 3.799351
##$NOISF2= 2.8
##$NSP= 1
##$NTH_PI= 0
##$NZP= 0
##$OFFSET= 15.70392
##$PC= 1
##$PHC0= -8853.823
##$PHC1= 16.80026
##$PH_mod= 1
##$PKNL= yes
##$PPARMOD= 0
##$PSCAL= 0
##$PSIGN= 0
##$REVERSE= no
##$SF= 200.130013532006
##$SI= 16384
##$SIGF1= 3
##$SIGF2= 2
##$SINO= 400
##$SIOLD= 16384
##$SREGLST= <1H.CDCl3>
##$SSB= 0
##$STSI= 0
##$STSR= 0
##$SW_p= 3612.71676300578
##$SYMM= 0
##$S_DEV= 0
##$TDeff= 0
##$TDoff= 0
##$TI= <>
##$TILT= no
##$TM1= 0
##$TM2= 0
##$TOPLEV= 0
##$USERP1= <user>
##$USERP2= <user>
##$USERP3= <user>
##$USERP4= <user>
##$USERP5= <user>
##$WDW= 1
##$XDIM= 8192
##$YMAX_p= 0
##$YMIN_p= 0
$$ End of Bruker specific parameters
$$ ---------------------------------
##NTUPLES= NMR FID
##VAR_NAME=  TIME,          FID/REAL,        FID/IMAG
##SYMBOL=    X,             R,               I
##VAR_TYPE=  INDEPENDENT,   DEPENDENT,       DEPENDENT
##VAR_FORM=  AFFN,          ASDF,            ASDF
##VAR_DIM=   8192,          8192,            8192
##UNITS=     SECONDS,       ARBITRARY UNITS, ARBITRARY UNITS
##FACTOR=    0.0002004,     1,               1
##FIRST=     0,             0,               0
##LAST=      1.6414764,     0,               0
##MIN=       0,             -598002,         0
##MAX=       1.6414764,     403167,          0
$$ Real data points
##PAGE= N=1
##DATA TABLE= (X++(R..R)), XYDATA
$$ [...]
$$ plain form
2831 -6002 -5775 -1697 713 -3281 -6881 -5236 -1325 -64 -2682 -5507 -4956 -631 1352 -2584 -4845
2846 -4845 -2201 378 -690 -575 -895 -1510 -1038 504 579 1748 2084 -1296 -2808 1702 6284 4461 -749
2863 -749 -2867 196 5391 7389 2514 -2067 235 4836 4788 3497 3156 2622 2099 3129 3313 4351 4596
2880 4596 2792 50 2575 6209 4925 1437 939 3635 5901 5218 1509 -363 3750 7338 4857
2895 4857 178 89 3698 5489 4993 2927 704 1870 3594 3180 3889 5131 2595 -1171 190 4642
2911 4642 6775 3753 -747 -2643 1493 6654 4484 -1375 -2600 1391 2757 1879 223 -983 -161
2926 -161 1099 -669 -1923 -37 963 -1772 -2671 -763 -7 -2171 -3684 -3364 -1153 636 -2444 -6898
2942 -6898 -5307 966 1488 -3456 -7533 -6155 -2411 725 -1246 -6140 -6414 -3745 -2758 -3461 -1870 -1885
$$ packed form
2831f002K27M078K410l994l600J645L911J261k618k825N51M325J983l936k261
2846d845K644K579j068J15l20o15M72J542P5J169L36l380j512M510M582j823n210
2863g49k118L063N195J998m875m581K302M601m8j291l41n34n23J030J84J038K45
2880D596j804k742K525L634j284l488m98K696K266o83l709j872M113L588k481
2895D857m679q9L609J791m96k066k223J166J724m14P09J242k536l766J361M452
2911D642K133l022m500j896M136N161k170n859j225L991J366q78j656j206Q22
2926a61J260j768j254J886J000k735q99J908P56k164j513L20K211J789l080m454
2942f898J591O273N22m944m077J378L744L136j971m894k74K669R87p03J591j5
$$ plain form
2958 -1885 -5297 -7492 -4912 -1233 330 -2863 -7890 -7085 -946 1509 -2984 -6358 -4460 -1313 -913
2973 -913 -2741 -4706 -3270 -396 -865 -4110 -4023 -796 -812 -1814 -1472 -730 -1168 -2271 -2765 -770 3013
2990 3013 2324 -3250 -5048 425 5639 3991 -1332 -3606 -1355 3769 5610 1341 -901 690 2249
3005 2249 1889 3410 4545 3188 903 534 2633 5836 6407 1831 -793 2691 7272 5047 1758 1673
3021 1673 3635 5830 5295 1549 952 4782 7030 3877 1018 2552 3828 3946 3991 3615 2675 2395 1070
3038 1070 953 4561 6580 2620 -2570 -1290 3702 6251 3852 -1011 -3198 777 5054 3376 -441
3053 -441 -802 367 314 516 1180 260 -210 -1042 -2442 -702 2257 673 -3187 -3006 118 722 -1165 -3335
3071 -3335 -3317 -450 1150 -2185 -6055 -4063 124 255 -2947 -4817 -4388 -2669 -1346 -1559 -3386 -3558
$$ packed form
2958a885l412k195K580L679J563l193n027Q05O139K455m493l374J898L147M00
2973i13j828j965J436K874m69l245Q7L227j6j002L42P42m38j103m94J995L783
2990C013o89n574j798N473N214j648n323k274K251N124J841m269k242J591J559
3005B249l60J521J135j357k285l69K099L203N71m576k624L484M581k225l289q5
3021A673J962K195n35l746n97L830K248l153k859J534J276J18M5l76r40k80j325
3038A070j17L608K019l960n190J280M992K549k399m863k187L975M277j678l817
3053d41l61J169n3K02O64r20m70q32j400J740K959j584l860J81L124O04j887k170
3071c335J8K867J600l335l870J992M187J31l202j870M29J719J323k13j827j72
$$ plain form
3087 -3558 -3423 -5263 -3842 -61 -461 -4635 -7121 -4958 -1055 1227 -1948 -7131 -6089 -1249 -254 -2662
3103 -2662 -3784 -2946 -2509 -1954 -2026 -2568 -1319 -626 -2192 -3471 -557 724 -1398 -2280 -910 780 630
3120 630 -1212 -2922 -740 3341 2589 -2340 -3412 360 3354 2810 689 -1445 -526 2168 3081 2003
3136 2003 1503 2054 -9 85 3103 4584 2914 223 -525 1404 5247 5265 818 -999 1941 4745 3660
3153 3660 1759 1450 1684 3122 3213 1020 1215 2809 2736 1242 2052 2889 1645 470 1530 2348 2940 1946
3171 1946 -1105 -1283 2602 4579 943 -2117 -1542 1014 3052 2350 -514 -3083 -765 1611 1167 706
3187 706 296 -1560 -2419 -85 1355 798 -405 -2308 -2391 4 2450 31 -3022 -2023 484 1050 -73
3204 -73 -1640 -2707 -569 1175 -215 -2231 -1446 -433 -120 87 -129 -1729 -2041 -828 11 117 257
$$ packed form
3087c558J35j840J421L781m00m174k486K163L903K282l175n183J042M840R95k408
3103b662j122Q38M37N55p2n42J249O93j566j279K914J281k122q82J370J690j50
3120F30j842j710K182M081p52m929j072L772K994n44k121k134R19K694R13j078
3136B003n00N51k063R4L018J481j670k691p48J929L843J8m447j817K940K804j085
3153C660j901l09K34J438R1k193J95J594p3j494Q10Q37j244j175J060Q18N92r94
3171A946l051j78L885J977l636l060N75K556K038p02k864k569K318K376m44m61
3187G06m10j856q59K334J440n57j203j903q3K395K446k419l053R99K507N66j123
3204g3j567j067K138J744j390k016P85J013L13K07k16j600l12J213Q39J06J40
$$ plain form
3221 257 -2249 -4341 -1664 2038 1124 -1971 -3939 -3644 -513 1732 -68 -3583 -3830 -1148 -36 -371
3237 -371 -856 -2438 -2966 -1320 5 -133 -583 -1711 -2820 -1482 1572 1127 -1884 -2338 -575 1432 1626
3254 1626 248 -1932 -663 3089 3196 812 38 399 1391 2970 3666 1925 269 1060 1919 3108 4228
3271 4228 2865 -491 302 3182 4647 3177 747 -734 1162 4621 4483 821 -965 627 1546 2462
3287 2462 2375 524 -1288 -143 1479 953 880 -155 -1864 -1242 1255 1522 -1133 -2506 -1326 -25 1268
3304 1268 466 -2840 -2905 -244 1558 568 -1049 -1774 -2098 31 1953 530 -1569 -1751 -761 191 2071
3321 2071 854 -1831 -2593 -206 1527 1242 -214 -2698 -2449 258 1902 -87 -2172 -2439 -1828 -662
3337 -662 473 -1587 -3387 -2517 -651 -1360 -1378 -2361 -4176 -3657 -1377 -704 -2979 -3963 -3511 -2980 -1501 -454
$$ packed form
3221B57k506k092K677L702r14l095j968K95L131K245j800l515k47K682J112l35
3237c71m85j582n28J646J325j38m50j128j109J338L054m45l011m54J763K007J94
3254A626j378k180J269L752J07k384p74L61R92J579O96j741j656P91Q59J189J120
3271D228j363l356P93K880J465j470k430j481J896L459j38l662j786J592R19R16
3287B462q7j851j812J145J622n26p3j035j709O22K497K67k655j373J180J301J293
3304A268q02l306o5K661J802r90j617p25l24K129J922j423k099j82R90R52J880
3321B071j217k685p62K387J733k85j456k484K49K707J644j989k085k67O11J166
3337f62J135k060j800Q70J866p09j8r83j815N19K280O73k275r84M52N31J479J047
$$ plain form
3355 -454 -3031 -4888 -3264 -1070 -526 -1364 -3105 -4396 -2183 926 283 -1776 -2331 -1651 -160 1438
3371 1438 1965 -314 -1013 494 1612 2393 2388 830 -503 1567 4337 3896 1431 1358 1713 3470 5261
3388 5261 3885 678 1763 3884 4217 3630 2949 1957 1989 3660 4394 2733 1819 1290 1377 2916 4594 2726
3406 2726 -366 -186 2480 3576 3368 1078 -1081 -34 3391 3401 1219 -83 546 1040 2608 3015 1257
3423 1257 -120 776 1684 2193 3082 1612 -410 542 3468 3719 1440 368 -33 1858 3919 2628 -371
3440 -371 -1007 1639 2407 2283 1271 -837 -1563 866 2314 1387 -485 -1831 -2560 -825 1463 327 -2970
3457 -2970 -4254 -2380 -735 -9 -1581 -4742 -5114 -2075 -977 -2607 -4089 -4903 -4933 -3079 -2138 -3773
3473 -3773 -5222 -4741 -3827 -3072 -2639 -3702 -5717 -5157 -2517 -1614 -2960 -4303 -4768 -3967 -781 -242 -3321
$$ packed form
3355d54k577j857J624K194N44q38j741j291K213L109o43k059n55O80J491J598
3371A438N27k279o99J507J118P81nj558j333K070K770m41k465p3L55J757J791
3388E261j376l207J085K121L33n87o81r92L2J671P34j661r14n29Q7J539J678j868
3406B726l092J80K666J096k08k290k159J047L425J0k182j302O29M94J568M07j758
3423A257j377Q96R08N09Q89j470k022R52K926K51k279j072m01J891K061j291k999
3440c71o36K646P68j24j012k108p26K429J448r27j872j346p29J735K288j136l297
3457b970j284J874J645P26j572l161l72L039J098j630j482q14l0J854R41j635
3473c773j449M81R14P55M33j063k015N60K640R03j346j343m65Q01L186N39l079
$$ plain form
3490 -3321 -5002 -3366 -1039 -396 -844 -3013 -4265 -2460 281 226 -973 -1504 -2834 -1756 738 1603
3506 1603 -218 -2293 -1826 -747 1581 2107 -1049 -2682 -298 1996 1838 184 -803 -797 1293 2639 1113
3523 1113 -545 404 1383 1776 1877 1830 511 249 1983 3400 3586 2520 238 -215 3277 5869 3757
3540 3757 791 650 2828 4972 5565 2442 608 2133 4254 4449 3769 3721 2180 1401 2879 4678 4131
3557 4131 3267 2036 1732 3260 5207 2983 33 1186 3822 3712 2214 243 0 2445 3781 1774
3573 1774 -1011 -539 1348 1360 996 994 -497 -1630 -654 585 1115 734 -1619 -3978 -1624 2229 1444 -2166
3591 -2166 -3778 -3274 -470 949 -576 -3912 -3343 -1135 -1300 -2210 -2048 -2222 -2758 -2348 -2241 -2261 -2464 -2876
3609 -2876 -3692 -3170 -1053 -1674 -4705 -4495 -2097 -1272 -2081 -3854 -5046 -3439 346 -799 -4070 -4962 -3154
$$ packed form
3490c321j681J636K327O43m48k169j252J805K741n5j199n31j330J078K494Q65
3506A603j821k075M67J079K328N26l156j633K384K294j58j654r87OK090J346j526
3523A113j658R49R79L93J01m7j319k62J734J417J86j066k282m53L492K592k112
3540C757k966j41K178K144N93l123j834J525K121J95o80m8j541p79J478J799n47
3557D131q64j231l04J528J947k224k950J153K636j10j498j971k43K445J336k007
3573A774k785M72J887J2l64kj491j133R76J239N30l81k353k359K354L853p85l610
3591b166j612N04K804J419j525l336N69K208j65r10J62j74n36M10J07k0k03m12
3609b876q16N22K117o21l031K10K398Q25q09j773j192J607L785j145l271q92J808
$$ plain form
3626 -3154 -1602 -418 -933 -2684 -3234 -2451 -1372 -665 210 -718 -3224 -2920 249 2176 454 -1178 -2349
3643 -2349 -400 2584 2306 -773 -1276 991 2527 1605 310 533 1197 2407 2131 570 947 2307 1963
3660 1963 1699 2899 2574 625 508 1894 3585 3958 2204 -1192 -936 3678 5312 2283 -646 -589 1777
3677 1777 3450 3461 1053 -37 1047 1781 1437 2241 2894 930 -379 592 2577 3001 1769 -382 -398
3694 -398 2230 3382 652 -1240 823 2632 2249 109 -1143 -403 1982 3085 -14 -1796 -413 267
3710 267 126 547 594 -1093 -1836 -1436 -401 1336 1007 -2880 -4941 -2396 1081 574 -2801 -4248 -3626
3727 -3626 -955 9 -2210 -3858 -2896 -1746 -2697 -3186 -2027 -2035 -2985 -2859 -2950 -2330 -1464 -2737 -3970 -2049
3745 -2049 -302 -1976 -4173 -2999 -820 465 -427 -3311 -3900 -774 1836 228 -2413 -2383 -978 -179
$$ packed form
3626c154J552J184n15j751n50P83J079P07Q75r28k506L04L169J927j722j632j171
3643b349J949K984k78l079n03K267J536r22j295K23O64J210k76j561L77J360l44
3660A963k64J200l25j949j17J386J691L73j754l396K56M614J634l029k929N7K366
3677A777J673J1k408j090J084P34l44Q04O53j964j309R71J985M24j232k151j6
3694c98K628J152k730j892K063J809l83k140j252P40K385J103l099j782J383O80
3710B67j41M21M7j687p43M00J035J737l29l887k061K545L477n07l375j447O22
3727c626K671R64k219j648R62J150r51m89J159qr50J26r1O20Q66j273j233J921
3745b049J747j674k197J174K179J285q92k884n89L126K610j608k641L0J405P99
$$ plain form
3761 -179 670 727 -720 -735 -458 -668 1212 2695 1390 -1784 -1261 1659 3135 2302 131 -1166 1145
3778 1145 3261 2183 -487 747 2725 2434 1410 816 1301 1951 3012 1489 744 1881 1942 1245 1667
3795 1667 2954 2356 492 198 1880 3446 4152 1072 -1537 -209 3867 4117 1344 -11 9 1374
3811 1374 2507 1960 677 591 1058 674 512 1819 2094 -182 -629 736 1200 1354 308 -1402 -688 1597
3829 1597 1311 -1320 -1961 333 1520 535 -1550 -2577 -1179 1258 928 -1693 -2105 -1273 -1184 -1190 141 -45
3847 -45 -2220 -3009 -2681 -1129 447 -576 -3835 -4423 -1366 399 -865 -2869 -3830 -3009 -601 -682 -2768
3864 -2768 -3103 -1822 -1482 -2485 -1930 -1604 -2243 -2159 -1680 -1925 -1560 -1321 -2532 -2469 -86 405 -2077 -3534
3882 -3534 -1620 340 1348 166 -2377 -2856 386 2431 809 -735 -722 -228 1197 2138 1644 835 428
$$ packed form
3761a79Q49N7j447j5K77k10J880J483j305l174N23K920J476q33k171j297K311
3778A145K116j078k670J234J978k91j024n94M85O50J061j523p45J137O1o97M22
3795A667J287n98j864k94J682J566P06l080k609J328M076K50k773j355K0J365
3811A374J133n47j283q6M67l84j62J307K75k276m47J365M64J54j046j710P14K285
3829A597k86k631o41K294J187r85k085j027J398K437l30k621m12Q32Q9oJ331j86
3847d5k175p89L28J552J576j023l259n88L057J765j264k004r61Q21K408q1k086
3864b768l35J281L40j003N55L26o39Q4M79k45L65K39j211O3K383M91k482j457
3882c534J914J960J008j182k543m79L242K045j622j544J3M94J425R41m94q09m07
$$ plain form
3899 428 922 1161 2977 3723 1466 -406 1340 3200 3499 2435 928 754 2585 3744 1842 414
3915 414 1450 3274 2672 2215 1531 1084 1802 2869 2158 1356 1151 671 508 2072 2860 1150 -336 -425
3933 -425 990 2513 2432 -225 -2115 -211 2709 2240 427 -536 -369 688 1945 1456 168 320 489
3950 489 40 809 1683 343 -553 507 1237 1423 905 -424 -1000 618 2186 814 -1298 -1606 225
3967 225 1178 488 -636 -2017 -1545 455 -88 -1386 -1847 -2508 -2711 -1123 -55 -1624 -3138 -3735 -2887
3984 -2887 -1790 -840 -1989 -4919 -3851 -2106 -1872 -2715 -3684 -4274 -3647 -1717 -2011 -3631 -3892 -2601 -2353
4001 -2353 -1947 -1228 -2562 -2972 -1970 -941 -1033 -1029 -1665 -2405 -790 1170 539 -1570 -1976 -427 1017 2083
4019 2083 711 -1227 -1267 1088 2422 1521 531 -357 -130 893 2511 1496 353 -118 252 1280 2428
$$ packed form
3899D28M94K39J816P46k257j872J746J860K99j064j507j74J831J159j902j428
3915D14J036J824o02m57o84m47P18J067p11q02k05m80j63J564P88j710j486q9
3933d25J415J523q1k657j890J904K920m69j813r63J67J057J257m89j288J52J69
3950D89m49P69Q74j340q96J060P30J86n18j329n76J618J568j372k112l08J831
3967B25R53o90j124j381M72K000n43j298m61o61k03J588J068j569j514n97Q48
3984b887J097R50j149k930J068J745K34q43r69n90O27J930k94j620k61J291K48
4001b353M06P19j334m10J002J029r2Mo36p40J615J960o31k109m06J549J444J066
4019B083j372j938m0K355J334r01r90q88K27J023J618j015j143m71L70J028J148
$$ plain form
4036 2428 1617 -807 -590 949 1939 1378 497 -620 -542 1707 2044 5 -819 147 1197 1418 1441 211
4054 211 -1101 609 1767 1839 1398 484 -642 529 2699 3051 940 -13 830 2203 3268 3090 1104
4071 1104 27 2108 3834 3221 2190 1377 225 2052 3592 2880 1011 754 1089 1971 2880 2509 62
4088 62 -39 1498 2311 1517 697 -1005 -1230 894 1829 650 -1456 -2074 -961 108 717 -839 -3023
4105 -3023 -2078 -9 -13 -859 -1922 -2795 -2304 -316 465 -1567 -2641 -2896 -1997 -367 535 -1339 -3319 -2760
4123 -2760 -615 -160 -552 -1938 -2943 -1208 312 352 -1720 -2202 -1686 -660 154 273 -1176 -2183 -751
4140 -751 142 418 93 -1445 -2292 -1086 973 299 -1719 -2389 -1783 39 1556 -107 -2513 -2678 -459
4157 -459 824 297 -281 -1836 -2044 -561 944 80 -831 -1476 -1246 190 1885 194 -1907 -1352 372
$$ packed form
4036B428q11k424K17J539R90n61q81j117P8K249L37k039q24R66J050K21K3j230
4054B11j312J710J158P2m41r14j126J171K170L52k111r53Q43J373J065j78j986
4071A104j077K081J726o13j031q13j152J827J540p12j869k57L35Q82R09l71k447
4088F2j01J537Q13p94q20j702k25K124R35j179k106o18J113J069O09j556k184
4105c023R45K069mq46j063q73M91J988P81k032j074k55Q99J630R02j874j980N59
4123b760K145M55l92j386j005J735J520M0k072m82N16J026Q14J19j449j007J432
4140g51Q93K76l25j538q47J206K059o74k018o70O06J822J517j663k406j65K219
4157d59J283n27n78j555k08J483J505q64r11o45K30J436J695j691k101N55J724
$$ plain form
4174 372 1602 1447 352 -1363 -448 1809 2059 621 -399 -461 662 1906 2226 448 -323 420 1439
4191 1439 2140 1774 294 -945 316 2567 2672 890 -280 -318 549 2954 2463 134 -966 497 1747
4208 1747 2047 1585 114 -771 962 2531 1911 499 -535 -397 619 2606 1618 -600 -952 558 1071
4225 1071 2162 635 -1061 -1023 1229 2060 696 -629 -1004 -376 1170 2223 122 -1481 -1243 29
4241 29 878 1168 -302 -2378 -1821 392 1583 -109 -1453 -2366 -1860 620 1081 -1104 -3132 -2194 -554
4258 -554 429 337 -1420 -2966 -1456 60 -119 -1219 -1484 -1969 -1280 860 577 -1277 -2320 -1444 -43
4275 -43 664 782 -2033 -2892 -274 1785 1291 -524 -1504 -1047 649 1852 419 -1394 -1084 283 1011
4292 1011 1414 914 -1293 -1356 455 1811 1321 586 -1289 -1749 478 2371 849 -1484 -1185 299 1244
$$ packed form
4174C72J230j55j095j715R15K257K50j438j020o2J123J244L20j778p71P43J019
4191A439P01l66j480j239J261K251J05j782j170l8Q67K405m91k329j100J463J250
4208A747L00m62j471q85J733J569o20j412j034J38J016J987r88k218l52J510N13
4225A071J091j527j696L8K252Q31j364j325l75O28J546J053k101j603K38J272
4241B9Q49K90j470k076N57K213J191j692j344r13N06K480M61k185k028R38J640
4258e54R83r2j757j546J510J516j79j100k65m85O89K140k83j854j043Q76J401
4275d3P07J18k815q59K618K059m94j815r80M57J696J203j433j813L10J367P28
4292A011M03n00k207o3J811J356m90p35j875m60K227J893j522k333K99J484R45
$$ plain form
4309 1244 1436 -91 -1286 -488 1356 1624 435 -6 -855 -355 1460 2056 613 -483 -594 340 2249
4326 2249 2699 425 -1320 24 2578 3009 1196 -261 -232 1279 2935 2739 211 -368 565 1741 2368
4343 2368 2442 533 -274 421 1702 1852 1581 419 -1072 267 2229 1707 -605 -1213 -946 699 1281
4360 1281 403 -2407 -1865 371 652 -281 -1592 -2547 -1964 -247 501 -1101 -2635 -2484 -1860 -721 556
4377 556 -935 -3312 -3061 -1242 46 125 -1702 -3524 -2485 -31 792 -1226 -2432 -1712 -842 -182 250
4394 250 -1306 -1821 -902 108 47 312 -354 -1618 -1013 959 1377 -300 -1031 -1211 -275 1742 1413 -1386
4412 -1386 -2096 -16 1870 1312 100 -1394 -1503 769 1927 717 -306 -381 -569 -18 1746 1645 -442
4429 -442 -1517 -512 904 1857 1116 -981 -1394 1158 2626 1497 -209 -415 297 1347 2287 823 -414
$$ packed form
4309A244J92j527j195P98J844K68j189m41q49N00J815N96j443j096j11R34J909
4326B249M50k274j745J344K554M31j813j457K9J511J656j96k528n79R33J176O27
4343B368P4j909q07O95J281J50k71j162j491J339J962n22k312o08K67J645N82
4360A281q78k810N42K236K81r33j311r55N83J717P48j602j534J51O24J139J277
4377E56j491k377K51J819J288P9j827j822J039K454Q23k018j206P20Q70O60M32
4394B50j556n15R19J010o1K65o66j264O05J972M18j677p31j80R36K017l29k799
4412a386p10K080J886n58j212j494j09K272J158j210j023p5j88N51J764j01k087
4429d42j075J005J416R53p41k097m13K552J468j129j706k06P12J050R40j464j237
$$ plain form
4446 -414 959 1817 1911 1679 1299 360 547 2044 2898 1682 701 93 633 2917 3652 1026 -1056 290
4464 290 2487 3232 2211 179 -1045 980 2418 1823 684 -225 -276 362 1494 1858 336 -1048 -836
4481 -836 8 825 1371 -969 -2469 -1111 942 252 -1495 -2334 -1617 -425 711 -1014 -2746 -2358 -934
4498 -934 -649 -796 -1517 -2677 -2726 -1210 -537 -1009 -1864 -2876 -3015 -1254 381 -967 -2956 -3339 -1992 -160
4516 -160 177 -1479 -3287 -2587 -329 -13 -1306 -1228 -1778 -1618 -328 456 -734 -1286 -896 -1013 -143 621
4534 621 -60 -1807 -903 826 1262 362 -1064 -1360 -100 2088 1707 -946 -786 449 1134 1305 915 -586
4552 -586 -636 971 1741 1567 917 -186 -652 347 2272 2351 597 -256 52 1111 2666 2136 -129 -488
4570 -488 1306 2438 1476 556 532 593 1596 2216 1055 565 1062 1160 1225 1857 1676 154 -1 1635 1977
$$ packed form
4446d14J373Q58R4k32l80r39J87J497Q54j216r81o08N40K284P35k626k082J346
4464B90K197P45j021k032j224K025J438n95j139r09n1O38J132L64j522j384K12
4481h36Q44Q17N46k340j500J358K053o90j747q39P17J192J136j725j732L88J424
4498i34K85j47p21j160m9J516O73m72q55j012j39J761J635j348j989l83J347J832
4516a60L37j656j808P00K258L16j293P8n50J60J290P84j190n52L90j17Q70P64
4534F21o81j747R04J729M36r00j426k96J260K188l81k653J60J235O85J71l90j501
4552e86n0J607P70j74o50j103m66R99J925P9j754q53L08J059J555n30k265l59
4570d88J794J132r62r20k4O1J003O20j161m90M97R8O5O32j81j522j55J636L42
$$ plain form
4589 1977 2135 874 333 235 2427 2856 902 -624 100 1292 1951 1727 282 -595 33 1278 895 622
4607 622 319 -1205 -989 385 610 -329 -1120 -1792 -1373 51 534 -1489 -2405 -1293 -441 -636 -1238 -2267
4625 -2267 -2728 -1132 -395 -1422 -2489 -2170 -1538 -1621 -1220 -1325 -2464 -2571 -1585 -689 -625 -786 -2087 -2804 -926
4644 -926 550 -8 -1385 -1789 -1196 -3 756 -184 -1513 -888 196 643 614 325 -623 -504 617 1120
4662 1120 685 445 -188 -549 656 1492 321 -877 -367 854 1048 977 -153 -557 -141 1583 1253 -206
4680 -206 -295 -197 282 1403 1224 -168 -387 296 802 879 1379 458 -528 352 1357 1531 824 347 -86 467
4700 467 2302 1990 78 377 970 1585 1988 1459 705 433 1283 1930 1540 986 1028 723 768 1755 1351 -120
4720 -120 400 475 539 1428 828 -570 -636 1020 1117 232 -704 -682 -515 159 435 -361 -1358 -916 -723 -562 -128
$$ packed form
4589A977J58j261n41r8K192M29j954j526P24J192O59k24j445q77O28J245l83k73
4607F22l03j524K16J374K25r39p91o72M19J424M83k023r16J112Q52j95o02j029
4625b267m61J596P37j027j067L19O32q3M01j05j139j07R86Q96O4j61j301p17J878
4644i26J476n58j377m04N93J193P59r40j329O25J084M47k9k89r48J19J121N03
4662A120m35k40o33l61J205Q36j171j198N10J221J94p1j130m04M16J724l30j459
4680b06q9R8M79J121j79j392k19O83N06P7N00r21r86Q80J005J74p07m77m33N53
4700D67J835l12j912K99N93O15M03n29p54k72Q50O47l90n54M2l05M5R87m04j471
4720a20N20P5O4Q89o00j398o6J656R7q85r36K2J67O74K76p96r97M42J93J61M34
$$ plain form
4741 -128 -368 -1731 -1706 -945 -453 -680 -840 -1935 -1885 -738 -305 -1460 -1514 -1471 -1147 -606 -410 -1157 -1675 -1081
4761 -1081 -234 -805 -743 -517 -1042 -601 73 125 -690 -654 -346 -392 337 627 -920 -1345 -76 318 337 106 -603
4782 -603 -717 -66 656 207 -116 83 147 -226 412 311 -245 -249 453 510 639 750 -189 -540 450 1152 550
4803 550 341 268 370 483 1082 624 -161 416 886 668 628 813 356 63 1002 1203 344 521 796 368 774
4824 774 1426 843 447 632 661 865 986 602 -187 283 1069 1304 195 290 297 5 544 581 420 -192 188
4845 188 234 -49 520 298 -270 -200 729 5 48 -183 -414 -196 423 146 -816 -527 -39 155 -363 -88 -819
4866 -819 -834 -348 -96 -650 -490 -718 -1131 -1003 -240 -373 -1538 -1489 -932 -933 -424 -704 -1564 -1603 -885 -628 -952
4887 -952 -1067 -1080 -1459 -984 -693 -1305 -1454 -855 -1092 -949 -529 -414 -1206 -1114 -598 -525 -744 -636 -967 -860 80
$$ packed form
4741a28k40j363K5P61M92k27j60j095N0J147M33j155n4M3L24N41J96p47n18N94
4761a081Q47n71O2K26n25M41O74N2q15L6L08m6P29K90j547m25J269L94J9k31p09
4782f03j14O51P22m49l23J99O4l73O38j01n56mP02N7J29J11r39l51R90P02o02
4803E50k09p3J02J13N99m58p85N77M70k18m0J85m57k93R39K01q59J77K75m28M06
4824G74O52n83l96J85K9K04J21l84p89M70P86K35j109R5Pk92N39L7j61o12L80
4845A88M6k83N69k22n68P0R29p24M3k31k31K18O19k77r62K89M88J94n18K75p31
4866h19j5M86K52n54J60k28m13J28P63j33j165M9N57jN09k80q60l9P18K57l24
4887i52j15j3l79M75K91o12j49N99k37J43M20J15p92R2N16P3k19J08l31J07R40
$$ plain form
4908 80 429 -292 -524 -89 92 53 864 329 -277 286 601 394 747 633 368 329 985 1093 709 632 297
4929 297 478 872 1586 347 173 755 816 579 840 570 65 551 839 583 596 420 301 203 637 845 198
4950 198 -71 256 539 750 481 476 -479 490 1053 703 347 539 140 464 1007 1012 109 155 644 568 817 1044
4972 1044 508 -62 580 1264 994 1247 484 -2 668 1558 1176 -58 555 745 345 638 233 -218 45
4991 45 735 266 -352 221 -200 -642 -284 389 -616 -782 -744 -1049 -867 410 -946 -1555 -1425 -302 -641
5010 -641 -905 -1127 -1497 -1490 -641 -358 -1418 -1111 -933 -983 -1099 -650 -722 -1167 -1150 -696 -501 -178 -541 -1056 -1192
5031 -1192 83 142 -654 -986 -325 -207 136 150 -404 -511 -40 207 -296 70 110 -357 -317 184 45 -73 -102
5052 -102 -361 -613 397 374 -592 -1042 -260 276 42 1 -538 -671 -118 189 -243 -406 -139 -182 -498 139 392
$$ packed form
4908H0L49p21k32M35J81l9Q11n35o06N63L15k07L53j14k65l9O56J08l84p7l35
4929B97J81L94P14j239j74N82O1k37K61k70n05M86K88k56J3j76j19r8M34K08o47
4950A98k69L27K83K11k69nr55R69N63l50l56J92l99L24N43Nr03M6M89p6K49K27
4972A044n36n70O42O84k70K53p63m86O70Q90l82j234O13J90m00K93m05m51K63
4991D5O90m69o18N73m21m42L58O73j005j66L8l05J82J277j356o09J30J123l39
5010f41k64k22l70PQ49K83j060L07J78n0j16M49p2m45J7M54J95L23l63n15j36
5031a192J275N9p96l32O61J18L43J4n54j07M71K47n03L66M0m67M0N01j39j18k9
5052a02k59k52J010k3r66m50P82N36k34m1n39j33N53L07m32j63K67m3l16O37K53
$$ plain form
5073 392 -361 111 67 -253 371 768 -156 -616 721 820 286 314 112 163 863 1349 319 8 1170 1251 752
5094 752 544 622 654 462 1570 980 543 1035 344 351 974 1638 510 366 332 488 762 911 275 -611 223
5115 223 864 256 -512 -108 -104 -81 106 65 -839 -420 -686 -932 -649 -134 -656 -1291 -508 -503 -612 -940 -980 -1656
5137 -1656 -827 494 -670 -1716 -1194 -590 -538 -641 -691 -986 -1045 -249 -683 -810 -284 -727 -1278 -376 28 -173
5157 -173 -432 -659 -625 75 830 36 -1096 -830 244 182 -442 -430 -290 -64 304 53 -705 -177 480 -359
5177 -359 -27 249 182 -387 -161 258 315 614 542 -413 -293 1181 931 -320 -505 346 324 810 687 35 -35
5198 -35 738 641 365 591 704 290 301 915 959 870 879 572 378 1704 1834 813 396 1632 1572 1493 1599 1080
5220 1080 996 1783 2038 802 937 1557 1424 1048 1461 1476 920 783 906 1083 1484 1564 499 -308 1030 1254
$$ packed form
5073C92p53M72m4l20O24L97r24m60J337R9n34K8k02N1P00M86j030l11J162Q1m99
5094G52k08P8L2j92J108n90m37M92o91PO23O64j128j44l4J56K74J49o36q86Q34
5115B23O41o08p68M04MK3J87m1r04M19k66k46K83N15n22o35P83Nj09l28m0o76
5137a656Q29J321j164j046N22O04N2j03n0k95n9P96m34j27N26m43n51R02M04k01
5157a73k59k27L4P00P55p94j132K66J074o2o24J2J40K26L68k51p58N28O57q39
5177c59L32K76o7n69K26M19N7K99p2r55J20J474k50j251j85Q51k2M86j23o52p0
5198c5P73r7k76K26J13m14J1O14M4q9Rl07j94J326J30j021m17J236o0p9J06n19
5220A080q4P87K55j236J35O20j33l76M13J5n56j37J23J77M01Q0j065q07J338K24
$$ plain form
5240 1254 705 200 194 -13 433 607 31 -414 375 204 -269 -436 -196 -589 -880 -418 -975 -930 -600 -1220 -1553
5261 -1553 -879 -393 -1237 -1683 -1026 -953 -929 -1285 -1795 -2046 -1153 -584 -1365 -1978 -1482 -1222 -1380 -1067 -1061 -1604 -1414
5282 -1414 -1362 -1595 -1184 -852 -1505 -1516 -1517 -790 -906 -1291 -1290 -1508 -819 386 -903 -1818 -1048 -779 -657 -845 -741
5303 -741 -875 -660 -229 -761 -1053 -168 -305 -763 -596 -119 -267 -685 -274 -143 49 603 -62 -606 -133 690
5323 690 535 -196 39 184 359 960 818 365 442 890 556 734 995 1065 513 884 1086 1398 1627 1156 654
5344 654 870 1704 1597 844 988 1758 1462 1383 1321 866 1016 1723 1395 880 1069 1606 897 986 1275 954 756
5365 756 852 358 596 1194 1003 -222 81 758 579 -55 -224 -84 -270 359 182 -338 -622 10 -535 -994
5385 -994 -299 -432 -829 -658 -533 -849 -704 -480 -1083 -1220 -148 -494 -1051 -1300 -1149 -936 -773 -671 -1318 -1327
$$ packed form
5240A254n49n05ok07M46J74n76m45P89j71m73j67K40l93k91M62n57M5L30o20l33
5261a553O74M86q44m46O57P3K4l56n10k51Q93N69p81o13M96K60j58L13On43J90
5282a414N2k33M11L32o53j1jP27j16l85Jk18O89J205j289r15P70K69J22j88J04
5303g41j34K15M31n32k92Q85j37m58J67M77j48m18M11J31J92N54o65n44M73Q23
5323F90j55p31K35J45J75O01j42m53P7M48l34J78K61P0n52L71K02L12K29m71n02
5344F54K16Q34j07p53J44P70k96p9o2m55J50P07l28n15J89N37p09Q9K89l21j98
5365G56R6m94K38N98j91j225L03O77j79o34j69J40j86O29j77n20k84O32n45m59
5385i94O95j33l97J71J25l16J45K24o03j37J072l46n57k49J51K13J63J02o47r
$$ plain form
5405 -1327 -416 -571 -835 -1212 -1160 -1021 -836 -750 -466 -1010 -1059 -1185 -1323 -488 -427 -1339 -1288 -725 -442 -370 -913 -975
5427 -975 -1073 -140 -114 -646 -820 -329 -384 -452 -36 -178 -405 -34 178 -278 28 190 111 -130 350 820 390 37
5449 37 458 367 792 1226 447 121 922 1214 1107 1086 709 885 646 1350 1187 826 1023 1249 952 1184 1934
5470 1934 1030 980 1005 1464 1381 1217 1296 954 1323 1745 832 934 1153 1209 1153 1501 1272 651 861 1362 1081 803
5492 803 643 708 336 861 888 451 504 557 369 560 736 83 -62 -108 372 121 32 -287 -470 -322 -7 -495
5514 -495 -837 -939 -475 -738 -724 -650 -877 -1197 -883 -721 -902 -886 -1434 -1360 -1138 -496 -1132 -1791 -959 -1097 -1333
5535 -1333 -1172 -921 -1332 -1338 -555 -643 -1422 -978 -1320 -1497 -1059 -675 -1098 -1019 -665 -800 -798 -791 -560 -1063 -819 -12
5557 -12 -356 -1006 -609 -633 -555 -65 285 -553 -440 -230 -253 -233 286 -452 -843 347 217 -105 73 133 -311 -181
$$ packed form
5405a327R11j55k64l77N2J39J85Q6K84n44m9j26j38Q35O1r12N1N63K83P2n43o2
5427i75r8R33K6n32j74M91n5o8M16j42k27L71K12m56L06J62p9k41M80M70m30l53
5449C7M21r1M25M34p79l26Q01K92j07k1l77J76k39P04j63l61J97K26k97K32P50
5470A934r04n0K5M59q3j64P9l42L69M22r13J02K19N6n6L48k29o21K10N01k81k78
5492H03j60O5l72N25K7m37N3N3j88J91J76o53j45m6M80k51q9l19j83J48L15m88
5514d95l42j02M64k63J4P4k27l20L14J62j81J6n48P4K22O42o36o59Q32j38k36
5535a333J61K51m11oP83q8p79M44l42j77M38L84m23P9L54j35KPK31n03K44Q07
5557a2l44o50L97k4P8M90L50q38J13K10k3K0N19p38l91J190j30l22J78O0m44J30
$$ plain form
5579 -181 545 209 -561 119 75 246 279 321 -414 -109 418 1068 283 466 187 -52 443 795 616 553 600 591
5601 591 863 1236 994 291 734 1001 763 780 876 609 503 827 1542 680 647 922 859 975 1118 714 588
5622 588 715 931 627 419 640 69 248 920 570 180 -44 -11 -200 187 441 -277 -847 -265 -56 -242
5642 -242 -159 -645 -466 -340 89 -507 -974 -699 -583 -835 -183 -478 -1049 -1114 -401 -442 -656 -365 -748 -1054 -351
5663 -351 120 -527 -747 -426 -562 -363 116 -536 -675 -218 209 -233 -180 -318 -376 -490 195 16 -333 -125 -197
5684 -197 18 130 415 24 -213 30 72 299 137 142 -499 -109 647 278 -403 98 36 -32 418 294 -257 -368
5706 -368 146 132 284 270 72 -369 544 1185 693 384 429 479 680 1252 894 123 455 1167 1288 920 838 722
5728 722 906 1260 1472 800 814 1044 914 1293 1511 1208 308 707 1197 1139 1045 734 157 649 1456 1339 201
$$ packed form
5579a81P26l36p70O80m4J71L3M2p35L05N27O50p85J83k79k39M95L52j79o3M7r
5601E91K72L73k42p03M43K67k38J7R6k67j06L24P15q62l3K75o3J16J43m04j26
5622E88J27K16l04k08K21n71J79O72l50l90k24L3j89L87K54p18n70N82K09j86
5642b42Q3m86J79J26M29n96m67K75J16k52O52k95n71o5P13m1k14K91l83l06P03
5663c51M71o47k20L21j36J99M79o52j39M57M27m42N3j38n8j14O85j79l49K08p2
5684a97K15J12K85l91k37K43M2K27j62No41L90P56l69o81N01o2o8M50j24n51j11
5706c68N14j4J52j4j98m41R13O41m92l09M5N0K01N72l58p71L32P12J21l68q2j16
5728G22J84L54K12o72J4K30j30L79K18l03r00L99M90n8r4l11n77M92Q07j17j138
$$ plain form
5749 201 -64 337 494 573 799 236 -221 450 212 194 245 208 -927 -359 7 -185 -528 -766 -701 -609 -277 -219
5771 -219 -991 -1302 -238 -279 -422 -686 -1382 -1327 -766 -459 -755 -1016 -1028 -1245 -1127 -251 -651 -1713 -894 -778
5791 -778 -621 -268 -566 -1268 -1413 -199 -290 -1009 -1416 -947 -1297 258 86 -1168 -1394 -1246 -714 -730 -249 -413
5811 -413 -1343 -1232 -577 -485 -472 -852 -1114 -1022 -479 -47 -1102 -1469 -613 -145 -191 -467 -1003 -1189 -407 433 -108
5832 -108 -457 -226 -553 -362 460 154 -554 -829 43 212 516 873 145 -610 191 1167 1028 392 -74 -91
5852 -91 918 1876 1065 37 465 1101 1306 1253 1117 602 727 1308 1014 903 961 849 455 1042 1687 1342
5872 1342 660 399 875 1232 1186 742 -191 658 1361 1099 370 174 207 326 811 831 -85 117 358 -212 384
5893 384 708 178 -454 44 405 432 445 -110 -619 28 852 248 -651 -723 -149 250 290 139 -561 -688 106
$$ packed form
5749B01k65M01J57P9K26n63m57O71k38j8N1l7j135N68L66j92l43k38O5R2L32N8
5771b19p72l11J064m1j43k64o96N5N61L07k96k61j2k17J18Q76m00j062Q19J16
5791g78J57L53k98p02j45J214r1p19m07M69l50J555j72j254k26J48N32j6M81j64
5811d13r30J11O55R2J3l80k62R2N43M32j055l67Q56M68m6k76n36j86P82Q40n41
5832a08l49K31l27J91Q22l06p08k75Q72J69L04L57p28p55Q01R76j39o36m66j7
5852i1J009R58q11j028M28O36K05n3j36n15J25N81k94j11N8j12l94N87O45l45
5872A342o82k61M76L57m6m44r33Q49P03k62p29j96L3J19M85K0r16K02K41n70N96
5893C84L24n30o32M98L61K7J3n55n09O47Q24o04q99p2N74L99M0j51p00j27P94
$$ plain form
5914 106 -106 -249 -383 -59 -538 -479 406 -19 -567 -530 -365 -281 404 -237 -1307 -1195 -230 533 -461 -865 -861
5935 -861 -1036 -103 -301 -671 -919 -772 -866 -165 -283 -371 -1416 -1096 -252 -67 -217 -326 -1178 -806 385 350
5955 350 -398 -639 -450 39 210 211 -313 -706 312 452 227 243 -135 -211 390 934 1043 152 541 75 199
5976 199 1352 1519 -8 -83 404 1364 1118 690 117 -75 1203 1454 985 115 441 397 526 1037 596 286
5996 286 833 845 984 835 1030 146 89 788 1539 640 198 -169 417 1088 933 279 -578 202 983 720 181
6017 181 -111 -407 167 1062 642 -611 -203 -535 -379 420 808 -76 -1136 -406 8 131 -61 -686 -1618
6036 -1618 -581 368 -323 -1037 -764 -844 -732 -418 -483 -1161 -1071 -580 -713 -746 -491 -1206 -1602 -1034 -187 -415 -859
6057 -859 -1635 -1213 -752 -41 -977 -2017 -1575 -715 -304 -466 -752 -1393 -1148 -525 -210 -716 -577 -812 -1380 -423
$$ packed form
5914A06k12j43j34L24m79N9Q85m25n48L7J65Q4O85o41j070J12R65P63r94m04M
5935h61j75R33j98l70k48J47r4P01j18q8j045L20Q44J85j50j09q52L72J191l5
5955C50p48k41J89M89J71Jn24l93J018J40k25J6l78p6O01N44J09q91L89m66J24
5976A99J153J67j527p5M87R60k46m28n73j92J278K51m69q70L26m4J29N11m41l10
5996B86N47J2J39j49J95q84n7O99P51q99m42l67N86O71j55o54q57P80P81k63n39
6017A81k92k96N74Q95m20j253M08l32J56P99L88q84j060P30M14J23j92o25r32
6036a618J037R49o91p14K73q0J12L14o5o78R0M91j33l3K55p15l96N68Q47k28m44
6057h59p76M22M61P11r36j040M42Q60M11j62k86o41K45O23L15n06J39k35n68R57
$$ plain form
6077 -423 0 -200 -1266 -1230 -557 -362 -46 -523 -1300 -319 553 221 -218 -703 -660 -165 355 426 -236 -579 133
6098 133 18 104 341 129 -580 -85 678 707 291 59 -171 254 1290 674 -15 -234 239 769 1046 935
6118 935 314 -8 702 921 770 472 711 -116 685 1225 1028 396 748 473 673 1476 1284 212 276 952
6138 952 998 754 457 686 433 1184 1236 539 112 502 647 732 717 197 -100 167 803 632 827 70 -280
6159 -280 -409 521 979 -25 -250 -493 135 322 760 -343 -881 -181 459 129 -286 -518 -637 -7 125
6178 125 -215 -893 -136 -643 -391 106 406 -424 -961 -249 466 255 202 -772 -998 72 651 348 -613 -418
6198 -418 6 2 249 -179 -958 -417 41 -152 257 129 -520 -784 -85 942 209 -825 -483 41 608 420
6218 420 303 -726 -108 613 315 293 51 -478 -109 630 441 265 169 275 383 468 873 150 -126 321 428
$$ packed form
6077d23M23k00j066L6O73J95L16m77p77R81Q72l32m39m85M3M95N20P1o62l43P12
6098A33j15Q6K37k12p09M95P63K9m16k32k30M25J036o16o89k19M73N30K77j11
6118I35o21l22P10K19j51k98K39q27Q01N40j97o32L52k75K00Q03j92j072O4O76
6138I52M6k44k97K29k53P51N2o97m27L90J45Q5j5n20k97K67O36j71J95p57l50
6159b80j29R30M58j004k25k43O28J87M38j103n38P00O40l30m15k32j19O30J32
6178A25l40o78P57n07K52M97L00q30n37P12P15k11n3r74k26J070N79l03r61J95
6198d18M24mK47m28p79N41M58j93M09j28o49k64O99J027p33j034L42N24N67j88
6218D20j17j029O18P21k98k2k42n29L69P39j89j76r6J06J08Q5M05p23k76M47J07
$$ plain form
6239 428 441 529 223 -162 287 832 828 105 265 289 512 775 547 -67 -135 417 624 647 923 180 -216 -1
6261 -1 723 561 -81 -219 -124 178 723 218 -496 -211 286 341 412 -119 -294 -806 29 209 -293 -766 -425 -677
6283 -677 -338 183 -303 -680 -545 -252 -287 -345 -699 -1079 -1538 -298 -100 -688 -728 -1143 -872 -207 -420 -709 -1041
6304 -1041 -752 -798 -508 -57 -703 -960 -856 -491 -311 -602 -916 -919 -1090 -312 3 -973 -1267 -657 -633 -540 -359
6325 -359 -543 -1160 -575 10 -332 -556 -498 -590 48 181 17 -506 -419 -255 -25 397 241 -581 -184 8 707
6346 707 159 66 -144 -246 526 656 272 -403 -41 187 534 754 427 239 179 808 907 692 788 188 257 798
6368 798 1298 668 284 491 746 1117 1281 748 206 658 1132 1026 865 738 602 495 1219 791 444 377
6388 377 827 1044 847 1162 719 93 418 852 918 585 299 -25 336 1264 552 39 191 397 328 423 393
$$ packed form
6239D28J3Q8l06l85M49N45mp23J60K4K23K63k28o14o8N52K07K3K76p43l96K15
6261aP24j62o42j38R5L02N45n05p14K85M97N5P1n31j75n12Q35J80n02m73L41k52
6283f77L39N21m86l77J35K93l5n8l54l80m59J240J98n88m0m15K71O65k13k89l32
6304a041K89m6K90M51o46k57J04L65J80k91l14lj71P78L15r76k94O10K4R3J81
6325c59j84o17N85N85l42k24N8r2O38J33j64n23Q7J64K30M22j56q22L97J92O99
6346G07n48r3k10j02P72J30l84o75L62K28L47K20l27j88o0O29R9k15R6o00O9N41
6368G98N00o30l84K07K55L71J64n33n42M52M74j06j61j27j36j07P24m28l47o7
6388C77M50K17j97L15m43o26L25M34O6l33k86l24L61R28p12n13J52K06o9R5l0
$$ plain form
6409 393 -363 -164 264 11 297 145 -377 -511 -183 353 -240 -892 -625 -464 -229 183 -224 -942 -636 -287
6429 -287 -150 -287 -414 -772 -935 -362 -163 -308 -939 -811 -557 -433 112 -451 -868 -750 -293 -461 -305 -364
6449 -364 -967 -789 -146 6 -716 -1033 -819 -533 25 -172 -932 -959 -252 -271 -349 -116 -105 -419 -530 -100 -80 -64
6471 -64 -420 -343 -360 513 241 -375 -825 -13 273 304 462 -126 -473 349 557 260 242 280 318 321 707 624 363
6494 363 371 437 839 962 788 495 458 1102 1218 909 645 489 765 1079 905 446 434 866 768 551 794 903
6516 903 66 338 823 546 475 854 46 120 940 634 278 -141 138 533 486 641 -98 -167 418 773 149
6537 149 -8 -144 -273 -457 -108 -116 -250 150 -178 -259 141 35 -251 -1060 -383 -1 -417 -592 -602 -898 -475
6558 -475 88 -348 -1221 -764 -391 -748 -685 -907 -768 -814 -568 -860 -947 -590 -1001 -1314 -1075 -511 -1068 -1213 -1193
$$ packed form
6409C93p56J99M28k53K86j52n22j34L28N36n93o52K67J61K35M12m07p18L06L49
6429b87J37j37j27l58j63N73J99j45o31J28K54J24N45n63m17J18M57j68J56n9
6449c64o03J78O43J52p22l17K14K86N58j97p60k7P07j9p8K33J1l14j11M30K0J6
6471f4l56P7j7Q73k72o16m50Q12K86L1J58n88l47Q22K08k97j8L8L8LL86q3k61
6494C63QO6M02J23j74k93l7O44J16l09k64j56K76L14j74m59j2M32r8k17K43J09
6516I03q37K72M85k77p1L79q08P4Q20l06l56m19K79L95m7J55p39o9N85L55o24
6537A49j57j36j29j84L49qj34M00l28q1M00j06k86q09O77L82m16j75j0k96M23
6558d75N63m36q73M57L73l57O3k22J39m6K46k92q7L57m11l13K39N64n57j45K0
$$ plain form
6579 -1193 -965 -559 -844 -1168 -1268 -1064 -524 -721 -942 -965 -754 -485 -611 -575 -1010 -632 -390 -564 -962 -323
6599 -323 -511 -670 -442 -278 60 -94 -294 -912 -449 825 475 -362 -140 152 484 414 204 194 202 313 257
6620 257 54 186 461 26 310 518 597 360 75 321 430 717 651 -248 262 766 569 377 153 320 805
6641 805 1004 680 143 378 827 697 890 655 861 387 264 752 620 943 679 50 195 854 802 335
6661 335 375 621 648 860 385 354 479 775 780 82 617 573 151 328 389 152 131 72 76 -103 369 265 -357 -411
6685 -411 66 204 -92 -86 -532 -535 -361 32 -470 -601 -458 -345 -540 -435 -134 -372 -409 -303 -661 -168 138 -577
6707 -577 -1033 -222 342 -320 -480 -322 -540 344 -194 -71 -516 380 582 -13 -275 128 27 68 304 131
6727 131 -154 192 324 93 149 356 213 -519 176 282 560 371 -221 -469 309 880 279 -197 -197 95 284
$$ packed form
6579a193K28M06k85l24j00K04N40j97k21k3K11K69j26L6m35L78K42j74l98O39
6599c23j88j59K28J64L38j54k00o18M63J274l50q37K22K92L32p0k10j0QJ11n6
6620B57k03J32K75m35K84K08P9k37k85K46J09K87o6q99N10N04j97j92k24J67M85
6641H05J99l24n37K35M49j30J93k35K06m74j23M88j32L23k64o29J45O59n2m67
6661C35M0K46K7K12m75l1J25K96No98N35m4m22J77O1k37k1n9Mj79M72j04o22n4
6685d11M77J38k96Om46lJ74L93n02j31J43J13j95J05L01k38l7J06l58M93L06p15
6707e77m56Q11N64o62j60J58k18Q84n38J23m45Q96K02n95k62M03j01M1K36j73
6727A31k85L46J32k31N6K07j43p32O95J06K78j89n92k48P78N71o01m76%K92J89
$$ plain form
6748 284 631 404 397 669 302 -41 318 749 602 -43 294 698 1076 504 128 -158 603 790 278 -128 192
6769 192 589 347 177 -76 101 471 615 151 -136 63 496 147 268 332 216 -235 -504 -293 32 334
6789 334 -35 -732 -369 -67 -221 -373 -715 -258 -562 -269 -721 -964 -740 -300 -652 -774 -541 -379 -765 -646
6809 -646 -681 -695 -718 -755 -1052 -781 -375 -441 -800 -1146 -601 -506 -762 -1035 -1045 -893 -723 -688 -1195 -989 -810 -741 -723
6832 -723 -872 -638 -593 -959 -825 -434 -507 -639 -1028 -665 -184 -152 -434 -463 -614 -518 -72 141 -401 -522 321 107
6854 107 -375 -72 -79 -124 366 268 386 -14 436 343 273 862 687 260 154 439 703 966 898 268 385 734
6876 734 1243 726 519 597 741 1037 709 777 368 1006 728 860 1251 1184 942 725 748 700 853 1097 540 702
6898 702 967 1337 572 568 1167 1043 792 783 561 457 766 1067 638 410 820 417 527 832 834 631 300 507
$$ packed form
6748B84L47k27pK72l67l43L59M31j47o45L37M04L78n72l76k86P61J87n12m06L20
6769A92L97k42j70k53J77L70J44m64k87J99M33l49J21O4j16m51k69K11L25L02
6789C34l69o97L63L02j54j52l42M57l04K93m52k43K24M40l52j22K33J62l86J19
6809f46l5j4k3l7k97K71M06o6l59l46N45R5k56k73j0J52J70L5n07K06J79O9J8
6832g23j49K34M5l66J34L91p3j32l89L63M81L2k82k9j51R6M46K13n42j21Q43k14
6854A07m82L03pm5M90r8J18m00M50r3p0N89j75m27j06K85K64K63o8o30J17L49
6876G34N09n17k07P8J44K96l28O8m09O38k78J32L91o7k42k17K3m8J53K44n57J62
6898G02K65L70p65mN99j24k51rk22j04L09L01m29k28M10m03J10L05Kk03l31K07
$$ plain form
6920 507 403 574 647 19 -266 235 641 122 -84 25 -45 -348 313 -287 -428 -413 -401 -423 -480 -246 -779 -894
6942 -894 -582 -514 -421 -696 -827 -1201 -688 -134 -471 -1240 -846 -561 -630 -588 -866 -1160 -606 -584 -881 -785 -653 -747
6964 -747 -1001 -960 -197 -627 -1050 -643 -776 -665 -387 -537 -720 -781 -432 -276 -331 -108 -804 -768 -135 -383 -633
6985 -633 -345 136 -361 -315 -105 -300 -370 187 -279 26 136 -163 -437 -176 379 368 100 -222 266 66 473
7006 473 516 -205 135 455 781 323 416 354 463 601 726 529 390 552 396 703 1098 807 592 580 874
7027 874 745 887 749 559 551 919 1116 616 836 865 583 852 733 434 704 474 702 620 676 846 162 439
7049 439 694 720 -93 -20 26 448 198 115 -406 -391 -167 252 -193 -227 -369 -321 8 71 -210 -475 -547 -469 -320
7072 -320 -428 -289 -390 -605 -389 -455 -278 -584 -599 -531 -515 -152 -762 -523 -517 -651 -582 -589 -767 -905 -540 -274 -683
$$ packed form
6920E07j04J71P3o28k85N01M06n19k06J09p0l03O61o00j41J5J2k2n7K34n33j15
6942h94L12O8R3k75j31l74N13N54l37p69L94K85o9M2k78k94N54K2k97R6J32r4
6964g47k54M1P63m30m23M07j33J11K78j50j83o1L49J56n5K23o96L6O33k48k50
6985f33K88M81m97M6K10j95p0N57m66L05J10k99k74K61N55j1k68l22M88k00M07
7006D73M3p21L40L20L26m58R3o2J09J38J25j97j39J62j56L07L95k91k15j2K94
7027H74j29J42j38j90qL68J97n00K20K9k82K69j19k99K70k30K28q2N6J70o84K77
7049D39K55K6q13P3M6M22k50q3n21J5K24M19m45l4j42M8L29O3k81k65p2P8J49
7072c20j08J39j01k15K16o6J77l06j5O8J6L63o10K39Oj34O9pj78j38L65K66m09
$$ plain form
7095 -683 -850 -828 -862 -937 -316 -339 -839 -758 -903 -816 -823 -445 -537 -1006 -647 -190 -642 -483 -806 -1086 -453 -354 -303 -673
7119 -673 -429 -592 -584 -90 -426 -633 -808 -592 -84 -261 12 -379 -257 -50 198 -73 -27 46 -318 122 432
7140 432 -36 -187 266 413 156 262 414 -239 142 681 514 511 370 496 231 551 1055 534 260 481 538
7161 538 431 629 508 480 383 763 388 312 343 394 81 299 704 582 169 500 650 474 648 440 216 207
7183 207 348 316 259 373 -167 150 778 567 -33 0 339 341 426 516 -94 -59 422 583 409 -19 128 -495 -333
7206 -333 143 197 113 -191 39 294 48 82 -164 -376 -52 90 -152 -471 -502 -607 -222 -97 -359 -293 -314 -335
7228 -335 25 -126 -204 -515 -642 -25 -254 -97 -99 -367 -308 93 410 -191 -575 -48 -520 -225 139 109 -19 -195
7250 -195 218 -99 92 277 -192 -167 198 700 86 -39 109 -29 554 574 42 -427 423 329 409 344 418 -113
$$ packed form
7095f83j67K2l4p5O21k3n00Q1j45Q7pL78r2m69L59M57m52J59l23k80O33R9N1l70
7119f73K44j63QM94l36k07j75K16N08j77K73l91J22K07K48k71M6P3l64M40L10
7140D32m68j51M53J47k57J06J52o53L81N39j67lj41J26k65L20N04n21k74K21N7
7161E38j07J98j21k8r7L80l75p6L1N1l13K18M05j22m13L31J50j76J74k08k24r
7183B07J41l2n7J14n40L17O28k11o00L3L39KQ5R0o10L5M81J61j74m28J47o23J62
7206c33M76N4q4l04K30K55k46L4k46k12L24J42k42l19l1j05L85J25k62O6k1k1
7228c35L60j51p8l11j27O17k29J57kk68N9M01L17o01l84N27m72K95L64l0j28j76
7250a95M13l17J91J85m69K5L65N02o14j25J48j38N83K0n32m69Q50r4Q0o5P4n31
$$ plain form
7272 -113 116 602 496 -50 354 212 365 361 388 294 -97 172 333 462 385 -388 -170 123 616 565 151 311
7294 311 171 285 205 175 -211 -26 216 23 528 487 159 -309 243 116 18 -62 -71 -105 412 512 19 -663 -180
7317 -180 -31 167 220 -411 -693 -413 -19 -359 -623 -689 -539 -859 -568 -45 -691 -1049 -649 -425 -333 -459 -813
7338 -813 -1299 -664 -148 -630 -975 -1231 -1297 -762 -360 -799 -1387 -792 -669 -422 -681 -801 -577 -1183 -776 -331
7358 -331 -311 -544 -759 -961 -902 14 -9 -733 -909 -402 -95 -415 -626 -1059 -673 -325 114 -420 -305 -187 -421
7379 -421 73 43 76 73 -131 -298 28 569 -188 -346 -474 531 668 186 254 -135 472 783 692 114 251 460
7401 460 589 768 992 850 158 710 846 988 793 837 228 532 1569 1200 613 157 388 775 1217 1008
7421 1008 824 74 720 1040 867 733 558 669 540 874 783 624 620 604 369 835 955 447 -45 479 796
$$ packed form
7272a13K29M86j06n46M04j42J53mK7r4l91K69J61J29p7p73K18K93M93n1m14J60
7294C11j40J14q0l0l86J85K42j93N05m1l28m68N52j27r8q0rl4N17J00m93o82M83
7317a80J49J98N3o31k82K80L94l40k64o6J50l20K91N23o46l58M00K24R2j26l54
7338h13m86O35N16m82l45k56o6N35M02m39n88N95J23K47k59j20K24o06M07M45
7358c31K0k33k15k02N9R16k3p24j76N07L07l20k11m33L86L48M39n34J15J18k34
7379d21M94l0L3lk04j67L26N41p57j58j28J005J37m82O8l89O07L11r1n78J37K09
7401D60J29J79K24j42o92N52J36J42j95M4o09L04J037l69n87m56K31L87M42k09
7421A008j84p50O46L20j73j34j75J11j29L34r1j59mj6k35M66J20n08m92N24L17
$$ plain form
7442 796 833 841 63 -87 325 644 90 -208 -157 296 261 516 -222 -309 -276 48 -24 -79 83 -526 -502 -272 146
7465 146 -34 -522 -1099 -439 -119 -104 -459 -1024 -817 6 132 -406 -748 -909 -700 -316 -528 -678 -644 -436 -740
7486 -740 -339 -275 -628 -961 -892 -345 -217 -295 -757 -1111 -689 -96 -276 -700 -856 -638 -441 -182 -341 -859 -418
7507 -418 2 -221 -158 -215 -317 -460 -184 53 -120 -60 -116 -338 11 431 -2 -202 -403 210 240 489 145 -239
7529 -239 393 617 445 51 15 318 236 513 875 664 244 248 558 767 1074 414 -112 363 976 990 636 224
7551 224 97 720 762 739 118 199 557 631 498 656 616 224 95 323 836 49 289 202 160 533 512 -318 -438
7574 -438 41 545 519 -76 -310 -651 156 605 -83 -806 -501 -465 -146 322 -176 -642 -249 -733 -217 197 -164
7595 -164 -680 -803 -203 -255 -271 -684 -918 -878 78 99 -670 -1170 -584 -446 -220 52 -438 -1111 -507 -163 -366
$$ packed form
7442G96L7Qp78j50M12L19n54k98N1M53l5K55p38q7L3L24p2n5J62o09K4K30M18
7465A46j80m88n77O60L20J5l55n65K07Q23J26n38l42j61K09L84k12j50L4K08l04
7486g40M01O4l53l33O9N47J28p8m62l54M22N93j80m24j56K18J97K59j59n18M41
7507d18M20k23O3n7j02j43K76K37j73O0n6k22L49M20m33k00k01O13L0K49l44l84
7529b39O32K24j72l94l6L03q2K77L62k11m20ML10K09L07o60n26M75O13J4l54m12
7551B24j27O23M2k3o21Q1L58P4j33J58m0l92j29K28N13p87K40q7m2L73k1q30j20
7574d38M79N04k6n95k34l41Q07M49o88p23L05L6L19M68m98m66L93m84N16M14l61
7595a64n16j23O00n2j6m13k34M0R56K1p69n00N86J38K26K72m90o73O04L44k03
$$ plain form
7616 -366 -346 -551 -567 -879 -58 120 -409 -910 -956 -592 145 22 -421 -799 -299 33 54 -19 -405 -531 -318 176
7638 176 -138 -620 -518 -438 -468 -27 194 -365 -956 -69 232 -45 61 -351 -623 57 724 364 -532 -234 -133
7659 -133 425 231 134 -130 -210 278 636 707 645 4 -208 351 899 736 478 126 298 440 1219 607 157
7680 157 241 733 905 654 533 -60 -49 551 849 470 -63 -132 263 412 755 213 -178 173 441 481 392 23
7702 23 -95 -81 203 526 167 -14 -74 -102 569 346 -468 -151 -375 87 192 -3 -125 -331 -310 688 225 -1
7724 -1 -117 -265 -487 373 103 -224 -475 151 395 339 485 -357 -728 222 306 -83 -472 -88 -288 374 163
7745 163 -56 -264 -63 -180 102 -139 -296 -382 -373 -27 437 -109 -334 -174 -164 126 257 -111 -446 -204 38
7766 38 227 29 -120 -433 22 335 296 -12 295 74 -92 347 537 77 85 268 97 620 392 -249 203
$$ packed form
7616c66K0k05j6l12Q21J78n29n01m6L64P37j23m43l78N00L32K1p3l86j26K13M94
7638A76l14m82J02Q0l0M41K21n59n91Q87L01k77J06m12k72O80O67l60q96K98J01
7659a33N58j94r7k64q0M88L58P1o2o41k12N59N48j63k58l52J72J42P79o12m50
7680A57Q4M92J72k51j21n93J1O00K98l79n33o9L95J49L43n42l91L51K68M0q9l69
7702B3j18J4K84L23l59j81o0k8O71k23q14L17k24M62J05j95j22k06K1R98m63k26
7724aj16j48k22Q60k70l27k51O26K44n6J46q42l71R50Q4l89l89L84k00O62k11
7745A63k19k08K01j17K82k41j57q6RL46M64n46k25J60J0K90J31l68l35K42K42
7766C8J89j98j49l13M55L13l9l08L07k21j66M39J90m60QJ83j71N23k28o41M52
$$ plain form
7787 203 383 842 686 -10 140 -44 325 487 404 -101 94 459 507 380 368 -62 242 124 595 491 109
7808 109 -198 -81 394 793 297 -547 -300 114 366 9 -66 -598 -303 48 338 259 -120 -605 -421 249 764
7829 764 -111 -758 -272 -447 72 -55 -261 -1166 -477 228 291 -314 -572 -776 -502 -58 80 -279 -1029 -329
7849 -329 -139 87 -315 -527 -1172 -485 4 127 -411 -756 -422 -371 -88 -114 -840 -1012 -551 -79 -92 -342 -870
7870 -870 -1007 -299 -372 -159 -165 -832 -606 -220 15 -207 -625 -805 -707 -26 403 -102 -892 -603 -127 234 125
7891 125 -257 -690 -284 338 333 -290 -502 85 -121 46 340 -2 -380 82 365 633 477 -29 -143 18 558
7912 558 821 299 -220 130 449 431 1007 274 -227 355 388 696 302 157 226 514 649 446 272 59 445
7933 445 399 935 777 78 76 525 662 944 285 505 360 887 1285 370 -195 33 592 441 734 644 85
$$ packed form
7787B03J80M59j56o96J50j84L69J62q3n05J95L65M8j27j2m30L04j18M71j04l82
7808A09l07J17M75L99m96q44K47M14K52l57p5n32K95L51K90p9l79m85J84O70N15
7829G64q75o47M86j75N19j27k06r05O89P05O3o05k58k04K74M44J38l59p50P00
7849c29J90K26m02k12o45O87M89J23n38l45L34N1K83k6p26j72M61M72j3k50n28
7870h70j37P08p3K13oo67K26L86K35k22m18j80R8O81M29n05p90K89M76L61j09
7891A25l82m33M06O22no23k12N87k06J67K94l42l78M62K83K68j56n06j14J61N40
7912E58K63n22n19L50L19j8N76p33n01N82L3L08l94j45O9K88J35k03j74k13L86
7933D45m6N36j58o99kM49J37K82o59K20j45N27L98r15n65K28N59j51K93r0n59
$$ plain form
7954 85 82 532 871 592 621 61 87 629 818 509 -235 27 -50 556 494 274 -256 221 343 208 35 2 -75
7977 -75 -412 456 189 159 -93 -23 -132 -30 388 -137 -571 -322 355 192 -5 -452 -893 -114 157 -121 -642
7998 -642 -671 -292 -136 133 1 -698 -594 -32 -382 -102 52 -327 -570 -23 148 -104 -404 -223 -359 86
8018 86 286 -342 -815 -451 216 10 -77 -761 -502 -240 221 235 -219 -109 57 60 -69 318 78 -466 -136 137
8040 137 413 205 -8 -421 126 395 523 -249 -593 28 208 476 183 -226 95 119 117 463 136 -38 125
8061 125 -196 349 685 202 -366 -330 66 704 335 -169 -250 140 736 513 156 -243 20 505 746 136 -276
8082 -276 28 128 28 128 178 -330 -348 114 240 473 119 -795 -782 160 498 20 -584 -410 -137 362 243
8103 243 -409 -664 -5 55 24 -368 -584 -471 -281 -235 10 -23 -318 -659 -679 54 380 -293 -812 -563 -341 5
$$ packed form
7954H5lM50L39k79K9n60K6N42J89l09p44K62p7O06o2k20n30M77J22j35j73l3p7
7977g5l37Q68k67l0k52P0j09J02M18n25m34K49O77j63j97m47m41P79K71k78n21
7998f42k9L79J56K69j32o99J04N62l50K80J54l79k43N47J71k52l00J81j36M45
8018H6K00o28m73L64O67k06q7o84K59K62M61J4m54J10J66Lj29L87k40n44L30K73
8040A37K76k08k13m13N47K69J28p72l44O21J80K68k93m09L21K4kL46l27j74J63
8061A25l21N45L36m83n68L6L96O38l69n04q1L90N96k23l57l99K63M85K41o10m12
8082b76L04J00j00J00N0n08j8M62J26K33l54r14J3R42L38m78o04J74K73M99j19
8103B43o52k55O59O0l1l92k16J13J90M6K45l3k95l41k0P33L26o73n19K49K22L46
$$ plain form
8125 5 -306 -786 -505 -263 200 107 -239 -509 97 -618 238 65 -333 -84 -296 -348 284 194 -451 -521 -107 -18
8147 -18 107 -315 -277 -256 197 99 -177 -402 -146 52 239 -120 -204 -192 -18 211 141 37 387 -184 -281 158 504
8170 504 163 67 -231 209 579 240 29 -223 330 830 427 38 217 -8 243 640 346 179 656 596 488
$$ packed form
8125El11m80K81K42M63r3l46k70O06p15Q56j73l98K49k12n2O32r0o45p0M14Q9
8147a8J25m22L8K1M53r8k76k25K56J98J87l59q4J2J74K29p0j04L50n71r7M39L46
8170E04l41r6k98M40L70l39k11k52N53N00m03l89J79k25K51L97k94j67M77o0j08
8191D88
$$ Imaginary data points
##PAGE= N=2
##DATA TABLE= (X++(I..I)), XYDATA
$$ plain form
0 0 0 0 0 0 0 0 -8 8 -8 8 -16 16 -16 24 -31 32 -40 48 -56 64 -77 92 -102 118 -138 157 -178 202 -228 259
30 259 -289 326 -366 405 -453 506 -562 623 -691 766 -847 940 -1039 1151 -1276 1415 -1577
47 -1577 1760 -1969 2216 -2511 2864 -3308 3877 -4634 5699 -7311 10021 -15439 30545 -160143
61 -160143 -598002 -300677 155473 240867 -44290 -196045 -110526 -44405 -167933 -219653 -39023
72 -39023 136579 -834 -245128 -215974 41530 105617 -120528 -290129 -131404 130440 128056
83 128056 -107229 -194684 -31661 64931 -84900 -199988 -29015 223330 196371 -91479 -283455
94 -283455 -161966 87552 178466 103944 39084 2192 -91486 -156049 -33296 189154 240245
105 240245 38464 -176077 -139823 91719 207235 69256 -107867 -91923 59626 143260
$$ packed form
0@%%%%%%qJ6j6J6k4L2l2M0n5O3p2Q8j04J20j41J69j94K20k56K95l35L80m30M87
30B59n48O15o92P71q58R59j068J185j314J457j613J787j979K190k427K691k992
47a577L337l729M185m727N375o172P185q511J0333j3010J7332k5460M5984j90688
61a60143m37859K97325M56150Q5394k85157j51755Q5519O6121j23528n1720J80630
72c9023J75602j37413k44294K9154K57504O4087k26145j69601J58725K61844k384
83A28056k35285q7455J63023R6592j49831j15088J70973K52345k6959k87850j91976
94b83455J21489K49518R0914p4522o4860l6892r3678o4563J22753K22450N1091
105B40245k01781k14541L6254K31542J15516j37979j77123J5944J51549Q3634
$$ plain form
115 143260 90026 -10802 -56231 -32629 6484 34489 80445 117455 65161 -55057 -107706
126 -107706 -33697 83594 138009 98964 19435 -26436 -26038 -14471 20482 100166 159287 108354
138 108354 -20241 -92644 -18238 146529 220918 105910 -56233 -53915 99155 199389 145839
149 145839 32864 -9508 41617 110994 138137 140862 127248 55915 -37869 -15029 142906 250422
161 250422 164205 -14842 -79542 27226 149683 134882 42064 29895 85542 61821 -37262
172 -37262 -49930 65563 154078 85060 -64740 -107273 -381 91404 43520 -43098 -39562 -2273
184 -2273 -31412 -69741 -19916 57426 20194 -125806 -190921 -52715 126622 92659 -122839
195 -122839 -236367 -121938 40582 59649 -35258 -99508 -84769 -69131 -94856 -83119 6142
$$ packed form
115A43260n3234j00828m5429K3602L9113K8005M5956L7010n2294j20218n2649
126a07706P4009J17291N4415l9045p9529m5871L98J1567L4953P9684N9121n0933
138A08354j28595p2403P4406J64767P4389j15008j62143K318J53070J00234n3550
149A45839j12975m2372N1125O9377K7143K725j3614p1333r3784K2840J57935J07516
161B50422q6217j79047o4700J06768J22457j4801r2818j2169N5647k3721r9083
172c7262j2668J15493Q8515o9018j49800m2533J06892R1785m7884q6618L536L7289
184b273k9139l8329M9825P7342l7232j46000o5115J38206J79337l3963k15498
195a22839j13528J14429J62520J9067r4907o4250J4739J5638k5725J1737Q9261
$$ plain form
206 6142 50406 -46118 -162969 -132449 -6489 36560 -45039 -115950 -71347 8001 -18670 -114900
218 -114900 -111323 2931 45100 -58307 -150300 -95694 27358 51843 -52756 -143794 -105759
229 -105759 -7004 19236 -19441 -38517 -44143 -85419 -114689 -55399 52680 77665 -35392 -167310
241 -167310 -146933 9284 98381 17579 -98238 -99743 -21406 18382 -11108 -44912 -30609 -726
253 -726 -13782 -39913 -16201 25849 9230 -42385 -44554 6080 38887 18949 -16854 -14581 20700
266 20700 21515 -26812 -36619 35658 96231 53362 -45241 -82884 -15777 83559 105131 30970 -41177
279 -41177 -39243 4428 39891 57841 49726 8486 -28168 -18635 30748 72235 55592 -14865 -55611
292 -55611 -5911 72446 77483 12396 -40352 -30430 21209 51740 29178 -4202 2082 21179 7558
$$ packed form
206F142M4264r6524j16851L0520J25960M3049q1599p0911M4603P9348k6671r6230
218a14900L577J14254M2169j03407r1993N4606J23052K4485j04599r1038L8035
229a05759R8755K6240l8677j9076n626m1276k9270N9290J08079K4985j13057j31918
241a67310K0377J56217Q9097q0802j15817j505P8337L9788k9490l3804J4303K9883
253g26j3056k6131K3712M2050j6619n1615k169N0634L2807j9938l5803K273L5281
266B0700Q15m8327r807P2277O0573m2869r8603l7643O7107R9336K1572p4161p2147
279d1177J934M3671L5463J7950q115m1240l6654R533M9383M1487j6643p0457m0746
292e5611M9700P8357N037o5087n2748R922N1639L0531k2562l3380O284J9097j3621
$$ plain form
305 7558 -16027 -7591 21562 36604 24969 -2680 -18327 -8453 4957 11402 27735 37911 6015
318 6015 -40217 -34424 21672 61386 36853 -29620 -60821 -9397 60410 53398 -16473 -54536 -27980
331 -27980 18452 36487 18927 -10292 -22815 -21651 -17874 3134 33486 23755 -27099 -48936 -13618
344 -13618 25850 20350 -16779 -33792 -6233 24297 5192 -37747 -32185 13799 29182 -3445
356 -3445 -34606 -28510 3323 21668 3553 -21618 -18294 -2735 -4095 -2242 14933 13245 -17890
369 -17890 -37092 -12593 32097 44570 1877 -48012 -34627 25841 48361 12160 -22362 -18041
381 -18041 5505 19394 14626 2104 1798 7346 2146 -1306 14343 23607 6791 -6643 5344
394 5344 21507 21126 6271 -4144 10179 35535 29408 -6226 -14897 18484 43877 31810 3921
$$ packed form
305G558k3585Q436K9153J5042j1635k7649j5647R874J3410O445J6333J0176l1896
318F015m6232N793N6096L9714k4533o6473l1201N1424O9807p012o9871l8063K6556
331b7980M6432J8035j7560k9219j2523J164L777K1008L0352r731n0854k1837L5318
344a3618L9468n500l7129j7013K7559L0530j9105m2939N562M5984J5383l2627
356c445l1161O096L1833J8345j8115k5171L324J5559j360J853J7175j688l1135
369a7890j9202K4499M4690J2473m2693m9889J3385O0468K2520l6201l4522M321
381a8041K3546J3889m768j2522l06N548n200l452J5649R264j6816j3434J1987
394E344J6163l81j4855j0415J4323K5356o127l5634q671L3381K5393j2067k7889
$$ plain form
407 3921 -10426 3633 31282 38360 19073 3971 3599 7522 18957 35678 32180 6689 -8143
420 -8143 3298 26812 42295 30716 -1753 -12482 15348 40073 31657 9415 -185 8334 26179
433 26179 30533 12283 -684 9690 21995 20886 16454 10033 1011 4584 19201 23419 12938
446 12938 988 -5022 2995 23567 27547 1960 -19440 -8738 16270 28705 16281 -13689 -28401
459 -28401 -5488 23175 19841 -3863 -18698 -19343 -7294 8774 8453 -10013 -22507 -19948 -8964
472 -8964 4502 4410 -18487 -35576 -20541 4082 5463 -12176 -28890 -29186 -9366 7931 -4259
485 -4259 -27690 -27309 -10067 113 -2220 -14784 -27183 -22526 -2902 5156 -3124 -15839 -27338
498 -27338 -24857 -1088 16968 1722 -26821 -31723 -12058 10791 15338 -7361 -31674 -24241 3463
$$ packed form
407C921j4347J4059K7649P078j9287j5102l72L923J1435J6721l498k5491j4832
420h143J1441K3514J5483j1579l2469j0729K7830K4725q416k2242r600Q519J7845
433B6179M354j8250j2967J0374J2305j109m432o421r022L573J4617M218j0481
446A2938j1950o010Q017K0572L980k5587k1400J0702K5008J2435j2424k9970j4712
459b8401K2913K8663l334k3704j4835o45J2049J6068l21j8466j2494K559J0984
472h964J3466r2k2897j7089J5035K4623J381j7639j6714k96J9820J7297j2190
485d259k3431L81J7242J0180k333j2564j2399M657J9624Q058q280j2715j1499
498b7338K481K3769J8056j5246k8543m902J9665K2849M547k2699k4313P433K7704
$$ plain form
511 3463 13904 1830 -14239 -23479 -17240 1641 9618 -3009 -15997 -17694 -14096 -3559 4698
524 4698 -4476 -21520 -19428 -4155 1392 -5685 -18361 -23249 -9401 8094 734 -21806 -26082 -10345
538 -10345 3478 5631 -5217 -21763 -23516 -4933 7999 4011 -6602 -17501 -21526 -6757 13126
551 13126 11118 -8100 -21157 -17905 -612 16888 10514 -14848 -22159 -5127 8424 6150 -2450
564 -2450 -8880 -9449 -1377 772 -6198 -7038 -1919 -4660 -9716 -8649 -9218 -13309 -10539 -4820 -7179 -13554
580 -13554 -20822 -25679 -17607 650 -1316 -25581 -38134 -26059 -6817 355 -11627 -32418 -34816
593 -34816 -16232 -3734 -8742 -15760 -19365 -24422 -20791 -7310 519 -4225 -12910 -20525 -17578 -273
607 -273 10025 -1032 -10996 -4365 3206 1688 -1072 231 8815 18101 11994 -6177 -7233 14838
$$ packed form
511C463J0441j2074j6069r240O239J8881P977j2627j2988j697L598J0537Q257
524D698r174j7044K092J5273N547p077j2676m888J3848J7495p360k2540m276J5737
538a0345J3823K153j0848j6546j753J8583J2932l988j0613j0899m025J4769J9883
551A3126k008j9218j3057L252J7293J7500o374k5362p311J7032J3551k274q600
564b450o430n69Q072K149o970q40N119k741n056J067n69m091K770N719k359o375
580a3554p268m857Q072J8257j966k4265j2553J2075J9242P172j1982k0791k398
593c4816J8584J2498n008p018l605n057L631J3481P829m744q685p615K947J7305
607b73J0298j1057r964O631P571j518k760J303Q584R286o107j8171j056K2071
$$ plain form
621 14838 27330 18084 5091 11 3905 15444 22802 17888 10662 4374 -2132 3668 25198 32479
635 32479 10671 -13666 -12525 9781 31047 28015 1682 -14789 -1883 16505 15780 10486 11028
648 11028 10679 6288 4511 6886 16130 25274 19293 6078 10183 23484 23145 16605 22136 30970 29099
663 29099 20934 15979 26743 48731 51270 24875 6364 24514 54753 62355 45867 24354 17541
676 17541 32935 50736 53346 48688 42500 27008 15298 29621 54554 56472 33602 10178 9194
689 9194 30787 46185 31133 6754 6833 20004 19681 9282 6480 9019 9995 2372 -10433 -10632 5419
704 5419 11677 -4725 -20099 -18377 -12763 -11350 -8930 -6683 -8112 -17475 -34311 -38513 -13150 13194
718 13194 366 -37424 -50465 -28561 -860 4009 -16055 -35703 -32090 -16663 -13267 -14943 -9826
$$ packed form
621A4838J2492r246j2993n080L894J1539P358m914p226o288o506N800K1530P281
635C2479k1808k4337J141K2306K1266l032k6333j6471J2906J8388p25n294N42
648A1028l49m391j777K375R244R144n981j3215M105J3301l39o540N531Q834j871
663B9099q165m955J0764K1988K539k6395j8511J8150L0239P602j6488k1513o813
676A7541J5394J7801K610m658o188j5492j1710J4323K4933J918k2870k3424r84
689I194K1593J5398j5052k4379P9J3171l23j0399k802K539R76p623j2805j99J6051
704E419O258j6402j5374J722N614J413K420K247j429r363j6836m202K5363K6344
718A3194j2828l7790j3041K1904K7701M869k0064j9648L613J5427L396j676N117
$$ plain form
731 -9826 -12522 -28291 -35013 -20308 -1062 2058 -18014 -41094 -36955 -9209 519 -17936 -30121
744 -30121 -23425 -19721 -27275 -33799 -26654 -9759 -7031 -32242 -55693 -42411 -12682 -7355 -25662
757 -25662 -40010 -40997 -34590 -28464 -26101 -21993 -18249 -30095 -50378 -45155 -11620 4736 -17404 -46276
771 -46276 -47610 -21257 3802 -1409 -24566 -29753 -15223 -9924 -15066 -6835 8007 6434 -11160
784 -11160 -22437 -10551 16602 27779 8886 -10467 -2716 13111 12862 9623 17417 23921 15434
797 15434 -949 -5229 16380 42253 33535 -2930 -15788 9876 34721 31608 11422 -1869 1732
810 1732 12510 13715 12813 20252 19932 -1299 -16283 1003 27817 30085 7524 -12508 -9735 11348
824 11348 20636 7369 -723 9462 13481 -153 -7780 4400 21628 22864 4634 -13214 -4306
$$ packed form
731i826k696j5769o722J4705J9246L120k0072k3080M139K7746R728j8455j2185
744c0121O696L704p554o524P145J6895K728k5211k3451J3282K9729N327j8307
757b5662j4348r87O407O126K363M108L744j1846k0283N223L3535J6356k2140k8872
771d6276j334K6353K5059n211k3157n187J4530N299n142Q231J4842j573j7594
784a1160j1277J1886K7153J1177j8893j9353P751J5827k49l239P794O504q487
797A5434j6383m280K1609K5873q718l6465j2858K5664K4845l113k0186j3291L601
810A732J0778J205r02P439l20k1231j4984J7286K6814K268k2561k0032K773K1083
824A1348R288j3267q092J0185M019j3634p627J2180J7228J236j8230j7848Q908
$$ plain form
837 -4306 20986 27048 10685 662 3173 6065 9068 17263 23833 19956 4747 -12011 -4572 28252
851 28252 44586 19848 -13299 -15727 7332 27945 26756 8444 -4140 507 5940 2818 5684
864 5684 15372 11220 -4706 -11144 -1493 11154 12413 -2404 -14310 -6129 7837 2626 -8290 -3740
878 -3740 5134 -350 -13731 -17364 -2932 16770 15530 -11641 -30372 -15085 9201 15891 6815
891 6815 -3546 -11478 -12284 -4910 5422 16698 16952 -2656 -21091 -9040 20431 27607 7234 -10805
905 -10805 -8025 10866 24305 14809 -1171 220 9735 8633 5352 13190 18435 11413 471 -4255
919 -4255 3952 18380 20335 6752 -142 6278 6862 -691 1559 14466 19812 9259 -9127 -14913
933 -14913 3682 23763 17160 -6326 -12813 -2007 7395 8694 4654 -1848 -5714 -5065 -3175 4124
$$ packed form
837d306K5292O062j6363j0023K511K892L003Q195O570l877j5209j6758P439L2824
851B8252J6334k4738l3147k428K3059K0613j189j8312j2584M647N433l122K866
864E684R688m152j5926o438R651J2647J259j4817j1906Q181J3966n211j0916M550
878c740Q874n484j3381l633J4432J9702j240k7171j8731J5287K4286O690r076
891F815j0361p932q06P374J0332J1276K54j9608j8435J2051K9471P176k0373j8039
905a0805K780J8891J3439r496j5980J391R515j102l281P838N245p022j0942m726
919d255Q207J4428J955j3583o894O420N84p553K250J2907N346j0553j8386n786
933a4913J8595K0081o603k3486o487J0806R402J299m040o502l866O49J890P299
$$ plain form
947 4124 13080 5856 -14897 -19757 -1946 14604 12239 -2931 -15534 -12580 1714 5709 -1845 -3940
961 -3940 639 -3228 -11264 -9843 -1805 3261 878 -7383 -14409 -9137 -1176 -3505 -6602 -3785 -5438
976 -5438 -12881 -13390 -5348 1513 494 -9172 -21383 -16956 1190 7817 -3993 -16057 -17812 -11836
990 -11836 -1842 3138 -3388 -11069 -12603 -12642 -9911 -492 3336 -5752 -14213 -11801 -5755 -2061 -188
1005 -188 -4372 -8303 -5082 -2166 -5646 -6287 294 2073 -1036 -4995 -7207 -4455 4392 7446 -1495
1020 -1495 -7902 -4515 1117 5042 7256 2732 -5873 -5840 1153 6261 9887 7596 -3687 -9495 432
1035 432 11860 11592 4923 -1381 -4102 3082 11173 8429 1294 1642 5201 4606 4742 5335 2640 2892
1051 2892 5763 4830 2719 4066 3625 750 3635 6881 1901 -2487 1119 6073 6780 3400 -3964 -7999
$$ packed form
947D124Q956p224k0753m860J7811J6550k365j5170j2603K954J4294L995p554k095
961c940M579l867q036J421Q038N066k383q261p026N272P961k329l097K817j653
976e438p443n09Q042O861j019r666j2211M427J8146O627j1810j2064j755N976
990a1836R994M980o526p681j534l9K731R419L828r088q461K412O046L694J873
1005a88m184l931L221K916l480o41O581J779l109l959k212K752Q847L054q941
1020a495o407L387N632L925K214m524q605L3O993N108L626k291j1283n808R927
1035D32J1428k68o669o304k721P184Q091k744p135L48L559n95J36N93k695K52
1051B892K871r33k111J347m41k875K885L246m980m388L606M954P07l380p364m035
$$ plain form
1067 -7999 1269 11703 7963 -2986 -7854 -6858 -1035 7093 6459 -3396 -8915 -6987 -3106 1534 3605
1082 3605 -4016 -12820 -8446 -177 792 -3214 -8850 -12209 -7994 193 -936 -8445 -10135 -8368 -7778
1097 -7778 -5817 -4384 -8462 -10636 -6572 -4575 -7594 -9891 -10728 -11196 -5080 152 -6006 -14614 -13454
1112 -13454 -7387 -2710 -498 -5347 -13948 -12593 -3495 -134 -2510 -5740 -9457 -9692 -1545 4544 -789
1127 -789 -6949 -7978 -5493 918 6580 2426 -6510 -5837 538 3141 3605 2586 -1734 -2214 4339 6379
1143 6379 1931 531 1666 2870 6465 8660 3847 -463 3586 7984 8175 7799 6542 2246 4258
1158 4258 11229 11254 6378 4690 5370 7621 13249 13747 5522 1455 7164 12712 13539 12582 7748 3959
1174 3959 8908 14961 13768 11023 11572 9442 8332 13619 16742 12942 9579 10146 11373 15430 17488
$$ packed form
1067g999R268J0434l740j0949m868R96N823Q128o34r855n519J928L881M640K071
1082C605p621q804M374Q269R69m006n636l359M215Q187j129p509j690J767N90
1097g778J961J433m078k174M064J997l019k297q37m68O116N232o158q608J160
1112a3454O067M677K212m849q601J355R098L361k376l230l717k35Q147O089n333
1127g89o160j029K485O411N662m154q936O73O375K603M64j019m320m80O553K040
1143F379m448j400J135J204L595K195m813m310M049M398J91l76j257m296K012
1158D258O971K5m876j688O80K251N628M98q225m067N709N548Q27r57m834l789
1174C959M949O053j193k745N49k130j110N287L123l800l363N67J227M057K058
$$ plain form
1189 17488 11401 6542 12362 17264 13814 10140 10294 11378 13729 13951 9404 7004 11751 13867 9111
1204 9111 8008 10093 7371 4418 6854 9618 8776 6465 293 -2895 4514 11284 4417 -5604 -4638
1219 -4638 587 2728 1222 -3552 -6535 -3290 -1228 -6182 -7386 -2043 -2550 -9485 -10141 -5525 -3289
1234 -3289 -4315 -8251 -11799 -7550 -1454 -5868 -13016 -9430 -1543 -2948 -10177 -11991 -8185 -1638 -422
1249 -422 -8425 -13996 -7588 -1229 -5146 -8000 -4839 -4690 -8416 -9346 -7216 -2675 335 -6030 -16217
1264 -16217 -11976 526 1117 -9159 -14323 -10743 -5245 -3423 -8747 -13663 -9611 -4422 -10084 -15754
1278 -15754 -10082 -4243 -7431 -12913 -14305 -10889 -5968 -6210 -12734 -12152 -4323 -4217 -13399 -14383 -3789
1293 -3789 2014 -2605 -11580 -14633 -5298 7286 3904 -8696 -9582 -951 2292 396 1115 1815 1020
$$ packed form
1189A7488o087m859N820M902l450l674J54J084K351K22m547k400M747K116m756
1204I111j103K085k722k953K436K764q42k311o172l188P409O770o867j0021R66
1219d638N225K141j506m774k983L245K062m954j204N343n07o935o56M616K236
1234c289j026l936l548M249O096m414p148L586P887j405p229j814L806O547J216
1249d22q003n571O408O359l917k854L161J49l726r30K130M541L010o365j0187
1264a6217M241J2502N91j0276n164L580N498J822n324m916M052N189n662n670
1278a5754N672N839l188n482j392L416M921k42o524N82P829J06r182r84J0594
1293c789N803m619q975l053R335J2584l382j2600q86Q631L243j896P19P00p95
$$ plain form
1308 1020 -717 -3273 1286 11753 12312 -2658 -9657 1988 14435 11695 2019 -3757 840 10150
1322 10150 8892 -620 -237 9287 9000 -1227 -4467 2774 8285 6697 -972 -5284 529 6145 -329
1337 -329 -5673 2014 7901 -1460 -12109 -7516 5761 12952 2237 -15265 -15002 3979 14939 3928
1351 3928 -8283 -7246 -1050 2099 2233 2899 4406 3544 -4616 -8773 4565 18338 10437 -7593 -8773
1366 -8773 5467 15715 11114 -1562 -4238 7895 13925 2814 -4793 5353 15362 9300 -2548
1379 -2548 -4675 4188 12921 9486 -1745 -2291 5436 4143 -4308 19 11728 9929 -5497 -15890
1393 -15890 -6460 14167 18980 -2280 -21764 -11786 10281 13415 576 -7901 -5931 -547 601
1406 601 -1051 2420 8854 2503 -12364 -9982 9449 17713 4871 -9573 -7175 7344 15053 4853
$$ packed form
1308A020j737k556M559J0467N59j4970o999J1645J2447k740r676n776M597R310
1322A0150j258r512L83R524k87j0227l240P241N511j588p669m312N813N616o474
1337c29n344P687N887r361j0649M593J3277P191j0715j7502K63J8981J0960j1011
1351C928j2211J037O196L149J34O66J507q62q160m157J3338J3773p901j8030j180
1366h773J4240J0248m601j2676k676J2133O030j1111p607J0146J0009o062j1848
1379b548k127Q863Q733l435j1231n46P727j293q451M327J1709j799j5426j0393
1393a5890R430K0627M813k1260j9484R978K2067L134j2839q477J970N384J148
1406F01j652L471O434o351j4867K382J9431Q264j2842j4444K398J4519P709j0200
$$ plain form
1420 4853 -6427 2241 16687 10452 -5613 -4916 12183 20648 11316 -4091 -6326 9009 19200
1433 19200 10802 1198 5079 8071 1666 -515 9982 19106 11679 -7272 -15592 1885 25773 20256
1447 20256 -8089 -19103 -2258 14218 11831 -677 -7368 -1520 3257 -2982 -6992 3457 10926
1460 10926 -1712 -16422 -10494 6050 10238 -1298 -12983 -8880 4421 3756 -11236 -11529 6200
1473 6200 11679 -6598 -21608 -12716 9068 16628 -1343 -21311 -16240 4680 8865 -2627 -6933
1486 -6933 -2934 -4497 -10600 -8358 3159 11792 435 -22368 -23788 2837 19231 2561 -21272
1499 -21272 -20463 -2179 6752 -2018 -14365 -10001 1947 -2033 -17490 -15559 1838 7227 -7347
1512 -7347 -19161 -14301 -1065 2913 -7625 -13659 -4510 1604 -10762 -19302 -4766 12734 6258
$$ packed form
1420D853j1280Q668J4446o235j6065O97J7099Q465r332j5407k235J5335J0191
1433A9200q398r604L881K992o405k181J0497R124p427j8951q320J7477K3888n517
1447B0256k8345j1014J6845J6476k387j2508o691N848M777o239m010J0449P469
1460A0926j2638j4710N928J6544M188j1536j1685M103J3301o65j4992k93J7729
1473F200N479j8277j5010Q892K1784P560j7971j9968N071K0920M185j1492m306
1486f933L999j563o103K242J1517Q633j1357k2803j420K6625J6394j6670k3833
1499b1272Q09J8284Q931q770j2347M364J1948l980j5457J931J7397N389j4574
1512g347j1814M860J3236L978j0538o034R149O114j2366q540J4536J7500o476
$$ plain form
1525 6258 -16447 -26133 -8390 16680 15803 -9733 -23486 -8089 8478 6627 -536 -1051 767 -2350
1539 -2350 -6718 -2690 11987 17429 -244 -17196 -6128 17028 19722 1504 -9723 -1284 13552
1552 13552 12804 -1054 -4702 10364 18272 3526 -9458 -899 15507 17885 6106 -5110 -2179
1565 -2179 8938 10479 4205 5936 11986 4955 -8444 -4564 14603 23754 10674 -11959 -15877 7270
1579 7270 26920 15803 -7979 -11692 1886 11612 9218 3055 879 2713 685 -5263 -649 12430
1593 12430 11836 -4712 -12613 -1633 9526 7455 -4059 -8622 844 9644 -559 -14605 -7630
1606 -7630 10128 11007 -6742 -17966 -10383 6222 10609 -2577 -15766 -10643 -810 -1474 -4309 10
1620 10 -169 -10952 -18613 -10581 6702 12901 -4612 -26738 -21890 4083 13838 -2759 -18635 -15057
$$ packed form
1525F258k2705r686J7743K5070q77k5536j3753J5397J6567j851p163n15J818l117
1539b350m368M028J4677N442j7673j6952J1068K3156K694j8218j1227Q439J4836
1552A3552p48j3858l648J5066P908j4746j2984Q559J6406K378j1779j1216K931
1565b179J1117J541o274J731O050p031j3399L880J9167R151j3080k2633l918K3147
1579G270J9650j1117k3782l713J3578R726k394o163k176J834k028n948M614J3079
1593A2430n94j6548p901J0980J1159k071j1514m563R466Q800j0203j4046O975
1606g630J7758Q79j7749j1224P583J6605M387j3186j3189N123R833o64k835M319
1620A0j79j0783p661Q032J7283O199j7513k2126M848K5973R755j6597j5876L578
$$ plain form
1634 -15057 -2093 2084 -5154 -11943 -5851 802 -6304 -13971 -6210 3853 -416 -11248 -12227 -2849
1648 -2849 3168 -2278 -11221 -7589 6158 5195 -12525 -17377 495 15433 7507 -11464 -18475 -4645
1662 -4645 12797 11014 -3724 -8163 -988 1139 -57 4057 9044 4584 -5009 -8110 2682 17778
1676 17778 15252 -5194 -13991 2255 18991 15206 978 -3739 2975 11635 9742 1629 3268 13025
1690 13025 12716 2642 599 7272 10986 8588 6542 7321 9804 8040 1416 1915 14212 18617 6199
1705 6199 -6179 -9 14309 18892 8958 -4841 -5422 8802 18017 10834 1266 -766 741 2674
1719 2674 7381 9923 6341 1092 -3904 -3002 5576 11586 3833 -6630 -4028 4593 6518 595 -5690
1734 -5690 -5153 2560 6586 -812 -8816 -5044 1983 1876 -2824 -5814 -6102 -2378 1157 -1437 -5341 -6007
$$ packed form
1634a5057J2964M177p238o789O092O653p106p667P761J0063m269j0832r79R378
1648b849O017n446q943L632J3747r63j7720m852J7872J4938p926j8971p011J3830
1662d645J7442j783j4738m439P175K127j196M114M987m460r593l101J0792J5096
1676A7778k526k0446q797J6246J6736l785j4228m717O714Q660j893q113J639R757
1690A3025l09j0074k043O673L714k398k046P79K483j764o624M99J2297M405j2418
1705F199j2378O170J4318M583r934j3799n81J4224R215p183r568k032J507J933
1719B674M707K542l582n249m996R02Q578O010p753j0463K602Q621J925n923o285
1734e690N37P713M026p398q004L772P027j07m700k990k88L724L535k594l904o66
$$ plain form
1750 -6007 -7292 -7379 -1344 4052 -1163 -11340 -14360 -7948 2656 6004 -4574 -16630 -13108 56
1764 56 3504 -3045 -9954 -10720 -5570 -513 -1491 -7238 -7485 -5393 -6434 -5017 -486 -1310 -7516 -9513
1780 -9513 -5108 -309 -87 -5253 -10317 -4847 4530 1838 -9520 -11439 -2162 5385 4341 -3712 -10817
1795 -10817 -6608 3073 5080 632 -1567 -2859 -4656 -1619 5247 6365 443 -5263 -5127 3637 11864
1810 11864 6598 -6321 -7825 3908 11296 7530 287 -3116 346 7040 8012 2819 2222 4059 3766
1825 3766 3386 6228 5554 850 876 5427 8850 7702 1798 -4573 110 11024 12417 1729 -5092
1840 -5092 -1455 5121 9018 6283 -1727 -3651 2329 6276 4786 2375 -1474 -5247 -1595 6519 7078
1855 7078 39 -6148 -7082 -1594 6103 5384 -4155 -8668 -3458 1363 1431 -2055 -5803 -6442 -697 2710
$$ packed form
1750f007j285q7O035N396n215j0177l020O412J0604L348j0578j2056L522J3164
1764E6L448o549o909p66N150N057r78n747k47K092j041J417M531q24o206j997
1780i513M405M799K22n166n064N470R377k692j1358j919R277P547j044q053p105
1795a0817M209R681K007m448k199j292j797L037O866J118n922n706J36Q764Q227
1810A1864n266j2919j504J1733P388l766p243l403L462O694R72n193n97J837k93
1825C766l80K842o74m704K6M551L423j148n904o371M683J0914J393j0688o821
1840e092L637O576L897k735q010j924N980L947j490k411l849l773L652Q114N59
1855G078p039o187r34N488P697p19r539m513N210M821O8l486l748o39N745L407
$$ plain form
1871 2710 -1779 -6761 -7047 -5117 -1236 2335 -675 -7896 -8681 -3252 -252 -477 -3361 -8072 -7704 -343
1887 -343 2306 -3340 -8983 -9122 -4759 1914 4098 -3954 -11821 -10114 -2251 1816 1284 -3636 -8947 -6979
1903 -6979 -683 901 -2765 -4938 -5104 -3814 637 1956 -3220 -7790 -5001 236 3087 2567 -3302
1918 -3302 -7331 -2524 4797 3401 -2062 -3448 -727 3508 5688 1672 -3952 -2720 3477 6670 6478
1933 6478 4707 -698 -3540 2360 9724 9346 4659 -60 -700 5481 11563 7898 282 756 6927 10128
1949 10128 8923 4841 1431 2554 8266 9122 6519 5581 4449 2897 5019 8689 6956 2909 3061
1964 3061 5849 8259 7660 2133 -2336 2314 11101 9998 2127 -2661 -1016 4211 8779 6311 -4
1979 -4 -2028 1521 3527 3751 4027 386 -3688 -1194 4531 5588 1826 -3329 -6103 -1387 5745 4890
$$ packed form
1871B710m489m982k86J930L881L571l010p221p85N429L000k25k884m711L68P361
1887c43K649n646n643j39M363O673K184q052p867J707P863M067n32m920n311J968
1903f979O296J584l666k173j66J290M451J319n176m570K789N237K851n20n869
1918c302m029M807P321j396n463j386K721M235K180m016n624J232O197L193j92
1933F478j771n405k842N900P364l78m687m719o40O181O082l665p616M74O171L201
1949A0128j205m082l410J123N712Q56k603r38j132j552K122L670j733m047J52
1964C061K788K410n99n527m469M650Q787j103p871m788J645N227M568k468o315
1979dk024L549K006K24K76l641m074K494N725J057l762n155k774M716P132q55
$$ plain form
1995 4890 -2697 -5893 -2481 664 531 -1117 -4405 -3551 594 -309 -4426 -5397 -3553 -3249 -1717 -327
2011 -327 -3247 -7299 -6740 -3694 -1200 -42 -4015 -10269 -9230 -662 2220 -3126 -9233 -10772 -6190
2026 -6190 1311 1898 -5736 -10472 -7619 -3803 -2205 -670 -2644 -7184 -7515 -5040 -2471 -753 -1398 -6272
2042 -6272 -6852 -1668 1053 -3122 -6098 -3314 177 1684 -1150 -6192 -5369 1894 4824 -421 -4906
2057 -4906 -3150 133 3009 3758 207 -2505 -1739 103 2634 6002 5177 -2542 -6433 274 8590 8858
2073 8858 2737 -3917 -3666 4577 10052 5020 -536 764 3725 3946 3494 3841 3614 3986 3597 1556 2864
2090 2864 6262 4642 798 2583 6084 4065 778 1090 4115 7748 5619 -1827 -4714 4001 11246
2105 11246 6088 -2247 -4799 -796 4532 7154 2683 -1655 -2268 -1542 -1813 2071 5848 1790 -5896
$$ packed form
1995D890p587l196L412L145j33j648l288Q54M145r03m117r71J844L04J532J390
2011c27k920m052N59L046K494J158l973o254J039Q568K882n346o107j539M582
2026f190P501N87p634m736K853L816J598J535j974m540l31K475K569J718o45m874
2042f272n80N184K721m175k976K784L491J507k834n042Q23P263K930n245m485
2057d906J756L283K876P49l551k712P66J842K531L368q25p719l891O707Q316K68
2073H858o121o654K51Q243N475n032n556J300K961K21m52L47k27L72l89k041J308
2090B864L398j620l844J785L501k019l287L12L025L633k129p446k887Q715P245
2105A1246n158q335k552M003N328K622m471m338o13P26k71L884L777m058p686
$$ plain form
2120 -5896 -7198 -1390 4226 3722 -3453 -8803 -4009 2728 973 -5406 -4977 -1757 -1642 -4235 -5873 -4457
2136 -4457 -64 387 -5942 -9514 -5018 -841 -1823 -3711 -3462 -4560 -6506 -6934 -4837 1028 3284 -5120
2152 -5120 -13619 -9736 1948 5030 -1809 -9437 -10005 -3465 2467 11 -5140 -4698 -2627 -4909 -4710
2167 -4710 -141 2223 -1154 -6417 -7591 -2473 3727 2730 -4747 -6098 -219 1454 -2625 -3433 1231
2182 1231 4504 2430 -4264 -7614 579 9413 6464 -2521 -4459 846 4288 5069 4287 2860 2388 1174
2198 1174 -274 4172 11268 10047 -741 -5280 2958 12062 12852 4211 -2337 620 8778 10165 4459
2213 4459 3587 7650 6605 2239 1567 6316 10049 8575 2642 -641 4737 9043 5528 2065 4944
2228 4944 7106 3137 -645 1086 7474 10623 3700 -6193 -4653 7701 12741 4243 -4095 -4235 492
$$ packed form
2120e896j302N808N616n04p175n350M794O737j755o379M29L220J15k593j638J416
2136d457M393M51o329l572M496M177r82j888K49j098j946m28K097N865K256q404
2152e120q499L883J1684L082o839p628n68O540N932k456n151M42K071k282J99
2167d710M569K364l377n263j174N118O200r97p477j351N879J673m079q08M664
2182A231L273k074o694l350Q193Q834k949q985j938N305L442P81p82j427m72j214
2198A174j448M446P096j221j0788m539Q238R104P90q641o548K957Q158J387n706
2213D459q72M063j045m366o72M749L733j474n933l283N378M306l515l463K879
2228D944K162l969l782J731O388L149o923r893J540J2354N040q498q338j40M727
$$ plain form
2243 492 4803 4588 1152 665 -321 -3194 -4469 2302 8125 1901 -7003 -7724 -713 5285 3391 -4450
2259 -4450 -7352 -952 2449 -3042 -5964 -1557 2202 -1055 -6799 -8302 -2752 3577 1100 -7404 -8711
2274 -8711 -3449 -1303 -3171 -2633 -1279 -3493 -7678 -9429 -4754 3583 3373 -8061 -15198 -8087 3274
2289 3274 3537 -4136 -10406 -8268 -2441 -88 -3478 -4614 -1521 -2742 -7272 -6520 211 2443 -1337
2304 -1337 -6581 -6567 -1499 2849 -561 -5371 -1871 3086 -200 -5900 -3608 3536 6828 1734 -6480
2319 -6480 -6534 2687 9385 4217 -2772 -2874 812 2741 3587 4294 3811 1848 -1689 -2498 4417 11722 6930
2336 6930 -3582 -4877 3594 9705 7365 988 -2126 2738 7512 4266 82 3075 6753 3938 -164
2351 -164 396 4023 6976 5123 487 -387 3666 4438 904 1471 6318 5300 -1302 -4054 381 7865
$$ packed form
2243D92M311k15l436m87r86k873j275O771N823o224q904p21P011N998j894p841
2259d450k902O400L401n491k922M407L759l257n744j503N550O329k477q504j307
2274h711N262K146j868N38J354k214m185j751M675Q337k10j1434p137P111J1361
2289C274K63p673o270K138N827K353l390j136L093j221m530P52O731K232l780
2304a337n244J4N068M348l410m810L500M957l286n700K292P144L292n094q214
2319f480n4R221O698n168o989j02L686J929Q46P07m83j963l537q09O915P305m792
2336F930j0512j295Q471O111k340o377l114M864M774l246m184K993L678k815m102
2351a64N60L627K953j853m636q74M053P72l534N67M847j018o602k752M435P484
$$ plain form
2367 7865 9433 249 -8367 -3870 6989 8290 1199 -3829 -3326 -687 1876 1828 584 1022 -1225 -5096
2383 -5096 -4098 2985 4736 -2060 -7274 -5179 187 2868 -1423 -6651 -4638 1359 -191 -6458 -6690
2398 -6690 -1071 1683 -1850 -6773 -8075 -3287 1001 -764 -5252 -5070 -4004 -5481 -4581 -647 743
2413 743 -3359 -8533 -9124 -2572 4189 1505 -8774 -11195 -3508 2672 755 -4084 -6586 -4737 -1003
2428 -1003 -575 -3287 -2650 -359 -2368 -4517 -1677 1392 -229 -2622 -2871 -1233 1480 981 -3000 -2827
2444 -2827 3037 5042 -695 -4883 -1177 4484 6804 3011 -3053 -3195 3118 6909 4460 1611 837
2459 837 335 1948 5061 6472 4667 1944 -494 978 7285 9955 3424 -2129 586 6300 8654
2474 8654 5724 917 313 4568 7409 4166 1585 3487 5413 4397 3622 2611 2352 3367 4325 3769
$$ packed form
2367G865J568r184q616M497J0859J301p091n028N03K639K563m8j244M38k247l871
2383e096R98P083J751o796n214K095N366K681m291n228K013N997j550o267k32
2398f690N619K754l533m923j302M788M288j765m488J82J066j477R00L934J390
2413G43m102n174n91O552O761k684j0279k421P687O180j917m839k502J849L734
2428a003M28k712O37K291k009k149K840L069j621k393k49J638K713m99l981J73
2444b827N864K005n737m188L706N661K320l793o064j42O313L791k449k849p74
2459H37n02J613L113J411j805k723k438J472O307K670o531n553K715N714K354
2474H654k930m807o04M255K841l243k581J902J926j016p75j011k59J015R58n56
$$ plain form
2490 3769 3811 3865 1136 -191 3915 7511 4610 -800 -2258 1447 6922 7475 309 -4818 -1099 5231
2506 5231 5658 2207 -975 -2698 -1024 1906 2832 1240 11 -1817 -3554 -478 3143 886 -3837
2521 -3837 -3821 -1340 1347 556 -3639 -6509 -2426 2353 116 -4980 -5572 -3240 -1101 -821 -3138 -5759
2537 -5759 -4578 -1617 -1462 -2356 -2871 -5207 -6475 -3377 1220 369 -4202 -7506 -6590 -1370 3021 -139
2553 -139 -6755 -6696 -1820 918 -277 -2711 -4820 -3775 452 674 -1361 -2186 -2342 -3296 -609 2230 658
2570 658 -3069 -3471 -1248 856 1938 -683 -4122 -2182 2922 2827 -1677 -3494 -2385 987 3603 2392
2586 2392 -2485 -3646 -482 1733 2188 2042 -450 -3259 -831 3103 3328 1615 -1292 -2201 1037 5561
2602 5561 5088 -585 -2889 488 3886 5625 3940 -194 -670 2694 4741 3246 2091 1724 1480 2799
$$ packed form
2490C769M2N4k729j327M106L596k901n410j458L705N475N53p166n127L719O330
2506E231M27l451l182j723J674K930R26j592j229j828j737L076L621k257m723
2521c837J6K481K687p91m195k870M083M779k237n096n92K332K139K80k317k621
2537e759J181K961J55q94n15k336j268L098M597q51m571l304R16N220M391l160
2553a39o616N9M876K738j195k434k109J045M227K22k035q25j56r54K687K839j572
2570F58l727m02K223K104J082k621l439J940N104r5m504j817J109L372K616j211
2586B392m877j161L164K215M55j46k492k809K428L934K25j713k907r09L238M524
2602E561m73n673k304L377L398J739j685m134m76L364K047j495j155l67k44J319
$$ plain form
2618 2799 4503 2867 514 534 2293 3552 4534 2737 -1333 -1929 2637 5028 2409 -1114 -2457 -979
2634 -979 2930 3446 -1207 -4251 -2208 647 1262 589 -2167 -4492 -3722 -408 453 -770 -2271 -5088
2650 -5088 -5003 -937 1070 -2168 -5649 -4523 -2111 -285 -745 -4558 -6372 -2337 1287 -498 -3194 -4102
2666 -4102 -3584 -1961 405 -620 -3252 -2950 -2163 -1931 191 305 -3091 -4926 -1242 1716 1641 -1667 -4928
2683 -4928 -4316 516 3958 458 -4015 -3729 -916 730 862 -388 -2574 -2551 -495 17 -352 -71 -2082
2700 -2082 -3205 -210 2855 848 -2236 -2972 -1255 2269 3666 234 -3323 -710 3563 3483 695 -84
2716 -84 506 2483 4948 3741 1109 1255 2760 3310 5386 6829 4065 -39 1532 5441 7565 6746
2732 6746 3172 464 3522 8248 7323 2888 1596 3386 5178 6485 5424 1666 1606 4005 4278 4184
$$ packed form
2618B799J704j636k353K0J759J259R82j797m070n96M566K391k619l523j343J478
2634i79L909N16m653l044K043K855O15o73k756k325P70L314Q61j223j501k817
2650e088Q5M066K007l238l481J126K412J826m60l813j814M035L624j785k696r08
2666d102N18J623K366j025k632L02P87K32K122J14l396j835L684K958p5l308l261
2683d928O12M832L442l500m473K86K813J646J32j250k186K3K056N12l69K81k011
2700b082j123K995L065k007l084p36J717L524J397l432l557K613M273q0k788p79
2716h4N90J977K465j207k632J46J505N50K076J443k764m104J571L909K124q19
2732F746l574k708L058M726r25m435j292J790J792J307j061l758o0K399K73r4
$$ plain form
2748 4184 4421 2544 257 1502 3936 3466 1272 40 -380 1969 4372 1672 -3290 -2485 1577 3574
2764 3574 1504 -1555 -3601 -2496 1545 2862 -872 -2436 -1914 -1569 -645 1664 655 -2651 -3402 -1248
2780 -1248 1120 2267 103 -4390 -4295 959 3325 99 -3268 -3994 -1900 1097 653 -2965 -3665 -929
2796 -929 -134 -1962 -2023 -2070 -3825 -3187 -1640 -1415 -2340 -3505 -5693 -4508 160 742 -4799 -8191 -4788
2813 -4788 -867 538 -2880 -7265 -7139 -1861 815 -2003 -5003 -4373 -4120 -3136 -499 -167 -1662 -3418
2829 -3418 -4068 -2710 1127 2783 -1724 -4986 -1482 3073 2682 -397 -2342 -569 3292 4208 387 -1739
2845 -1739 2079 4272 3232 1878 1703 1661 2495 3243 3471 3376 2977 559 9 4258 7675 4061 -1135
2862 -1135 -1501 2571 6889 6314 644 -2997 1071 5369 4465 1391 820 927 917 2189 2469 1910 2028
$$ packed form
2748D184K37j877k287J245K434m70k194j232m20K349K403k700m962Q05M062J997
2764C574k070l059k046J105M041J317l734j564N22L45R24K309j009l306p51K154
2780a248K368J147k164m493R5N254K366l226l367p26K094K997m44l618p00K736
2796i29P95j828o1m7j755O38J547K25r25j165k188J185M668N82n541l392L403
2813d788L921J405l418m385J26N278K676k818l000O30K53R84K637L32j495j756
2829c418o50J358L837J656m507l262L504M555l91l079j945J773L861R16l821k126
2845a739L818K193j040j354j75m2Q34P48K28r5l99k418n50M249L417l614n196
2862a135l66M072M318n75n670l641M068M298r04l074n71J07j0J272K80n59J18
$$ plain form
2879 2028 667 -1148 944 4566 2432 -1934 -1256 2075 3322 1499 -1523 -2073 1794 4689 742
2894 742 -3767 -2251 2000 2739 920 -1492 -2755 -1291 908 654 -389 -112 -2130 -4476 -2305 2058
2910 2058 2237 -2160 -5358 -5347 -252 3456 66 -6341 -6173 -754 632 -1730 -3770 -4311 -2515 -1587
2926 -1587 -2204 -3653 -2155 -1112 -3814 -4153 -1922 -865 -2906 -3704 -2501 -372 50 -2859 -5567 -2937
2942 -2937 3039 2445 -3854 -5923 -2215 2261 2952 140 -3515 -3048 906 1909 622 1043 905 -1358
2958 -1358 -2077 1466 4381 3564 270 -2921 -698 5353 6524 948 -2174 1063 4737 4212 1849 616
2974 616 2313 5224 3890 432 1125 4605 4434 2452 2863 3385 2839 2349 2682 3974 5913 4720 -208
2991 -208 -793 5766 9029 5097 -451 -1239 2717 7263 6726 1282 -744 2074 3911 2897 3348 3824
$$ packed form
2879B028j361j815K092L622k134m366O78L331J247j823l022n50L867K895l947
2894G42m509J516M251P39j819k412j263J464K199k54j043K77k018k346K171M363
2910B058J79m397l198J1N095L708l390o407J68N419J386k362k040n41J796R28
2926a587o17j449J498J043k702l39K231J057k041p98J203K129M22k909k708K630
2942b937N976n94o299k069L708M476O91k812l655M67L954J003j287M21j38k263
2958a358p19L543K915q17l294l191K223O051J171n576l122L237L674n25k363j233
2974F16J697K911j334l458O93L480j71j982M11N22n46m90L33J292J939j193m928
2991b08n85O559L263l932n548p88L956M546n37n444k026K818J837j014M51M76
$$ plain form
3007 3824 1481 -696 99 2681 4120 3533 -729 -2879 1105 4537 1793 -2552 -2274 833 2155 305
3023 305 -3127 -3144 819 2016 -1809 -4568 -2213 -434 -1063 -1484 -2175 -3073 -3421 -3129 -2995 -861 209
3040 209 -3934 -7696 -4324 878 1358 -2763 -6678 -6795 -1983 1657 -1256 -5389 -4900 -2763 -2530 -2824
3056 -2824 -2109 -2415 -3769 -4010 -4037 -2057 -28 -1720 -5346 -4545 -729 -263 -2399 -4026 -2670 -353 307
3073 307 -2960 -5359 -2166 1790 961 -2951 -3542 -2066 -100 1095 -186 -1593 -1271 -476 -1271 234
3089 234 3042 1896 -1956 -3083 801 3850 3925 425 -3290 -1200 4422 4963 1026 -445 1345 2263
3105 2263 2359 2506 1867 2451 3321 1748 866 3284 4393 2104 777 2980 3928 3141 1337 852 2800
3122 2800 5554 4254 -691 -688 3630 5822 3813 735 -592 1117 3715 3863 1365 960 1451 196
$$ packed form
3007C824k343k177P95K582J439n87m262k150L984L432k744m345K78L107J322j850
3023C05l432j7L963J197l825k759K355J779o29m21o91q98l48K92J34K134J070
3040B09m143l762L372N202M80m121l915j17M812L640k913m133M89K137K33k94
3056b824P15l06j354k41k7J980K029j692l626Q01L816M66k136j627J356K317O60
3073C07l267k399L193L956q29l912n91J476J966J195j281j407L22P95p95J505
3089B34K808j146l852j127L884L049P5l500l715K090N622N41l937j471J790R18
3105B263R6J47o39N84Q70j573q82K418J109k289j327K203R48p87j804m85J948
3122B800K754j300m945LM318K192k009l078j327J709K598J48k498m05M91j255
$$ plain form
3138 196 296 3086 3904 740 -1780 -978 1636 3849 2481 -1684 -3019 636 2659 844 -1630 -1635 -266
3155 -266 601 202 -1765 -1756 128 -442 -1946 -1897 -779 -1945 -2650 -1687 -344 -1082 -2342 -3889 -3418 -194
3173 -194 774 -3488 -5392 -3726 -431 97 -1063 -4013 -4911 -2116 80 -721 -2574 -2689 -3421 -3232 -929
3190 -929 147 -825 -2756 -3225 -2595 -79 1469 -1341 -4043 -2401 796 655 -715 -2325 -1902 -86
3206 -86 1574 -70 -2698 -1156 533 578 56 -52 -1139 -1221 664 1411 605 163 -1170 -2174 750 4008
3224 4008 2143 -1450 -2161 -162 2399 4030 1544 -1704 -997 2783 3417 1982 1304 958 1005 2467 3556
3241 3556 2669 2187 1802 1011 2587 5325 4253 1037 1250 3436 4572 4260 2148 648 2286 5366
3257 5366 5000 1654 356 2262 2876 4120 3463 1347 -4 1195 2358 2596 2625 734 -2194 -629
$$ packed form
3138A96J00K790Q18l164k520Q02K614K213j368m165j335L655K023j815k474nJ369
3155b66Q67l99j967RJ884n70j504M9J118j166p05R63J343p38j260j547M71L224
3173a94R68m262j904J666L295N28j160k950q98K795K196q01j853j15p32J89K303
3190i29J076r72j931m69O30K516J548k810k702J642L197j41j370j610M23J816
3206h6J660j644k628J542J689M5n22j08j087q2J885P47q06m42j333j004K924L258
3224D008j865l593p11J999K561J631k486l248P07L780O34j435o78l46M7J462J089
3241C556q87m82l85p91J576K738j072l216K13K186J136l12k112j500J638L080
3257E366l66l346j298J906O14J244o57k116j351J199J163K38K9j891k928J565
$$ plain form
3273 -629 2680 2813 -364 -2288 -2259 -405 2716 961 -2991 -3421 -1279 89 240 -555 -2037 -3290 -1805
3290 -1805 -27 -825 -1400 -2038 -2406 -1850 487 -30 -2377 -3030 -1230 693 732 -358 -2902 -2746 678
3307 678 1883 -301 -1923 -1960 -1116 521 1639 -475 -2480 -1619 -280 197 764 -417 -3337 -3348 52
3324 52 997 -355 -2178 -3383 -3110 -320 764 -2069 -3993 -3277 -1729 -989 -870 -2795 -4429 -3072 -859
3341 -859 -1056 -2190 -2842 -3119 -2154 -30 311 -2490 -2766 -1256 -34 662 783 -1188 -2554 2 2505
3358 2505 2211 604 -516 -368 1751 4410 3013 8 151 2283 3187 4145 3221 1000 479 2775 3547
3375 3547 3402 2846 1156 600 2474 4498 2827 238 330 1756 2946 2994 1274 -1424 -429 2228 2089
3392 2089 321 -458 -769 -375 1343 1294 -301 -1600 -1226 -541 763 1074 -966 -3213 -1934 1029 1585
$$ packed form
3273f29L309J33l177j924K9J854L121j755l952m30K142J368J51p95j482j253J485
3290a805J778p98n75o38l68N56K337n17k347o53J800J923L9j090k544J56L424
3307F78J205k184j622l7Q44J637J118k114k005Q61J339M77N67j181k920j1L400
3324E2R45j352j823j205K73K790J084k833j924P16J548P40J19j925j634J357K213
3341h59j97j134o52k77R65K124L41k801k76J510J222O96J21j971j366K556K503
3358B505k94j607j120J48K119K659j397l005J43K132R04R58r24k221n21K296P72
3375C547j45n56j690n56J874K024j671k589R2J426J190M8j720k698R95K657j39
3392B089j768p79l11L94J718m9j595j299L74O85J304L11k040k247J279K963N56
$$ plain form
3409 1585 156 -1625 -2804 -781 2243 1724 -1433 -2048 -382 328 1190 1164 -809 -1795 -639 1021 950
3426 950 861 -481 -2131 -916 1771 1163 -1712 -1901 -1345 356 1205 -612 -3300 -3096 -335 520 -889
3443 -889 -2104 -3064 -3235 -1135 141 -2033 -3969 -3659 -3383 -1898 -206 -1575 -4612 -4461 -1920 49
3459 49 -730 -2439 -4641 -3502 -319 974 -1359 -3141 -2217 -989 428 1114 -391 -2040 -348 885
3475 885 1179 1270 302 -965 302 2949 3192 997 143 519 2393 4180 3635 756 -634 1964 3900
3492 3900 3953 2704 885 138 2495 4710 3460 1250 996 1282 2380 3951 3853 1252 99 1344 3100
3509 3100 3696 3275 630 -994 1874 4295 2688 798 195 1078 2662 3158 1277 -373 1232 2813
3525 2813 2003 1844 1221 250 468 1957 2935 1657 276 -794 -528 2586 4125 638 -2707 -1431 1314
$$ packed form
3409A585j429j781j179K023L024n19l157o15J666P10Q62k6j973r86J156J660p1
3426I50q9j342j650J215K687o08k875j89N56J701Q49j817k688K04K761Q55j409
3443h89j215r60j71K100J276k174j936L10K76J485J692j369l037J51K541J969
3459D9p79j709k202J139L183J293k333j782R24J228J417O86j505j649J692J233
3475H85K94R1r68j267J267K647K43k195q54L76J874J787n45k879j390K598J936
3492C900N3j249j819p47K357K215j250k210k54K86J098J571r8k601j153J245J756
3509C100N96m21k645j624K868K421j607j890o03Q83J584M96j881j650J605J581
3525B813q10j59o23r71K18J489R78j278j381j070K66L114J539l487l345J276K745
$$ plain form
3542 1314 2587 1712 -1399 -2710 -1027 1192 417 -1235 -1764 -1912 -2121 -1115 329 -963 -2906 -3264
3558 -3264 -3147 -1504 -559 -2710 -5040 -3658 -1147 -1512 -3523 -5163 -3696 -2000 -805 -3322 -5536 -4272
3574 -4272 -1826 -1873 -3275 -3054 -3992 -3763 -2737 -2013 -2296 -2854 -4322 -5170 -2405 669 -1037 -4874 -5377
3591 -5377 -2974 -200 294 -1909 -4415 -3376 -334 -632 -2047 -1904 -1304 -1591 -1178 -685 -797 -989 -769
3608 -769 -1133 -606 1218 481 -1809 -1053 1632 2223 1026 -430 -815 1917 4192 2755 -480 -709 2242
3625 2242 3980 3437 2349 1071 1163 2957 3758 3871 3751 2934 827 1581 4967 5382 3067 991 1681
3642 1681 3627 5684 4300 1497 955 3926 4943 2760 1566 2087 3107 3332 2699 1262 1561 2741
3658 2741 2396 1646 2022 1885 513 -61 2041 3160 2543 -15 -2181 -1025 3053 3962 -207 -3100 -1509
$$ packed form
3542A314J273q75l111j311J683K219p75j652n29j48k09J006J444j292j943l58
3558c264J17J643R45k151k330J382K511l65k011j640J467J696J195k517k214J264
3574d272K446m7j402K21r38K29J026P24k83n58j468q48K765L074j706l837n03
3591e377K403K774M94k203k506J039L042k98j415J43O00k87M13M93j12j92K20
3608g69l64N27J824p37k290P56K685N91j197j456l85K732K275j437l235k29K951
3625B242J738n43j088j278R2J794Q01J13j20q17k107P54L386M15k315k076O90
3642A681J946K057j384k803n42K971J017k183j194N21J020K25o33j437K99J180
3658B741l45p50L76j37j372n74K102J119o17k558k166J156M078R09m169k893J591
$$ plain form
3675 -1509 1158 2137 1155 -1400 -2281 -584 504 -191 -345 -169 -1619 -2580 -1029 436 -48 -1634 -3019
3692 -3019 -2156 -219 461 -2113 -4282 -1518 315 -1126 -3541 -4015 -2695 -192 -749 -3601 -4834 -2947
3708 -2947 -1488 -2025 -2149 -2614 -3847 -4515 -3312 -1844 -1109 -1655 -4633 -5470 -1883 1016 -951 -4241 -5056
3725 -5056 -2647 43 403 -2297 -3645 -1743 -222 -835 -1168 -342 -286 -1147 -429 -140 528 721 534 -92
3743 -92 1121 2431 1242 -974 620 3310 3433 1646 -212 -107 2898 5207 2541 -142 542 3093
3759 3093 3213 3018 2471 1423 1253 1960 2166 3210 4136 2173 -594 1064 3877 4588 2012 161 232
3776 232 2473 3849 2188 -196 260 2959 2073 427 544 1125 1556 2044 705 -308 673 1303 643
3793 643 326 1412 848 -1295 -1091 966 1907 1336 -1385 -3363 -759 2839 1926 -1606 -2900 -1368 -91
$$ packed form
3675a509K667R79r82k555q81J697J088o95j54J76j450r61J551J465m84j586j385
3692c019Q63J937O80k574k169K764J833j441k415m74J320K503n57k852j233J887
3708b947J459n37j24m65j233o68J203J468P35n46k978q37L587K899j967l290q15
3725e056K409K690L60k700j348J902J521o13l33Q26N6q61P18K89O68J93j87o26
3743i2J213J310j189k216J594K690J23j787j858J05L005K309k666k683O84K551
3759C093J20j95n47j048j70P07K06J044R26j963k767J658K813P11k576j851P1
3776B32K241J376j661k384M56K699q86j646J17N81M31M88j339j013R81O30o60
3793F43l17J086n64k143K04K057R41n71k721j978K604L598r13l532j294J532J277
$$ plain form
3810 -91 588 -39 -1713 -1666 -967 -1120 -1516 -269 -470 -2216 -2526 -1491 -658 -1069 -2326 -2797 -1573 -49
3828 -49 -762 -3558 -3305 -575 24 -1526 -3323 -3309 -1372 780 -289 -2991 -3083 -1789 -1230 -1044 -549 -917
3846 -917 -2918 -3364 -1611 186 502 -1055 -3533 -3413 315 1933 -282 -2537 -2218 -371 1288 1010
3862 1010 -1113 -1494 373 829 194 -132 907 601 588 1272 1046 1094 1322 525 1107 2622 2586 526 -250
3881 -250 1772 3956 3609 1652 10 429 3688 4890 2262 474 1240 2389 2724 3475 2422 1162
3897 1162 1114 1587 1970 2999 3259 438 -927 1114 3221 2237 609 -421 -294 1802 1993 -400 -1623
3914 -1623 -293 1132 475 -819 -1256 -1081 -252 474 -191 -1469 -1301 -1099 -1533 -110 489 -1555 -2852
3931 -2852 -1581 174 876 -19 -2310 -3290 -997 1564 497 -2081 -2262 -1482 -150 758 -104 -1643 -1853
$$ packed form
3810i1O79o27j674M7O99j53l96J247k01j746l10J035Q33m11j257m71J224J524
3828d9p13k796K53K730N99j550j797J4J937K152j069k702r2J294N59J86M95l68
3846i17k001m46J753J797L16j557k478J20L728J618k215k255L19J847J659k78
3862A010k123l81J867M56o35l26J039l06j3O84k26M8K28p97N82J515l6k060p76
3881b50K022K184l47j957j642M19L259J202k628j788P66J149L35P51j053j260
3897A162m8M73L83J029K60k821j365K041K107r84j628j030J27K096J91k393j223
3914a623J330J425o57j294m37J75Q29P26o65j278J68K02m34J423N99k044j297
3931b852J271J755P02q95k291r80K293K561j067k578j81P80J332R08q62j539k10
$$ plain form
3948 -1853 -484 -1022 -738 256 -1103 -1929 -1279 114 -827 -1436 -1995 -2295 -617 270 -1101 -3214 -2285 -705
3966 -705 -422 -1245 -2417 -3067 -1904 199 -758 -2586 -2733 -2203 -1606 -857 -68 -1695 -2850 -2360 -979 135
3984 135 605 -844 -2425 -1242 1154 1461 -2 -872 -513 1002 2148 2063 -209 159 1735 2499 2444 2174
4002 2174 1571 1227 2392 3407 2806 2356 1787 2063 2784 4160 3152 825 1216 3126 4099 3288 1881
4019 1881 223 787 3093 3468 1453 412 219 553 1961 2708 1129 -485 -139 1057 1265 1410 690
4036 690 -1212 -750 1302 1597 302 -844 -1086 -259 1438 1538 -654 -1717 290 1003 814 189 -340
4053 -340 -1174 399 1959 1210 -210 -572 -727 369 2234 1389 -886 -1504 -470 761 1111 145 -1576
4070 -1576 -2193 -23 1565 174 -1699 -1996 -2167 -530 488 -1098 -2961 -2499 -1828 -1283 -930 -1608 -3500
$$ packed form
3948a853J369n38K84R94j359q26O50J393r41o09n59l00J678Q87j371k113R29J580
3966g05K83q23j172o50J163K103r57j828j47N30N97P49P89j627j155M90J381J114
3984A35M70j449j581J183K396L07j463q70L59J515J146q5k272L68J576P64n5k70
4002B174o03l44J165J015o01m50n69K76P21J376j008k327L91J910R73q11j407
4019A881j658N64K306L75k015j041j93L34J408P47j579j614L46J196K08J45p20
4036F90j902M62K052K95j295j146k42Q27J697J00k192j063K007P13j89o25n29
4053c40q34J573J560p49j420l62j55J096J865q45k275o18J034J231L50r66j721
4070a576o17K170J588j391j873k97j71J637J018j586j863M62O71N45L53o78j892
$$ plain form
4087 -3500 -3586 -1667 -656 -1997 -3148 -3430 -3126 -1359 -554 -2320 -4200 -3348 -1484 -880 -1139 -2595 -3459
4104 -3459 -2186 182 -316 -1600 -1863 -1832 -1266 660 1069 -1307 -2254 -1260 167 1277 1765 -606 -1968
4121 -1968 -126 2020 1804 631 -709 -671 773 2449 1596 -712 -388 604 1379 2023 1570 -195 -671
4138 -671 969 2313 1847 836 -380 -383 1745 2837 1257 -606 -103 1090 2268 2357 766 -1036 -131
4155 -131 2141 2745 1816 579 -22 420 2149 3254 1922 421 580 1556 2536 3326 1501 -469 835
4172 835 2663 2951 2224 925 -209 1457 3305 2638 798 -13 991 1936 2325 1929 671 -431 927
4189 927 2501 1560 789 -303 -1139 325 2480 1740 -620 -1398 -524 691 1941 708 -1806 -1758 115
4206 115 1450 766 -770 -1620 -1605 72 1106 -337 -1607 -2026 -1305 -504 391 -565 -2881 -2539 -736 -97
$$ packed form
4087c500q6J919J011j341j151k82L04J767Q05j766j880Q52J864O04k59j456q64
4104c459J273K368m98j284k63L1N66J926M09k376r47R94J427J110M88k371j362
4121a968J842K146k16j173j340L8J444J676q53k308L24R92P75O44m53j765m76
4138f71J640J344m66j011j216lK128J092j580j863N03J193J178Q9j591j802R05
4155a31K272O04r29j237o01M42J729J105j332j501J59R76R80P90j825j970J304
4172H35J828K88p27j299j134J666J848o67j840q11J004R45L89l96j258j102J358
4189I27J574r41p71j092q36J464K155p40k360p78Q74J215J250j233k514M8J873
4206A15J335o84j536q50J5J677J034j443j270m19P21Q01Q95r56k316L42J803O39
$$ plain form
4224 -97 -394 -1507 -3094 -2155 -149 689 -1664 -2911 -2511 -1162 -137 -546 -2347 -3263 -2258 -705 -228
4241 -228 -739 -2022 -3150 -2435 -15 283 -1349 -2892 -2313 -1178 518 392 -1820 -3198 -1387 789
4257 789 1054 54 -1363 -1889 -299 1641 775 -532 -954 -105 170 1548 1255 -664 -997 648 1453
4274 1453 1591 895 -953 -1054 1386 3180 1682 -257 -1112 183 2051 2702 749 -1113 -501 1827
4290 1827 1798 1644 486 -810 -941 1548 2351 1581 41 -1134 -503 1432 2689 700 -1347 -620 1451
4307 1451 2046 1610 -75 -899 553 2247 1653 143 -177 488 764 2372 2224 252 -582 347 1350
4324 1350 2229 2123 -169 -1103 489 2915 2431 347 -971 -786 1556 2738 997 -1297 -1262 13 1099
4341 1099 904 435 -1030 -1955 -498 467 175 -581 -1661 -2263 -843 636 -224 -2579 -2686 -1369 -301
$$ packed form
4224i7k97j113j587R39K006Q38k353j247M00J349J025m09j801r16J005J553M77
4241b28n11j283j128P15K420K98j632j543N79J135J696j26k212j378J811K176
4257G89K65j000j417n26J590J940q66j307m22Q49K75J378k93j919l33J645Q05
4274A453J38o96j848j01K440J794j498j939q55J295J868O51j953j862O12K328
4290A827k9j54j158j296j31K489Q03p70j540j175O31J935J257j989k047P27K071
4307A451N95m36j685q24J452J694n94j510l20O65K76J608j48j972q34R29J003
4324A350Q79j06k292r34J592K426m84k084j318J85K342J182j741k294L5J275J086
4341A099j95m69j465r25J457R65k92p56j080o02J420J479q60k355j07J317J068
$$ plain form
4358 -301 97 -1663 -3464 -2299 109 176 -1701 -2202 -2369 -1457 17 545 -1393 -2606 -1470 -325 563
4375 563 504 -947 -2179 -1324 1016 1831 788 -1184 -2039 -183 1676 1980 -475 -1134 -135 1044 1566
4392 1566 1223 -304 -750 410 1487 955 711 -54 -496 96 1840 1692 -473 -772 -135 1180 2143 693
4410 693 -1229 -1519 1120 2308 1223 -976 -1243 -372 1356 2194 -2 -1050 -617 -111 1090 1556 1055
4427 1055 -535 -1028 574 1624 1651 287 -1142 -1002 1819 2622 540 -1399 -653 538 1424 1440 -229
$$ packed form
4358c01L98j760j801J165K408O7j877n01j67R12J474N28j938j213J136J145Q88
4375E63n9j451j232Q55K340Q15j043j972q55J856J859L04k455o59R99J179N22
4392A566l43j527m46J160J077n32k44p65m42N92J744j48k165k99O37J315R63j450
4410F93j922k90K639J188j085k199k67Q71J728Q38k196j048M33N06J201M66n01
4427A055j590m93J602J050K7j364j429J40K821Q03k082j939P46J191Q86J6j669
$$ [...]
8191A10
##END NTUPLES=NMR FID
##END=
