##TITLE=1H_CG-1102-0
 DMSO, 8 sc, 
 9.4.2019
##JCAMPDX= 6.0         $$ Bruker NMR JCAMP-DX V2.0
##DATA TYPE= NMR FID
##DATA CLASS= NTUPLES
##ORIGIN= UXNMR, Bruker Analytische Messtechnik GmbH
##OWNER= root
$$ XWIN-NMR		Version 3.5
$$ Tue Apr  9 14:20:32 2019 Russian Standard Time (UT+4h)  she@DPX200
##.OBSERVE FREQUENCY= 200.1315
##.OBSERVE NUCLEUS= ^1H
##.DELAY= (6, 6)
##.ACQUISITION MODE= SIMULTANEOUS
##.ACQUISITION SCHEME= undefined
##.AVERAGES= 8
##.DIGITISER RES= 18
##SPECTROMETER/DATA SYSTEM= spect
##.PULSE SEQUENCE= zg30
##.SOLVENT NAME= DMSO
##.SHIFT REFERENCE= (INTERNAL, DMSO, 0, 15.7039)
##AUDIT TRAIL= $$ (NUMBER, WHEN, WHO, WHERE, WHAT)
$$ ##TITLE= Audit trail, XWIN-NMR		Version 3.5
$$ ##JCAMPDX= 5.01
$$ ##ORIGIN= Bruker BioSpin GmbH
$$ ##OWNER= she
$$ F:/spectra/data/she/nmr/H-F/1/audita.txt
$$ ##AUDIT TRAIL=  $$ (NUMBER, WHEN, WHO, WHERE, WHAT)
(   1,<2019-04-09 14:19:31.07 +0400>,<she>,<DPX200>,
      <created by zg, POWCHK disabled, PULCHK disabled
       configuration hash MD5:
       00 E9 B6 7A A2 85 ED C7 34 08 36 98 17 FE 4E 26
       data hash MD5: 16K
       AE F7 D8 CB A4 50 C6 E6 54 77 8A E1 13 B8 AC 7E>)
$$ ##END=
$$ 
$$ hash MD5
$$ 9F 04 7E 8B AD F4 61 C6 27 B4 BE 07 FE 30 6F C5
##$RELAX= 
##$RELAX= 
##$RELAX= 
##$RELAX= 
##$RELAX= 
##$RELAX= 
$$ Bruker specific parameters
$$ --------------------------
##$DU= <F:/spectra>
##$EXPNO= 1
##$NAME= <H-F>
##$PROCNO= 1
##$TYPE= <nmr>
##$USER= <she>
##$AMP= (0..31)
100 100 100 100 100 100 100 100 100 100 100 100 100 100 100 100 100 100 
100 100 100 100 100 100 100 100 100 100 100 100 100 100 
##$AQSEQ= 0
##$AQ_mod= 1
##$AUNM= <au_zg>
##$AUTOPOS= <>
##$BF1= 200.13
##$BF2= 200.13
##$BF3= 200.13
##$BF4= 200.13
##$BF5= 200.13
##$BF6= 200.13
##$BF7= 200.13
##$BF8= 200.13
##$BYTORDA= 1
##$CFDGTYP= 0
##$CFRGTYP= 5
##$CHEMSTR= <none>
##$CNST= (0..31)
1 1 145 1 1 1 1 1 1 1 1 1 1 1 1 1 1 1 1 1 1 1 1 1 1 1 1 1 1 1 1 1 
##$CPDPRG= <>
##$CPDPRG1= <>
##$CPDPRG2= <>
##$CPDPRG3= <>
##$CPDPRG4= <mlev>
##$CPDPRG5= <mlev>
##$CPDPRG6= <mlev>
##$CPDPRG7= <mlev>
##$CPDPRG8= <mlev>
##$CPDPRGB= <>
##$CPDPRGT= <>
##$D= (0..31)
0 1.2 0 0 0 0 0 0 0 0 0 0.03 0 0 0 0 0 0 0 0 0 0 0 0 0 0 0 0 0 0 0 0 
##$DATE= 1554805170
##$DBL= (0..7)
120 120 120 120 120 120 120 120 
##$DBP= (0..7)
150 150 150 150 150 150 150 150 
##$DBP07= 0
##$DBPNAM0= <>
##$DBPNAM1= <>
##$DBPNAM2= <>
##$DBPNAM3= <>
##$DBPNAM4= <>
##$DBPNAM5= <>
##$DBPNAM6= <>
##$DBPNAM7= <>
##$DBPOAL= (0..7)
0.5 0.5 0.5 0.5 0.5 0.5 0.5 0.5 
##$DBPOFFS= (0..7)
0 0 0 0 0 0 0 0 
##$DE= 6
##$DECBNUC= <off>
##$DECIM= 24
##$DECNUC= <off>
##$DECSTAT= 4
##$DIGMOD= 1
##$DIGTYP= 9
##$DL= (0..7)
0 120 120 120 120 120 120 120 
##$DP= (0..7)
150 150 150 150 150 150 150 150 
##$DP07= 0
##$DPNAME0= <>
##$DPNAME1= <>
##$DPNAME2= <>
##$DPNAME3= <>
##$DPNAME4= <>
##$DPNAME5= <>
##$DPNAME6= <>
##$DPNAME7= <>
##$DPOAL= (0..7)
0.5 0.5 0.5 0.5 0.5 0.5 0.5 0.5 
##$DPOFFS= (0..7)
0 0 0 0 0 0 0 0 
##$DQDMODE= 0
##$DR= 18
##$DS= 0
##$DSLIST= <SSSSSSSSSSSSSSS>
##$DSPFIRM= 0
$$ [...]
##$SUBNAM2= <"">
##$SUBNAM3= <"">
##$SUBNAM4= <"">
##$SUBNAM5= <"">
##$SUBNAM6= <"">
##$SUBNAM7= <"">
##$SUBNAM8= <"">
##$SUBNAM9= <"">
##$SW= 24.9337058887773
##$SWIBOX= (0..15)
0 0 2 0 0 0 0 0 0 0 0 0 0 0 0 0 
##$SW_h= 4990.01996007984
##$TD= 16384
##$TD0= 1
##$TE= 0
##$TE2= 300
##$TE3= 300
##$TEG= 300
##$TL= (0..7)
0 120 120 120 120 120 120 120 
##$TP= (0..7)
150 150 150 150 150 150 150 150 
##$TP07= 0
##$TPNAME0= <>
##$TPNAME1= <>
##$TPNAME2= <>
##$TPNAME3= <>
##$TPNAME4= <>
##$TPNAME5= <>
##$TPNAME6= <>
##$TPNAME7= <>
##$TPOAL= (0..7)
0.5 0.5 0.5 0.5 0.5 0.5 0.5 0.5 
##$TPOFFS= (0..7)
0 0 0 0 0 0 0 0 
##$TUNHIN= 0
##$TUNHOUT= 0
##$TUNXOUT= 0
##$USERA1= <user>
##$USERA2= <user>
##$USERA3= <user>
##$USERA4= <user>
##$USERA5= <user>
##$V9= 5
##$VALIST= <valist>
##$VCLIST= <CCCCCCCCCCCCCCC>
##$VD= 0
##$VDLIST= <DDDDDDDDDDDDDDD>
##$VPLIST= <PPPPPPPPPPPPPPP>
##$VTLIST= <TTTTTTTTTTTTTTT>
##$WBST= 1024
##$WBSW= 4
##$XGAIN= (0..3)
0 0 0 0 
##$XL= 0
##$YL= 0
##$YMAX_a= 179425
##$YMIN_a= -277306
##$ZGOPTNS= <>
##$ZL1= 120
##$ZL2= 120
##$ZL3= 120
##$ZL4= 120
##$ABSF1= 10
##$ABSF2= 0
##$ABSG= 5
##$ABSL= 3
##$ALPHA= 0
##$AQORDER= 0
##$ASSFAC= 0
##$ASSFACI= 0
##$ASSFACX= 0
##$ASSWID= 0
##$AUNMP= <proc_1d>
##$AZFE= 0.1
##$AZFW= 0.1
##$BCFW= 1
##$BC_mod= 2
##$BYTORDP= 1
##$COROFFS= 0
##$CY= 11.3945322036743
##$DATMOD= 1
##$DC= 2
##$DFILT= <>
##$DTYPP= 0
##$F1P= 18.9103706918063
##$F2P= -1.10871071338519
##$FCOR= 0.5
##$FTSIZE= 0
##$FT_mod= 4
##$GAMMA= 1
##$GB= 0.15
##$INTBC= 1
##$INTSCL= 1
##$ISEN= 128
##$LB= 0.24
##$LEV0= 0
##$LPBIN= 0
##$MAXI= 10000
##$MC2= 0
##$MEAN= 0
##$ME_mod= 0
##$MI= 1.114404
##$NCOEF= 0
##$NC_proc= 0
##$NLEV= 6
##$NOISF1= 3.799351
##$NOISF2= 2.8
##$NSP= 1
##$NTH_PI= 0
##$NZP= 0
##$OFFSET= 15.70392
##$PC= 1
##$PHC0= -8872.513
##$PHC1= 38.40026
##$PH_mod= 1
##$PKNL= yes
##$PPARMOD= 0
##$PSCAL= 0
##$PSIGN= 0
##$REVERSE= no
##$SF= 200.130013532006
##$SI= 16384
##$SIGF1= 3
##$SIGF2= 2
##$SINO= 400
##$SIOLD= 16384
##$SREGLST= <1H.CDCl3>
##$SSB= 0
##$STSI= 0
##$STSR= 0
##$SW_p= 3612.71676300578
##$SYMM= 0
##$S_DEV= 0
##$TDeff= 0
##$TDoff= 0
##$TI= <>
##$TILT= no
##$TM1= 0
##$TM2= 0
##$TOPLEV= 0
##$USERP1= <user>
##$USERP2= <user>
##$USERP3= <user>
##$USERP4= <user>
##$USERP5= <user>
##$WDW= 1
##$XDIM= 8192
##$YMAX_p= 0
##$YMIN_p= 0
$$ End of Bruker specific parameters
$$ ---------------------------------
##NTUPLES= NMR FID
##VAR_NAME=  TIME,          FID/REAL,        FID/IMAG
##SYMBOL=    X,             R,               I
##VAR_TYPE=  INDEPENDENT,   DEPENDENT,       DEPENDENT
##VAR_FORM=  AFFN,          ASDF,            ASDF
##VAR_DIM=   8192,          8192,            8192
##UNITS=     SECONDS,       ARBITRARY UNITS, ARBITRARY UNITS
##FACTOR=    0.0002004,     1,               1
##FIRST=     0,             0,               0
##LAST=      1.6414764,     0,               0
##MIN=       0,             -277306,         0
##MAX=       1.6414764,     179425,          0
$$ Real data points
##PAGE= N=1
##DATA TABLE= (X++(R..R)), XYDATA
0@%%%%%%%qJ6j6K4l2L3m1N4o3P4r0J06j28J52j75K05k39K73l12L58m07M62n24
30b78N93o71P52q38R38j049J163j292J439j593J761j952K165k396K652k939L261
47A716l628M048m532N100n773O587p601Q898j0633J3086j6842K3392l8071J30886
61A06633n5403k78589N8111J83738J21085o3965o6847k5559L010j9826K8315M5229
73C5932q994p8780J36J10196P5753j03287j60519k0136J43108J23789j150p7585
85C8463o8666o0461k7540P5953J57442N4018j43650j70064K6733J68583O3888
96A14699j17267j04193O8172J34621O295j17804q1844K2275N9209N0401N0353
107H4917J0148q8798j27230j2386J33662J21625k9271j11005l9203M2148J7567
$$ y = [0, 0, 0, 0, 0, 0, 0, 0, -8, 8, -8, 16, -16, 17, -24, 30, -33, 41, -49, 57, -71, 81, -94, 111, -128, 145, -167, 191, -216, 246, -278, 315, -356, 396, -442, 496, -553, 610, -682, 757, -836, 925, -1027, 1138, -1258, 1394, -1545, 1716, -1912, 2136, -2396, 2704, -3069, 3518, -4083, 4815, -5818, 7268, -9574, 13818, -24253, 106633, 51230, -227359, -169248, 14490, 135575, 71610, 4763, -20796, -17786, -37612, -9297, 35932, 26938, -51842, -51706, 58490, 134243, 30956, -129563, -149699, -6591, 117198, 116048, 38463, -30203, -90664, -118204, -42251, 115191, 169209, 25559, -144505, -117772, 50811, 114699, -2568, -106761, -38589, 96032, 102327, -15477, -97321, -75046, -15837, 34564, 84917, 95065, 6267, -120963, -133349, 313, 121938, 92667, -18338, -57541, -15393, 2174]
118B174k7372P603M9404Q609m6401j1751M6569K493r0537n7286J01890J60291
130A45686j247j77209j29538O4420J43766M7718n4581m8381n334m162r116J7665
142a0313L0440j1600l3558K2772O7190o456j07950p1784P0784J26684L0669p6508
154C0370o9865q153O947L759M5088P5138j160j07867p9721O1604J10554j089j02584
167c6979m3146Q7067R1901l5013j14315n3698N0945Q3871N1896k03o1882r9334
179g8890m1075Q2092J28636K5219j04693r5782K6575Q5494J6285n1965k4039L0374
191a769K2721q143J22Q953l4462o3878O719J15080R6490o1406j65033p1128J00466
204e5268J40349K9980p7908q4624k3740L4265N6997L6978k2737o8611l0226O3219
$$ y = [2174, -25198, -17595, 31809, 40418, -5983, -17734, 28835, 31328, -59209, -116495, -14605, 145686, 144439, -32770, -162308, -97888, 45878, 93596, 39015, -9366, -14700, -18862, -27978, -10313, 20127, 8527, -25031, -2259, 64931, 58475, -49475, -121259, -50475, 76209, 106878, 30370, -39495, -47648, -40701, -36942, 8146, 83284, 82124, -25743, -105464, -43860, 66694, 65605, -36979, -80125, 6942, 98843, 63830, -50485, -104183, -53238, 30633, 82529, 82326, 20444, -78890, -119965, -37873, 90763, 115982, 11289, -84493, -57918, 27576, 43861, -8104, -32143, -1769, 20952, 12809, 12931, 21884, -12578, -76456, -69737, 45343, 141833, 80427, -84606, -155734, -55268, 85081, 115061, 37153, -47471, -71211, -36946, 20051, 57029, 34292, -34319, -64545, -1326]
216a326Q4041k0201j14469o0969P4932J14673K2821p3259p3972j9627J9164M0689
228g503O0678L6559n1164j07986l6298Q8635J01842j3325r7625m7256N5680P2635
240E4872l599o4661m6517J2060N2949N6820J3979o0587r5219k4436Q9737J08460
252I3858K167r9577p6767K6366O9439K0975k6669j4584P595m130j0254J3030K0059
265B1508j9021m4102L269O9441N1148m6518r6968k9415O8963Q1132J2096m9934
277B1599n5186k1579K3746M9781L1863k4092n5860j6308N1117M9734l0000p5339
289e0524j4302P0812O3461j9242o7117l5290J7605L2556K1383J4212l1l5076m6587
302d8140K431N7938M0581k8529n4274p172M3933L1671k0415m3431j6135K5498
$$ y = [-1326, 82715, 62514, -51955, -112924, -37992, 76681, 99502, 26243, -47729, -67356, -48192, -7503, 53175, 89734, 38570, -69416, -105714, -17079, 84763, 71438, -26187, -73443, -17763, 54872, 51273, -13388, -59905, -47845, 5104, 61924, 75903, 15316, -79903, -104339, -14602, 93858, 96025, -3552, -80319, -53953, 15486, 36461, 9792, -4792, 2803, -1327, -11581, 1449, 21508, 2487, -41615, -38346, 31095, 82243, 35725, -61243, -90658, -21695, 59437, 71533, 21599, -33587, -55166, -31420, 18361, 50224, 26132, -29728, -46036, 5081, 54815, 24815, -50524, -64826, 5986, 69447, 50205, -16912, -52202, -34597, -2041, 19342, 33554, 33523, -1553, -48140, -45709, 12229, 52810, 24281, -29993, -37165, 6768, 38439, 18024, -25407, -41542, -16044]
314a6044M1535K6371j6306n9897n1468K4472Q8896N3082m8849r2816k6938O3799
326a4163O6888p692n5020k6594K1587K8854Q820q386k0532k4743k360L9361M8348
339E4368l191o5806n9164J8887P7679M9536k4768o4310m1952J1623N2985M7979
351E3866n187n8870n1033K0002P4239L8343n2895q0933n054P7295O3820k1009
363E2584p2655m3582J9347N3643L9014r67l8486m9394j6726M0948O0761J2112
375E6599n1254n2773M898N0380L7001j4246m5995k8879J5765M6165L6433j5417
387C8677o3176m8701K9860Q4697M2037n1161q5525k1699O0214O6029J317n1983
399E86l9270O526L3086K6278L25k7491l1197k72L6641L6248p303m7045l6930J6195
$$ y = [-16044, 25491, 51862, 35556, -24341, -75809, -51337, 37559, 90641, 41792, -51024, -77962, -14163, 52725, 45033, -9987, -36581, -14994, 13860, 22680, 14294, -6238, -30981, -33341, 6020, 54368, 51177, -14629, -73793, -54906, 22773, 72309, 47541, -16769, -58721, -47098, 5887, 53866, 48679, -10191, -61224, -41222, 33017, 71360, 18465, -62468, -67522, 9773, 73593, 52584, -20071, -63653, -44306, 9337, 48351, 47384, 8898, -40496, -57222, -16274, 44487, 56599, 5345, -47428, -42530, 7850, 44851, 30605, -15390, -44269, -28504, 17661, 54094, 38677, -24499, -73200, -43340, 41357, 83394, 32233, -53292, -74991, -14777, 51252, 52569, 586, -38684, -32158, 928, 27206, 27531, 40, -31157, -31429, 5212, 41460, 34157, -12888, -49818, -33623]
413c3623N1493L0836j7161m4479l0790Q343M2031L8489o928m9396l8769J8863
425c1091N7284K6170l9215n6388j467N3302M0931j7832n0112k6697J9827M1970
437A6682K2885j4029l5539k6313P892L6622K8671j1327l8366k0881J7198L2590
449A6085J2210j7942k8656r618J9039L0125J2525k2458m0682j5910L5930N2309
461D2957O831n0166n0963P156N5056L9590j8167n0994k4976K3301M1265J6160
473C7050k1512l8032j5493K5931M1053J1534l1902m1674q227L5128M1870M642
485D0368l5167l8028o077L0069L9482J1581l1522m5543r744L9680M7407J528n0304
498f270m5362J3903N8439L4384k7150n6396k4834L1171N3163K0453l2453n0795
$$ y = [-33623, 17870, 48706, 31545, -12934, -43724, -35381, 6650, 45139, 38211, -11185, -49954, -31091, 26193, 52363, 13148, -43240, -44707, 8595, 49526, 31694, -18418, -45115, -25288, 16682, 39567, 25538, -10001, -36314, -28422, 8200, 36871, 25544, -12822, -33703, -16505, 16085, 28295, 10353, -18303, -27921, -8882, 21243, 33768, 11310, -29372, -45282, -9352, 42957, 49788, -378, -51341, -44185, 10871, 50461, 32294, -18700, -43676, -20375, 20890, 37050, 15538, -22494, -37987, -12056, 28997, 40531, 8629, -33045, -41272, -6144, 35726, 40368, 5201, -32827, -38904, -8835, 30647, 42228, 10706, -34837, -44581, -4901, 42506, 44034, -6270, -51632, -37729, 20710, 55094, 27944, -28452, -53286, -22115, 31048, 51501, 19048, -31747]
510c1747j7058L1775M8441J5362l3822m5700q585L4102L8499L858l0736l3960
522b9571l764L0418L4266M019l2722l8965l907M0964M4204l099m9389m2295J2087
535c7754N2139L5841j8332n1575k7355K3680M5958K0103k5278m2650j5313K8975
547a1561M1470P798l2696l7429l047L3381L5077j58l3265l1109j78K9782L2025
560C0090L019l1682l4247m91L5939L3332o039l9607l0094J5195M3017K2142k4040
573A6534m1419j4499K7853M0431R673l1844l8368m205L2820L5577M15l4090l1687
586c2809N329L3829K4636r236l0130j9652R288K9265J8583j1153k9915j8935J1795
599a9105L4443K1212j8081l9458j7870K3968M0513J3500k8248m0202q200L2367
$$ y = [-31747, -48805, -17030, 31411, 46773, 12951, -32749, -41334, -7232, 31267, 35125, 4389, -29571, -33335, -2917, 31349, 35368, 2646, -36319, -40226, 738, 44942, 41843, -7546, -49841, -37754, 14385, 50226, 31894, -19681, -47036, -23356, 22602, 42705, 17427, -25223, -40536, -11561, 29909, 37707, 5011, -32418, -35465, -2084, 32993, 32835, -430, -31539, -31717, -1935, 30090, 33109, 1427, -32820, -33311, 2628, 35960, 29921, -9686, -39780, -24585, 18432, 40574, 16534, -24885, -39384, -11531, 28900, 38573, 6729, -31639, -35844, -3024, 32553, 32968, -1122, -32809, -27480, 6349, 30985, 21749, -8381, -28033, -18745, 10520, 29103, 17950, -11965, -30900, -19105, 15338, 36550, 18469, -20989, -38859, -14891, 25622, 39122, 10874, -29328, -37528, -5161]
611e161L6463K386l3925l3460K594L7302L1355j0351m0348k5841J5420M0602K1995
624C9031j9330l9454j7963K0140L6350J7243j7861l6416j9043J9662L8282J6941
636C7582k2793l8799j4545K7996M0124Q348l3635l8080k891L6182L8082q18m0626
649c873l6556O112M1688L4681j0135m2877l0735J4895M2260K3242j8154l7361
661a6813j8352J7839L5157J6197j9271l4344j5086K0527L7044J5032k5855l9917
673b7842j0820K9854L8702P089l1155l6874l852L2480L3595k7l1887l0723K889
686b8571L4828K8189j0293l7430k1837J6374L6272J7407k0027l5351j2352K0603
698a2188L1539J1438j8217l0782j2999J9295L1747J0308k1798l0452o530K5526
$$ y = [-5161, 31302, 33688, -237, -33697, -31103, 6199, 37554, 27203, -13145, -38986, -23566, 17036, 39031, 19701, -19753, -37716, -17576, 18774, 36017, 18156, -18260, -37303, -17641, 20641, 37582, 14789, -24010, -38555, -10559, 29565, 37913, 4278, -33802, -36693, -511, 37571, 36753, -3873, -40429, -34317, 7371, 42052, 31917, -10960, -41695, -26800, 15460, 38702, 20548, -16813, -35165, -17326, 17831, 34028, 14757, -19587, -34673, -14146, 22898, 37930, 12075, -27842, -38662, -8808, 29894, 36983, 5828, -31046, -34898, -2418, 31177, 31150, -737, -31460, -28571, 6257, 34446, 24153, -13277, -35114, -18740, 17532, 34939, 14912, -20439, -32791, -12188, 19351, 30789, 12572, -18210, -31209, -11914, 19833, 30141, 8343, -22109, -28639, -3113]
710c113K8767n23k8258k4208M958K8649K2580p052l1176k2936J0752L4465K1065
723C3970j4623l5710j8212J9949L4702J0591k2821k8984m480K1974K4870K283
735B3509k3221k3480O70K4676K4366j880k9687k6826P378L4242K3299j1499l2304
748a0757k0524J1616L1347J8152j2679k9862j7275J4207L3160J5385k2224l5807
760b5261q359K9616L4492J338l3131l1963L639L3128K8545l381l0617k9087J475
773b9566L2005L0485m642l5131k6897R274L6321K2620j5986l6098j5922J9528
785a4009L3544J4168j9386l6007j6085K2969M0122J5159k6439m2519j2012L0969
797i526L9746M997l1931l1363m64K7455K7336l94k7408k6236K552K9558K7758
$$ y = [-3113, 25654, 25131, -3127, -27335, -22377, 6272, 28852, 21800, -9376, -32312, -21560, 12905, 33970, 19347, -16363, -34575, -14626, 20076, 30667, 7846, -21138, -25618, -3644, 21226, 23509, 288, -23192, -22522, 2154, 26520, 24640, -5047, -31873, -24495, 9747, 33046, 21547, -10757, -31281, -19665, 11682, 29834, 17155, -12707, -29982, -15775, 17385, 32770, 10546, -25261, -33620, -4004, 30488, 31826, -1305, -33268, -29629, 3499, 32044, 28663, -1954, -31041, -29566, 2439, 32924, 28282, -6849, -33746, -24472, 11849, 34469, 18483, -17615, -33537, -14009, 19535, 33703, 14317, -21690, -37775, -14806, 25316, 40475, 14036, -28483, -40495, -9526, 30220, 35217, 3286, -28077, -28541, -1086, 26250, 25856, -1552, -27788, -25236, 4322, 32080]
810C2080n749l6124k7669J2753L9271K2728j6203l6411j9650J4260L3899J8995
822C2180j3514l0875j8810J3469L2901J6595k0203l4573p357K7220L0239r6l0081
835b905k6029M691K8637K3450l466k6538k5242N19K9063K7205m568l0853k2128
848b8164R973K8664J5249j4943k5463o574J6511K0237M856j5600k2331o817J9674
861d728K6969N466k4432k8944j799K7701K5917m175k6325j7829O780K0355J3565
874A8521o814j8762j2427Q963K2383J1260j4458k7860q432K2549K9379L194k5923
887A573k5656n99K2955K3045J048k0174k1661j525K0375K2209j090k6125k0963
900b6588J0512L0598J4698j8338l0865j0044K1807L0382P819k0665k9092j1606
$$ y = [32080, 26331, -9793, -37462, -24709, 14562, 37290, 21087, -15324, -34974, -20714, 13185, 32180, 18666, -12209, -31019, -17550, 15351, 31946, 11743, -22830, -30187, -2967, 27272, 27176, -2905, -28934, -24243, 4394, 27844, 24378, -2160, -27402, -26883, 2180, 29385, 24817, -6036, -28164, -18191, 10473, 25722, 10779, -14684, -21258, -4747, 15490, 20346, 4746, -17585, -24402, -4728, 22241, 27707, 3275, -25669, -27468, 233, 26150, 21975, -4350, -22179, -15399, 4956, 18521, 11707, -7055, -19482, -10519, 11864, 23124, 8666, -19194, -27626, -5077, 24302, 27496, 1573, -24083, -24682, -1727, 21318, 22366, 2192, -19469, -20994, -619, 21590, 20500, -5625, -26588, -16076, 14522, 29220, 10882, -19983, -30027, -8220, 22162, 29981, 9316, -19776, -31382]
912c1382J9124L2548J3227k2163l4749p961K6370L0383J198k8933k5024O235K8712
925G585J9484p661k7947k1661P413L3043K5518j1101l7584k5648J3982M0021K3023
938C8467j8419l7068j6074J8481L0105J2578j5648k8482j1993J8798K9992R106
950B9843k3469l3499n296L1212L4123j594l3516k9692K921L0263K7594r25k7492
963D73k6807n73K6851K6874j851k9827k4187J0152L1402J6054j5992k9385j1202
976b8018J8392K8334R965j8071k8764j2686J7849L2007J3627k1056l3094q353
988b9868K3091K7748K886k2141k2101K876K0902J5364m033j9389j6583N530K4312
1001H594J7871j0164k8926j6380J4142L0129J2960j7200k6039p707J5181J9511
$$ y = [-31382, -12258, 20290, 33517, 11354, -23395, -31356, -4986, 25397, 26595, -2338, -27362, -21127, 7585, 27069, 19408, -8539, -30200, -22787, 10256, 35774, 24673, -12911, -38559, -24577, 15444, 38467, 20048, -17020, -33094, -14613, 15492, 28070, 12422, -16060, -28053, -9255, 20737, 29843, 6374, -27125, -32421, -1209, 32914, 31320, -2196, -31888, -28967, 1296, 28890, 27965, 473, -26334, -26907, -56, 26818, 24967, -4860, -29047, -18895, 12507, 28561, 12569, -16816, -28018, -9626, 18708, 28673, 10602, -18162, -30848, -12999, 19008, 32635, 11579, -21515, -29868, -6777, 20971, 23857, 1716, -20385, -17509, 3393, 18757, 14724, -4665, -21248, -15718, 8594, 26465, 16301, -12625, -29005, -14863, 15266, 28226, 11026, -15013, -22720, -7539, 11972]
1013A1972O060j1680j7760n182J3331J8412Q65j8551j7867M916K4219J5965j1695
1026A3005k5194j1300J2020K2460J1029j0344k0619j1502Q417K1080J1588j0965
1038I675k2542p805J8049K1620j587k2058j7322O813K3228J5747q599k3664j5685
1051b4130O471K4349J9835o466k8153k0517J1465K9049J4942j5359k6576q947
1063b4037J8214K3677L541j8867k1794l503K0129K5975L384k5417k9628j95K9428
1076I07K9145k572l1242k5960O388K8463K0365n593k4904j9365N368K6711J8921
1089B6632r539k9882j7200J5478L3464J3746k1628l3437q994K2316L0480Q884
1101C0320k0276k9774j0415J9453L0174J0387k1482l0298o152K5743K7142j519
$$ y = [11972, 18032, 6352, -11408, -16590, -3259, 15153, 16018, -2533, -20400, -15484, 8735, 24700, 13005, -12189, -23489, -11469, 10991, 22020, 11676, -8943, -20445, -12028, 9052, 20640, 9675, -12867, -20672, -2623, 18997, 17410, -4648, -21970, -15157, 8071, 23818, 15219, -8445, -24130, -17659, 6690, 26525, 20059, -8094, -28611, -17146, 11903, 26845, 11486, -15090, -24037, -5823, 17854, 21395, 2528, -19266, -22769, -2640, 23335, 26719, 1302, -28326, -28521, 907, 30052, 27480, -3762, -29722, -23334, 5129, 25494, 19901, -5003, -24368, -19000, 7711, 26632, 17093, -12789, -29989, -14511, 18953, 32699, 11071, -22366, -31360, -9044, 21436, 30320, 10044, -19730, -30145, -10692, 19482, 29869, 8387, -21911, -28063, -2320, 24822, 23303]
1113B3303k7242k1817O048K6229J9838p382k6261j9842O492K8134K2430q044l1516
1126i630k2334J2801L2067J6009j4818k7689j1021J4813K3614P231j4354k0623
1138a3934o870J4849K3370O081k0663k4559j838K3928K3566k014k4617k0288M558
1151a8431K2034J6439m084j8704j5647L456J9744J4814p451k1222j1699J2477
1163h274K2551O143j7191k0430j300J7668J6831J192j5845j7396j433J6515J7395
1176A6426N67j7872j7430L604K0419J3343r185k0118p042J1821J7749N061j3295
1189D048j7576m492J3952J9083N089j5466k2008l842K0274K1150j425k1701j7114
1202b0028M697K0897J4188p636j9548j1591P609K0221J3183j0194k4492j2427
$$ y = [23303, -3939, -25756, -19708, 6521, 26359, 18977, -7284, -27126, -20634, 7500, 29930, 21886, -9630, -31964, -19163, 12904, 28913, 14095, -13594, -24615, -9802, 13812, 21043, 6689, -13934, -20804, -5955, 17415, 23496, 2833, -21726, -23564, 364, 23930, 21916, -2701, -22989, -18431, 3603, 20042, 15958, -2746, -18393, -14937, 4807, 19621, 12170, -9052, -20751, -8274, 14277, 20420, 3229, -17201, -18501, -833, 15998, 17190, 1345, -16051, -17484, -969, 16426, 16993, -879, -18309, -14705, 5714, 19057, 9872, -10246, -17288, -5467, 12282, 17343, 4048, -13528, -18020, -4068, 15015, 20104, 4638, -17370, -21212, -938, 20212, 18787, -2914, -20028, -15331, 5566, 19754, 12118, -7430, -19021, -11412, 8809, 21992, 11798, -12694, -25121]
1214b5121J5042K6589R282j7847k6092o622J9802K3775L613j8718k1786l339J8016
1227c406K2809K911k1851k3233J043K5312K2007n641k7331j9647J0014K6852J6190
1240B6029j0338k5900j5945J0543K6822J5328j2075k7008j4552J4152K8554J1541
1252B7151j8467k7048o577J9407K4202N065j9397k4556l360K0367K4558K947k2404
1265A888k5997l09K6235K4178m472k6531j9917O473K5259J7734q702k4249j4633
1278b3043Q694K3767J4416j0609k5693j2231J4334K5245Q797j6071k4070o010
1290b2474J7404K1308L754j6573j9324l234J5787K0008K860j8899j9263J121J9954
1303B429J7066m457k0669j4100P797J9519J0821q269j7986j0642Q908J8911R482
$$ y = [-25121, -10079, 16510, 25792, 7945, -18147, -24769, -4967, 18808, 22421, 3703, -18083, -21422, -3406, 19403, 22314, 463, -22770, -21727, 3585, 25592, 19951, -7380, -27027, -17013, 9839, 26029, 15691, -10209, -26154, -15611, 11211, 26539, 14464, -12544, -27096, -12944, 15610, 27151, 8684, -18364, -24941, -5534, 18668, 23733, 4336, -20220, -23580, -3213, 21345, 24292, 1888, -24109, -24418, 1817, 25995, 21523, -5008, -24925, -18452, 6807, 24541, 15839, -8410, -23043, -14349, 9418, 23834, 13225, -12468, -24699, -10365, 14880, 23677, 7606, -16464, -22474, -5070, 16238, 19992, 3419, -15905, -19139, -3352, 16656, 19516, 617, -18646, -17525, 2429, 19495, 15038, -5631, -19731, -11934, 7585, 18406, 10137, -7849, -18491, -9583, 9328, 18810]
1316A8810j1009j9628o526J2666J9755L181j5568j6764L47J5508J4058j593j5666
1329b429j3167L123J6528J2468m436j7421j3091P337K0417J0261j1633j9884o655
1342a8582J3087J8450M340j4181j7700j828J4689J6911J319j6403j7797Q74K0499
1355C678J6125n418k0627j3981P730K0855J1647r329j9961r870R310J9406J0757
1368B0322j0414k1947r548J3749K2557P038j6421k2849l522J9070K0784Q37j9273
1381C83j9278k53J9554J9648r06k1130k0058L496K3146J8900o473k5079j5100
1394b3150R820K3260J1806r990k1627j1976J0363K2641J1413j2017k3540j1061
1406b4058J4513K5985P845j8472k4186l485J8624K1322K313j8820j9914r51J8435
$$ y = [18810, 7801, -11827, -18353, -5687, 14068, 17249, 1681, -15083, -14736, 772, 14830, 13237, -2429, -15596, -12473, 4055, 16523, 12087, -5334, -18425, -11088, 9329, 19590, 7957, -11927, -18582, -5495, 12955, 17295, 3114, -14586, -16414, -1725, 15186, 16505, 102, -17695, -16821, 3678, 19803, 14385, -6242, -20223, -12493, 8362, 20009, 10680, -9281, -19151, -9841, 9565, 20322, 9908, -12039, -21587, -7838, 14719, 21757, 5336, -17513, -21035, -1965, 18819, 19656, 383, -18895, -19148, 406, 20054, 19148, -1982, -22040, -18544, 4602, 23502, 17029, -8050, -23150, -13330, 9930, 21736, 11746, -9881, -21857, -11494, 11147, 22560, 10543, -12997, -24058, -9545, 16440, 24285, 5813, -18373, -21858, -3234, 18088, 20401, 1581, -18333, -19284, -849]
1419h49J9585O05k0107k0466K060K3783J8574p417k3257j5310R739K2235J1683
1432B0858r829k0095j0603Q523J9615J2013r777k1849j0253J3451K2262N679j5806
1445D189k0139j895J7325J6149o39j5150j4665o7J4554J6450M7j8112j6171L257
1459a4867J9838J4079p224k0331r378J0758J6976M821j0168j3496m579Q646J4906
1472I981N057j0513j6945m685J4430J8352R46j7970j5678L983J6715J1584m567
1485A0690j4742j0095M169J4433J0590m947j6712j1133R032K0591P467j4888j9787
1498a5332k768J6730J7038k19j5198j4699M52J3006J4624J779j4150j7316j61
1511a6214J8914J6438n783k0670j2261R799K0524Q003j1438j7612p185R193J7930
$$ y = [-849, 18736, 19341, -766, -21232, -19172, 4611, 23185, 15768, -7489, -22799, -13060, 9175, 20858, 11029, -9066, -19669, -11146, 8469, 20482, 10705, -11144, -21397, -7946, 14316, 19995, 4189, -15950, -17845, -520, 15629, 14990, -160, -14825, -14892, -338, 16112, 16159, -1953, -18124, -14867, 4971, 19050, 11826, -8505, -17883, -7125, 9851, 14672, 4504, -8992, -13571, -4925, 9981, 15038, 4525, -12420, -17105, -2675, 15677, 16623, -1347, -17025, -13042, 3673, 15257, 10690, -4052, -14147, -9978, 4455, 15045, 10098, -6614, -17747, -8715, 11876, 19343, 4455, -15332, -18100, -1370, 15668, 15449, 251, -14448, -13996, -990, 13634, 15413, 1263, -16053, -16214, 2700, 19138, 13355, -7315, -19576, -9777, 10747, 18750, 7312, -10300, -17485, -8292, 9638]
1524I638R955r573k1750j0172J3562K3252P086j7492k2015j103J9041J6621l113
1537A3937j6018j2983J428J5147J5038r72j7973j7846K958K3010J7999q098k5419
1550i792j3419J1893K1734Q708j0190j7573q329P794J7372R546q690k0024r386
1563b0356J3642K3475M338k0412k0618K148K0278J6138l020j7483j4288R56J4797
1576d05J5546J649j5792j8738P89K0749J5379p499k0258r474J1453J7588M636
1589A5623j1214j4517m700Q664J5349Q380r408k0045q679J4025K1847L866j7330
1602A861j7929J853J6875J0950m995j2112p407K515J1514R524l082j5051j1523
1615a7007O837J9521J0654j2558k0653n154J4839J5880J246j0988j1568k114P921
$$ y = [9638, 19593, 10020, -11730, -21902, -8340, 14912, 21998, 4506, -17509, -18612, 429, 17050, 13937, -2081, -15064, -13636, 1511, 16549, 15577, -2396, -20242, -17284, 5726, 23725, 15627, -9792, -23211, -11318, 10416, 19124, 8934, -8639, -16968, -9174, 8198, 17744, 9054, -10970, -20356, -6714, 16761, 21099, 687, -19931, -17783, 2495, 18633, 15613, -1870, -16158, -15202, -405, 15141, 16790, 998, -17740, -16951, 3798, 19177, 11678, -8580, -18054, -6601, 10987, 15623, 4409, -10108, -14808, -6144, 9205, 17585, 8177, -11868, -20547, -6522, 15325, 19191, 1861, -16068, -14215, 2660, 13610, 8615, -3497, -10904, -8389, 3125, 12649, 9567, -5484, -17007, -10170, 9351, 20005, 7447, -13206, -18360, -3521, 12359, 13605, 2617, -8951, -11065, -3144]
1628c144J1357L893r175j4042k520J5171J5216n041j9783j0844J1397J8123O194
1641A6802j0710j4987n783P297J3867Q518m996j6430j1177R043J9721O474j4921
1654B718j7313P04J6738J2634m993j5617r443M775J3198J1176n02j5860j6501
1667a8286J635K0774J7199p179k2190j2015J0890J9440N816j1331j3940l447Q461
1680d173J2979N887r517j7455o324J4741K1192L364j9833k1282K094K1040J5976
1693A8689m622j5941j2094R41J2849J3103M36j3831j4867J582J8928J4351r182
1706A0342k1992q340J4468J9399L760j3758j6019m231J0289J6034P862r118j9022
1719a0326r374J2742K0718L982j6366j6261K590J5608J0498n441j3388p443M612
$$ y = [-3144, 8213, 12106, 2931, -11111, -13631, 1540, 16756, 11715, -8068, -18912, -7515, 10608, 16802, 6092, -8895, -14678, -7381, 6486, 15004, 10008, -6422, -17599, -8556, 11165, 17639, 2718, -14595, -13891, 2847, 15481, 10488, -5129, -14572, -9797, 3401, 14577, 14075, -1785, -18286, -16651, 4123, 21322, 14143, -8047, -20062, -9172, 10268, 16084, 4753, -9187, -12634, -4173, 8806, 14693, 5176, -12279, -18603, -3862, 17330, 20694, 861, -20421, -18327, 2713, 18689, 14067, -1874, -13968, -13027, -178, 12925, 13361, -470, -15337, -13755, 5173, 19524, 10342, -11650, -19990, -5522, 13877, 17637, 3879, -12140, -16371, -6082, 9952, 17814, 8696, -10326, -19700, -6958, 13760, 17742, 1376, -14885, -12295, 3313, 13811, 8370, -5018, -12461, -7849]
1732g849J1254J0292j845j5564j4105M443K0014J3376r234k0350q136J1389J5455
1745I140L474r707j0145k029O143R583M287p813j3629k585J3384J4945q67j8669
1759d488j3256O133J8397Q894p320j3198p329M142J0454Q864k490j2454r258N595
1773g314J5492O508j2219j6014P1J6571J2332m942j4391r591K801J2409J0622
1786A2335o7j1874j3973j87J4957J4668m384j7877r083R768J5241L280j0818j2300
1800a0314r39J0123J0942K843q930j4836n724J2317J9011M159j6894j7997P79
1813a5460J6612J3760l610j4245r221L793J0406R078j380j3294j1438M496J7929
1826G426J1451r350k1462q437J3778K0052M665j3618j5316m330R451J4254O497
$$ y = [-7849, 3405, 13697, 11852, -3712, -17817, -13374, 6640, 20016, 10782, -9568, -17704, -6315, 9140, 12614, 2907, -7238, -9267, -3124, 6459, 10746, 2933, -10696, -13281, 103, 15048, 14181, -4488, -17744, -11611, 6786, 15680, 8360, -4838, -12167, -8025, 2429, 11293, 8803, -3651, -12909, -7314, 8178, 14686, 2467, -13547, -13476, 3095, 15427, 10485, -3906, -13497, -10696, 1713, 12335, 12268, 394, -13579, -13766, 1191, 15859, 11475, -6402, -15485, -5717, 9524, 12804, 1986, -10314, -11253, -1130, 9812, 12655, 3725, -11111, -16835, -4518, 14493, 18652, 1758, -16239, -15460, 1152, 14912, 11302, -2943, -12164, -8371, 2035, 11113, 9733, -3561, -14999, -10503, 7426, 18877, 9527, -11935, -20372, -6594, 13458, 18123, 4505, -10811, -15141, -5690, 8564, 15061]
1839A5061q462j6118o119J1240J7292K611j5895j6206L666J8347J1495o886j6135
1852f109r653N055J5156J1464l481j5336j3760K982J8328J3532p304j9158q089
1865a6373J0433J5283L664j0455j2162j807R324J1398L257r677j4472m222J3554
1878b255J7494Q45j7046j4636K598J5702J0977l861j2797p624K892R591P837j918
1892G799j1261q745N185J4615O632r347j5545l592J2492J4051K2j1882j0675k86
1906a0537R045R554K904q819j1348j773J0774J1264j766j3369q626P011J3832
1919H146L823r254j1388k714Q120J1036M417p046j3266n269Q045J4607N174j1706
1933B725j4630N8J3126J0178k802j2231p433M192J1095O958m268j1924q355M751
$$ y = [15061, 6599, -9519, -15638, -4398, 12894, 15505, -390, -16596, -12930, 5417, 16912, 10026, -6109, -15762, -10707, 4449, 15913, 12432, -2904, -16664, -13682, 4646, 18178, 10874, -8284, -16373, -5940, 9343, 13007, 2552, -9610, -11417, -2093, 9305, 12562, 2885, -11587, -15809, -2255, 15239, 16084, -962, -15598, -13000, 2702, 13679, 9818, -2979, -10603, -7711, 1880, 9717, 7799, -3462, -12207, -7022, 7593, 14225, 4878, -10667, -14259, -1767, 12284, 12306, 424, -10251, -10537, -1492, 8062, 10966, 2147, -9201, -10974, -200, 11064, 9298, -4071, -12697, -5686, 8146, 11969, 2715, -8673, -11387, -3267, 7769, 12186, 5140, -8126, -13395, -5350, 9257, 14431, 2725, -11905, -11847, 1279, 11457, 8655, -3576, -11009, -6817, 4278, 11236, 6968, -4956, -13311, -8560]
1947h560J5073R584p790j7264p367J0443J5434M794j0685j2957k692R516J1256
1960H785K509r208j1999k639J1517J4304m80j5248j3352L555J7016J1745n748
1973A0757j5957r892N337J4168R624l846j4522j0313N061J5584R346p781j6428
1986h862o665J1165J5516K832j2389j3283j612J0991J4137K499j2029j4901k451
1999a5052J3195J5775J284j4823j5074J813J5609J1503m369j3611r404N083J3015
2012D944P845m818j3933p857O093J5256Q545r314j6012o248J0701J4478L986r730
2026C936j2958l141R125J1225K726q387j1330k352J0359J2232j254j2023j0714
2039a2556L391J3234R009n330j3121p047N508J1738O680m466j2086o886O109J2418
$$ y = [-8560, 6513, 16097, 8307, -8957, -16324, -5881, 9553, 14347, 3662, -9295, -11987, -2471, 8785, 11294, 2086, -9913, -12552, -1035, 13269, 12789, -2459, -15811, -12256, 4760, 16505, 10757, -5200, -15092, -9755, 4413, 14037, 10191, -4331, -14644, -9583, 6001, 15347, 7566, -8862, -15527, -4362, 11154, 13986, 1597, -11686, -13298, -2307, 11830, 14329, 2300, -12601, -15052, -1857, 13918, 15202, 379, -14695, -12882, 2727, 14230, 9861, -3750, -13154, -8071, 4944, 12789, 7971, -5962, -13819, -7726, 7530, 16075, 6761, -9251, -15499, -4798, 9680, 13666, 3936, -9022, -12163, -3038, 8187, 10913, 2526, -8804, -11156, -797, 11435, 10181, -1842, -12556, -9165, 4069, 13078, 7748, -5373, -12420, -6912, 4826, 11506, 7040, -5046, -11932, -5823, 6595]
2053F595M815q220j1029j965Q911J0437j015j0062p766J795R472P524j107j0729
2067b344q531K225J1329R198l742j2575p973O438J1990M889p198j0728k735P444
2081b313R993J972q763r748j364R805J1288p5j1880j1393K212J2972R649l738
2095H617j1800q522M080J1462P273m276j1128o982M788J2505O526p069j4475m351
2109a3352R996J4061K805j1622j3918j135J2258J2409Q78j1162j2593j279J2687
2122C3J2726j547j3361j1032L301J4178R267n809j3885p429O922J3271P014o433
2136G216j4013p827P396J4918P303q131j5357o538R679J5348L682j0339j3174
2149i837k605R972J2907J296j1029j2201l48J2596J2301j478j4249j1863L838
$$ y = [6595, 11410, 3190, -7839, -9804, -893, 9544, 8529, -1533, -9299, -7504, 1968, 9492, 8385, -2344, -10875, -8650, 2679, 11877, 8135, -4440, -12413, -5975, 6015, 10904, 3706, -7022, -9757, -2313, 7680, 9652, 889, -8859, -10223, -418, 10870, 10795, -1085, -12478, -10266, 2706, 12355, 8617, -3183, -11705, -7625, 3837, 11110, 6834, -4294, -11276, -6488, 6017, 12543, 5474, -9001, -13352, -3356, 10705, 13510, 1888, -12030, -13165, -907, 11502, 12380, 1218, -11375, -12654, 33, 12759, 11212, -2149, -13181, -9880, 4298, 13565, 7756, -6129, -13558, -6636, 6635, 13649, 7216, -6797, -14624, -7228, 7690, 14993, 6862, -8495, -15033, -5354, 9994, 13676, 3337, -9837, -12442, -2470, 10437, 11733, 704, -11497, -11845, 751, 13052, 11574, -2675, -14538, -10700]
2162a0700J4993R636n014j3125q326M197J2247P895m340j1870o775M162J2209
2175E189O841o555j2947m309Q471J2198K653r351j2028j499J0313J0649J501r820
2189A306j1395j014J1165J1124j656j1845q383L523J1229O346n937j0324l175
2202i036O041Q444L445n595r608l793P028J0617L007p904j0683k200R106J0124
2216H993j67r371p668J075Q477P459k165r804o735M137J0736O169o036j2152n260
2231a2312Q641J2468K172q819j0649j088Q331Q939J126q027q184o95P541Q785
2245H229m8r842q485K673J0842P729m376j1398p136M977J2182P132n743j2249
2259e513p135N262J4359O455q129j3929l822R538J2904J441j1420j1074J361J1210
$$ y = [-10700, 4293, 13929, 8915, -4210, -12536, -8339, 3908, 11803, 7463, -4407, -11182, -7020, 5189, 12030, 5475, -7472, -11781, -3310, 8888, 11541, 2190, -9838, -11337, -1024, 9625, 11126, 1306, -10089, -11103, 62, 11186, 9530, -2315, -10698, -7175, 4054, 10400, 4463, -5861, -9036, -2995, 5449, 8894, 3299, -6309, -10102, -3074, 7543, 10550, 2646, -8037, -10237, -1131, 8993, 8826, -545, -8213, -7138, 1339, 8798, 6633, -3171, -9906, -5769, 4967, 11136, 5100, -7052, -12312, -3671, 8797, 10969, 2150, -8499, -9587, -1256, 7683, 8809, 782, -7402, -8097, -556, 8229, 8181, -1661, -10146, -7473, 3369, 11098, 6722, -4676, -11812, -6835, 5347, 12479, 6736, -5513, -12648, -7386, 6973, 13428, 5299, -8630, -12452, -2914, 9990, 11431, 11, -11063, -9702, 1508]
2273A508R559j918j0699j0038J363J2444J0423k333j2975j0351L284J3231R230
2286A2728m389j2063p820M302J1409O974m589j2229o783O826J3730N346r317j4761
2300a0636l742J2060J4334R32j2182j2279J04J1099J0521l5j0007r755L06R910
2314F30R008p15j0749q555L393J0963O580m735j0057o808N038J1108O130n096
2328F135j1557p016N604J3138O601q068j3027l255R243J1077M38r976q315J662
2342g316R392O564k488q972o187K553R919O580m008j0099o057M532J0168N203
2356I784n401q846l774M545P776L599m458q297l124O240R404J187q713r686P46
2371i018J1686Q642l414j1757p458M849J1101N340m713r737m581M695Q976M135
$$ y = [1508, 11067, 9149, -1550, -11588, -10225, 2219, 12642, 10309, -2666, -13017, -9733, 3498, 12728, 8339, -3724, -11544, -7242, 4167, 11141, 6552, -5677, -12460, -5634, 8096, 13442, 4125, -10636, -14378, -2318, 12016, 12948, 766, -11513, -11409, -310, 10211, 10176, 169, -9586, -9280, 630, 9638, 8923, -1826, -10381, -6988, 3975, 10555, 5820, -4237, -11045, -6007, 5101, 11231, 6135, -5422, -12438, -6834, 6304, 12905, 4837, -8190, -11445, -2202, 8875, 9313, -663, -8978, -7316, 2076, 8640, 6152, -2820, -9007, -6454, 3465, 10045, 6037, -4062, -10119, -5587, 4581, 9784, 4383, -4463, -8237, -3692, 4084, 7683, 3225, -5072, -8196, -1956, 7448, 8635, -78, -9764, -9018, 2668, 11310, 7896, -3861, -11319, -6470, 4631, 9971, 5258, -4479, -9060, -4365, 4611, 8746]
2385H746n834q953k379P744Q237J34q188p681N90Q134P916j19q321q442r61Q755
2401f22J0448J89j1130r922K155J2096P997m601j1704n995O776J1274L756q123
2415B594j0654l025Q715J1367K714r948j1890j060J0097J1034L64j0046r081J06
2429h713Q509Q205M3p898q606k07R828Q888j600j1452r139L487J3955Q601o837
2444G064j4473o194P972J3244N353p651j3279m122Q082J2014L042q568j0989r33
2458i438R678Q830j002r276p596J506Q542Q019j775q491q425M95R461J0077r15
2473I690j1579r071K362J1845P619m173j1423n099N734J0211L095o877r720j775
2487i161P795J0046R19j0203r143J395R685Q036j791r384o637K780P355M845j464
$$ y = [8746, 2912, -6041, -8420, -676, 7561, 7695, -493, -8174, -7584, 550, 8466, 8347, 26, -8416, -9377, -622, 9826, 10015, -1115, -11037, -8882, 3214, 11211, 6610, -5094, -11089, -4313, 6961, 10717, 2594, -8060, -11085, -2370, 8997, 11711, 1763, -10127, -11187, -1090, 9944, 10308, 262, -8819, -8713, -204, 8001, 8044, 146, -8460, -8667, 1161, 10049, 8449, -3003, -12142, -8655, 5300, 13901, 7064, -7409, -13603, -5631, 7613, 12966, 5315, -7964, -12086, -4004, 8010, 11052, 2484, -8505, -9438, 240, 9070, 8068, -1208, -8804, -7298, 1244, 9263, 7488, -1003, -9428, -8933, 528, 10605, 9690, -1889, -10960, -8598, 3247, 10866, 6693, -4730, -9829, -4095, 6116, 9211, 2334, -7386, -9161, -1366, 8680, 9599, -604, -9747, -8352, 1333, 9369, 7578, -1806, -8443, -5663, 1692, 6537, 5073]
2502E073n912n418J010P308N018k236q783m399M259R948L980o828j0711j965P770
2517a886R667J873q330r753m37Q895Q511q36r627p161L272R869M565n293q698
2532e369k461N809P571J646n266p235k618M740Q311L605m875r610m046O672R970
2547F844K172p234r328r34Q701Q823j677r559p322K250J0893P590m110j3076o671
2562a2638P079J2730M704p692j1915k658P721R361J766o236p654k625N672P958
2576E573K507o180q800j898Q013R550P33r957r660Q98J0421R733j504j0617r947
2591a1135J693J2083R343l706j2314p696N646J2532M511p585j0869j459P456R166
2605G666O16o995q468j122O492Q810K490p255r516k330P976R573J200q231q515
$$ y = [5073, -839, -6257, -5247, 2061, 7079, 4843, -3940, -8339, -4080, 5868, 9848, 3020, -7691, -9656, -1886, 7781, 9654, 1324, -8429, -8866, 29, 8540, 7704, -1923, -9084, -5812, 4057, 8622, 3329, -5369, -7830, -2021, 5550, 7196, 1930, -5305, -7923, -3183, 5128, 8733, 3858, -5752, -9798, -3126, 6844, 9016, 1782, -7546, -8480, 221, 9044, 7367, -2192, -9514, -7264, 3629, 11219, 7109, -5967, -12638, -5559, 7171, 11875, 4183, -7732, -10390, -2669, 6692, 8458, 2222, -5432, -8057, -2385, 5573, 8080, 1900, -6900, -8798, -785, 8765, 9498, -459, -10119, -9221, 1200, 10933, 9429, -1188, -11135, -9442, 2641, 11984, 8278, -4036, -11732, -6086, 6446, 10957, 3372, -7497, -8956, -1500, 7666, 8282, 1287, -7181, -8303, -1811, 6999, 9489, 2234, -7282, -9612, -1636, 7937, 9137, 906, -7609]
2620g609o63Q418Q044r26q610p347J805J0109P510m584j1806n831P451J1678L200
2635A0839q490j0220j164Q149P873Q8o407o316m76N351N810Q83n992n847N18O395
2651I94N705j304p951n127K365P965N389k711q286n776L201R606N669n147r839
2666e247m045O650R863J241r152p554K208Q664N305l222p827m569L110P462M835
2681G722k627p536n405K410Q626M592l698p253m236L461P174L799l450q175l125
2696g721M739Q765L351p425j0195j633J0368J0520j620j0937r091K966J1153O755
2710I995m195r200n506L780Q496M766l729q720m128N229Q483L116n614q582k822
2725h631O122Q602K616n922q989l179N558J0995L755q063j1125k162R617J0564
$$ y = [-7609, -8272, 146, 8190, 7264, -1346, -8693, -6888, 3221, 10731, 6147, -5659, -11490, -4039, 7639, 10839, 2349, -7871, -9035, -886, 6987, 7075, 668, -5648, -6124, -773, 5037, 5920, -72, -5919, -5401, 994, 6699, 5395, -2556, -7683, -5318, 2647, 8036, 5325, -2961, -8737, -5536, 4070, 9739, 4592, -5247, -9292, -2642, 7221, 8462, -690, -8244, -6036, 2628, 7933, 4711, -3116, -7685, -4575, 2887, 7722, 5095, -2441, -7846, -5436, 3190, 7782, 4084, -3169, -7405, -3944, 3230, 7029, 3579, -4596, -7721, -2982, 5783, 9134, 1709, -8486, -10119, 249, 10769, 9149, -1788, -10879, -7913, 3240, 9995, 5800, -3400, -8906, -5126, 3370, 8136, 4407, -4313, -8441, -3212, 5271, 8387, 2773, -5809, -8631, -2509, 6093, 8709, 2787, -6202, -9381, -3823, 7172, 10927, 2864, -8261, -10423, -806, 9758]
2739I758n45j1085q339L595J0261O073m195r947n184M929R425M710n031r093m988
2754i656N385R467L226n145q261k663M694P289L446m775p583l126M785Q603K696
2769H382o756r418j230R485R325j708j0429p584L228J0645N577m584q765m214
2783h046L778Q313L403m465p932k054N186P155P77n610o098n76O223M903N04m554
2799I07o103j427N235P312J573o923q006J47Q527O756j986q905n542M724Q298
2814D587L094n083q317j921N493Q473J218p156p075l69P286P103q91p843n468
2829f869J953O184M610j100n833m386J209N308N233q26p372o037K855Q698N327
2844H954n175r659l880O733R719K261p200q696j259O870Q551J001q542p639O16
$$ y = [9758, 9213, -1872, -10211, -6616, 3645, 9718, 5523, -4424, -9608, -4679, 4746, 9456, 4425, -4668, -9656, -4271, 5196, 8422, 3277, -4984, -7647, -2953, 4336, 7782, 3007, -4576, -7702, -2917, 5686, 8382, 1626, -7792, -9022, 463, 9788, 8080, -2349, -9933, -6705, 3940, 9517, 4933, -3832, -8046, -4268, 4045, 7448, 2983, -4949, -7003, -1817, 5338, 6115, 505, -5593, -6169, 54, 4957, 5461, 907, -5196, -6623, -1388, 5924, 7497, 574, -7432, -7285, 1242, 7998, 6012, -2893, -8435, -3711, 4587, 7681, 2598, -5719, -7640, -2147, 6326, 7544, 388, -6687, -7056, 230, 7333, 6442, -1401, -6869, -4916, 1268, 5878, 4778, -1055, -5441, -4232, 1076, 6309, 5483, -1889, -7926, -5071, 3627, 8954, 3779, -5880, -9760, -3027, 6692, 8953, 1753, -6943, -8202, -1332, 7219, 8220, -322, -7961, -7345]
2859g345R255O661k916q499n318L606Q071M205l501p413l934K318P201N537k448
2874E480q862n423L153R953N064m953j0052l962O681R733K261p459q900j517Q049
2889g54R354j33r299q284J340R491P556k631r596n482L349P860M507k623p267
2904b612m088K373O661M401k311p475m744L360Q754M149n248q655l056O264Q530
2919F303K141p025q362j075P483P473J57p322p513J485Q339N779l624p379l908
2934g048L845P066K283l940n846k210L098N884L152l557o375l149M039P198K411
2949F851n044p149j236O004O215O1o158n396L47O557O095k215p469n337L369Q758
2965D253L920m923q562k193O046O793O43n085n356p70M623M934R61m869n480n36
$$ y = [-7345, 1910, 8571, 5655, -2844, -8162, -4556, 3515, 7720, 4219, -3194, -7128, -4810, 2391, 7928, 5480, -3382, -8805, -5652, 4301, 9365, 4412, -5640, -9602, -2921, 6812, 9073, 1614, -7286, -8803, -754, 8600, 8467, -832, -9116, -7776, 1715, 9271, 6640, -2956, -8438, -5089, 2771, 7278, 4655, -2612, -6700, -4327, 2334, 6735, 4424, -3051, -7795, -4435, 4319, 8468, 3220, -5435, -8491, -2227, 6303, 8444, 1419, -6943, -8018, -535, 6938, 7095, -227, -7740, -6255, 2084, 7863, 4239, -3140, -7048, -3203, 3863, 6146, 2206, -3640, -5850, -2752, 3132, 6284, 2727, -3648, -6797, -2758, 4440, 6851, 1807, -5342, -6578, -574, 5641, 5702, -456, -5852, -5505, 1052, 7147, 4932, -2537, -7874, -4505, 4253, 8173, 3250, -5312, -7505, -1459, 5334, 5977, 892, -4464, -5234, -611, 4323, 5284, 415, -5065, -5601]
2981e601N713N628R3p117n616J635P232N128j733p861n081K846P619N094l176
2996D803q567m859N209R341K478o761q318r24P131P419o46p104o041J259O622
3011A042N418K8p087o268N72P206O391j405p691n549J882P633N538l157p294m511
3027g252K670P812N312l948r699l934N521J0024K841p210r589p52P767P756p87
3042F532o339o311j90O259O112j92o613n533O22O975N706k071p425m959L171P303
3058C047M100k733p281m607L120P564M556l542p986m333M990Q837J933o706p376
3073f417K32O633O187j679o600m337J272O052M458o60o709m731J469P065M496
3088F731k638o617l758L393N959K632l495n287j862K801N439K650m241o704j654
$$ y = [-5601, 112, 5740, 5833, -1284, -6900, -5265, 1967, 7095, 5362, -2499, -7580, -4734, 2885, 7979, 4803, -3764, -8623, -3414, 5927, 8405, 1644, -6674, -7598, -467, 6952, 6306, -798, -6839, -5580, 1042, 6460, 6488, -599, -6867, -6295, 911, 7302, 5897, -1794, -7343, -5461, 2172, 7710, 4553, -2741, -7252, -4582, 3230, 8542, 4594, -5105, -9039, -3518, 6506, 9347, 2137, -7452, -8204, -437, 7319, 6532, 193, -6118, -6308, -49, 6063, 5871, -742, -6275, -5653, 1322, 7028, 4957, -2468, -7427, -4256, 3047, 7147, 4414, -2867, -7474, -4354, 3210, 7766, 4224, -3762, -8095, -3105, 5732, 7665, 959, -6417, -6185, 448, 6635, 4956, -1644, -5981, -4709, 1343, 5801, 5141, -1568, -6299, -4830, 2235, 6731, 4093, -2524, -6282, -2889, 3070, 5702, 2207, -3080, -4942, -2141, 3298, 5948, 1707, -4997, -6651]
3103f651N903O814N78p329o553J930P477M327k280o204l851K017N927L668l042
3118B731n347k972L216O178K025m862n910r82N981N206q4m858n289p46M828N954
3134E069J056n422o520m72O817O643j870p808n133L845P636L012m277p084k138
3149f646M636O711K059m369p578k786N681Q112J529o124p050p30O293N902k84
3164E356n305m848j41N119N287K0o013o549J354P703O176k530q862n523M070Q592
3180C906M307m213p798l376L406P147L731l984p200k766M718P619J341o233o776
3195f171K85O750N565q28o370m972L4N900N580L84o144o418p1P199O535k095p538
3212b375m553L527O647K869l720o278k092M210O005J942m157p178k034N883P598
$$ y = [-6651, -748, 6066, 6644, -685, -7238, -5308, 2169, 6496, 4216, -1988, -5839, -3822, 2105, 5773, 2731, -2616, -5588, -2372, 3806, 5831, 969, -4941, -5923, 58, 5264, 5180, 322, -4967, -5713, -885, 5069, 6125, 703, -5817, -6289, 528, 7171, 5301, -2507, -7640, -3795, 3841, 6853, 2576, -4508, -6646, -2010, 4701, 6760, 2391, -5187, -7973, -2292, 5820, 7349, 1225, -5825, -6555, -262, 5640, 5356, 51, -4797, -4938, 181, 5468, 5488, -525, -7074, -5720, 1983, 8159, 5629, -3233, -8756, -4686, 3906, 8213, 4000, -3798, -7174, -3768, 3379, 7110, 3126, -4074, -6840, -2122, 5497, 6838, 605, -6171, -5886, 864, 6429, 5601, -769, -5741, -5707, 193, 5773, 6157, 13, -6405, -6476, 723, 7258, 5163, -2375, -6928, -3401, 3246, 6115, 2395, -3883, -5975, -1765, 4240, 6182, 2025, -5153, -7187, -1304, 6294]
3227F294K31o506n746L66N801M747j435m352l434O31L986L516n65m770m319K222
3243c333N867L949l468p394k548N092O474J270m420n664j058L559N320J756m352
3258A050n179p53M792N597j577o007l922K746O431K293l357n276j957K570M867
3273B318L397k564n702l387K558O750L279m319o969o61N117M890k70m972m266
3288d801N78N435M415r07o147n124J407P080N994k922q271m035L664O979K898
3303F243l649n970j577L078N005K175l041o073k278M659P336P78n922p418J04
3318f550O993O415j129o452n159M41O005N345j6o339o135J265P049N023k575p581
3334c400l450M065P488J670m611o294j353L899O169K294l752o913k704M501P366
$$ y = [6294, 6525, 19, -5727, -5361, 440, 5187, 3752, -600, -4034, -3403, 583, 4099, 3534, -1236, -5555, -3333, 2534, 6483, 3015, -4379, -6927, -1835, 4639, 5909, 1489, -4175, -5233, -1674, 3646, 5402, 1050, -4129, -4882, -90, 5507, 3930, -2077, -5999, -3253, 3178, 5471, 2114, -3162, -5119, -2549, 2318, 5715, 3151, -2551, -5938, -3380, 3370, 6649, 2330, -4639, -5300, -183, 4707, 4437, -535, -4801, -4223, 1212, 5627, 4720, -1427, -6551, -5144, 1936, 7930, 5008, -3263, -7298, -3634, 3345, 6243, 2594, -3376, -4953, -1875, 3130, 5305, 2264, -3809, -6087, -1428, 5908, 6686, 764, -6654, -6550, 443, 6858, 5729, -723, -5882, -5441, 564, 5909, 5893, -446, -6581, -5316, 1733, 6756, 4181, -3400, -6850, -2785, 4703, 6373, 1762, -4532, -5885, -1986, 4183, 6477, 2725, -4188, -6892, -2391, 4975]
3349D975K271n795o767m29N980M600n05m972m422J106N358M222j212n859m861
3364f310J814P009N150l517p871l486M322O556K156l920n077j440K901M374J825
3379D486k866n398r96M092N599j25n838m927J296O001M544k097n730l723K158
3394c524M738L784r46n459l915K029O062K829l459n860j286M659M815l15m874
3409g22m124R54M274M047o3m510m962K85N445M790r72n877m249K351N881K051
3425D599k891m236j792L030M418J525l632m790j517M014O103J397o008n976J99
3440e557O256N046j138n287m566R54N479L606j388m544m265J968N459M351l236
3455C138o786k829M316O505K050m852o012j950M208O115K144l667o567k216N015
$$ y = [4975, 7246, 1451, -5316, -5745, 235, 4835, 4330, -642, -5064, -3958, 1400, 5622, 4410, -1449, -6310, -4496, 2513, 7663, 4146, -3725, -7211, -2889, 3667, 5823, 1903, -3174, -4614, -1713, 2661, 4486, 1620, -3778, -4774, -682, 4917, 4792, -1046, -5973, -4677, 1324, 5868, 3771, -1959, -5682, -3524, 1214, 4998, 4052, -1407, -5322, -3293, 2769, 5598, 2139, -3721, -5007, -348, 4467, 4152, -722, -4846, -3892, 382, 4429, 4366, -144, -5106, -4821, 624, 5414, 4442, -1435, -5684, -3333, 2548, 4599, 1708, -2528, -4320, -1290, 3128, 4653, 1021, -3769, -5286, -1272, 4831, 6228, 220, -5756, -5557, 699, 5745, 4607, -680, -5246, -4292, 1187, 4793, 3405, -1139, -5404, -3436, 2023, 6374, 3138, -3648, -6477, -2161, 4344, 6394, 1542, -4470, -6420, -2212, 3903, 6047, 2380, -4187, -6403, -1388]
3470a388O043J201n576o039N68O146N066j648o272l892J730N700L994j599n893
3485a859m796K273O918M309l120o804l372L915O206J724l410n116j915L784N036
3500C773J661m309n489q59M570N949N74o406n586P19O371M561j458n112m057J114
3516c984N108L497j072m974l405J948N269K820l188n621j918M185N204J035l755
3531A149n276q69M381M341J065l634m988j191M634N019l82m845l702J202M601
3546A505L416k408m918j935K335M626J933k352n168k156L206N526J611l761n313
3561c853j072M641M589j84m326l493J61M393L188p81m312l458J175N494L312k609
3577B865n575l040L295N691K341l672m978k204L724N073J275l600m846r96M215
$$ y = [-1388, 4655, 5856, 280, -5759, -5191, 955, 6021, 4373, -1899, -5791, -4061, 1639, 5633, 4034, -1859, -6655, -4382, 2536, 6845, 3725, -3079, -6451, -2536, 3670, 5394, 1984, -3132, -5047, -1263, 3773, 5434, 1125, -4364, -5223, -653, 5296, 5870, -536, -6122, -5403, 968, 5529, 4071, -1041, -5098, -3984, 1124, 4621, 3549, -1425, -4830, -2882, 2387, 5207, 2019, -3602, -5520, -1335, 3869, 4904, 1149, -4127, -4996, -615, 3726, 4791, 1157, -3831, -5022, -388, 4631, 4249, -596, -4298, -3096, 1505, 4921, 2513, -2405, -4340, -2005, 2621, 4554, 2202, -2966, -5122, -1916, 3610, 5221, 1460, -3853, -4925, -284, 4305, 4121, -205, -3698, -3537, 856, 4044, 3263, -1049, -4507, -3332, 2162, 5474, 2865, -2710, -5750, -2455, 3236, 5577, 1905, -3073, -5277, -1553, 3520, 4795, 1195, -3651, -4647, -432]
3592d32M744L18n103m840J407N114M475j175o155l528J698N715K991j917n220
3607a908l606K004N973L315k734o014k950M008N352J897m030n716m66M002N202
3622D329Q54m342n622m54M975N445J49n804n181O36O101M433j265n849l466J830
3638c231M709L823k079n606l149K638N617L099l343n823k424L900N868J395m325
3653A069n066j123L748N059J142m241m848j25M349M443m32m488m152J243M849
3668A427L640k079m599l228J899N194K610k070n106k627K284N477K310l463m759
3683c090j168L056M461R34l526m410j68M022L877n07l895l915O27M942L328j058
3699C510n042l198J983M915K425k451m601j733K798L849J542l066m176o35L234
$$ y = [-432, 4312, 4630, -473, -5313, -3906, 1208, 5683, 4508, -1647, -5175, -3477, 2238, 5229, 3312, -1908, -5514, -3510, 2463, 5778, 3044, -2970, -5920, -1912, 3440, 5337, 1307, -4409, -4875, -873, 4329, 5183, 841, -4781, -5235, -260, 5185, 5334, -470, -5651, -5015, 1086, 5519, 4254, -1595, -5061, -3231, 1478, 5301, 3222, -2384, -5533, -2895, 2722, 5821, 2478, -3345, -5769, -1869, 3999, 5394, 1069, -3997, -5120, -1372, 3687, 4829, 588, -4260, -4385, -36, 4407, 3975, -513, -4665, -3422, 1427, 5067, 2988, -1611, -4839, -2940, 2254, 4864, 2794, -2312, -4939, -2655, 2822, 5132, 1669, -3090, -4258, -1202, 3259, 4193, 667, -3743, -3911, 111, 3988, 3481, -414, -4329, -3702, 1240, 4568, 3510, -1532, -4730, -2747, 2168, 4593, 2142, -2459, -4192, -1394, 2455, 3997, 931, -3245, -3880, -646]
3714f46M033N97l707m805K52N200L798j121m726l389J140M420L470j435m791k588
3730d298J777M458K614k168n458k012L821M811J052l738m757o97M279M572L14
3745D570m532m350J0L982M964q4m847m253M56N288L529j292n094l233J944N345
3761B403K474k407m989k941K810N681K537l672n345k014L878N340J583m325m846
3776c833o81L915M344O24m065m622j55N363L779o60m756m445J725N221L818k404
3792C168n035l095J934N084K801k286m942k725K885M645K276l052m703j857M011
3807h91M788P5l759l878l88M155M244k66m507l837J76M173M380o71m828l673J082
3824c625M929L077j873m127k427K292L953J523k154l940k014L137M725J099l895
$$ y = [-646, 3387, 3984, 277, -4528, -4276, 924, 4722, 3601, -1125, -4514, -3374, 1046, 4516, 3081, -1710, -4298, -2521, 1937, 4551, 2383, -3075, -5087, -1266, 3545, 4597, 859, -3898, -4595, -316, 4256, 4570, 38, -4312, -4302, -320, 4644, 4560, -287, -4540, -4084, 1204, 4733, 3441, -1653, -4886, -2942, 2403, 4877, 2470, -2519, -5460, -2650, 3031, 5568, 1896, -3449, -5463, -1585, 3755, 5338, 1013, -3833, -4514, -599, 3745, 4369, 304, -4318, -4473, 890, 4669, 4009, -747, -5192, -3467, 1754, 5572, 3168, -1867, -4962, -3028, 2056, 4857, 2571, -2371, -5096, -2211, 2434, 4710, 1658, -3045, -4902, -891, 3897, 3972, 213, -3665, -4053, 102, 4346, 4080, -427, -4264, -4088, 85, 4465, 3794, -1034, -4707, -3625, 1304, 4381, 2508, -1619, -4046, -1754, 2199, 3722, 1568, -2372, -4386, -1249, 3476, 4575, 680]
3839F80m267m59L679M012J73l905l769R70L206K942k76l721k850J017L986K623
3855D041k376l843k280K925M646Q44l053m111p90L211L671J041k983m257n18L513
3871c19M045o0l780l883O99M626L039k051m544k193K386M096K215j925m770k010
3887d429K560M348K581k989n256j415L380M437Q77l426m086k83L687L557k47l721
3903d25l972Q53M653L558p65n489l394J308N493L478k081n463k564K142M550K385
3919D267k048m292k308K724M181K043l879m135q85L911M669K34m855m165N43M017
3935B2M007L4m130m068J87M230L720l58m520l341J052M768K571k144m643j591
3951d204K549M275J731l043m465j407L127M529J674l521m786j058L919M382k92
$$ y = [680, -3587, -4046, -367, 3645, 3818, -87, -3856, -2886, 320, 3262, 2986, -735, -3585, -2568, 1418, 4041, 1665, -2178, -4458, -1533, 3113, 3957, 904, -3207, -3997, -786, 2885, 3926, 943, -3314, -3832, -319, 3726, 3666, -114, -3997, -3298, 1328, 4367, 2316, -2228, -4421, -2035, 2061, 4276, 2351, -2419, -4429, -1869, 2479, 5060, 2071, -3185, -4600, -1220, 3217, 4094, 668, -3418, -3701, -14, 3543, 3296, -425, -4397, -3544, 1109, 4667, 3902, -1587, -4981, -3673, 1820, 5298, 3217, -2246, -4810, -2668, 1882, 4267, 2219, -2073, -4381, -1657, 2524, 4567, 688, -3447, -4332, -421, 4248, 4482, -373, -4538, -3995, 22, 4029, 4063, -67, -4135, -3948, 282, 4002, 3644, -876, -4217, -3165, 1603, 4174, 2030, -2613, -4204, -1655, 2620, 4351, 1308, -3157, -4564, -1437, 3092, 4766, 1245, -3541, -4599, -680, 3702, 3410]
3966C410l387l410M63L421K809r34l003k787P71L752L089j673m753k418K502M715
3982B567J990k823m445j511K709M248Q05k631k985q38K099L719N73l301l582M79
3998b927L914K856j484m500j871K005L545J931j489l729k359J627L980K189j918
4013A770m100j309K469L827N66l442k935O85K857K650j78l391l306L91M197L186
4029C937m05m171l719J119M736K942k048l760k185J753L637J752k434l470j163
4044c479K492M031J117l339m768m92M085M658j05m383l626R0L779L547n1l757
4060b01l359L28L815L161o06m684k949K489M657J830k729m742j549L219M078J469
4076D227k574m088k147K673M832J453k996m462j007L383M108K3l694l284Q45L602
$$ y = [3410, 23, -3387, -2924, 497, 3306, 2372, -631, -3418, -2647, 1105, 4194, 2521, -2232, -4650, -2148, 2567, 4557, 1734, -2711, -4222, -1513, 2735, 3540, 909, -2076, -2914, -815, 2904, 3477, 176, -3406, -2927, 987, 3843, 2359, -2141, -4012, -2007, 1538, 3469, 1980, -1749, -4108, -2481, 1499, 3688, 1770, -2330, -3639, -1170, 2657, 3223, -219, -3154, -2469, 388, 3038, 2860, -531, -3837, -3446, 751, 3937, 3532, -639, -4358, -3239, 1497, 4439, 2391, -1369, -3554, -1801, 1836, 3588, 1154, -2316, -3479, -987, 3044, 4161, 822, -3946, -4438, -353, 4305, 4200, -183, -3809, -3719, 60, 3607, 3556, -201, -3560, -3232, 583, 3744, 3138, -1546, -4495, -2006, 2651, 4481, 1752, -2990, -4539, -1320, 2758, 4227, 1653, -2435, -4582, -1909, 2923, 4376, 1380, -3082, -4089, -706, 3402, 3425, -269, -3553, -2708, 894]
4092H94K473p22m005k760J057M249L267j146n083l256J910M834K727k431m173
4107b165j281K322K866J468k340k925q95K340L273Q74l396m013K78L855L958j184
4123C035l516l402J053L331L085q28l062k740L11L288K780j109m005j629K452
4138i56L157P45k803l273J43L198K895n55k393l131p6K707L483P1l258l157L45
4155b858L740K451j649l437j379J928K904J432k348k955j176K340L783J109k698
4170A187m394q57L054M575K01l880l148L59L000K680l18k670k875J048K998K285
4186C245j154m057k251K229M864J817l158m290j590K975L574J678k505l708j307
4201c638K110L800J400l036l881k78L734L291l73m327k703J254L872K834j448
$$ y = [894, 3367, 2645, -1360, -4120, -3063, 1186, 4453, 3307, -1776, -5032, -3122, 1712, 4439, 2008, -2165, -3446, -1124, 1742, 3210, 870, -2055, -2950, -610, 2663, 3537, 141, -3872, -3594, 261, 4219, 3035, -481, -3883, -2830, 501, 3586, 2758, -304, -3044, -2733, 555, 3335, 2226, -1779, -3408, -956, 2201, 2946, 143, -3130, -2987, 211, 3106, 2551, 158, -2973, -3049, -342, 3141, 3212, -46, -3203, -2858, 882, 3333, 1684, -1753, -3132, -1204, 1700, 3132, 784, -2171, -3347, -1007, 2776, 3885, 1187, -3207, -4064, -1010, 3565, 3766, -114, -3262, -2903, 97, 2777, 2459, -211, -3086, -2038, 960, 3245, 2091, -1966, -4217, -1988, 2876, 4693, 1535, -2755, -4345, -1370, 2204, 3882, 1377, -2331, -3638, -1528, 2272, 3672, 636, -3245, -3523, 211, 3502, 3129, -1198, -3901, -2647, 1225, 4059, 2611]
4216B611l900k769J124L992L267j306m511k504J406M534K005k128m278j038K840
4231f55L047Q76k657l172j077L414L726L80l622l902l09L888M292n77m551k749
4247c648O99L415K585o18l133k313Q47L131K584j450l924k050K513M047J153k962
4263H76l931n75K801L197J003k473l346o60K349L002J062k774l341k8L463K529
4279C154j069l516j496J326L365J349j957k998j591J945L185K186k237l797j334
4294c485K340L343N28k225k957J66L022J574l48k591j774K45L100K143p07l448
4310a074k366J082M084J990j800l886j431J893L262J048j909k638r99K129K507
4325A892J041k750k833n1K838L250p94l599k586J186L329K488r11l503k359R33
$$ y = [2611, -1289, -4058, -2934, 1058, 4325, 3019, -1492, -3996, -2590, 1944, 3949, 1821, -2457, -3495, -655, 2392, 3268, 611, -2561, -3638, -224, 3502, 3882, 260, -3642, -3951, -63, 4229, 3652, -899, -3648, -2949, 466, 3051, 2433, -700, -3013, -2166, 965, 3549, 2099, -1825, -3875, -1362, 2685, 3838, 876, -3055, -3630, -829, 2368, 3371, 898, -2448, -3108, -759, 2243, 3305, 531, -2810, -2838, 625, 3154, 2085, -1431, -2927, -1601, 1764, 3113, 1156, -1842, -3433, -1488, 1697, 3883, 1646, -2151, -3485, -1145, 2198, 2726, 501, -2456, -2290, 732, 2306, 1958, -633, -2407, -2162, 938, 3081, 2374, -1074, -3440, -2358, 1726, 3716, 1916, -1970, -3401, -1508, 1754, 2802, 893, -1745, -2744, -615, 1892, 2933, 183, -2650, -2701, 137, 3387, 2593, -1006, -3592, -2406, 923, 3411, 2500, -1003, -3362, -2429]
4341b429L230K446o11m099j914J591L727J463k193l758p10K833L225M59k970l286
4357b996k73L192L265L34k798m095k50L517L422k07l395k940O14L911J684r97
4373A988k945k169J199L424K082j671m150j598K279L723K002k899m218q98L013
4388h38K994J011k365k972p25K417L075j3k814k826L49L353K966j366l459k470
4404c683J881L166K033j400l128k011J054L294J880j346l051k125K007L453Q99
4419B923j950l358j43K464K641K29l055k607N42K313K994k73k971k837N10L485
4435I07J990p84l397j666J505K803O33j414k014r40J585K386J214k094k722p62
4451b770K365L211j29k898k720K99L406K096m25k752k339P05K665K015q22k948
$$ y = [-2429, 801, 3247, 2636, -1463, -3377, -1786, 1941, 3404, 1211, -2547, -3257, -424, 2801, 3260, 290, -2996, -3269, -77, 3188, 3522, 724, -3371, -3621, -104, 3318, 3111, -284, -3224, -2610, 1301, 2985, 1988, -957, -3126, -1927, 1497, 3579, 1908, -2242, -3840, -1561, 2162, 4164, 1265, -2953, -3851, -838, 2156, 3167, 802, -2170, -2895, -478, 2597, 2584, -230, -3056, -2707, 646, 3612, 2246, -1213, -3683, -1802, 1364, 3397, 1997, -1131, -3142, -2088, 1206, 3086, 1740, -1311, -3436, -1429, 2024, 2923, 973, -2385, -2528, -64, 2577, 2806, -249, -2856, -2314, -1, 2993, 2720, -251, -3088, -2578, 907, 2897, 2113, -1284, -2950, -1445, 1358, 1991, 577, -1437, -2377, -792, 1594, 2808, 714, -2008, -2770, -405, 2806, 2677, -221, -2941, -2642, 764, 2860, 2435, -317, -2656, -1951, 714, 2729, 1907, -1041]
4467a041j684J395L069J302k196l315l50K515K871L16k272k903n78K382K672P87
4483B970k621l009j97K730L393q02l288k138J153L020K038j589l280j416J357
4498a679L109J931j652l315j878K146L774R74k492l399n95K500L194K06k654k730
4514b560k97K769K941j68l306k570Q38L160K623r45l241k876J594L435J998j642
4530A753l162j707J460L042J917j483l662j592K082L460J191k531l330n64K999
4545a27K742j4k495k551p8K714K488k2k874k812L33L249K528j099l067j511J091
4562a505K886J189j410k558j133J261K711J195j756k981j023K482L029O73k769
4577B91k835J93K356K297m1k751j902N05K438J930q89k317j764O36K963J245j040
$$ y = [-1041, -2725, -1330, 1739, 3041, 845, -2470, -2820, -305, 2566, 2882, 610, -2293, -2871, -489, 2183, 2970, 349, -2660, -2857, -127, 3266, 2464, -824, -2962, -1809, 1211, 3249, 1660, -1620, -3036, -1679, 1430, 3361, 1709, -1606, -3484, -1338, 2436, 3410, 918, -2481, -3076, -576, 2618, 2824, 170, -2560, -2857, -88, 2853, 2685, -621, -3191, -2353, 807, 3430, 2485, -756, -3632, -2038, 1397, 3395, 1753, -1409, -3116, -1656, 1386, 3303, 1820, -1842, -3434, -1352, 2108, 3299, 768, -2562, -3126, -127, 2615, 2601, 106, -2445, -2523, 191, 2679, 2657, -217, -3029, -2696, 553, 3081, 1982, -1085, -2596, -1505, 1381, 2570, 1160, -1398, -2531, -1270, 1441, 2636, 880, -2101, -3124, -642, 2387, 3060, 291, -2544, -2351, 5, 2302, 2261, -490, -2392, -1887, 551, 2481, 1592, -725, -2489, -1853, 1110, 2355, 1315]
4594A315k926j089J671K905O30j876k381p51J779K518N27j964k284m50K529J952
4610B105J12k570k482J140K836J369j103k776j465J108L039J361j384k745j233
4625b688J548K774J581k264l258m20K166K798L32k466k682J90K610K142O9k704
4641b72k430O2L186K550p59l468j841J059L351J609j403l180j517J724K894J390
4657B955j759k953j272K314K769R33k465l104l78K525L051J98k734k655q1K435
4673b21K737j74k700k419P62K711K137q13l379j971J578L467J199j384l149j381
4689c000K022K975J082k114l058p54J587L433O40k251l035RK383K300l47k110
4705b38k204L27K413J952k23k673j951P01K698K129j131l268j430J542K871Q79
$$ y = [1315, -1611, -2700, -1029, 1876, 2506, 630, -1751, -2502, -723, 1795, 2322, 358, -1926, -2376, 153, 2105, 2217, -353, -2835, -1695, 1141, 2510, 1407, -1369, -2834, -1726, 1313, 2674, 1290, -1455, -2688, -1140, 1634, 3215, 951, -2307, -2727, -561, 2237, 2569, 103, -2579, -2389, 221, 2363, 2432, -272, -2702, -2640, 546, 3096, 2337, -1131, -2972, -1913, 1438, 3047, 1644, -1536, -3053, -1329, 1565, 2955, 1196, -1757, -3029, -715, 2054, 2987, 522, -2582, -2960, -435, 2616, 2814, 80, -2575, -2656, -221, 2516, 2342, -358, -2777, -2015, 696, 2833, 2020, -1359, -3330, -1752, 1715, 2914, 1530, -1619, -3000, -978, 1997, 3079, 965, -2093, -2847, -1260, 2173, 2813, 562, -2473, -2464, -81, 2219, 1872, -238, -2442, -2115, 298, 2250, 2027, -646, -2597, -1896, 802, 2931, 1800, -1468, -2898, -1356, 1515, 2394]
4721B394j309k660p75J657K432L92j420k553k75K312K091k54k081k352M25K457
4737D81J621m72k344j776P59K352J963q03k482j615R46K541J137j432k646r01
4753b671K123K443L22j988k337m6J918K418L88k545k246j04K744K020l10k890
4769g61j763R33K515J335j062k307j071J237K264J078j543k279j375J898L234
4784B333L57k208k909k63K486K538j10j755l081K68K632K167l54k374k229O63
4800a839K613K208j620k800j216J377K724J303j656l015q05J551K648J049r44
4815A578l522n56J841K874L64k261k367j03K517K124j35k982k016N21K751K258
4831B886n96l147k045P33L351J545q31k997j571J326K742P08j239k135j229J535
$$ y = [2394, 1085, -1575, -2350, -693, 1739, 2131, 711, -1842, -2117, 195, 2286, 2032, -49, -2401, -1976, 481, 2102, 1630, -714, -2490, -1731, 621, 2584, 1781, -701, -2316, -1370, 1171, 2308, 876, -1770, -2671, -548, 1895, 2217, 229, -2108, -2154, -236, 2182, 2570, 25, -2221, -2325, 419, 2439, 2129, -761, -2524, -1591, 924, 2259, 1197, -1110, -2181, -944, 1320, 2398, 855, -1424, -2799, -901, 2333, 2690, 482, -2427, -2690, -204, 2334, 2224, 469, -2612, -2344, 288, 2455, 2101, -273, -2502, -1839, 774, 2982, 1362, -1438, -2654, -1277, 1447, 2750, 1094, -1921, -2726, -1175, 1473, 2522, 1578, -1944, -2500, -659, 2215, 2579, 318, -2049, -2152, 365, 2489, 2354, -628, -2644, -2123, 628, 2886, 2290, -857, -2902, -2169, 1182, 2727, 1896, -1101, -2672, -1346, 1396, 2104, 865, -1270, -2499, -964]
4847i64K521R21j979k400n78J920L134j8k447k466K43K414K033o33j707j986J72
4864a820K399J925q69k547j510Q38K613J663j846k519n96J654K454K87j677k378
4880a929k37J963J949P3j455k125k91K091K197l32k294j751R04J745J549r14j985
4897h42j109J165J869J175j077k755j049J638K785R05j909k522o49K066K492m20
4913A763k002j465Q8K026J564k96k214j651N92K371J800j033k727j619J171L179
4929A547Q08j168k253j059J227K008J102j308k338r25K057K138Q80k561k751M33
4945b163K741K160p23k759j633M31K458J780o03k128j956N02K540J914j072k118
4961f29j788J382K639P28j380k561q81J718K200J122j964k662r65K650K650M36
$$ y = [-964, 1557, 2478, 499, -1901, -2479, -559, 2575, 2557, 110, -2356, -2113, 301, 2334, 1701, -6, -1992, -1820, 579, 2504, 1635, -912, -2422, -1584, 1029, 2692, 846, -1673, -2269, -615, 1839, 2126, 449, -1929, -2166, -203, 1746, 1819, 364, -1761, -2052, 39, 2236, 1904, -390, -2141, -1237, 508, 2057, 1143, -842, -1951, -786, 1083, 2258, 1181, -1574, -2623, -985, 1800, 2705, 796, -1726, -2375, -309, 2183, 1763, -239, -1704, -1616, 410, 1974, 1678, -536, -2187, -1595, 776, 2576, 1543, -1184, -2803, -1632, 1547, 2355, 1187, -1066, -2125, -898, 1110, 2212, 904, -1434, -2359, -302, 1836, 2716, 155, -2596, -2163, 578, 2738, 2015, -744, -2377, -1946, 512, 2292, 1689, -439, -2395, -1893, 647, 2561, 1489, -629, -2417, -1035, 1604, 2332, 952, -1609, -2490, -772, 1428, 2550, 586, -2076, -3041, -391, 2259, 2695]
4977B695k465k417k86K621J994k87k392j709N61K077J794p50k649j175Q70K588
4993A070J271j408k318j071J482K773M12j443k052r03J163J909R09j234j960n05
5009a905J296K535J39k588k127J108K347J467p40k429j263R66K339J167j224j931
5025h43j421R59K214J485j722j953m25J339J714L71j810j236l3J427J639J27j641
5042A91k419N04J754K165m14k381j808P55K564J324r32k280j033J355J618R48
5058A911j484k027n10J852K021K22j894k356J31K674J535j11k477j308m7K155
5074B87J532j16k072j610O23K188J331j037k023j919J998K544N21j762k369n90
5090b474K111K155M32j576k598l01J914K525J20k343k176N19J843K062n57k423
$$ y = [2695, 230, -2187, -2473, 148, 2142, 1855, -537, -2246, -1685, 392, 2186, 1436, -1213, -2388, -1518, 1070, 2341, 933, -1385, -2456, -974, 1799, 2211, 768, -1284, -2187, -1024, 885, 1794, 560, -1400, -1905, -609, 1926, 2065, -523, -2650, -1542, 805, 2272, 1532, -897, -2160, -1194, 1145, 2312, 1088, -843, -2264, -1305, 909, 2394, 672, -1281, -1706, -367, 1347, 1718, -92, -1328, -1361, 66, 1705, 1832, 191, -2228, -1724, 30, 2195, 1781, -600, -2408, -1653, 911, 2235, 1303, -977, -2010, -655, 963, 1911, 427, -1600, -2110, -258, 1763, 1985, 91, -2265, -2134, 540, 2075, 1964, -513, -1821, -1868, 287, 1819, 1703, -369, -1979, -1356, 832, 2163, 1126, -897, -2816, -818, 1726, 2247, 485, -1884, -2474, -363, 1792, 2224, 648, -1950, -2251, -337, 2188, 2308, -35, -2211, -1692, 151, 2213, 1656, -767]
5106g67j345R53K254R22j180j244j963R98K389J621j387k321j436J291K758J219
5122B762j942k340o36J324K118O76j706k251j23K354J949n34k061j752M57K304
5138E99J359n04k147j156N55J807J377o88j720j627J155J871J184j086k262m53
5154a736J235J979N07j753j973j81J815J660L83j873k251K34K018J997j20k519
5170e78j445R34J669J249j071j424r03R13J726K80o12j711o05J038K028N33j831
5187A90j551l59J446J570P42k032j459q8J479J592m88j417j321O30J496J745j115
5204A060k488p96J264K473L20j705j056r43J287J675Q55j602j478l50J076J650
5220A242L66j348j956K40J997J595m13k195j773Q93J920J441o01k029j774J237
$$ y = [-767, -2112, -1159, 1095, 2017, 837, -407, -2370, -1372, 1017, 2638, 1251, -1070, -2506, -1215, 1543, 2762, 820, -1520, -2156, -832, 1286, 1962, 256, -1995, -2118, 236, 2185, 1651, -410, -2162, -1705, 599, 1958, 1454, -693, -1849, -1294, 513, 1890, 1202, -518, -2145, -990, 881, 2065, 979, -1283, -1736, -501, 1478, 1985, 232, -1741, -1922, -107, 1553, 1936, 63, -2188, -1954, 64, 2061, 1941, -578, -2023, -1089, 580, 1829, 758, -666, -1569, -656, 1070, 1350, 738, -973, -1578, -540, 1488, 2021, 190, -1361, -1720, -274, 1296, 2038, 6, -1453, -1541, -62, 1530, 1042, -375, -1696, -1066, 430, 2175, 1060, -1428, -2224, -960, 1513, 1833, 128, -928, -1871, -584, 1091, 1946, 344, -1134, -1484, -408, 1242, 1608, 260, -1696, -1456, 541, 2136, 1723, -472, -2245, -1352, 568, 2009, 1408, -621, -2395, -1158]
5236a158K410J092j403k444p26J739J955L16j536j714k32J708J612j61j481j758
5252a781j99K103J697K84k349k011N43K155J669m75k314j275M58J953J523q49
5268A132j870j510J180K494P92j103k391r20J791K203N62k484j798mK055J353
5284A482L00j546k103J26K044J432k37j697j486L48J790J612j272j329j276R78
5300h34J679J076o65j915j444J020K464Q40j475k143n74J585K333m46j588j300
5316a387j82J655J223j62j303j276L49J339J788j020j751j006J044J496Q33j024
5332F16j565n34Q23J346P05j095j192q23J112K029M38j858j690K29J629J851o19
5349A402k058j213P56J909R87q66j586r81P13J922P87j048j759o62J268J665J63
$$ y = [-1158, 1252, 2344, 941, -1503, -2229, -490, 1465, 1781, 245, -1469, -1701, 7, 1619, 1458, -23, -1781, -1980, 123, 1820, 2104, -245, -2256, -1713, 442, 2111, 1636, -678, -1953, -1495, 458, 1981, 1132, -738, -2248, -1068, 1426, 2218, 1115, -1276, -2196, -405, 1798, 2360, -124, -1922, -1926, 129, 1482, 1782, 236, -1867, -1741, 303, 1735, 1498, -199, -1685, -1337, 453, 2065, 793, -536, -1812, -834, 845, 1921, 1256, -659, -2103, -1083, 1381, 2221, 746, -1397, -1971, -386, 1947, 1501, -87, -1387, -1569, 86, 1309, 1147, -156, -1432, -1083, 256, 2044, 1024, -727, -1733, -689, 807, 1640, 616, -949, -1483, -660, 686, 1391, 296, -896, -1719, -607, 1422, 1860, 2, -1688, -1459, 170, 2021, 1402, -656, -1869, -1113, 796, 1783, 917, -669, -1650, -937, 985, 1772, 724, -1035, -1697, -429, 1236, 1399]
5366A399j045j891j9J394J553M56j757j657j0J386K006l49j599j847K61K219J118
5383A618o75j751j052R49J978Q24j278j838l20R90J700R22j819j787l27J900J598
5400A632r1j273j909K19J575J589K50j985j520n38J984J955m20k081j373O24K270
5417I08J360j017k426j036J336J905J058j340j883q64J475J534P61j365j827k56
5433a677J019J947L95j877j109j24J488J281J14j564j660K82J848J257k30j557
5449a67j932R09J777J574j205j946n95N46K232M10j034j784k67J053J575O11j548
5466B09j900K50J584J340m16j174j218K51J307J122l43j234j165J96J789N06k26
5483H78j569r14J072J667L93p27k051n03J355J931j58j336j510q8J735J453l77
$$ y = [1399, 354, -1537, -1556, -162, 1391, 1847, 90, -1567, -1577, -191, 1815, 1466, -133, -1980, -1719, 500, 1618, 943, -808, -1860, -911, 1067, 1891, 613, -1225, -1545, -555, 1145, 2067, 248, -1539, -1866, 34, 1632, 1541, 268, -1641, -1422, 153, 1742, 1992, 7, -1513, -2051, -67, 1888, 1468, -613, -1986, -1362, 908, 2268, 1251, -1175, -2211, -875, 1030, 2088, 748, -1135, -1999, -524, 1010, 1771, 406, -1421, -1677, -658, 1289, 1684, -193, -1302, -1426, 62, 1343, 1457, -107, -1767, -1485, 363, 1620, 1390, -167, -2099, -1190, 587, 2161, 956, -990, -1585, -1039, 1193, 1603, 569, -1215, -1482, -429, 1146, 1757, 209, -1691, -1441, 143, 1483, 1067, -107, -1325, -1074, 233, 1355, 1012, -222, -1387, -1191, 598, 1104, 878, -691, -1605, -533, 1134, 1527, 800, -1251, -1754, -399, 1532, 1374, 38, -1472, -1560, 175, 1628, 1251]
5500A251j457j433K81J800J260j033j336j145J254J202M97m79j351j140J040K043
5516A254N04j047j965m54J333J657L82j562j365p9J256J580r3j767j189J21J812
5533C78J347k61j769j611Q21J948J211j223k014n93P48J810P67q86j643p44J094
5550f20J838M60j045j679p79J900J318N16j804j816L56J298J983l85j597j832
5566a888L63K080J416n46k006j140N18K018J012j203j472r73J223J698M68j110
5582D58j435m59J346J496L80j369j640l14J069K243k73j607j153L6J354J568l66
5599A334j738j146O12J564J176p47j932p66Q16K155M87j066j866m73J438J013
5615H61R42j499j467M5Q98J539k42j179j386N65J063J173j54j406j214M69J623
$$ y = [1251, -206, -1639, -1358, 442, 1702, 669, -667, -1812, -558, 644, 1141, 662, -689, -1829, -789, 1254, 1758, 711, -1254, -1708, -375, 1282, 1664, 102, -1263, -1342, -86, 1494, 1401, -366, -1555, -1434, 378, 1725, 1464, -305, -1916, -1095, 853, 2064, 841, -1173, -1766, -1018, 792, 1559, 673, -970, -1714, -620, 1218, 1678, 633, -1046, -1825, 75, 1393, 1909, 105, -1711, -1355, -57, 1926, 1541, -56, -1888, -1525, 555, 1971, 1425, -581, -1721, -1203, 815, 1827, 624, -848, -1821, -598, 1100, 1568, 458, -977, -1436, -90, 1406, 1786, 417, -1223, -1537, -468, 1775, 1502, -105, -1258, -1222, 132, 1700, 1334, -404, -1550, -938, 626, 1802, 1055, -877, -1643, -827, 1328, 1815, 749, -1117, -1590, -152, 861, 1803, 304, -1163, -1118, -220, 1319, 1077, -102, -1488, -923, 140, 1313, 1159, -247, -1461, -992, 631]
5632F31Q56n66j733o68O62J732P19j039j663o64J094J833L13j755q12k02J405
5649A43R46j70j258q85K98J170J445q53j427j009O08J671R42m47j847r38R27J403
5667G19J019j202j537n48J184J221O93j252j526l85J456J962m93j403j285p7K021
5684E67J083n62j599r86L98J784J083j013j546q92R88J589Q46j162j795m68J128
5701e57J654M20j153j384o61J266J783P5r88j918j96J957J358l19j520j500L25
5718a358J898J135n52j348j463P15J971P33j012j739o18R33J855M64j212j392
5734i90l34Q21J494K45r41j512l61J230J595J70j323j261l97J820J444l58j487
5751a45j581P40J812Q14q87j589m07N59J513P20q66j422m53Q43J406L56j072j383
$$ y = [631, 1487, 921, -812, -1480, -818, 914, 1633, 594, -1069, -1733, -639, 1194, 1507, -248, -1060, -1262, 143, 1089, 919, -339, -1224, -926, 244, 1689, 836, -591, -1600, -992, 679, 1621, 1174, -673, -1611, -684, 719, 1738, 536, -1001, -1549, -365, 856, 1549, 297, -1229, -1614, -158, 1804, 1311, -92, -1377, -1454, 567, 1650, 1088, -511, -1497, -1099, 685, 1768, 755, -791, -1683, -695, 894, 1740, 578, -1217, -1685, -557, 1097, 1517, 364, -1020, -1681, -415, 1368, 1443, 455, -1463, -1659, 298, 1656, 1337, -183, -1683, -1358, 540, 1675, 1123, -225, -1688, -973, 998, 1731, 719, -1020, -1638, -705, 1150, 1614, 402, -990, -1324, -503, 991, 1236, 295, -1217, -1578, -348, 1247, 1417, 94, -1167, -1564, 256, 1700, 1342, -145, -1726, -986, 826, 1640, 753, -836, -1243, -684, 829, 1549, 683, -739, -1192, -349, 1057, 1413, 341, -1042]
5769a042j8J340J078O5j288j201o9R48J289M4j401j091M30J511R95j011j023r48
5787a392P54J181J075j205j316l46R53J307K29j122j253l90J250J640k42j505
5803c82r01J65J104J057k79j083q97M94J077R71o86q82j021N44J517J022j053
5820G67j899m39R91J720L35q76j975qJ055J736n3j702p57J4J169J391j88j948
5838f67m10K69J168J153n11j700o82N69J581P65m00j956o60N58J868Q28j404j835
5856a466K04N97J980J33j053j871R2J421J274L21j926j134J94J551P48Mj734n87
5874a252K12J465J140o24j397r96N59J640O09n88j538q66R19J848M54j287j340
5891a042m47J330J381J18j357j454J77J172J002L54j081j580K74J749N60K9j649
$$ y = [-1042, -1060, 280, 1358, 1423, 135, -1066, -1135, -187, 1102, 1146, -255, -1346, -916, 595, 1590, 579, -444, -1392, -638, 543, 1618, 413, -903, -1249, -296, 1011, 1240, 118, -1135, -1525, -275, 1365, 1123, -382, -1283, -1118, -14, 1043, 764, -319, -1216, -722, 355, 1326, 640, -242, -1263, -719, 798, 1820, 767, -1132, -1571, -580, 1140, 1475, 599, -1376, -1384, -329, 1407, 1354, -348, -1105, -1091, 78, 1469, 1281, -667, -1077, -808, 360, 1513, 1002, -698, -1380, -811, 770, 1535, 1135, -821, -1481, -923, 945, 1773, 369, -1466, -1262, -665, 1315, 1448, 395, -1476, -1384, 37, 1311, 1632, -294, -1428, -1234, 317, 1065, 1069, -665, -1252, -1040, 425, 1565, 941, -456, -1452, -893, 747, 1356, 768, -770, -1636, -717, 1131, 1585, 298, -1042, -1489, -159, 1222, 1340, -17, -1471, -1294, -122, 880, 1234, 153, -1427, -1153, 596, 1156, 1185, -464]
5908d64p09N99J181Q93q38j188q31R30J154N15q08j294q62J396J509q9q47j398
5926a151k04J215J085o7r93r22K41R74J026k67j637n61M88J592M96p17j390p61
5944a553J267J319J39p15j358l00P61J311K70r68j273J34Q85J363P0j825j000
5961a473N91Q99J289p12j128q08O11J360R29o85j761p56J137J469M08q58j854
5978a342MJ057J289L15j122j474m5J140J340N8j317j320J77J535J058k02j455
5995c04r76N11J251J353q68j475p86N50J742K31n53j656m61J134J249M55j117
6012B80j384j93J163J011L66q62j928M10J011J123K27j282r73M2J369Q89k55j462
6030d48p82N40J418M39m10j487n88O32J447M22r50r80n31O89J325P09j227j337
$$ y = [-464, -1173, -574, 607, 1500, 662, -526, -1357, -427, 727, 1242, 434, -860, -1722, -326, 1183, 1094, 247, -1151, -1355, -140, 945, 878, -115, -1037, -796, 178, 1204, 937, -700, -1261, -773, 819, 1315, 598, -792, -1553, -286, 1033, 1172, 457, -901, -1201, -440, 871, 1141, 173, -1100, -966, -81, 1282, 1352, -473, -1473, -882, 17, 1306, 594, -534, -1342, -731, 629, 1558, 873, -888, -1644, -507, 962, 1370, 512, -1342, -1338, -281, 1008, 1323, 201, -1273, -1318, -178, 1162, 1220, -97, -1417, -1240, 295, 1353, 1151, -304, -1280, -769, 482, 1835, 967, -508, -1294, -744, 998, 1229, 676, -980, -1441, -307, 942, 1397, 280, -1104, -1297, -134, 877, 1243, 381, -1547, -1137, -126, 997, 1224, -58, -1031, -989, 380, 1269, 1014, -448, -1230, -690, 728, 1167, 757, -730, -1318, -686, 761, 1183, 233, -747, -1278, -589, 736, 1445, 218, -1119]
6048a119jJ068J203l31r28j253L02J141R45l83j328o71N99P62J529q58j170n69
6066a062L64J111R90j016j304J62N18J311q5q16j111L24M08J225k89r84r95K56
6084i93J418O98l68r48j003L71J265N54l30j029q54N96J256O63q50j263m26P61
6102d82J681m3j216p95j88J265Q83k02p67j333j7J325J104n9j385j281P10J300
6120E00R47p81j052j014P13J479O47q37j408o33J043J287K65j006j310j60J233
6137h7J029K05p73j348P5Q92J062K12j541j106M38J144J364o45j477p22N93J320
6155F35Q19o84j381p43N24J646N72p51j564k97Q66J450P7r05j483J32J183Q76
6173I72K60j633o07j78O94J941m54j102q55j86J677P69n19j272p66P48Q33P30
$$ y = [-1119, -1120, -52, 1151, 820, -108, -1361, -1059, 82, 1027, 644, -684, -1355, -756, 6, 1535, 677, -493, -1062, -698, 413, 1403, 387, -917, -755, -237, 1074, 989, 173, -938, -614, -206, 1019, 730, -254, -1249, -993, 425, 1123, 755, -193, -1196, -825, 440, 994, 664, -365, -1219, -623, 633, 1296, 446, -817, -1243, -482, 1199, 1156, -60, -855, -1043, 222, 1105, 903, 136, -1197, -1214, 111, 1215, 1156, -229, -1510, -800, 500, 1447, 666, -386, -1400, -687, 792, 1439, 602, -806, -1439, -396, 891, 1156, 150, -1160, -1320, -87, 942, 1147, 374, -974, -899, -7, 1055, 1267, -274, -1380, -942, 202, 1566, 921, -556, -1278, -685, 635, 1454, 770, -611, -1354, -830, 816, 1388, 637, -927, -1224, -358, 1092, 1169, 264, -1219, -1087, 96, 972, 1232, -401, -1008, -1186, -492, 1449, 995, -107, -962, -1148, 529, 1298, 779, -493, -1259, -511, 322, 1052]
6191A052q31o43o18Q44Q18M72j173o02k39R08R97J21j185j008Q9J273P59k37r60
6210a63j030N12R56O85l91r06n34L55J335L87q84r83m48O48J390L73r54j313l37
6229a302Q28J269O6p50j005p7J163P24l40r11p81L08J041R24p20p05p90O68J082
6248F92N02p53j069p83J185Q21M33q59j053k1P80Q94K08q50r99j28J227R51j89
6267I89j100j199M33J319Q68n12j086j104N58J287J162q45j324l90M14J191N98
6284A259r37j288l31J145J309k48q19j395KJ154J136N3j091j062J71J248P85l12
6302G79j032j060M93J233N06m19j195k48N53N83J034p10j420k42N79J247M18o21
6320D78j110l99P02J020O77j337r69L5J078P39Q3j265n28O5J054O29m41q28o97
$$ y = [1052, 221, -422, -1040, -196, 622, 1094, -79, -681, -920, -12, 985, 1106, -79, -1087, -998, 275, 1034, 797, -163, -1193, -681, 275, 960, 569, -337, -871, -516, 819, 1206, 322, -661, -1109, -461, 929, 1302, 348, -965, -1302, -474, 795, 861, 111, -894, -971, 192, 916, 576, -335, -1116, -808, 233, 1157, 437, -268, -1058, -390, 692, 1194, 441, -628, -1411, -226, 595, 1028, 169, -884, -905, -125, 769, 977, 127, -872, -1000, 227, 1178, 989, -111, -1310, -877, 442, 1310, 798, -288, -1392, -834, 453, 1615, 770, -554, -944, -530, 661, 1259, 322, -966, -1297, -152, 1157, 909, 90, -1305, -1303, -149, 987, 1040, -51, -1113, -942, 306, 1091, 779, -253, -1313, -820, 413, 919, 500, -695, -943, -390, 193, 1227, 517, -903, -1145, -566, 681, 1099, 478, -632, -1031, -329, 691, 1368, 31, -938, -903, 175, 914, 997, -268, -796, -731, 323, 952, 511, -317, -1014]
6339a014N13J148P73j025j113m45Q39J005N48r01r74k57P81J051K21o77j350j93
6357a070R17J097j82r15o81L9R22R05j32j141j042P95R34M95l47j114n39O43O39
6376B23O81m25j119m21R42R43%q54o89P6Q31L90J25p65j008M14R56O76m78n91
6396i3q31J85J196N16n04q83m47M57P79N93o65j100l16Q30J120K46q88j237J83
6415h59R82J085m21r29r64L15R01Q65l81q92o02K20J109K75l12q95o68M12J441
6434F82M75q48j125m53J097R94M09q99j228J92N27P78O37j359q13J41R07R60j30
6453I44j031r41J61J004Q18j79q04j197N90J006O22j57j545k33M35J489K13r44
6471B51q29o11P46R53L07q62r48K13P59Q55Q0r90j084J45J233J094j015n44o14
$$ y = [-1014, -501, 647, 1420, 395, -718, -1163, -324, 681, 1229, 328, -646, -903, -122, 929, 1150, 473, -877, -1070, -153, 944, 762, -153, -834, -795, 127, 1032, 900, -241, -1283, -488, 446, 941, 594, -520, -1059, -416, 223, 904, 479, -640, -1061, -119, 824, 824, -30, -719, -643, 188, 578, 703, -62, -1070, -656, 300, 976, 498, -93, -924, -739, 457, 973, 469, -414, -861, -404, 375, 968, 303, -797, -1113, -283, 837, 1083, 195, -1042, -859, 123, 1208, 787, -142, -1106, -791, 110, 975, 594, -298, -900, -680, 429, 704, 392, -503, -1171, -759, 682, 1157, 309, -816, -1269, -172, 822, 1231, 332, -896, -704, -177, 601, 1238, -121, -934, -793, 114, 1074, 944, -87, -1028, -867, 137, 955, 776, -28, -1225, -635, 371, 993, 836, -709, -942, -507, 982, 1195, 251, -578, -1189, -443, 510, 817, -45, -993, -780, -21, 834, 914, -76, -1160, -1015, 218, 1312, 297, -247, -861]
6490h61K90O81R53o72r10n54M54J352K40o15j095m7N10J062l5q17r60L82O97Q48
6510I03j49m87j141%R51O22J77j045n83K82R75N29m26p84m84K00Q20O45p11o69
6530c75q17O61J392L2o37j108l6J024O59o5n29q27l2O80R98o22o33r62N57R59
6550C19M74j69j172l95N24R24M57m23q74o01N23J002L95q63q74k04Q30R99k35
6569F37q98r74N86R07M20j35p19p49M55R59M77k09r46q66K08J397O72n93j242
6588f13n62J036P88K59m55j487K30Q40M26M71j198o89l7P14J220K34j111r92K45
6607f81R38Q52j83j128o39J93Q89R11n11j272k25M62J059K12o47j129m32J114
6625b17R09K56r04o89p6J22J101O19r38p85J4N60J137k52r15n99J28J089K38n48
$$ y = [-861, -571, 110, 1063, 391, -519, -1073, -619, 733, 973, 358, -737, -784, -274, 788, 753, -64, -1024, -642, 55, 903, 754, 267, -874, -874, 77, 699, 876, -169, -752, -470, 505, 1034, 608, -176, -660, -460, 360, 1005, 294, -375, -1192, -531, 861, 893, 256, -852, -888, 136, 795, 730, 201, -626, -658, 22, 1020, 398, -235, -1197, -640, 319, 793, 624, -548, -943, -419, 505, 962, 539, -335, -936, -413, 589, 984, 121, -753, -957, -127, 872, 637, -261, -1235, -649, 258, 678, 543, -176, -925, -470, 489, 966, 757, -189, -1055, -847, 550, 1222, 629, -613, -1175, -139, 649, 908, 453, -1034, -804, 36, 462, 933, -265, -954, -991, -277, 943, 1177, 66, -926, -681, 257, 1109, 926, -202, -841, -648, 241, 1152, 641, -631, -856, -394, 665, 877, 230, -899, -1331, -217, 692, 948, 44, -645, -721, -599, 502, 1121, 183, -602, -588, -28, 1109, 857, -58, -657, -529, 560, 798, 250]
6645B50n70m87M82Q05N90p66q07l47O78R05K91p36j154l62J114J004k63q46o68
6664h87K91N94P55J55j100o35K83N44J052m61j004l76K15R30N69o71o37k96L02
6683c77J244j15n50p07k12M85R62J52q30q75M2R72R01n12o71q53M59R25L68j43
6703F65q75p70P22P05J2J3j179j40L37J388o1q80p86j03P63P78M22r06j005k02
6723a102J007J087l15p29o37k64R50P33k42r10n92M75J145K60m70n36n86Q2J270
6742F26M40p61j121n76J417P19J12k27j472j23P52P23J54p29q04l5R48R69m03
6761F09o12r47K90J063M87l56p97n95L12R69Q95p96j050l10L22J010L99m15q75
6780c97n21R50J40O70j102n98L28P00M72l2p11p27oR83R13l06r40q16M58P76N61
$$ y = [250, -320, -807, -325, 480, 1070, 304, -503, -850, -172, 733, 1024, 288, -866, -1228, -114, 890, 627, -219, -887, -596, -2, 753, 908, -192, -827, -544, 0, 1052, 591, -413, -789, -574, 356, 925, 254, -383, -679, -377, 867, 752, 202, -505, -717, -232, 730, 882, 52, -823, -781, 191, 1092, 580, -91, -944, -485, 440, 808, 665, -210, -980, -258, 447, 459, 472, -707, -847, -510, 878, 817, -63, -849, -952, -189, 589, 1011, 105, -900, -1102, -95, 992, 677, -52, -689, -953, -3, 730, 488, -422, -1014, -539, 606, 866, 396, -140, -726, -644, 626, 1066, 305, -816, -1392, 25, 744, 856, 629, -843, -966, -214, 509, 663, -66, -870, -905, 43, 1012, 609, -3, -950, -660, 403, 890, 534, -263, -858, -546, 423, 1318, 522, -528, -838, -516, 494, 893, 478, -397, -918, 32, 172, 842, -260, -858, -530, 170, 642, 610, -101, -828, -834, 149, 1062, 756, -184, -1000, -542, 234, 795]
6801G95l37j038q7M57M69M57k58j056n6O92R72l25l91q65j68R03O88k64p54n02
6821f68L4O30O11k45j37q86N7J008N30n21j112K20L32M40N58n53r69o5Q44P80
6841H88Op59p99J02L56R67k21n79j077O66P21O03n03p27o01Q58K70N64k90p40
6861b95m96M23J018R1l99r87m12Q21J098J03n10j251L9O52R68L8q78j006M92N75
6881H4L96R9m46j086j27J493M90k52j085k62K04J077J74k19r23l52M58Q16K50
6900G89m29r00l04O13P75K71p84o78j15J020L11J00n11p57l65J156Q77l91p51
6919g3n97Q0R80K91l64p68k82K63Q44N56p46o46l13M78R03j6l25n78k4K19P91
6940F73J38p84p57l04J132N70j52r98k87J55J122L66q6j072p33O22N44M81l74
$$ y = [795, 458, -580, -667, -210, 259, 716, 458, -598, -654, 38, 1010, 685, 294, -571, -739, 164, 852, 588, -166, -668, -634, -4, 607, 362, 225, -661, -604, 404, 934, 413, -699, -479, -147, 293, 851, 298, -671, -736, 108, 888, 894, 135, -664, -562, -206, 761, 540, -39, -1116, -450, 271, 874, 371, -356, -957, -99, 171, 735, 445, -295, -791, -368, 650, 741, 342, -645, -1057, -236, 862, 965, 455, -796, -757, -105, 863, 901, 23, -983, -491, 84, 480, 579, 133, -953, -1080, 413, 903, 651, -434, -696, -492, 585, 759, 540, -383, -735, -277, 539, 789, 360, -540, -844, -231, 544, 815, 31, -647, -762, 258, 569, 669, 158, -599, -964, 192, 1069, 678, -73, -670, -590, 390, 681, 317, -451, -733, -470, 374, 930, 184, -462, -775, -297, 606, 590, 265, -313, -337, -118, 673, 811, 27, -730, -1034, 98, 668, 516, -482, -769, -614, 508, 874, 788, -284, -1017, -395, 149, 630, 256]
6959B56j003MM47Q59K67o75r69L53M50N26J09p15o64k53R90M29R7p13m91K52J051
6980F07L21j22j205l08J7J144K92n26k93o69N16P81K71r85l76k73P91L87N78q33
7000A15r38L19N55N19J51q38n97P3Q48R29o60o98m67K17Q50O8j09m49o03P37O80
7021G02j39n36o83l81R84P68K06p99j015R3Q42Q86n28m09o60K08N20N73m6r45
7041c59k95L58P06M44j23j084m65M73M38R22o26j014j80M06R48N07p97p70l45
7060h56R49M77J83q05q47M53O68N83k65q65n53J46R24O68m25o77p49O53P05M59
7080H26l33r86o32N42J045N3m63n29k5M43O60K07p46p29k87P71P25Q1p00p39M93
7101c23M74Q53l52n03j324P02O59L79J4r94k75M33O62M25o21o87n0N84M81J37
$$ y = [256, -747, -743, -296, 563, 830, 155, -814, -461, -11, 515, 624, -91, -755, -1008, -18, 411, 508, -205, -696, -444, 607, 928, 806, -399, -707, -690, 454, 746, 220, -73, -742, -226, 555, 826, -159, -535, -808, -17, 370, 948, 115, -823, -504, 51, 570, 721, -117, -714, -641, 207, 1136, 476, -222, -689, -472, 378, 446, 337, -112, -715, 22, 702, 563, 27, -656, -1037, -53, 715, 921, 122, -893, -800, 42, 928, 400, -9, -669, -461, 59, 632, 586, -359, -654, -296, 410, 854, 731, -353, -818, -345, 93, 1015, 389, -625, -805, -399, 549, 1056, 259, -511, -856, 93, 570, 753, -52, -899, -446, 222, 805, 540, -325, -878, -732, 192, 860, 435, -242, -991, -338, 367, 826, 493, -493, -1125, -583, 462, 515, 52, -477, -502, -59, 601, 808, 62, -667, -954, -183, 542, 623, -77, -816, -323, 151, 1004, 652, 149, -1175, -473, 186, 565, 579, -415, -690, -257, 405, 830, 209, -478, -528, 56, 537, 674]
7121F74q18l90J09N05N71k63p37n63L4R81N32l53n77l70M55O01M40o77n33j97
7141e76J24R10Lj58q63J35j21R93L47r86o98J46P89P90lp99l47k46J007M4k47
7162B44l24l31k60J024M97p91m38j82K36R29J51r26l28j4L14O68M19o70q79r7
7182g58P43P77j9r00o54L37Q80O29k90j002n83L40O61O60j2j123o42M01R73O98
7202A116p70o12n68O60P59J33o70p46K28J34R35n4m99q45L20J77J100l44q77k00
7222f23K40N62L86J11o67l17k44L18R66m81n46o42Q44L33N14n22o87J75K1Q62
7242F03j4l33q78q7O63M80K19m23q49L44N50L54l02n06o22M19O63L23k74n61n64
7263g95K95R41L42n69r52j75P15O14M97o58p88j17N75P46l31l97l63P2K80M84
$$ y = [674, -144, -534, -425, 80, 651, 388, -349, -912, -878, 103, 635, 282, -295, -665, -210, 391, 831, 154, -379, -576, -452, 458, 461, 303, -560, -425, -546, 447, 794, -192, -890, -744, 45, 835, 832, 33, -314, -560, 447, 491, 244, -80, -411, -671, 353, 850, 59, -379, -561, -325, 604, 755, -171, -499, -513, -199, 469, 888, 218, -661, -758, -15, 762, 743, -157, -811, -474, 406, 1035, 745, -257, -840, -500, 161, 821, 809, -314, -956, -555, 418, 1116, 346, -266, -834, -174, 585, 718, 48, -698, -470, -336, 599, 545, 46, -799, -479, -302, 798, 454, -423, -623, -383, 179, 565, 676, 9, -308, -552, -234, 732, 251, -295, -937, -93, 240, 754, 232, -455, -280, -259, 603, 589, 256, -622, -709, -46, 434, 653, 230, -619, -275, 275, 629, 327, -179, -801, -382, 281, 604, 330, -231, -795, -500, 441, 783, 214, -738, -913, -198, 416, 913, 255, -533, -650, -75, 671, 340, -57, -420, -348, -68, 416]
7283D16N0o38n99L59M24O91l79q25k31J43J040r6j29n35j85L96L63L10m97o87
7303f09J47O02N96k01n63n09O8P03M89Q3o27j021J75J187j3j7r44j14K79Q00L53
7324H64n70p34k68O10R87j78n80p49j46R47K42M19p32r16r3J052O63j74p38l98
7344d92J01N52N63m39m02n21K20Q30N73o10o81m07N62Q02Q2l35n77l62J98R16
7364E73m5o62n88N4L55R71j45n72n50J08M57Q05j18n83o76Q8O75J17j42r6r16
7385h90M15Q02M74k17q29l75M04Q85M82j083n89k77N76P99n3o07n81K75P82K97
7405F90R4j038k16L44K25N59j56q49j09J89O91P5l82l22m41M18O08J36n34m59
7425d77k5N96M06J19m82q79L23M27N60M4q68j34n2Q17J50M5o24p61L56Q65L64
$$ y = [416, 466, -172, -771, -412, 12, 703, 324, -501, -732, -589, 451, 355, 226, -309, -494, -98, 265, 575, 78, -609, -462, 140, 736, 535, -28, -537, -469, 234, 723, 806, 179, -842, -667, 520, 507, 490, -454, -568, -289, 511, 864, 294, -440, -708, -98, 889, 711, 131, -618, -764, 183, 425, 844, 112, -804, -897, 155, 818, 644, -94, -492, -391, 161, 724, 285, -117, -638, -418, 412, 985, 375, -306, -713, -151, 651, 733, 398, -179, -541, -343, 573, 528, -134, -722, -668, -313, 658, 513, -59, -609, -501, -44, 761, 643, 60, -616, -528, 147, 264, 122, 26, -890, -475, 327, 801, 584, -245, -620, -216, 669, 1151, 68, -521, -798, -222, 577, 524, -83, -664, -389, 393, 690, 784, -254, -470, -126, 99, 658, 502, -347, -456, -267, 424, 499, 117, -205, -646, -228, 380, 516, -18, -477, -502, 94, 500, 619, 137, -742, -419, 8, 568, 612, -256, -390, -442, 375, 525, 570, -54, -815, -459, 406, 770]
7446G70k81o64o08O83N18L98o52o94n6N57P78o6n73r32O69JN54l3o66m46L63N22
7468A42K72J29o61p23M39N65N75l87o66k23j06J068l2l75o28m2M22N91M65q77
7488e2m59k73P79N88l23l23p03J95P53M73j37p35o61N41N94L05R3j233k61N54
7508b85M83L72l60k09p56M97O16L98m24n10m99Q06L90k44j66n70k2M42O02j59
7528D02k06n77N7O1N63K06m36n84K15K77O30p45N0n79N08N36L69o56m03k74N28
7549e8M79N3m34o01O2O82J21J04k52o73R7L33Q33l20j024j87N70N94L82o43n26
7570d08m9K93N77J96l41r49l67Q47N89J32n82l04J63M14p5M57p25k35P3N76K78
7591E60k10r31l80P16P46o2j10o90pJ96N47J86n70p35K99M42N80j59j63o66l01
$$ y = [770, 489, -175, -783, -100, 418, 816, 164, -530, -586, -29, 749, 683, 110, -822, -153, -152, 402, 369, -297, -743, -380, 142, 414, 543, -118, -841, -402, 163, 738, 351, -315, -538, -644, 424, 392, 17, -611, -653, -231, 360, 825, -52, -511, -784, -5, 583, 260, -63, -766, -571, 182, 655, 518, -217, -878, -337, 257, 562, 655, -578, -839, -285, 198, 570, 210, 1, -755, -258, 358, 756, 332, -178, -677, 129, 519, 275, 109, -461, -483, -41, 561, 402, 196, -381, -324, -263, 300, 506, 70, -514, -299, -22, 608, -137, -87, -666, -158, 378, 747, 91, -312, -586, -58, 421, 474, 40, -561, -499, 183, 304, 408, 156, -517, -420, -87, 746, 426, -598, -785, -215, 379, 761, 118, -408, -457, -164, 413, 609, 268, -681, -1048, -201, 388, 520, -62, -366, -203, 211, 136, 593, -132, -367, -294, 282, 560, 350, -581, -961, -245, 501, 439, 329, -361, -368, -172, 375, 561, -9, -744, -445, -3, 577, 418, 255, -411, -712]
7612g12N56Q98j73q37m43J65N60P70l71p08m46L12Q15L08l63n62l30L76P10L67
7632H92o40n31o22P09O19K12n65l56q7K51L66K32m16o26k5L70R59p6p74n96J71
7653e33Q12J8M5n97l07M1P68O28n30r94j22O65N84J21k80p59l9J73O95K01n52
7674C8q05J19Q06L49J04q06m8k67N81N12k68n34k6k65Q51K43n75l47l83M14N16
7695B09L77l57n06m64O42K63K51l40m67l25O17O22k7l95o03J41M61p0J40m14j32
7716c77J03M67N75l54l82n72K63L35M41J38j233k29N85O01L75o50m47j2M78L26
7736D31k0o67n43N53N36KJ02n28j62m22P02O98m74j1m89oM15N90n06p23q7N63
7758d6O62K53q79m28Q8K57O59k20Jr03K21K01Q12o9p67o11M43O19J80m8n44l16
$$ y = [-712, -156, 742, 569, -268, -711, -546, 14, 784, 413, -295, -741, -429, 386, 694, 331, -231, -561, -185, 525, 892, 252, -279, -901, -192, 427, 639, 74, -282, -369, -118, 248, 480, 64, -562, -587, -217, 742, 666, -108, -704, -533, 279, 297, 342, -255, -562, -521, 247, 875, 345, -649, -771, -106, 478, 599, 319, -440, -479, -306, 389, 590, 38, -767, -648, 158, 507, 611, -195, -243, -510, 71, 583, 315, -219, -245, -510, 341, 584, 9, -338, -721, -307, 209, 586, 229, -277, -741, -99, 164, 415, 75, -392, -717, -100, 522, 495, 100, -503, -362, 99, 29, 169, -245, -377, -274, 193, 768, 414, 32, -540, -277, 58, 499, 637, -596, -825, -240, 361, 736, 86, -361, -373, 105, 431, 411, -256, -799, -246, 290, 292, 394, -134, -296, -718, -16, 682, 208, 197, -292, -298, 117, 707, 201, -522, -609, -46, 616, 869, -10, -438, -350, -93, 566, 346, 347, -556, -335, -134, 678, 609, -158, -769, -326, 293, 473, 425, -119, -435]
7780d35L36N80j33j72m72k93O05K64N8l01o04%M55M47L11n79o91k12O94P51k35
7801C74m32l92K1N17L22j90l94l02K15O17M73n04o35N8R4N67J93m09m49j63K37
7822a82M49J38j31n36k14N57J76K86m85n15j10P18pP1k08m36J18P27J22l04k80
7843d6m46J57M41M24l10n62L3J39N79J16k64n86m5M36K36J12n83l18K87K95L43
7864D38n06L44o21j63P24J11Q1q08l0L43K42L82l7j157J68r5J302n46m4m44k96
7885f12P72M78q6m17n99O0M02L56O4r20J32O9L84M73l6p94l34J03P75L24o76m69
7907e51J74K49N54J59k19o78k15N52O85j79l41q10P0O88L69k55n50R5j06N81N14
7928G86o51j04m24k81R16J56l59k18m85L87R07j59O2r78j69L89O54M82q82m69
$$ y = [-435, -99, 481, 348, 176, -296, -589, 16, 280, 338, 37, -567, -567, -112, 335, 646, 67, -624, -836, -142, 609, 374, -58, -450, -429, 88, 410, 220, -174, -476, -261, 356, 829, 325, -310, -252, -158, 409, 602, 193, -256, -419, -182, 267, 405, 274, -262, -476, 81, 257, 543, 58, -457, -567, 151, 144, 215, 7, -429, -311, 416, 538, 234, -46, -492, -335, 106, 530, 220, -342, -309, -170, 409, 525, 261, -325, -370, 66, 302, 414, -169, -487, -200, 95, 438, -68, 276, -345, -508, 216, 327, 408, -400, -430, -87, 155, 537, 500, -657, -489, -584, 718, 172, 128, -316, -612, 160, 638, 552, 135, -464, -404, -2, 354, 418, -502, -370, -301, 83, 556, 520, -274, -608, -505, 270, 594, -82, -551, -377, -128, 426, 585, 366, -312, -527, 25, 710, 531, 190, -620, -550, 138, 507, 252, -298, -203, -309, 272, 786, 135, 31, -393, -674, 242, 398, 39, -179, -664, -277, 630, 471, 533, -445, -614, -225, 429, 911, 29, -440]
7948d40j47M34N10R6l10l60k81J88Q40j97n82j22J27L67L95j29r23J24J76N48
7968C14P9j26p08k34O72K31L23l85n24k12J41L86K28N1n99O4K19K48J70l78l29
7989c69j04P23J78j77l61n43L84L92M46j84p26K57l17Q63K6k39p46p2P32l1K04
8010C36l89l94%M63K93J48m85n28p4M31J036n00m74m64J91N64N28o42j09n91M14
8031b46O36J91n0q97l17L83R75n10P1r30J44N37K93J28m12k99j7L38M13j95n20
8052b84j3J1N49K58N0p14j12K5M64J84n01l60k62N55M51M41o81l96j49P23J03
8073C42J18n68l14j00R59J04l22l44n25O43j01O69l01n18l07K95P40L91o07p55
8093e01l9K44N74J77m29o00P7L17O29J59n19l96n3M86L18k11m20l58R8N42K47
$$ y = [-440, -587, -153, 357, 453, 143, -217, -498, -310, 530, 333, -249, -371, -244, 123, 518, 389, -534, -410, -234, 314, 393, 267, -441, -675, -3, 228, 551, 166, -358, -570, -429, -43, 185, 236, -363, -299, -80, 168, 338, -40, -369, -473, 250, 428, 251, -110, -653, -269, 123, 569, 385, -341, -84, -401, 462, 488, 249, -497, -569, 163, 132, 336, -53, -447, -447, 16, 309, 457, -28, -556, -630, -199, 837, 337, -137, -601, -410, 154, 682, 40, -69, -660, -246, 390, 581, 531, -366, -683, -300, 675, 165, 236, -694, -550, -13, 280, 408, -4, -303, -320, 18, 431, 236, -284, -297, -286, 263, 521, 571, -143, -255, -230, 234, 418, -83, -443, -705, -150, 301, 742, 61, -335, -484, 239, 342, 460, -108, -422, -522, 437, 541, 219, -125, -650, -7, -108, 561, 260, -258, -565, -270, 470, 861, 254, -501, -540, -296, 278, 455, 26, -574, -497, -180, 449, 608, 89, -307, -360, 126, 444, 233, -187, -545, -447, 95, 342]
8114C42l9l93m05R2O57J58k67k66m78N16L51J40k24n98Q4J55Q53p4o14l80j12
8135e02J64O93P7m77k28m3M38M26k69l07m61J83N75P2q2o83q9L49N08K35o35m69
8157e25K97N4L07N02n85n11L13K09K12O3j82n49R1N27K77k02l39l68m7P99M95
8178H38n72m77l26O28K7L27j80p58LM59L97J18k02
$$ y = [342, 303, -90, -495, -403, 254, 412, 145, -121, -599, -83, 268, 408, 184, -414, -330, -175, 678, 604, -10, -390, -502, -338, 355, 432, -45, -273, -316, 122, 548, 279, -28, -489, -306, 269, 341, 259, -424, -513, -164, 344, 579, -56, -525, -228, -174, 133, 635, 50, -461, -148, 61, 273, 336, 154, -395, -304, 223, 500, 298, -41, -409, -456, 343, 838, 266, -211, -537, 91, 118, 445, 265, -493, -490, -31, 366, 484, 282]
8191B82
$$ Imaginary data points
##PAGE= N=2
##DATA TABLE= (X++(I..I)), XYDATA
0@%%%%%%%%%Qj6J6j6J6k4L2l3M1n0N8o8P8r2J06j21J41j60J80k04K31k61K92l27
33a73L67m10M54n05N63o24O90p64Q48r39J039j152J278j420J583j770J988k243
51a190K550k931L410m038M903o170Q214j2058K1738q8245k03489J55275K37417
64A15386O4039j31934j04708k281L5001O076K3248L3310j6040o2098R366R2653
76F2018L0944j20715j22283N0271J72533Q4845p6872j23103n3679N610L8472R0693
88C8734J03064k1213j70961j25081Q9286J81463K7483j43589q6658R3038J21023
99A06589l5850j36545n0569P7102Q6747K6452o834l6833q7985p3325N0740J50187
111F9876P7482q6961j31354j7679P5179L5599k5207J00L9054j944n1419j4510
$$ y = [0, 0, 0, 0, 0, 0, 0, 0, 0, 0, 8, -8, 8, -8, 8, -16, 16, -17, 24, -26, 32, -36, 42, -50, 56, -65, 76, -84, 96, -108, 123, -138, 154, -173, 194, -216, 238, -267, 296, -328, 362, -402, 446, -493, 546, -606, 672, -748, 835, -935, 1053, -1190, 1360, -1571, 1839, -2199, 2704, -3466, 4748, -7310, 14428, -73817, -277306, -122031, 115386, 179425, 47491, -57217, -59498, -24497, -18421, 4827, 38137, 22097, -40001, -30635, 62018, 92962, -27753, -150036, -99765, 72768, 157613, 80741, -42362, -96041, -90431, -51959, 38734, 141798, 120585, -50376, -175457, -86171, 95292, 122775, -20814, -107472, -14434, 106589, 70739, -65806, -116375, -39273, 47474, 73926, 67092, 30259, -57726, -131051, -80311, 69876, 147358, 60397, -70957, -88636, -13457, 22142, -3065, -2965, 36089, 34145, -17274, -31784]
123c1784M1383L950o5332j8743J08486J10224o5186j86442p1365J31695J55564
134A12450K129j04171o1883J3519K2158L674J7388K2955j3205l1429J6100M5159
146D4844k2789r2430k7370J01865J09787k0849j14193o4525K8408M7376K0211
157A0335K9282L3862l4982j02520m1304R0751J03223k8577j09096k1667R6840
168B6147O6747o7801j11088r671R4289Q2665M111n3462p4344n7612J8354J07718
180B6053R6581l2080j29922p1264O5488R7857J545o7624k2288M0405K4772j9409
192A0114j5307K543j9602l0911L2237R7343M0177j04184j44355k596J48802J22102
204A36363l3719j22754p2644K3975O8085N1406M716m5075n8296l461P0468N7611
$$ y = [-31784, 9599, 13549, -51783, -70526, 37960, 148184, 82998, -103444, -174809, -43114, 112450, 114579, 10408, -51475, -37956, -15798, -12124, 5264, 28219, 15014, -16415, -315, 44844, 22055, -70375, -97745, 4120, 113907, 93058, -21135, -85660, -57252, -9876, 10335, 39617, 73479, 38497, -64023, -105327, -14576, 88647, 60070, -49026, -70693, 26147, 92894, 25093, -85995, -95666, -1377, 81288, 85399, 31937, -42407, -100019, -81665, 26053, 122634, 90554, -39368, -110632, -45144, 52713, 54258, -13366, -35654, 4751, 29523, 10114, -5193, -2650, -22252, -53163, -20926, 76417, 116594, 12410, -131945, -134541, 14261, 136363, 102644, -20110, -92754, -68779, -694, 50712, 55428, 10353, -47943, -51404, 19064, 76675]
216G6675m7948j05130j7965J05221R7055k7802j06000o1263K5074N8067M4556
227D0540K6194r791p0067q0383J1122J09834P7290n3054j06935k1498P8802O3851
239F5905l0465p3582k3509M3947N8446K4786k6851p0968o0192K5369J06946P4371
251A14203m9156j17328m7927O4634Q2698M654m8090k2417J3454M212p514R046
263D69J4255j6714k9907J6029N9320K0574o6548p9827J1246R3804O4194k9880
275E7015p5741m3209J3223M7166M3830O075m1441m8893L577N5490L3581m2995
287G678o3727J0238P9028M1478m9605p3475j2759M6431M2464Q228j0643j8202
299G134l1205k5114K4019N9030K1469m6248n1831R488N1042K0565l3734l9842
$$ y = [76675, 28727, -76403, -94368, 10853, 107908, 80106, -25894, -87157, -62083, -4016, 40540, 66734, 56943, -13124, -93507, -82385, 27449, 104739, 51685, -55250, -76748, 2054, 65905, 35440, -38142, -61651, -17704, 40742, 65528, 38677, -32291, -92483, -67114, 39832, 114203, 65047, -52281, -100208, -35574, 47124, 51778, 3688, -18729, -5275, -1063, -8577, 469, 14724, -1990, -31897, -15868, 43452, 64026, -2522, -82349, -71103, 22701, 86895, 57015, -18726, -61935, -48712, -1546, 42284, 48359, 6918, -41975, -38398, 17092, 50673, 7678, -56049, -45811, 33217, 74695, 25090, -48385, -61144, -14713, 27751, 35979, 25336, 7134, -24071, -49185, -25166, 33864, 55333, 9085, -42746, -33258, 17784, 38349, 4615, -35227]
311c5227L201L9388L2963j458l6888m9860j5914N1395P8933J3797p7552q1929
323g9151J0539Q5600N3686l5011o6007j3350L8360L1375m735k1281j7964p732
335b5671J3693L7259K4749k7515o4331k9247M9639P7592J8040n8148o7062j1884
347f2886M3272N6855K1446l3714o0355k5451M3614O8204Q736o8611o3497K6541
359d5846Q6481L8145n4641p7201j4999N1958N8492J3936l2300m7767k9371J4070
371c9043N3266M4215j5981o3325l7214K9932N7308J9319l5328m6572q525L5512
383f436M3063R949l7383n5922j5632N4506P3974M990p6241p1668J5753Q0462N1176
396G0591k9980o5798k5900L0265M1187J3370j7943l1273j7534J6152L8206J9358
$$ y = [-35227, -32026, 7362, 40325, 38867, 1979, -47881, -63795, -12400, 66533, 80330, 2778, -79151, -68612, 16988, 70674, 35663, -30344, -43694, -5334, 26041, 21306, 25, -17939, -25671, -11978, 25281, 50030, 22515, -41816, -71063, -21424, 56168, 74208, 16060, -51002, -62886, -19614, 37241, 58687, 24973, -35382, -60833, -17219, 50985, 59721, -8890, -72387, -45846, 40635, 78780, 24139, -53062, -68061, -16103, 42389, 56325, 24025, -23742, -53113, -39043, 14223, 58438, 42457, -20868, -58082, -28150, 29158, 48477, 13149, -33423, -41948, -6436, 36627, 46576, 9193, -46729, -62361, -7855, 66119, 71109, -5132, -76800, -61047, 19415, 70591, 40611, -25187, -51087, -20822, 20365, 33735, 15792, -15481, -33015, -16863, 21343, 40701]
408D0701k5717m7009j5906L6711N0134Q782l9185m4247q790L0633M3267J7225
420D6599k8648n0090j7062L8106N2252M036n1972m4688K0434N9128K3740l8573
432A3262n1157n895L9241L9857L102l2600l5055p153K5468L6613J2038k7033l8064
445b7376o360L0726L0501k278k7916k3356M599K7492K2383n236l0538k8986N837
458c0508M3603L6828j7156n7840l1587L1632N9411J9346m0661n1600m993M1457
470b068L7614k951l5385l0976L849L6208L1249q183m1190l0281J3663M4445K8390
483D4384j7448m4655k5157J7177L9553K6755j1185m1379l1731J2703M8264L1591
495D8872k1930n4116k5867L5949N7212J1440m7594n0865J080M9401M4796o069
$$ y = [40701, 14984, -32025, -47931, -11220, 38914, 47696, 8511, -35736, -44526, -13893, 29374, 46599, 17951, -32139, -49201, -11095, 41157, 45193, -6779, -51467, -31033, 28095, 51835, 13262, -37895, -43790, -4549, 35308, 38410, 5810, -29245, -36398, -10930, 25683, 37721, 10688, -27376, -33736, -3010, 27491, 25213, -2703, -26059, -21460, 6032, 28415, 23179, -7359, -36345, -30508, 13095, 49923, 32767, -25073, -56660, -25028, 34383, 53729, 13068, -38532, -43525, -2068, 35546, 32595, -2790, -33766, -29917, 6291, 37540, 29357, -11833, -42114, -28451, 15994, 44384, 26936, -17719, -42876, -25699, 13854, 40609, 29424, -11955, -43686, -30983, 17281, 48872, 26942, -27174, -53041, -17092, 40120, 51560, 3966, -46899, -45819, 3582, 48378, 42309]
507D2309m9184m0392Q487M6985L7784r334m6591l5016J3316M5512K7162j6594
519B4444l9361k2269J5488L6985K1930j5886l8674k3805J7259M5539K6759k5867
531B2542n2460k1697L4253N3464J3863l9399m9244o152M2192M1794j757l9545
543b146l5704N286M0270L1904j1468m1834k5808J6642M0013K1857j8997l8804
555a8789j8389J8869L5250J8495j5571l6312k1185J8108L9647J8350k3267m0855
567b5649j3459L0757M0870L531l7210l5371N466L8356L0974r909m0812k7244J5314
580b4386M0405K2526j7686l9571j8708K1809L7059J1410k4115l0405p030K2375
592f317K7987M932k2444k7463m483K4718L0370L982l0303l4009Q72L6290L2702
$$ y = [42309, -6875, -47267, -38780, 8205, 45989, 36655, -9936, -44952, -31636, 13876, 41038, 24444, -14917, -37186, -21698, 15287, 37217, 21331, -17343, -41148, -23889, 21650, 48409, 22542, -29918, -51615, -17362, 36102, 49965, 10566, -38678, -44830, -2638, 39156, 37399, -2146, -37850, -32564, 7706, 39610, 28142, -13692, -39500, -22858, 17155, 39012, 20015, -18789, -37178, -18309, 16941, 35436, 19865, -16447, -37632, -19524, 20123, 38473, 15206, -25649, -39108, -8351, 32519, 36050, -1160, -36531, -31065, 7291, 38265, 28356, -12456, -39700, -24386, 16019, 38545, 20859, -18712, -37420, -15611, 21448, 32858, 8743, -21662, -28692, -6317, 21670, 26602, 4158, -23305, -27788, -3070, 27300, 31282, 979, -33030, -32158, 4132, 36834]
605C6834o329l8797l0418J1239M0957K5603j6908l9720k0074K0192L9690J6088
617C8357k6560m0370q347L1042L7477L591l3631l4935K84L4150L1310j432l0731
630B05l1384l49L1862L2613j618l4561l1663M675L7939L0574j1225m1754k5741
643d0427J7113M2285K2693k0988m4437k0083K6267M4810J6183k9383m3914j2317
655d2198L2652M1391N689l3525l4630j233L1162L0711o87l1073k8716K463L1372
668C378K9351l562l5674l0975Q604L9786K7851j2842l9715k4983J5444L9190K1201
681C7054j7910l7046j7795K0027L6467J4291k5046l6691o818L0409L2847K89l1449
694a371k9655L828L1746K5341m872k8252k5221L214K8704K5798n467l0382k3100
$$ y = [36834, 30505, -8292, -38710, -27471, 13486, 39089, 22181, -17539, -37613, -17421, 22269, 38357, 11797, -28573, -36920, -5878, 31599, 35190, 1559, -33376, -33092, 1058, 32368, 30936, 205, -31179, -31528, 334, 32947, 31329, -3232, -34895, -30220, 7719, 38293, 27068, -14686, -40427, -23314, 18971, 41664, 20676, -23761, -43844, -17577, 27233, 43416, 14033, -29881, -42198, -9546, 31845, 37534, 4009, -30621, -31854, -692, 30019, 29332, -1741, -30457, -27994, 3378, 32729, 29167, -6507, -37482, -28878, 10908, 38759, 25917, -13798, -38781, -23337, 15853, 37054, 19144, -17902, -35697, -15670, 20797, 35088, 10042, -26649, -33467, -3058, 29789, 30078, -1371, -31026, -27198, 4548, 29889, 25017, -3235, -28456, -25242, 3462, 29260, 23793, -6589, -29689]
707b9689Q783L1445J9705j4250l2511j2832J8711K9468R939k0134l0767q532K3649
720g015L2853N729k8121l2243k194L1473L0022m768l2255k2355R590K8303J7222
733B6241j1143k7203j4374J3521K7563J3151j5470l1230j2890K1178L4695Q669
$$ y = [-29689, -20906, 10539, 30244, 15994, -16517, -29349, -10638, 18830, 28769, 8635, -22132, -30664, -7015, 25838, 31567, 3446, -28797, -30991, 482, 30504, 25736, -6519, -28874, -19284, 9019, 26241, 15098, -12105, -26479, -12958, 14605, 27756, 12286, -18944, -31834, -10656, 24039, 32708]
$$ [...]
8191d02
##END NTUPLES=NMR FID
##END=
