##TITLE=1H_CG-1101
 DMSO, 8 sc, 
 4.4.2019
##JCAMPDX= 6.0         $$ Bruker NMR JCAMP-DX V2.0
##DATA TYPE= NMR FID
##DATA CLASS= NTUPLES
##ORIGIN= UXNMR, Bruker Analytische Messtechnik GmbH
##OWNER= root
$$ XWIN-NMR		Version 3.5
$$ Thu Apr  4 14:26:30 2019 Russian Standard Time (UT+4h)  she@DPX200
##.OBSERVE FREQUENCY= 200.1316
##.OBSERVE NUCLEUS= ^1H
##.DELAY= (6, 6)
##.ACQUISITION MODE= SIMULTANEOUS
##.ACQUISITION SCHEME= undefined
##.AVERAGES= 8
##.DIGITISER RES= 18
##SPECTROMETER/DATA SYSTEM= spect
##.PULSE SEQUENCE= zg30
##.SOLVENT NAME= CDCl3
##.SHIFT REFERENCE= (INTERNAL, CDCl3, 0, 15.7039)
##AUDIT TRAIL= $$ (NUMBER, WHEN, WHO, WHERE, WHAT)
$$ ##TITLE= Audit trail, XWIN-NMR		Version 3.5
$$ ##JCAMPDX= 5.01
$$ ##ORIGIN= Bruker BioSpin GmbH
$$ ##OWNER= she
$$ F:/spectra/data/she/nmr/H-F/1/audita.txt
$$ ##AUDIT TRAIL=  $$ (NUMBER, WHEN, WHO, WHERE, WHAT)
(   1,<2019-04-04 14:25:20.17 +0400>,<she>,<DPX200>,
      <created by zg, POWCHK disabled, PULCHK disabled
       configuration hash MD5:
       00 E9 B6 7A A2 85 ED C7 34 08 36 98 17 FE 4E 26
       data hash MD5: 16K
       4A 90 43 B4 19 15 16 D9 04 5C BA 52 28 9A 30 5D>)
$$ ##END=
$$ 
$$ hash MD5
$$ 58 47 27 37 08 81 FA 57 B3 2D BA 56 7E 98 1B 8B
##$RELAX= 
##$RELAX= 
##$RELAX= 
##$RELAX= 
##$RELAX= 
##$RELAX= 
$$ Bruker specific parameters
$$ --------------------------
##$DU= <F:/spectra>
##$EXPNO= 1
##$NAME= <H-F>
##$PROCNO= 1
##$TYPE= <nmr>
##$USER= <she>
##$AMP= (0..31)
100 100 100 100 100 100 100 100 100 100 100 100 100 100 100 100 100 100 
100 100 100 100 100 100 100 100 100 100 100 100 100 100 
##$AQSEQ= 0
##$AQ_mod= 1
##$AUNM= <au_zg>
##$AUTOPOS= <>
##$BF1= 200.13
##$BF2= 200.13
##$BF3= 200.13
##$BF4= 200.13
##$BF5= 200.13
##$BF6= 200.13
##$BF7= 200.13
##$BF8= 200.13
##$BYTORDA= 1
##$CFDGTYP= 0
##$CFRGTYP= 5
##$CHEMSTR= <none>
##$CNST= (0..31)
1 1 145 1 1 1 1 1 1 1 1 1 1 1 1 1 1 1 1 1 1 1 1 1 1 1 1 1 1 1 1 1 
##$CPDPRG= <>
##$CPDPRG1= <>
##$CPDPRG2= <>
##$CPDPRG3= <>
##$CPDPRG4= <mlev>
##$CPDPRG5= <mlev>
##$CPDPRG6= <mlev>
##$CPDPRG7= <mlev>
##$CPDPRG8= <mlev>
##$CPDPRGB= <>
##$CPDPRGT= <>
##$D= (0..31)
0 1.2 0 0 0 0 0 0 0 0 0 0.03 0 0 0 0 0 0 0 0 0 0 0 0 0 0 0 0 0 0 0 0 
##$DATE= 1554373519
##$DBL= (0..7)
120 120 120 120 120 120 120 120 
##$DBP= (0..7)
150 150 150 150 150 150 150 150 
##$DBP07= 0
##$DBPNAM0= <>
##$DBPNAM1= <>
##$DBPNAM2= <>
##$DBPNAM3= <>
##$DBPNAM4= <>
##$DBPNAM5= <>
##$DBPNAM6= <>
##$DBPNAM7= <>
##$DBPOAL= (0..7)
0.5 0.5 0.5 0.5 0.5 0.5 0.5 0.5 
##$DBPOFFS= (0..7)
0 0 0 0 0 0 0 0 
##$DE= 6
##$DECBNUC= <off>
##$DECIM= 24
##$DECNUC= <off>
##$DECSTAT= 4
##$DIGMOD= 1
##$DIGTYP= 9
##$DL= (0..7)
0 120 120 120 120 120 120 120 
##$DP= (0..7)
150 150 150 150 150 150 150 150 
##$DP07= 0
##$DPNAME0= <>
##$DPNAME1= <>
##$DPNAME2= <>
##$DPNAME3= <>
##$DPNAME4= <>
##$DPNAME5= <>
##$DPNAME6= <>
##$DPNAME7= <>
##$DPOAL= (0..7)
0.5 0.5 0.5 0.5 0.5 0.5 0.5 0.5 
##$DPOFFS= (0..7)
0 0 0 0 0 0 0 0 
##$DQDMODE= 0
##$DR= 18
##$DS= 0
##$DSLIST= <SSSSSSSSSSSSSSS>
##$DSPFIRM= 0
$$ [...]
##$SUBNAM2= <"">
##$SUBNAM3= <"">
##$SUBNAM4= <"">
##$SUBNAM5= <"">
##$SUBNAM6= <"">
##$SUBNAM7= <"">
##$SUBNAM8= <"">
##$SUBNAM9= <"">
##$SW= 24.9336934301222
##$SWIBOX= (0..15)
0 0 2 0 0 0 0 0 0 0 0 0 0 0 0 0 
##$SW_h= 4990.01996007984
##$TD= 16384
##$TD0= 1
##$TE= 0
##$TE2= 300
##$TE3= 300
##$TEG= 300
##$TL= (0..7)
0 120 120 120 120 120 120 120 
##$TP= (0..7)
150 150 150 150 150 150 150 150 
##$TP07= 0
##$TPNAME0= <>
##$TPNAME1= <>
##$TPNAME2= <>
##$TPNAME3= <>
##$TPNAME4= <>
##$TPNAME5= <>
##$TPNAME6= <>
##$TPNAME7= <>
##$TPOAL= (0..7)
0.5 0.5 0.5 0.5 0.5 0.5 0.5 0.5 
##$TPOFFS= (0..7)
0 0 0 0 0 0 0 0 
##$TUNHIN= 0
##$TUNHOUT= 0
##$TUNXOUT= 0
##$USERA1= <user>
##$USERA2= <user>
##$USERA3= <user>
##$USERA4= <user>
##$USERA5= <user>
##$V9= 5
##$VALIST= <valist>
##$VCLIST= <CCCCCCCCCCCCCCC>
##$VD= 0
##$VDLIST= <DDDDDDDDDDDDDDD>
##$VPLIST= <PPPPPPPPPPPPPPP>
##$VTLIST= <TTTTTTTTTTTTTTT>
##$WBST= 1024
##$WBSW= 4
##$XGAIN= (0..3)
0 0 0 0 
##$XL= 0
##$YL= 0
##$YMAX_a= 131806
##$YMIN_a= -169108
##$ZGOPTNS= <>
##$ZL1= 120
##$ZL2= 120
##$ZL3= 120
##$ZL4= 120
##$ABSF1= 10
##$ABSF2= 0
##$ABSG= 5
##$ABSL= 3
##$ALPHA= 0
##$AQORDER= 0
##$ASSFAC= 0
##$ASSFACI= 0
##$ASSFACX= 0
##$ASSWID= 0
##$AUNMP= <proc_1d>
##$AZFE= 0.1
##$AZFW= 0.1
##$BCFW= 1
##$BC_mod= 2
##$BYTORDP= 1
##$COROFFS= 0
##$CY= 11.3945322036743
##$DATMOD= 1
##$DC= 2
##$DFILT= <>
##$DTYPP= 0
##$F1P= 18.9103706918063
##$F2P= -1.10871071338519
##$FCOR= 0.5
##$FTSIZE= 0
##$FT_mod= 4
##$GAMMA= 1
##$GB= 0.15
##$INTBC= 1
##$INTSCL= 1
##$ISEN= 128
##$LB= 0.24
##$LEV0= 0
##$LPBIN= 0
##$MAXI= 10000
##$MC2= 0
##$MEAN= 0
##$ME_mod= 0
##$MI= 1.114404
##$NCOEF= 0
##$NC_proc= 0
##$NLEV= 6
##$NOISF1= 3.799351
##$NOISF2= 2.8
##$NSP= 1
##$NTH_PI= 0
##$NZP= 0
##$OFFSET= 15.70392
##$PC= 1
##$PHC0= -8855.262
##$PHC1= 14.00025
##$PH_mod= 1
##$PKNL= yes
##$PPARMOD= 0
##$PSCAL= 0
##$PSIGN= 0
##$REVERSE= no
##$SF= 200.130013532006
##$SI= 16384
##$SIGF1= 3
##$SIGF2= 2
##$SINO= 400
##$SIOLD= 16384
##$SREGLST= <1H.CDCl3>
##$SSB= 0
##$STSI= 0
##$STSR= 0
##$SW_p= 3612.71676300578
##$SYMM= 0
##$S_DEV= 0
##$TDeff= 0
##$TDoff= 0
##$TI= <>
##$TILT= no
##$TM1= 0
##$TM2= 0
##$TOPLEV= 0
##$USERP1= <user>
##$USERP2= <user>
##$USERP3= <user>
##$USERP4= <user>
##$USERP5= <user>
##$WDW= 1
##$XDIM= 8192
##$YMAX_p= 0
##$YMIN_p= 0
$$ End of Bruker specific parameters
$$ ---------------------------------
##NTUPLES= NMR FID
##VAR_NAME=  TIME,          FID/REAL,        FID/IMAG
##SYMBOL=    X,             R,               I
##VAR_TYPE=  INDEPENDENT,   DEPENDENT,       DEPENDENT
##VAR_FORM=  AFFN,          ASDF,            ASDF
##VAR_DIM=   8192,          8192,            8192
##UNITS=     SECONDS,       ARBITRARY UNITS, ARBITRARY UNITS
##FACTOR=    0.0002004,     1,               1
##FIRST=     0,             0,               0
##LAST=      1.6414764,     0,               0
##MIN=       0,             -169108,         0
##MAX=       1.6414764,     131806,          0
$$ Real data points
##PAGE= N=1
##DATA TABLE= (X++(R..R)), XYDATA
0@%%%%%%%qJ6j6J6k4L2l2M0n6O4p2Q8j05J24j47J71j98K29k61K99l41L86m39M96
31B62n57O25p00P82q72R72j079J198j329J475j634J806k001K218k458K728l035
48a599L386l791M265m831N516o366P460q924J0997j4191J9815l2668J17136K9144
62A25349j30634P8366N8725n1346j32638q956P7361L0816r2334o0588O0962J00772
74E5855j8300r0590j2844R8169M8158p4779p7355M6548P9650k3510r7063j8771
86h4832Q2841N5947n9618p3986L8653R9477M934q5136k2312Q7250N9404o1860
98D0762p9972L6964R3973j967r2083k8653P6620N4892n4233p1620K9073Q4615
110H8371l03q6550l4093P0204N6060n0444p7814J4400P6588O854p9131l7169O3243
$$ plain form
0 0 0 0 0 0 0 0 0 -8 8 -8 8 -16 16 -16 24 -32 32 -40 48 -57 67 -80 91 -107 122 -139 160 -181 205 -234 262
31 262 -295 330 -370 412 -460 512 -567 631 -698 777 -857 949 -1052 1166 -1292 1436 -1599
48 -1599 1787 -2004 2261 -2570 2946 -3420 4040 -4884 6113 -8078 11737 -20931 96205 125349
62 125349 -5285 73081 131806 80460 -52178 -61134 16227 47043 -45291 -105879 -44917 55855
74 55855 37555 -53035 -65879 32290 80448 5669 -71686 -25138 54512 31002 -66061 -84832
86 -84832 -1991 53956 -5662 -79648 -40995 58482 63416 -21720 -44032 43218 102622 40762
98 40762 -39210 -2246 91727 89760 -2323 -30976 45644 100536 46303 -25317 3756 88371
110 88371 88068 1518 -32575 37629 93689 43245 -34569 -20169 56419 63273 -15858 -53027 10216
123A0216N5366m5101p3858J2264P6053J6426p0426m3989N3415O0386l4090p1408
135e4746J0311P6957J9807o8701m2748N6930O4856k9004o7597Q470P0011J8467
147F3013n9200l8014M8235N6922k8755o5531M917O1994J6914n2574l7022L4850
159E749M7918j9719n7320k367N5423K0578m7710l9489L0903N0081j2301n2945
171b1199m121N1596K1413m0541l5683K8294M8920p490n2911r898N0241K5131m1679
184A2073l6072K9296M2074j4771m7224l994M4336J8736l7044l2415K1676L6744
196C3415q526m0250o933L7861J8008l3674k9570K2982L5444r382l4962n232L1333
209A0514J8208k3770k5339J7783L2508n094l2941m968L3148J8111k3550k4626
$$ plain form
123 10216 65582 20481 -53377 -41113 34940 51366 -19060 -63049 -9634 50752 16662 -54746
135 -54746 -44435 32522 52329 -16372 -59120 -2190 62666 33662 -33935 -25465 44546 63013
147 63013 3813 -34201 14034 70956 42201 -23330 -18413 43581 60495 7921 -29101 5749
159 5749 53667 33948 -23372 -25739 29684 50262 2552 -36937 -6034 44047 31746 -21199
171 -21199 -25320 26276 47689 7148 -28535 -241 48679 41189 -11722 -21620 28621 53752 12073
184 12073 -23999 5297 47371 32600 -14624 -18618 25718 44454 7410 -25005 -3329 33415
196 33415 24889 -15361 -22294 15567 33575 -99 -29669 -6687 28757 19375 -15587 -20819 10514
209 10514 28722 4952 -20387 -2604 29904 24810 -8131 -13099 20049 38160 14610 -10016
221a0016J7374L0592p278k9276p20K8779J1460k3848k0659J7009K5917q710k7110
234C514m55K4225O125k1708j4867J4520J9013r832k4780q88K1533N410k1255j3518
248a2963J2856J5831j0204k2096K517K1810M123k0873j1141J5939J7222q137j9043
261a4159M135K3800M123k1196p344K1694J6978j3223j8866Q041K4172P12k2969
274E898m700K2080J1310j7840j7059J0829K0521l256k3599n780K0637J0652j9231
287A0462j7643J1360K0394o426k5630m064K2967R956k1369j7361J2854J9844n930
300I414k3287m192K3151J2965k0655k0970J5270K6401n830k7053k372K7648J2499
313B2989k2898j9145J9055K5837q331k6968j522K6836J4299k2347k2068J7077
$$ plain form
221 -10016 7358 37950 30672 1396 676 29455 40915 17067 -3592 13417 39334 30624 3514
234 3514 3059 27284 33409 11701 -3166 11354 30367 20535 -4245 -5133 16400 21810 555 -12963
248 -12963 -107 15724 5520 -16576 -14059 7751 11874 -8999 -20140 -4201 13021 4884 -14159
261 -14159 -10024 13776 17899 -3297 -10641 11053 28031 14808 -4058 3983 28155 28867 5898
274 5898 1198 23278 34588 16748 -311 10518 31039 27783 4184 -1596 19041 29693 10462
287 10462 -7181 4179 24573 18147 -7483 -11547 11420 21376 7 -17354 -4500 15344 9414
300 9414 -13873 -18065 5086 18051 -2604 -23574 -8304 18097 12267 -14786 -17158 10490 22989
313 22989 91 -19054 1 25838 17507 -9461 -10983 15853 30152 7805 -14263 2814
325B814K9013q274l1658j132L0621J2289k6115k2281J7120K8593q685l2244l741
338a3680K9385J3380k5925k5741J5992L1865p237l6750n834L3445J6067k8319
350c352k6056J8301L3128o386l6380n894L5432J8386k7520k7512J8035L5534m225
363B1491l6412p931L6083K0663k8266k8768J7981L5852l657l6568r392L3865K2240
376C7181k6011l1116J4946L6487j807l7435j3175L2701K5224k6054l5060J2807
388a1312L7619o86l8920j5101L2640K5688k5245l6512J1846L9342J503l9143j6332
401c4613L2626K8003k3042l6488J0630M1313L854l9097j6593L3220K9910k0808
413H915l6494Q998M1572O643l7606j8292L1929L1094j8732l7744N851M0831R526
$$ plain form
325 2814 31827 23553 -8105 -9237 21384 33673 7558 -14723 2397 30990 22305 -9939 -13680
338 -13680 15705 29085 3160 -22581 -6589 25276 18039 -18711 -24545 8900 24967 -3352
350 -3352 -29408 -11107 22021 15635 -20745 -26639 8793 27179 -341 -27853 -9818 25716 21491
363 21491 -14921 -22852 13231 33894 5628 -23140 -5159 30693 27036 -9532 -18924 14941 37181
376 37181 11170 -19946 -5000 31487 29680 -7755 -20930 11771 36995 10941 -24119 -11312
388 -11312 26307 25621 -13299 -28400 4240 29928 4683 -31829 -19983 19359 20862 -18281 -34613
401 -34613 -1987 26016 2974 -33514 -22884 18429 22283 -16814 -33407 -187 29723 8915
413 8915 -27579 -18581 22991 29634 -7972 -26264 5665 36759 18027 -19717 -13866 26965 36491
426C6491l7780k1950K9633L2039j8504l8880L182L9532J0123l7804k4766K7570
438a114L2301j6917l9409M62L8025J2605l5653k6384K5497L4475j4265l9397p61
451c0535L8496J4240l2812k6289K3821L5167j1109l7734j982L7282J7013l0158
463d600k6904K1739L6180p884l7846l346L7573J7327k9087k6771J9659L5213o349
476B4904l7705n851L5313J7793k8360k7910J6933L3615n263l7518q658L3768J8408
489B9469k7666k8536J5334L3203m211l5625r855L1746J9773k5374k8733J4329
501a6146L2507j699l3488j0719K9974K1430k2507k8749J3183L3000k13l2137j1230
514b6794K8979K2009k0323k8146J0936L2187N47l0909j1104K6326K1988j8669
$$ plain form
426 36491 -1289 -23239 6394 38433 19929 -18951 -15769 23763 33886 -3918 -28684 -1114
438 -1114 31187 14270 -25139 -24677 13348 25953 -9700 -36084 -10587 23888 9623 -29774 -30535
451 -30535 7961 22201 -10611 -36900 -13079 22088 10979 -26755 -28737 8545 25558 -4600
463 -4600 -31504 -9765 26415 18531 -19315 -22661 14912 32239 3152 -23619 -3960 31253 24904
476 24904 -12801 -18652 16661 34454 6094 -21816 -4883 28732 23469 -14049 -22707 11061 29469
489 29469 1803 -26733 -11399 21804 17593 -18032 -27887 3859 23632 -1742 -30475 -16146
501 -16146 16361 14662 -18826 -29545 429 21859 -648 -29397 -16214 16786 16573 -15564 -26794
514 -26794 2185 24194 3871 -24275 -13339 18848 19395 -11514 -22618 3708 25696 7027
526G027k8906R266L1351J645l0275j1525K5006K0543j7306k7038Q181K9832K321
539B0122k8629j1861K3025K0708j5495k6959O602K8426L210k7529j2631K1900
551H89J9786j5015k5424M701K6941L663k6426j2811K0934J8740j4227k4293M394
564a8148K5520M116k4714j2934K0032J8841j2673k3559M221K5095M892k3062j2549
577b4922J9126J9801j1858k2450M596K4145N218k1339j2002J8043J9411j0892
589F877k1532L728K3672N281k0767j2618J7365J8675j0522k2269L679K2731L798
602A8098k0593j2234J5891J6865j0455k2008K518K1019L509k0865j1901J4928
614e228J5666j0024k1825K616K0628L031k0428j0016J4985J4941r634j8463L330
$$ plain form
526 7027 -21879 -12613 18738 20383 -9892 -21417 3589 24132 6826 -20212 -12031 17801 20122
539 20122 -8507 -20368 2657 23365 7870 -19089 -12487 15939 19149 -8380 -21011 889
551 889 20675 5660 -19764 -15063 11878 15541 -10885 -23696 -2762 15978 1751 -22542 -18148
564 -18148 7372 11488 -13226 -26160 -6128 12713 40 -23519 -19298 5797 10689 -12373 -24922
577 -24922 -5796 14005 2147 -20303 -15707 8438 13656 -7683 -19685 -1642 17769 6877
589 6877 -14655 -10927 12745 18026 -2741 -15359 2006 20681 10159 -12110 -8431 14300 18098
602 18098 -2495 -14729 1162 18027 7572 -14436 -11918 9101 12610 -8255 -20156 -5228
614 -5228 10438 414 -21411 -18795 1833 4864 -15564 -25580 -10595 4346 -5288 -23751 -20421
627b0421J9896N217j8350r664J5887J6715q406j8064L722K1450M906j8091q551
640a3754J6483J5307r377j6564L408J8762M985j7847j0452J4819J5603j0121j8934
653g682K972J8888K985j8896j0723J4348J3853j1138j8480L010J7614K798j8526
666h977j0862J3716J5262j0095j9354K914J9196K897j8298r251J4871J5018r967
679b930j7454L979J9512L295j7197q694J4651J5786q538j7963M312K0601L633
692A2993j8067p932J5582J4700q582j7412L437J9419L393j7899r063J4539J3726
705A8834r183j8006J889J8174L360j8738j0173J3774J3400r448j8280J530J8478
718E611L436j8355j0731J4091J4469q736j7602J660J8874M941j7740j0802J4886
$$ plain form
627 -20421 -525 4692 -13658 -23322 -7435 9280 874 -17190 -13468 7982 12888 -5203 -13754
640 -13754 2729 18036 8659 -7905 -4497 14265 19250 1403 -9049 5770 21373 11252 -7682
653 -7682 -4710 14178 17163 -1733 -12456 1892 15745 4607 -13873 -10863 6751 9549 -8977
666 -8977 -19839 -6123 9139 -956 -20310 -17396 1800 4697 -13601 -22852 -7981 7037 -2930
679 -2930 -20384 -16405 3107 6402 -10795 -19489 -4838 10948 2410 -15553 -11241 9360 12993
692 12993 -5074 -13006 2576 17276 8694 -8718 -5281 14138 17531 -368 -9431 5108 18834
705 18834 9651 -8355 -6466 11708 15068 -3670 -13843 -69 13331 3883 -14397 -12867 5611
718 5611 9047 -9308 -20039 -5948 8521 -215 -17817 -16157 2717 7658 -10082 -20884 -5998
731e998J5771q850j8341K499J9539N149j7610j0825J4719J6055q511j8688K690
744a2401K0111M551j7453j0883J3834J6595q223j8524J735J9293N311j7021j1577
757a4652J3293J6222p344j9265Q98J9522M945j7092j1350J2584J5478o961j9002
770a2724K18J8558N591j6744j2625J2275J6071p016j8851k63J8953O285j7010
783g282j1696J1992J6174n925j8152o04J8601P587j6284j2093J2272J6655n599
796E646j8937n77J8948P907j5775j3023J1328J6926n133j8531j651J8726Q344
809A4198j6079j3665J1587J7960n703j8267j167J7871Q089j5207j3636J0522J7492
822A3995m443j9266j835J7916P530j4544j3712R594J6879m603j8455k152J6671
$$ plain form
731 -5998 9773 923 -17418 -14919 4620 9769 -7841 -18666 -3947 12108 3597 -15091 -12401
744 -12401 7710 12261 -5192 -16075 -2241 14354 6131 -12393 -10658 8635 13946 -3075 -14652
757 -14652 -1359 14863 7519 -11746 -10848 8674 13619 -3473 -14823 -2239 13239 6278 -12724
770 -12724 -12506 6052 11643 -5101 -17726 -5451 10620 3604 -15247 -15510 3443 9728 -7282
783 -7282 -18978 -6986 9188 3263 -14889 -15493 3108 10695 -5589 -17682 -5410 11245 5646
796 5646 -13291 -13868 5080 12987 -2788 -15811 -4483 12443 7310 -11221 -12872 5854 14198
809 14198 -1881 -15546 -3959 14001 8298 -9969 -11136 6735 14824 -383 -14019 -3497 13995
822 13995 9552 -9714 -11549 6367 13897 -647 -14359 -4765 12114 7511 -10944 -13096 3575
835C575P627j3253j3819Q459J6983l034j8561k913J7147Q758j3963j3089Q726
848g357J6788k487j7417l533J6720R546j2845j3057P806J6679j195j7370m211
861a1933J6815R845j3440j3626Q406J6611k000j7208m563J6106R280j2790j3751
874a2248P282J6457j630j7187n062J5722J0473j2868j4513P101J7290k458j6990
887h631m321J5027R622j2013j4059P109J6202j827j6441m853J5091J0482j1554
900a66j4663P183J6547j272j6547l763J4659R872j0671j3237N738J6327J55j6200
914f038n263J4246J0401j0745j3750N593J6028o15j5823n086J4091R643j0471
927B211j3429M583J5341P99j5764o264J3724J0272j0613j3994N306J5303M57j5635
$$ plain form
835 3575 11202 -2051 -15870 -7411 9572 6538 -12023 -14936 2211 10969 -2994 -16083 -7357
848 -7357 9431 6944 -10473 -14006 2714 12260 -585 -13642 -5836 10843 9648 -7722 -11933
861 -11933 4882 14727 1287 -12339 -3933 12678 10678 -6530 -11093 5013 14293 1503 -12248
874 -12248 -4966 11491 9861 -7326 -12388 3334 13807 939 -13574 -6473 10817 8359 -8631
887 -8631 -12952 2075 11697 -316 -14375 -7266 8936 7109 -9332 -14185 906 11388 -166
900 -166 -14829 -7646 8901 7629 -8918 -12681 1978 11850 1179 -12058 -6320 10007 10162 -6038
914 -6038 -11301 2945 13346 2601 -11149 -5556 10472 9857 -5966 -11052 3039 12682 2211
927 2211 -11218 -6635 8706 9505 -6259 -12523 1201 11473 860 -13134 -7828 7475 7932 -7703
941g703o127J3610J0533r709j4188N152J5519J123j5187n930J3295J1417r413
954B392j4372N165J6042L16j4825n694J2987J0969r331j3972M734J5676N46j4640
968d007o469J2608J0747q788j3932L692J5739Q00j4960o473J2174J0231q234j3871
982a0743L021J5226J240j4775o530J1587J0350p735j3606K550J4922K184j4415
995f724o525J1693J0475p399j2864L024J4641K473j3612o885J1576J1150o774
1008D249j3541K974J4450K764j3363p168J1510J1456p319j3967K662J4849K502
1021A2058j3236p925J1482J1060p604j3982K479J4475K228j3560q303J0335J1100
1034A0607p277j3635J675J3948K224j2936p792J0243J1049o377j3693K013J4054
$$ plain form
941 -7703 -13830 -220 10313 604 -13584 -8432 7087 8210 -6977 -12907 388 11805 2392
954 2392 -11980 -6815 9227 9543 -5282 -10976 2011 12980 3649 -10323 -5589 10087 10633 -4007
968 -4007 -10476 2132 12879 4091 -9841 -6149 9590 10390 -4570 -11043 1131 11362 3128 -10743
982 -10743 -7722 7504 8744 -6031 -12561 -974 9376 1641 -11965 -9415 5507 7691 -6724
995 -6724 -13249 -1556 8919 1520 -11344 -8320 6321 8794 -4818 -11703 -127 11023 4249
1008 4249 -9292 -6318 8132 10896 -2467 -9635 1875 13331 6012 -7955 -5293 9556 12058
1021 12058 -1178 -9103 2379 13439 5835 -8147 -5668 8807 11035 -2525 -10828 -493 10607
1034 10607 3330 -10305 -8630 5318 7542 -5394 -13186 -2943 8106 1729 -11964 -9951 4103
1047D103K594j2352p248R814J1290n246j3544J482J4260L782j2519o962R364J1387
1061A0205n269j2570R21J4013L822j2391p761R827J1369m815j3101N60J3393M056
1075A2259j2432p587R179J0851n549j2985K92J2585M695j2471q683Q853J1435
1088A0442n796j3326K34J2969L949j2088q575Q767J1192n402j2655J96J2653M439
1102F999j1312q766Q914J1927n262j2894Q87J2981M566j0715p891Q456J1316m190
1116E016j2078L03J2917M301j0147q016Q008J1177l746j2801p5J2637M504j0881
1130A119p941P309J0808l612j2385j131J2314M466j0841q276O817J0340l335j2455
1144f803j645J2077M640j0743q932P373J0417l355j2395j274J2008N424j0720
$$ plain form
1047 4103 6697 -5655 -12903 -3089 8201 2955 -10589 -9107 5153 8935 -3584 -10546 -1182 10205
1061 10205 4936 -7634 -6713 7300 11122 -1269 -9030 797 12166 7351 -5750 -5190 8203 12259
1075 12259 -173 -7760 1419 12270 6721 -6264 -5972 6613 11308 -1163 -9846 -993 10442
1088 10442 4646 -8680 -8446 4523 8472 -3616 -12191 -3424 7768 2366 -10289 -10093 2560 6999
1102 6999 -4313 -13079 -4165 7762 2500 -10394 -9507 3474 8040 -2675 -10566 -2110 9206 5016
1116 5016 -7062 -6759 6158 10459 312 -7704 304 11481 7735 -5066 -5141 7496 12000 1119
1130 1119 -6822 487 11295 7683 -4702 -5833 6481 10947 106 -8170 -1353 8987 5652 -6803
1144 -6803 -8448 3629 8269 -2474 -11406 -4033 6384 3029 -9366 -10640 1368 6792 -3928
1157c928q846P795J0714k946j1720j139J2063N678r882q525P527J1327l027j1521
1171f430r81J1747N362r053q451P038J1167l016j1537j374J1594N390r700q677
1185f921O208J1209k960j1966j331J0789N053r118r227N661J0819k476j2284j844
1199h388J1003M859q749r247N497J0807k386j1638k348J0611O181r136q498N005
1213f427J1291j558j1559k061J1240O022q728q173N463J0584o31j1397k223J0901
1227B744O450q208q868N661J0984j318j1024k481J0564O240q601q726N001J0821
1241I239j575j1030k819R763O624q264r457N081J0369j651j0899k599R399O169
1255H350p718r419M499J0773j672j0960l012R709O183p444r386M185J0721o86
$$ plain form
1157 -3928 -12774 -4979 5735 2789 -8931 -10070 1993 7671 -2211 -10736 -3209 8118 5091 -6430
1171 -6430 -7411 4336 9698 645 -7806 -768 10399 7383 -4154 -5528 6066 11456 1756 -6921
1185 -6921 -713 10496 7536 -4430 -5761 5028 10081 963 -8264 -2603 8216 5740 -6544 -8388
1199 -8388 2615 7474 -1275 -10522 -5025 5782 3396 -8242 -10590 21 6202 -2934 -11432 -6427
1213 -6427 4864 3306 -8253 -10314 926 6948 -1780 -9953 -4490 6094 5463 -5934 -8157 2744
1227 2744 9194 986 -7882 -2221 8763 7445 -3579 -6060 4504 10744 2143 -6583 -1582 9239
1241 9239 7664 -3366 -6185 3578 10202 1938 -7519 -2438 7931 6280 -4619 -7218 2181 8350
1255 8350 632 -8787 -4288 6485 4813 -6147 -9159 550 6733 -711 -10097 -5912 4809 4123
1269D123j0938k858R285O613p045q933M062J0757O1j0947l006R749P019p026q562
1284g646L688J0736O88j0686l507R766O703o726q944L822J0174N9j0410l504R209
1299C422O451o506r353L575R572L32j0529m059Q997O637p007r144L203J0048J
1314E640j0450l783Q337P003o503r384L228R959M11r865m266Q308P262n654r410
1329i167L135J0052N33r368l900Q144P178n107r084K448J0614R50r384m005Q139
1344A178P384n107q950K181J0262J561r737m691P784O921m988r165J525R457J434
1359G049r488m799P293O733n184q843J449R382J707r827m602P788O859m834q558
1374g875J310R432J695q822m883P359P423m547q699J947Q827K032q195m835P199
$$ plain form
1269 4123 -6815 -9673 -388 6225 -820 -9753 -5691 5066 5127 -5820 -8826 923 7942 916 -7646
1284 -7646 -3958 6778 7466 -3220 -6727 3039 9742 3016 -5928 -2106 8068 8127 -2283 -5787 3422
1299 3422 9873 3367 -5986 -2411 7161 7493 -3036 -7095 1902 8539 1532 -7612 -4409 5639 5640
1314 5640 -4810 -8593 -256 6747 244 -9140 -5912 4047 4458 -5407 -9673 -1365 5897 243 -9167
1329 -9167 -6032 4020 4553 -4815 -8715 -571 6607 1500 -7584 -5136 5478 6428 -2956 -6961 1178
1344 1178 8562 3455 -5495 -3314 6948 8509 -1228 -5919 1865 8786 3798 -5367 -3842 5615 7049
1359 7049 -2439 -7238 55 6788 1604 -7239 -5790 3592 5299 -4528 -9130 -1342 5517 683 -7875
1374 -7875 -6565 2867 4562 -4260 -9143 -1784 5639 1092 -7607 -5660 3167 5199 -2996 -7831 -632
1389f32P176m195q492J365R254K064q291m907O676P478m270q678J323R050J664
1404F585q080m423N770P226l833q965J307Q608K053q006n110O202O947l743q805
1419f267M31R187J554p952m738N694P250l561q544M28Q996K712q080n066O402
1434a554P029l074q080M37Q684K358p527m692N836P191l270p814K86Q223K313
1449F346p171n201N948O840l438q008J08P941K510p179m944N355O767k935p836
1464d897m7P819K859p061n428N283O944k727q050M4P914K320o538n219M934P122
1480E272k750p909J75P502K926o872m807M771P083k330q213J55Q228K633p263
1495a399m690M994O827k277p749k61P994K750o875n006M538O981k284p544q47
$$ plain form
1389 -632 6544 2349 -6143 -4778 4476 6540 -1751 -6658 18 7496 3226 -5452 -4129 4921 6585
1404 6585 -1495 -5918 -148 7078 3245 -5720 -4413 4195 6248 -1758 -6868 -666 6281 2538 -6267
1419 -6267 -5836 3351 4905 -3047 -7785 -2091 5159 1598 -6946 -6518 2478 5190 -2890 -7956 -1554
1434 -1554 5475 2401 -5679 -5242 3442 5800 -1727 -6419 -583 6608 3338 -4476 -4190 4033 6346
1449 6346 -825 -6026 -78 6762 3324 -4684 -4576 3365 5875 -1304 -6248 -893 5874 2939 -4897
1464 -4897 -4944 2875 5734 -1327 -6755 -1472 5472 2745 -5305 -5261 2653 4973 -1565 -6784 -1850 5272
1480 5272 2522 -5387 -5212 2290 5216 -1656 -6463 -1692 5391 3061 -5152 -4997 3231 5864 -1399
1495 -1399 -6089 -1095 5732 3455 -4294 -4555 3439 6189 -686 -5692 -1154 5827 3543 -4001 -4848
1510d848P587L069o797n147M816O393k479p467n39P030L210o561n134M680O491
1525D304k312p183m13O937L692o205n325M266P037k070p007m65O644L759o008
1540c49n488M257O980k032p227p53O952L354n676n651L822P160j181p920r65P241
1556B524L454o040n701M145O938j503p850p73O684L360n344n579L362O919j334
1571C262p543j610P365L409n708n673L842O635j708p021j218O942L523n298n336
1586f137L383O795r10p198j073O231M249n391n521L710O436r94o506j551O527
1601B050L736m837n616K951O560m62o667j892O451L790m813n908K947O619q26
1616D083o689j854O213L995m782o045K645P083p17p151k067N951M342m574o356
$$ plain form
1510 -4848 2739 5808 -989 -6136 -1320 5073 2594 -4873 -5412 1618 4828 -1733 -6867 -2187 4304
1525 4304 1992 -5191 -5604 1333 5025 -1180 -6505 -2239 4798 2728 -4279 -4744 1900 5659 -349
1540 -349 -5837 -1580 5400 3368 -3859 -4612 2340 5694 18 -5633 -1811 5349 4168 -3752 -4717 2524
1556 2524 5978 -62 -5763 -1618 5320 3817 -4033 -4806 1878 5238 -106 -5685 -2323 4596 3262
1571 3262 -4281 -5891 1474 4883 -825 -6498 -2656 3979 2271 -4750 -5968 974 4497 -801 -6137
1586 -6137 -2754 4041 3131 -4067 -5140 1091 5340 -51 -5572 -1862 4574 3580 -2926 -4477 2050
1601 2050 5786 949 -4667 -1716 4844 4382 -2285 -4177 2274 6064 1251 -4657 -1710 4909 4083
1616 4083 -2606 -4460 1753 5748 966 -5079 -2434 4649 3932 -3219 -5286 665 5007 433 -5923
1631e923K555P074p65p105j741O219L714m219n965K447O978l86o841k078O352
1646C16M411m618n919L081O473k80o247k056O201L960m052n432K025O726L89o397
1662a419k545N819M635m146n961K406O111L14o385k624N495M131l629n721J205
1677b314N973O64o147l262N206M747l820o460J777O319N8n983k726N087M148l270
1693cn718J215O615P15o174k683N532M496l508n797J855O729M63n594k624M961
1709D80M858l310n451J455O102J302o178k798N123M815l125o010J422N952Q31
1724E468o156l023M908M317l316n383O92N552J089n541l344M057M945l506n770
1739e011J160N722J055n591l327M435M287k489n225O85N688J638n427l034M265
$$ plain form
1631 -5923 -3368 3706 2941 -4164 -5905 314 4028 -191 -6156 -3709 3269 2883 -3958 -6036 316
1646 316 4727 109 -5810 -2729 3744 3464 -2783 -4839 1362 5322 1270 -4162 -2137 4589 4978 -1419
1662 -1419 -3964 1855 6490 2344 -3617 -1211 4900 5214 -1171 -3795 1700 5831 2202 -3519 -2314
1677 -2314 3659 4323 -1824 -5086 120 4867 1047 -5413 -3636 2683 2741 -3242 -5968 -881 3267 -3
1693 -3 -5721 -4506 2109 2824 -3350 -6033 -501 3995 487 -5310 -3455 3274 3737 -1857 -4481 480
1709 480 5338 2028 -3423 -1968 4134 5436 -742 -3540 1583 6398 3273 -2737 -1315 4637 5468
1724 5468 -688 -3711 1197 5514 2198 -3185 -2493 3059 4148 -1393 -4737 -680 4265 759 -5011
1739 -5011 -3851 1871 2926 -2665 -5992 -1557 2730 241 -4984 -4299 1389 3027 -2400 -5434 -1169
1754a169N190k881n248Q35N789J395n010k715L934M917k472n599R40O050J331
1769E287n238l216M050M952k383n974O08N440J523n486l032L637M816k589n964
1784c569O95N577J691n773l179M085M329k519n696N07N528J608n326k944L623
1799a363M412k069n238J36N357J916m825l355M049M807k057n508m8N537J962m377
1815f64l313L115N078j705n284l00N367K621m941l763L700M865j900n040l54N416
1831B898J813m255l906L441M919j975n227l73N417J585m474l793L231M639j808
1846B132n399p2N114J835m336m026L306M413r71n919K0M887K339m681l302K886
1862a774M834j241n480l74N510K409m623l347K519N263j382m842n85M980K513
$$ plain form
1754 -1169 4021 1140 -4108 -3273 2516 3911 -1099 -3814 120 5037 2565 -3034 -2094 3956 5287
1769 5287 49 -3167 883 5835 3452 -2522 -1914 3526 5049 -437 -3469 168 4984 2395 -3569
1784 -3569 -2874 2703 4394 -1379 -4558 -473 3856 1337 -4359 -3852 1676 3284 -2042 -4986 -1363
1799 -1363 3049 980 -4258 -4122 1235 3151 -1674 -5029 -980 3827 1770 -3738 -3786 1751 3713 -664
1815 -664 -3977 -862 4216 2511 -2773 -3073 2294 4915 -26 -3789 -89 4776 2876 -2164 -2518 2898
1831 2898 4711 456 -3450 -9 4910 2935 -2292 -2665 2752 4337 -137 -3930 -699 3940 2132
1846 2132 -3267 -3339 1775 3610 -726 -4752 -1446 2967 1996 -3923 -3903 984 3323 -1358 -4660 -1774
1862 -1774 3060 1819 -3661 -4035 1475 3884 -739 -4086 -1567 3696 2314 -2528 -3113 1867 4380
1877D380m376l218K850M499r65m866o69M808K460m181l749K799M393q65m797j227
1893b724M427K998l953m150K643M588j168m654j365M828K371l774l750J774N099
1908C190j198n066q13M467K709l793m259K554M904p78n092o32M598K532l469l782
1924c928K246N146r37m788j027M868K601l786l500K010M908q46m746q19M319K409
1940D130l200l687J974M277k22m923j264M615K409l391m072K246M262l33m752
1955a931j334L890L054l543l782J521M839j77m717j793M246L032l537l395J897
1970a730M064J35m554j479M168K787k791m144J909M467j1m228j573L881L152l009
1986A044m106J727M608rm587j743M142K673k579m307J717M057L19m342j933M040
$$ plain form
1877 4380 4 -3214 -364 4135 3170 -1696 -2365 2443 4903 722 -3027 -228 4165 3300 -1497 -2724
1893 -2724 1703 4701 748 -3402 -759 3829 2661 -1993 -3358 1470 3841 67 -3683 -1909 3190
1908 3190 1992 -3074 -3887 580 3289 -504 -4763 -2209 2695 1917 -3175 -3807 791 3323 -146 -3928
1924 -3928 -1682 3464 2527 -2261 -3288 1580 4181 395 -3105 -1095 3813 2967 -1779 -2598 1721 4130
1940 4130 930 -2757 -783 3494 3272 -1651 -2915 1700 4109 718 -3354 -1108 3154 2821 -1931
1955 -1931 -3265 625 3679 136 -3646 -2125 2714 2537 -2180 -3973 273 3305 -232 -3627 -1730
1970 -1730 2334 2469 -2085 -3564 604 3391 600 -3544 -1635 2832 2821 -1407 -2980 901 4053 1044
1986 1044 -3062 -1335 3273 3264 -1323 -3066 1076 3749 1170 -3137 -1420 2637 2956 -1386 -3319 721
2002G21K797k822l877J269M486J95n209j140L579L111k596m015J428M132O03m514
2018a852j687L681L240k769l858J490M379rm303k165L803L566k418l915J016M354
2034B553Q14m503k080L920L210k467m168J141M470K89m078j902L196L296k527
2049A164m089J267M295K30m390j847L665L013k168m305J015M439L03l959j682
2064c049K910L034k149m203Q41M442P12l881k077L282L358j854m166K66M597R13
2080B976l850k250L033L571j853m096O31M248J426m643k379L252L530j905l838
2095b147J09M174J377m198k600L437L415k265l709L2M218J250l946k431L072L342
2111C130k027m008L14M283J165l677k806K718L887j846l983M76L967P29l393k364
$$ plain form
2002 721 3518 696 -3181 -1912 2574 2769 -2440 -3580 -1 3110 514 -3501 -2073 2059 2662 -1852
2018 -1852 -3539 142 3382 613 -3245 -1755 2624 2615 -1688 -3853 -50 3516 1098 -2817 -1801 2553
2034 2553 3367 -1136 -3216 704 3914 1447 -2721 -1580 2890 3179 -899 -2801 395 3691 1164
2049 1164 -2925 -1658 2637 2867 -1523 -3370 295 3308 1140 -3165 -2150 2289 2592 -1367 -3049
2064 -3049 -139 2895 746 -3457 -2616 1826 2538 -1343 -3420 -138 3220 1366 -2800 -2534 2063 2976
2080 2976 -874 -3124 -91 3480 1627 -2469 -1838 2410 3836 -807 -3186 66 3596 1691 -2147
2095 -2147 -2038 2136 3513 -685 -3285 152 3567 1302 -2407 -2375 1843 3093 -853 -3284 -212 3130
2111 3130 1103 -2905 -2591 1692 2857 -820 -3626 -908 2979 1133 -2850 -2374 1593 2322 -1071 -3435
2127c435K598L876j442m308M76L879J374l464k620K828L633j483m130k41M567
2142B108J103l299k586K291L762j305l921r7M025R86l290k628K524L463j547l674
2158b085l60L267J917l502k600K286L486j134l845p24M193J752l286k714K102
2173a247L351q15l482p09L702J927l055k988K046L886q22m167l31M152J656l033
2189G1k396J837L467j172l568j5L427J395k450k707J650L524p02l870K6K941J623
2206C081k669k587J678L229p97l598m62L097J406k508k844J730L025l16l378p26
2222b639K889J797k336k727J187L604o27l431m74K982K132k856k410J442L017
2237A550L54l717q33L131K121k385k536J460L051j11l126o78K778J894k219k548
$$ plain form
2127 -3435 -837 3039 1597 -2711 -2235 1644 3018 -446 -3066 -238 3395 1912 -2218 -2459 2108
2142 2108 3211 -88 -2674 -383 3379 2074 -1847 -1944 2081 3067 -223 -2851 -327 3136 1589 -2085
2158 -2085 -2445 822 2739 -763 -3363 -1077 2409 1275 -2570 -3294 899 2651 -635 -3349 -1247
2173 -1247 2104 1289 -2193 -2902 800 2727 -328 -3316 -1270 2616 1794 -2373 -2704 1448 3104 71
2189 71 -2325 -488 2979 1807 -1761 -1776 1651 3046 596 -2111 -461 3063 2361 -1509 -1483 1458 3081
2206 3081 412 -2175 -497 2732 1935 -1663 -2125 972 2378 -130 -2974 -1244 1781 1465 -1913 -2639
2222 -2639 250 2047 -289 -3016 -1829 1775 1148 -2283 -2757 225 2357 -499 -2909 -1467 1550
2237 1550 1904 -1813 -2646 485 2606 221 -2315 -855 2196 2085 -1041 -1719 1059 2953 734 -1814
2253a814J413L177k15l342q68K510K394k567k499J424K546N6l191o84K162J798
2269B300k144k207Q06K958p0l117j044K685J640k399k194J389K460ok929r64K781
2286e5J856k151k296R08K934M4k754r73L115J253j539k226R98K713J41k641j063
2303a736K378J689j715j993O80K864ok701p18K272J698j962k139J131K547k84
2319B005k663r05K309J545j788k203P66K589L4k715j191K162J753j874k266J390
2335a052K275k11k735o95K511J332j641k043Q73K742n52k084o64K500J414j763
2351B07k398J379K815r13j877q57K461J486j725k297J057L226q4l277q07K423
2367H19K045k134k300P61K805l7l079p32K444J691j945k028O27K881k30l127p03
$$ plain form
2253 -1814 -401 2776 2561 -781 -1649 861 3255 688 -1811 -387 2159 2215 -976 -1660 502 2300
2269 2300 156 -2051 -1245 1713 1643 -1474 -2518 167 1807 -592 -2786 -1397 1063 1057 -1872 -2836 -55
2286 -55 1801 -350 -2646 -1738 1196 1240 -1514 -2487 628 1881 342 -1884 -886 1827 1968 -673 -1736
2303 -1736 642 2331 616 -1377 -697 2167 2161 -540 -1258 1014 2712 750 -1389 -258 2289 2005
2319 2005 -658 -1563 746 2291 503 -1700 -934 1655 1689 -1026 -2217 -55 1698 -176 -2442 -1052
2335 -1052 1223 1012 -1723 -2418 93 1425 -216 -2259 -1386 1356 804 -1280 -1944 556 1970 207
2351 207 -2191 -812 2003 1090 -787 -1644 817 2303 578 -1719 -662 2564 2480 -797 -1604 819
2367 819 2864 730 -1570 -809 1996 1959 -1120 -1852 592 2283 338 -1690 -1063 1818 1588 -1539 -2242
2384b242K449J754j988k446J005K731r6k736r57K512J549k049j976J054L110j87
2400A487k983j086K846J761j794k680J321L227n45k349j026K196K360j919k283
2415a467Q81K747m37k319j341K680K112j642k957R36L049j25k736j226K307K131
2431B593j649l059J191K919j30k913j266K256K086j878k757Q45K771N85l216j170
2447b792K367K586j526l244N53L262N48l084j610K617K295j238l308P88L227P27
2463B168k938j798K711K654j606l089O47L019Q05l031k085K819K437j396l048
2478a731M33L102P52k644k118J911L117j291l485N57K804Q13k833j846K136K774
2494B451j361l066k50L211J015k517k231J747K929o91l478KK824J277k241k472
$$ plain form
2384 -2242 207 1961 -27 -2473 -1468 1263 1167 -1569 -2526 -14 1535 -514 -2490 -1436 1674 1487
2400 1487 -1496 -2582 264 2025 231 -2449 -1128 2099 1554 -795 -1821 375 2735 816 -1467
2415 -1467 -586 2161 1724 -595 -1936 744 2856 1214 -1743 -807 2242 2117 -619 -1845 462 2593
2431 2593 944 -2115 -924 1995 1865 -1048 -2314 -58 2028 150 -2607 -1762 1009 1594 -1622 -2792
2447 -2792 -425 2161 635 -2609 -2056 1206 1754 -1330 -2940 -323 1972 734 -2574 -1786 1441 2168
2463 2168 -770 -2568 143 2797 1191 -1898 -1251 1768 2573 -458 -2543 276 2713 1317 -1731
2478 -1731 -1298 1804 2556 -88 -2206 -295 2822 1531 -1954 -1397 1407 2220 -613 -2459 -323 2451
2494 2451 1090 -1976 -2226 985 2000 -517 -2748 -1001 1928 1237 -2241 -2239 585 1862 -379 -2851
2510b851J949K862n52l238m05K923J722k513k556K030K935p46l095o05L092J839
2526B791k718k397J622L046o56l179p59L182J646k298k216J212L041p83l021q43
2542b330L110J890k614k341J568K663l31k810r97K359K185j860k647P33K807J09
2558A494k772r56K382J921j720k514J123K762j68k433j275K378J889j683k571
2573b143P72L152K98k892j039K213J736j514k369L97K998J22k304j236K113J603
2589A907j474k145O88K181L69k155j223K187J718j504k279N67K512J34k087j165
2605a769J622J777r62k237l6K806L77k080j565J988J955j096k114J00K246N12
2621A524k105r76J501J753r81j990R2K237L86j553r26J175J616r55k281N68J996
$$ plain form
2510 -2851 -902 1960 1408 -1830 -2235 688 2410 -103 -2659 -629 2306 1560 -1535 -2140 952 2791
2526 2791 73 -2324 -702 2344 1688 -1491 -2250 932 2578 280 -1936 -724 2317 1534 -1487 -2330
2542 -2330 780 2670 56 -2285 -717 1946 1615 -1195 -2192 167 2352 492 -2155 -1422 1385 1494
2558 1494 -1278 -2234 148 2069 349 -2165 -1042 1720 1552 -881 -2156 222 2111 428 -2143
2573 -2143 -1371 1781 2079 -813 -1852 361 2097 583 -1786 -1389 1609 1731 -573 -1809 304 1907
2589 1907 433 -1712 -1024 1157 1526 -629 -1852 335 2053 549 -1730 -1163 1349 1483 -604 -1769
2605 -1769 -147 1630 668 -1569 -1605 1201 1578 -502 -2067 -79 1876 780 -1334 -1234 1012 1524
2621 1524 -581 -1557 -56 1697 716 -1274 -1182 1055 1441 -112 -1038 137 1753 798 -1483 -915 1081
2638A081J80j521j291J476J617q27j839N0J880O68j834j194J140J752o53j865
2654a180Q5J751L70j357j308J218J716r02j646L5J876L79j465r92J337J339n81
2671F75j586qJ507R65j906n96J132J174j215q89Q7J293O29j427q22J250J136j050
2689C49j436N45J520j51r48r87J179R96p27j325K54J197K41r86j137J298J073
2706I55p58j444K46J493K19j376o65R66J241n08j461L90J359Q1j366n32J350Q20
2724A010o85j069J29J502L4j326q87J436J254j145j021L30J206M87j866m43J658
2741F04Q78j271j220P11J157L39j798m88J240J084j183j409R59J140j44j175p03
2758a279J463J061j168j511O31J437P9j552m98J339J054r13j575P12J844k2j715
$$ plain form
2638 1081 1261 -260 -1551 -75 1542 715 -1124 -1074 806 1474 -360 -1554 -414 1338 685 -1180
2654 -1180 -1095 656 1026 -331 -1639 -421 1295 393 -1253 -1218 658 1037 -428 -1420 -83 1256 675
2671 675 -911 -919 588 1553 -353 -949 183 1357 142 -747 -660 633 1262 -165 -987 263 1399 349
2689 349 -1087 -542 978 827 -121 -1108 71 1067 340 -985 -731 466 707 -279 -1416 -118 955
2706 955 197 -1247 -1001 492 711 -665 -1330 -364 877 369 -1092 -702 657 738 -628 -1160 190 1010
2724 1010 325 -744 -615 887 921 -405 -1292 144 1398 253 -768 -438 768 1255 -611 -1054 604
2741 604 1482 211 -1009 -298 859 1198 -600 -1088 152 1236 53 -1356 -397 743 599 -576 -1279
2758 -1279 184 1245 77 -1434 -803 634 713 -839 -1337 2 1056 143 -1432 -720 1124 1102 -613
2775f13q24J627J229q54j677N06J808p2j785m66J454J039r41j484P85J479O6j716
2793d39o50J295J730j287j736L63K130j12j923p96J685J212r77j969M19J948K27
2810A120k287l91J699R01p85j873N61K075q7k235o37J813J316j068j920O51K103
2827I56K96k307l71J208J620j016j624rK402Q6j613o96J136J682j345j884Q34
2844f45J813M08j682j229J600J455o35k451M47J923N16j908j037J198J953q86
2860H40k315K39K132N04j702j321J321J709r50j939N9K262O35j993j714J701J913
2877A381o07k435K31J952O38j569j502J310J881n33j833m08J871J343k016j281
2893a577J426J810k82k149j8J776R04j526j733J393J761n51k076j25J560J214
$$ plain form
2775 -613 -1437 190 1419 565 -1112 -606 1202 1130 -655 -1121 333 1372 431 -1053 -268 1211 1277 -439
2793 -439 -1089 206 1936 649 -1087 -724 1406 1294 -629 -1425 260 1472 495 -1474 -1055 893 1120
2810 1120 -1167 -1558 141 1042 257 -1616 -1055 1020 933 -1302 -1939 -126 1190 122 -1798 -1147 956
2827 956 1252 -1055 -1426 -218 1402 386 -1238 -1247 1155 1241 -372 -1068 68 1750 405 -1479 -645
2844 -645 1168 1576 -106 -1335 265 1720 1085 -1366 -919 1004 1520 -388 -1425 -227 1726 840
2860 840 -1475 -1236 896 1400 -302 -1623 -302 1407 457 -1482 -1423 839 1474 -519 -2233 -532 1381
2877 1381 774 -1661 -1430 522 1160 -409 -1911 -601 1280 747 -1086 -1494 377 1720 -296 -1577
2893 -1577 -151 1659 1377 -772 -790 986 1890 364 -1369 24 1785 1234 -842 -967 593 1807
2909A807j609j632R00J954k27j985l13J461J439j472j685Q29J534l5j784q70J773
2926H5J072j061k120J204J803j3j950n55J615J083j086j748P99J890Pj764o43
2943a382J607J281j141k017R22K169K03k038p50J407J057l82k256O61J825J99
2959A365j629q56J589J100j029j584K90J582M29j560j277J426J374j195j366M21
2975i20J769J47j381j213J295J351r17j631K81J884L39j357r75P84J817j097j558
2992a382N71J424K99j397r38J331J400q93j687L60J781L82j364j061R88J103k50
3009F67j356J63J622J12j193r32R64J313p67j345J9J340M10q78j054R05J275q85
3027C80r84r2J195L74r93p86N60J161n51j028j61J131N87j062r74J077J315r11
$$ plain form
2909 1807 198 -1434 -534 1420 1193 -792 -1105 356 1795 323 -1362 -533 1001 966 -818 -1688 85
2926 85 1157 96 -2024 -820 983 970 -980 -1535 80 1163 77 -1671 -872 1018 1025 -739 -1382
2943 -1382 225 1506 365 -1652 -730 1439 1642 -396 -1146 261 1318 936 -1320 -659 1166 1365
2959 1365 -264 -1120 469 1569 540 -1044 -754 828 1257 -303 -1580 -154 1220 25 -1341 -920
2975 -920 849 996 -385 -1598 -303 1048 131 -1500 -1219 665 1004 -353 -1328 -544 1273 176 -1382
2992 -1382 -811 613 912 -485 -1423 -92 1308 415 -1272 -912 869 1251 -113 -1174 -186 917 667
3009 667 -689 -526 1096 1208 15 -917 47 1360 593 -752 -733 607 1017 139 -915 -10 1265 380
3027 380 -604 -696 499 873 -120 -906 -346 815 264 -764 -925 206 793 -269 -1243 -166 1149 238
3045B38j150P9J039N14j204n32J034P61o29j130j16J659K97q21j201J114Q00j93
3063E59j347L1J368N44r53n38M58J149q42j004l9J450Rq39r47R53R63q68q26j10
3083h29J385K71q78o61K99J159r5j390k25J363K10r47j064J405O23m66q39k81
3101i60J230N03j123p19J018N96k83r92m8J249K93q98m88P83P03j46j194p1J165
3120F18L01j167m88P84R48o75j167PJ214P00j467l34Q13J152q04j184n6J390J34
3139G19q47r28P09J186l69j329K48J074K33n76j304R14Q93m17q82J25P78K51p54
3158b76m31M33J279n69r63J13R69K95j025p78R18Q22l78r91k61J220O70j290n79
3177h22O75J010o82q08L1Q14O95j259n80R28J158q41r86j20J210M24j094q69R34
$$ plain form
3045 238 -912 -833 206 720 -484 -1016 18 779 150 -980 -1096 563 860 39 -1162 -48 752 559
3063 559 -788 -757 611 1155 202 -336 122 1271 429 -575 -614 836 845 6 -941 12 975 107 -719 -829
3083 -829 556 827 -51 -712 -413 746 651 -739 -964 399 609 -338 -1402 3 626 160 -679 -960
3101 -960 270 773 -350 -1069 -51 545 262 -730 -778 471 764 -134 -622 161 864 718 -476 -547 618
3120 618 919 -248 -736 48 996 321 -846 -839 375 1075 -392 -726 87 1239 435 -749 -805 585 719
3139 719 -128 -1056 -347 839 470 -859 -611 463 696 120 -1184 -270 623 206 -676 -551 227 478 -276
3158 -276 -707 -274 1005 436 -527 -414 555 850 -175 -953 -35 787 409 -582 -843 377 1047 -243 -822
3177 -822 -147 863 181 -627 -596 218 913 -346 -926 2 1160 319 -667 -787 423 847 -247 -1116 -182
3196a82R97l70j200l8J020Q16r81q00N48J142m55q06l39J060M36r85r30Q70J042
3215H45k35j352K97J043M87j090j197J001R51l73j069K06J188J45r75o68M55J069
3233G28l64j062j52J559Q3p51q79O19Q85k77j008m45J020P19o98j125O36J401
3251H89k92p27o12J172K11p77j025J097R11n78p96k63J139P37q49q33L11J064
3269G79m23j012q8R32P87r12r09P67P47J54r68p39J104J111j248j156R34Q36K80
3288I76j496m00J133N11n26j145M53R01M1r37k56R94N41q13r18L75R56K70j480
3307h20k71J326O14p65j076O29J145j02j120k90N89P90l36q90J13J313o1q37o35
3326f84J171L20p86p65L79Q92M29r38p59R76P34l90j163K3J488m32p95k07O45
$$ plain form
3196 -182 815 445 -755 -793 227 1043 62 -738 -190 952 497 -309 -648 412 848 -137 -1067 -197 845
3215 845 610 -742 -445 598 1085 -5 -1202 -201 750 377 -692 -486 702 847 -128 -796 -341 728
3233 728 364 -698 -850 709 792 41 -838 -219 666 389 -619 -1064 -44 675 -23 -1148 -512 889
3251 889 597 -130 -742 430 641 -136 -1161 -64 847 269 -527 -790 349 1086 237 -596 -285 779
3269 779 356 -656 -744 188 975 63 -846 -79 668 822 -146 -885 219 1330 82 -1074 -140 696 976
3288 976 -520 -920 213 724 198 -947 -494 407 448 -489 -745 249 790 -23 -941 -566 390 660 -820
3307 -820 -1091 235 849 84 -992 -363 782 680 -440 -730 -141 649 313 -577 -464 849 788 -49 -684
3326 -684 487 807 21 -744 -365 527 956 18 -741 235 969 579 -584 -561 927 495 -300 -507 138
3345A38N83n02r58L10P49Ln15p03O00Q22n40q83L87J137r3r51n20J089O34m62
3365C25j044K57J313j25r92m03R15O71n62j019L08R01K50j138m8L97Q00q71m35
3384e00p9J021M19q35m78M66P86p53p67L32O78L81q42p51J058O33o56r22L06P21
3404B18N86j050n19M77P00q3j232J78R15O99r59p97O53R07k39j050Q0Q20M1l18
3424B7r04P61P91n57p51N18O14R2o07o38O17O55m85n64K9O72M61p54l67J88P81
3445E79j64j249N79O44J94o83m57O73M62R1j212j65J030J60m15p34O11N29l18
3464A55n85l10R00M45r04k82L16O70k37o88k66J126M32q97m03N44O73n23n03j18
3484d55O45N88p20n64M11Q04p9q31k24Q66L52o36l94K16Q98m09o51L3Q30J8o09
$$ plain form
3345 138 721 219 -739 -429 320 323 -192 -895 -295 527 -13 -896 -509 628 535 -416 -936 153 787 325
3365 325 -719 -462 851 726 -266 -669 246 917 355 -664 -356 545 795 -343 -391 6 806 -65 -500
3384 -500 -579 442 861 26 -452 14 800 47 -720 -388 290 671 -171 -922 136 769 113 -809 -503 218
3404 218 804 -246 -765 -288 412 329 -903 -725 190 889 -70 -867 -214 693 454 -596 -516 304 345 27
3424 27 -877 -116 675 118 -633 -115 499 591 -16 -654 -37 618 133 -431 -402 270 731 -23 -390 -202 579
3445 579 415 -834 -255 389 583 -100 -557 116 578 669 -543 -708 322 482 67 -667 -56 473 155
3464 155 -430 -740 160 605 -299 -581 -265 405 168 -520 -786 340 772 -125 -528 16 689 166 -337 -455
3484 -455 190 778 58 -506 -95 709 630 -201 -425 441 793 157 -237 -21 877 468 -183 -150 680 698 89
3505H9o22K79Q39j78p16j7M77N56p62n80O50O70j94r70m7O38J70l53m71J44O44
3526B46R8q71p9R48R7o89o20Q68K76j83k77k57O18O92r39p53O35Q04qr79o6Q38
3548C99K20j96r85O43M71L3p75l2M68K57l49o08N62M13O3p85l7L48L22m41p30
3569g39K97Q13j05n47k8M40K52k62o17J55P95o8j018n9R11M15n61m41J16Q02m7
3590E04p12k53Q97R3l94o32K06Q65m9n60p09R01L32o99j69L93N08j63q13R3P53
3611C92L73n50n46J99M78J31p45n83Q92K84l40n22K4O62M61r62j56M11O96o05
3631fn81L68O67l04m81j60N97L72l37p02M26O51j71m33k44P09o5j20p97k0J125
3652D94J8m94n96L89P55l58r88J97R32j62m64J6M12N82n28p12J65N67Q0n73n39
$$ plain form
3505 89 -533 -254 585 407 -309 -326 151 707 -55 -635 15 685 491 -479 -526 112 282 -71 -542 -398 246
3526 246 344 -527 -606 342 439 -250 -870 -2 274 91 -186 -443 175 867 -72 -825 -190 614 606 -373 -439 399
3548 399 619 423 -562 81 552 585 -190 -222 246 503 154 -454 108 521 584 -201 -238 110 432 -9 -739
3569 -739 -442 371 266 -281 -309 131 383 121 -496 -341 454 386 -632 -691 220 635 74 -367 -251 551 504
3590 504 -208 -461 436 529 135 -497 -291 574 525 -35 -744 157 489 -210 -379 14 522 359 -454 -361 392
3611 392 765 215 -331 -132 346 477 -268 -851 41 325 -15 -537 -513 149 610 -352 -508 -97 599 -6
3631 -6 -587 -219 448 144 -337 -497 100 472 135 -567 -141 510 339 -94 -338 371 306 186 -611 -631 494
3652 494 512 18 -578 -189 566 208 -780 -583 349 187 -277 -261 151 733 205 -507 -342 225 305 -268 -807
3673h07Q71K96l50m13L02M58j5m33o39P53N38o17m20K97O15k23m27m81O46M62
3693D13k99n64j4M16L10m40n82R68O08p69o89L04N62M34r99n95J000K67l01l39
3713c09J10P47j17m79m36L20Q01n50j48m03P45R9n44k91L49M87k66m93M5P01j56
3734B12m72k22N68P17q19k69l60R18Jq06O7O49M6k65m97L87O50J33q76j89N03
3755G6O6j62j8l97M94K80k20o82M56M27n04l58K46J104k81p03l82M34R19l51p80
3776c36q0M99M22o63p33P64L97K3o39O7O04O1n29l85L33O82j14q09O4P05l8m14
3798a19l68J53R31m04l90Q6K42K15k21n05J49M66P1p13j2J015P6n25n13K61N33
3819D28J92j010J73L55J47l09l30J39M11Mm54k05P76o1n41k16N34M62j97o14k19
$$ plain form
3673 -807 64 360 10 -403 -101 357 342 -91 -730 23 561 -56 -476 -179 436 213 -214 -695 -49 413
3693 413 114 -450 -464 -48 262 -178 -760 208 816 47 -642 -338 224 658 -341 -936 64 331 30 -309
3713 -309 -199 548 431 -48 -484 -164 637 87 -61 -464 281 380 -164 -455 -106 381 115 -378 -333 368 212
3734 212 -260 -482 86 803 -16 -285 -645 273 274 -532 -465 184 230 -35 -532 -145 505 638 -238 -427 76
3755 76 142 -20 -38 -435 59 339 119 -563 -107 320 -184 -542 -296 808 527 -176 -558 -124 795 444 -336
3776 -336 -416 83 505 -158 -891 -127 270 293 -346 -279 325 386 -143 -528 -195 487 373 -436 -372 333 295 -119
3798 -119 -487 -334 597 193 -197 -111 131 346 125 -380 -231 235 306 -407 -419 596 672 147 -366 -105 428
3819 428 620 -390 -217 138 285 -24 -354 -215 196 200 -254 -459 317 256 -285 -501 33 495 298 -316 -535
3840e35O26L50l78n36K9N52J88l24l58N64L91n90n26N98J28j15j50l36N65N20
3860F63p00p51L36O77J19m55j99O12K2j17o78K64N29l8l86l6R3O16o31l20K97
3881h3K72L49r33P4L46L75o04p9K16O08k78m80j40K24L23j73m50J89K19L72o71
3902c24Q9K23M10m58l55J4N28M7k26k36K40P19r01l55O69J16m6j31j89rN66j33
3924B58n70J07O69j84m33p0K95K15j04m52j94Q86j62m59j20N7P18n05k17KM24
3945A61K62o00k48O33P7l98l79K10L64J00l14j22J43L26l1m80J21M65Km67n4L69
3967A40L57n84l63J67O26L9q08j9P72p1J7m33k0M12j76l53J2M55l5l36J02J7L71
3990B89N3q03K99J02N05k61k65j11M05K93o19o5O8P19m98n41J51N02J17m59l13
$$ plain form
3840 -535 91 441 63 -473 -444 108 296 -28 -386 178 569 -21 -547 51 179 64 -86 -422 143 663
3860 663 -37 -788 -452 225 344 -111 -310 302 324 207 -471 -207 322 284 -102 -138 -45 571 -60 -380 -83
3881 -83 189 538 -395 -321 25 400 -204 -283 -67 541 263 -217 -357 -133 190 17 -433 -244 -25 347 -324
3902 -324 -235 -12 398 -60 -415 -401 127 174 -52 -288 -48 671 -230 -585 84 200 154 23 -166 -175 391 258
3924 258 -312 -205 464 280 -153 -223 72 287 183 -269 -463 423 261 -198 -318 -261 457 -48 -265 -263 161
3945 161 423 -177 -425 208 285 -113 -492 -282 82 182 -132 -254 -111 215 184 -296 -175 290 292 -175 -229 140
3967 140 497 -87 -450 -283 343 382 -426 -445 327 256 273 -160 -180 232 56 -297 -285 170 135 -201 -99 -82 289
3990 289 342 -461 -162 -60 445 184 -81 -192 213 506 -113 -178 -110 609 111 -430 -279 223 340 -119 -432
4011d32K90M75q8o31J71M70k8m13KJ36M98j28m51m45L93M68m04n23J023l7M5p47
4033c56J97R18r9j121K89M51J42m10k71o3L16K60k20l08M10K4j63l24j28N22R1
4054A57l83k84O67J7J37q14J54M84J82o92r4N11J12n6l20N6L09J86k09p55O48
4075A3M22k76l68o1N62j15j46m00K37Q81k94p48J39L60J51m49n29L86O64k13p47
4096e31L54J35K28J5o78L83K27p4m68k1P86k2l31k16N4J59k5n22L47M31j34j07
4118a0l78p1O49L1n50mN43qk12m73L97N32j44k00l83O36j4k80J84l60M14M1n67
4141b27j88K89M34k83l53K36O53n27l32l8N65K8m8l99j40K88K76k76j53M22k18
4162IO8n04K00M88K9o49j6L13N22m85k59J52K23J91p09l18M67N12j96l73K40K74
$$ plain form
4011 -432 -142 333 245 -386 -215 255 227 -186 -184 -48 450 322 -129 -574 -181 287 -117 -640 383 346 391 -356
4033 -356 -159 759 660 -461 -172 279 421 11 -260 -323 -7 253 33 -275 135 159 -4 -328 -456 66 157
4054 157 -226 -510 157 174 311 -503 -349 135 317 -375 -469 42 154 98 -222 -166 143 329 120 -635 13
4075 13 435 159 -209 -270 292 177 31 -369 -132 749 455 -293 -154 206 357 -92 -621 -235 429 216 -531
4096 -531 -177 -42 186 201 -477 -94 133 59 -409 -430 356 334 3 -213 -159 0 -25 -547 -200 231 97 -10
4118 -10 -388 -459 190 221 -329 -333 210 202 -10 -483 -86 446 302 102 -281 355 341 61 245 -115 299 340 -227
4141 -227 -415 -126 308 25 -328 -92 561 34 -298 -336 229 257 209 -190 -330 -42 234 -42 -195 227 9
4162 9 77 -427 -227 261 290 -359 -375 -62 460 -25 -284 -132 91 282 -427 -745 -278 234 38 -335 -95 179
4184A79M40m19n55L07K66j29j13k78N47J31m17l30N78L20n25l93K58M38j68L9
4204A76k93K59K9l4k98K09M02k40j85k37J37K26o5m61K92L39k33Rk78J04L85k19
4226B4l74M05L2k1m12O5M92N1k64o8o3M17r4l84N1J82J12l71j93L68L09p7j31
4249E6j71J97K77k56r3J39K51Ln46M1L18J06j60n24J04P33m60J78k23L40L6j53
4271A93p28M34r0J80m72J66M39K29j82k90J27K01j97k7n77L16M88j1k71l08P89
4292D09j53m71j18L36M20P9o75j03N95j73m50j03P88k77j55k87L70j3O3q9n50
4313e57P33K40n72l53M67K99j30L4m15N08J51m41k63J43L61k79k7m03O35m3L0
4334A18n59K44K07M03k72p93O83L59l57m14O5O41k10k76n5L11k12K96l87p3N84
$$ plain form
4184 179 619 200 -355 -48 218 89 -24 -302 245 376 -41 -371 207 527 2 -391 -133 305 137 176
4204 176 -117 142 171 137 -161 48 450 210 25 -212 -75 151 86 -375 -83 256 23 32 -246 -142 243 24
4226 24 -350 55 87 66 -346 -281 211 262 -2 -70 -133 284 190 -194 -143 39 151 -220 -413 -45 264 187 56
4249 56 -115 82 359 103 10 149 400 403 -143 -102 216 322 162 -362 -258 475 15 193 -30 310 346 193
4271 193 -535 -101 -191 -11 -483 -317 122 351 169 -121 6 207 10 -17 -594 -278 210 199 -72 -380 409
4292 409 256 -215 -333 3 423 502 -173 -276 319 146 -304 -407 381 104 -51 -338 32 19 82 -7 -557
4313 -557 176 416 -156 -509 -42 257 127 161 -254 254 405 -36 -299 -156 205 -74 -101 -504 131 88 118
4334 118 -441 -197 10 413 141 -652 31 390 33 -381 -316 325 115 -161 -216 95 -117 179 -208 -281 303
4355C03J15m94P3o5N94n13n39K49M88j03j87r8K51L00j71n56K23M00Om70J96J73
4377A75P0k03k80J04K30K52k75m11M07J80k95R5m5l7p9J53n6P6M19l33l68k9M86
4400B36N5n87j54N74J6J15l39l38N70l07J50k59J86L35k80J14j88M19k96j00q6
4421a64J03L87l64j81K10Q2K80o61O0M59N8j51m25L16K44J56o88j2J92L23K48
4442D72m94k69L96J95j82k31k1L03o9j47R1k08K53j12j01J24K19k50k2r7M46m7
4464B49k99K9k00J034m78o30K17K59o0k37j51J11M13k22k03k74N63o5l15j48R9
4485c08N61j29q3r8J72k3k53k54L63J74J76m26j7K21J72j11m43L18J36N1l34K16
4507H1k81L88q0j86N42j78m0m27r7J67L82l29j48L34p7K7q3q2N47j27l26q3Q0
$$ plain form
4355 303 418 -76 -3 -68 526 13 -526 -277 211 108 -79 -177 74 374 203 -353 -130 270 276 -194 2 175
4377 175 245 42 -238 -134 96 348 73 -338 69 249 -46 49 4 -33 -112 41 -15 61 480 147 -221 -250 236
4400 236 291 -296 -450 124 140 255 -84 -422 148 -159 -9 -268 -82 253 -27 87 -101 318 22 -78 -164
4421 -164 -61 326 -38 -219 -9 73 353 -308 -248 211 269 118 -307 9 253 409 -279 -291 -99 224 472
4442 472 -22 -291 105 300 118 -113 -134 169 100 -47 44 -164 89 -23 -124 0 219 -31 -53 -150 296 249
4464 249 -50 -21 -221 813 335 -295 -78 181 121 -116 -267 -156 257 35 -168 -442 121 56 -259 -407 -308
4485 -308 253 124 41 -57 115 92 -161 -415 -52 122 298 -128 -145 76 248 137 -306 12 148 199 -135 81
4507 81 -200 188 108 -78 464 286 246 -181 -278 -111 271 -58 -206 128 51 78 -5 -87 460 333 7 -76 4
4530Dn3K11j19j90K35lj05j33L07J04l9l43j09K05O9n3p0j74J78Q8Lj25L36J8
4554B42k27l1j10O15n09k59K00J97K56m35J98M1o9L4k36q6J12J20K2j72j47L17
4576G3M2j10j75K16L4j43l49K34N37l25k8M2l14L96J74l24m12P10kn41n8L11J42
4599A30K0j40j65N32j28j95l19N13r1m7j42l90O27j14l0l60K42J32o7J30k68J27
4621cP9Q5l94K62K28k53j07M2L07k35k48k07L69K63k4m03n0J96K84r0j43n9K83
4644A82K1n68M83j7j52K03n61K97K76K6m31J51K35p9q8j17M88j93q9q6j14K24
4666I1J07n55O7L38K1K31l04R0K72l45j00oO0K37k97M7PK89k91l8m09N49K53l58
4690d4j60L09J83k45j54q1K31L3J31m04J62M39m24k81L61j02M38m16l4O7K89k42
$$ plain form
4530 4 -49 162 43 -147 88 85 -20 -153 154 258 219 -124 -233 -28 41 -12 -82 -256 -78 10 13 -112 224 242
4554 242 15 -16 -126 489 -20 -279 -79 118 374 -61 137 178 109 143 -93 -179 -67 53 75 -97 -244 73
4576 73 115 5 -170 46 80 -63 -412 -178 359 34 6 48 -266 130 304 -20 -432 278 276 -265 -323 -12 130
4599 130 150 10 -155 377 249 54 -265 248 157 110 -32 -422 205 91 61 -299 -57 75 8 138 -130 -3
4621 -3 76 161 -233 29 257 4 -103 -61 246 11 -237 -444 -75 188 164 -239 -289 -93 191 101 -42 -101 182
4644 182 203 -365 118 101 -51 152 -409 -112 164 190 -241 -90 145 66 -22 -139 349 156 67 -19 -133 91
4666 91 198 -357 -290 48 69 300 -4 86 358 13 -87 -93 -33 204 -93 -46 -39 250 -41 -79 -488 61 314 -44
4690 -44 -204 105 288 43 -111 -192 39 72 203 -201 -39 400 -24 -305 56 -46 392 -24 -58 9 298 56
4712E6J53m22J76M74n29K44j62Mj8k06J07K08k22J89oj98L98l67j91K43l07M35
4734E9J65m92kM80J5j75J24m43L93O3l51J24P8K43l86o2L97l5k6k89J91M3Q7k09
4758hJ3j49L77j64k80o9M18m6l9m61P5L45Qj76J28K00l8p1j67K82j75L60k55m51
4782c43P79j87l44L7k08L56l1k48o5K83o3k03RJ09K45O3m04J40j15K42q3k19K99
4805D9L43k32n54M52K14m0j90n98K99M72l63j31j29M55L3N6j59M1J00M6k15j32
4827a83J4K77K7j48l28N45m44K34M7K0n1k35Q0K50j25M0m46J02O49j36k04k62
4849b77L78K82ol64l42L29q3nj0L24n0l4j47K11m15L03l89K02q0L91l73j62K90
4872b7k38N48l19j25P9K91k5l33k9J03p8K44l6j45J29J98n10K72Q7R5m1k06k82
$$ plain form
4712 56 209 -213 -37 437 -92 152 -10 -6 -24 -230 -123 85 -137 52 46 -152 246 -121 -312 -69 -376 59
4734 59 224 -268 -270 210 225 50 174 -269 124 187 -164 -40 38 281 -105 -167 230 195 169 -120 71 114 201 -8
4758 -8 5 -144 233 69 -211 -280 138 92 53 -408 -333 12 20 -156 -28 172 134 63 -104 178 3 363 108 -343
4782 -343 436 249 -95 -58 -266 90 59 -189 -254 29 -34 -237 -228 -119 126 189 -215 -75 -190 52 -31 -250 49
4805 49 392 160 -394 58 272 232 42 -556 -257 215 -148 -279 -408 47 80 136 -23 18 118 164 -51 -183
4827 -183 -169 108 135 -13 -341 204 -240 -6 41 61 10 -225 -145 105 -20 20 -426 -324 325 189 -15 -277
4849 -277 101 383 377 13 -329 0 -83 -88 -98 226 176 142 -5 206 -209 94 -295 -93 -173 218 -155 -317 -27
4872 -27 -265 283 -36 -161 -82 209 184 -149 -178 -75 -153 91 55 -90 39 237 -273 -1 86 181 140 -66 -348
4895c48M94L74o92J58J55K32l41j96k47N03J4j19j47QM10m65L03k04K66M4k00
4916BJ7r4K87j26l25K38L6P1o06N73k26N40o6m26J52J77q7l19J30J64j20L08j11
4939A89l45M17j24m4k3J72l54L3n28L35N9L04l9K07j45j25K6j47K0M45k78j0m08
4962c63J29J17j48J10K94J39o9k50J01Q7J3r5j91o8J50L05l42r6L90j51J50k54
4984d2l49N11J73p2n44O68k93J24l28R6K7Q8j38j93J97K12n9q6l06J7L89J53k11
5007C4j4J61n5k06n4J96o4k06R4M85m44JJ30k90L71j9k4k15q3L99j14j58j5L79
5031B89l54o8O4n1J40k02O2j9MM11l43k9J68R1J4l68J10J3K57p9l51M12j72N8
5055E7l89J23K30j9n4l83O16r6J51l29j68L41l2L6m33N92j95Kn4l31M50j7m6j07
$$ plain form
4895 -348 146 520 -172 -14 141 373 32 -164 -411 92 106 -13 -160 -152 258 -207 96 -108 158 202 2
4916 2 19 -75 212 86 -239 -1 35 106 -500 73 -153 387 321 -105 47 224 137 -182 -52 112 -8 300 189
4939 189 -156 261 137 93 70 242 -112 -79 -607 -272 -213 91 52 259 114 -11 15 -132 -112 333 55 45 -363
4962 -363 -234 -117 -265 -155 139 278 209 -41 60 147 160 65 -126 -194 -44 261 -81 -177 213 62 212 -42
4984 -42 -391 120 293 221 -323 345 52 176 -152 -56 -29 59 -79 -272 -75 137 78 -8 -314 -297 92 245 34
5007 34 20 181 126 -80 -134 62 -2 -208 -114 371 -73 -72 58 -232 139 120 96 -119 -202 197 83 -75 -90 289
5031 289 -65 -133 -69 -120 20 -182 -120 -139 -135 276 -67 -96 72 163 177 -191 -81 -68 189 110 -241 171 -1 57
5055 57 -332 -209 21 2 -52 -435 181 85 236 -93 -261 80 48 84 -349 243 48 50 -4 -335 115 98 52 -55
5079e5R4J53n4m18M48k10M8j36p0M21j56j7J64p6j66Q3ok75J99K74m90O9J44K8
5103dL1j75K01l27M55r8R0o8k68L18k84j21K89K13j30j72n8K41J43m09j9j11K45
5126a8N0j22K80l35M34l04QJ08n3l1q0j32L98J86mn30Q1L95o2j35J14J32l19j90
5150a29k36Q4N10l40q5K21p4K56n57K51k3K46j54k02L29j12J83j99k75J55L3L44
5172B26k21j52M8j5K13j87l26M94r7j24L23k05M0k70J04o9K52l8q8P5M0J3J46
5195A82k69j33J04K6J47k24l0J35L94j89q7j30J74qj5P3r9K8k86K47q2r1O6K94
5219B27k04q5K5P7j84L80O8l06k4j59J28P9k54K30L06l30lm04M58J3J63q6J64
5242B79k73P1l55J77kJ05j3j32J43K72k53R9q7n7L77k40k24O1q9M55l78K15L17
$$ plain form
5079 -55 39 192 138 -280 168 -42 6 -130 -200 221 65 48 212 136 -30 53 47 -228 -29 245 -245 -176 -32 -4
5103 -4 27 -148 53 -274 181 83 173 105 -163 155 -129 -250 39 252 122 -50 -108 133 276 -133 -152 -263 -18
5126 -18 32 -90 190 -145 289 -15 -7 101 48 17 -63 -195 203 389 385 -145 -64 331 269 134 248 380 61 -129
5150 -129 -365 -281 229 -111 -196 25 -49 207 -350 -99 -122 124 -30 -232 97 -15 168 -31 -306 -151 -118 226
5172 226 5 -147 -99 -114 99 -88 -414 80 -17 -141 182 -23 17 -253 -149 -218 34 -4 -92 -17 23 36 182
5195 182 -87 -220 -116 -90 57 -167 -197 -62 332 143 56 -74 100 92 77 150 51 79 -207 40 -42 -133 -67 227
5219 227 23 -62 -37 40 -144 236 304 -2 -26 -185 -57 22 -232 -2 304 -26 -29 -433 25 38 201 115 279
5242 279 6 77 -278 -101 -103 2 -11 -143 0 272 19 118 31 -26 351 111 -113 -52 -141 314 -64 151 468
5265D68l36P1l38K11R0k28J04r1K54q4O6l13m0K29N9j65QK08O1k10Jj00J50J10
5289A85j25j30J86k18M1O3j12O6q0k5N13n25L65l36r3L82l07P8J27Jm47M84J30
5312B23n1O2o9J40m02m7J37L01m60J15J89O5N9l79k67O56n1k41m7L3J74n5l29
5335b44K63n3rm7j25L50j44J19j27k61J58M84k56k59Q4K08j69k9J44l68J69P4
5357c8O8k52M39n2j6m59K32K08J07n07J82r0J95j28KJ43j57K89k46m2k53O02j1
5380B16k86j7L54l43j51K11j39J60j17J78k90P6J13J19n0j24M77m38k6L58k46
5401C5O8oj46l32O13l45k0P6K30k42P9J41o3k6j68J14j9n0J12j54j34K16L68l63
5425a6K37k31j49K7J42j70R0J31o9J47l57L21L5j34j85J55j30L16k98j85M67k53
$$ plain form
5265 468 132 203 -135 76 166 -62 42 -49 205 121 187 -126 -166 63 122 -43 -35 173 234 24 25 -75 75 185
5289 185 60 -70 116 -102 -61 2 -110 -44 -124 -149 364 -161 204 -132 -225 157 -150 -72 55 56 -391 93 223
5312 223 172 234 165 305 -97 -144 -7 294 -166 -51 138 203 262 -117 -384 272 221 -20 -67 -34 140 85 -244
5335 -244 19 -34 -43 -90 -215 135 -9 110 -17 -278 -120 364 108 -151 -67 141 -28 -57 87 -281 -112 -38
5357 -38 30 -222 217 165 149 -310 -78 130 237 -270 -88 -178 17 -111 -109 34 -123 166 -80 -122 -375 227 216
5380 216 -70 -87 267 -76 -227 -16 -155 5 -112 66 -224 -148 -35 84 34 -90 387 -51 -77 281 35
5401 35 103 97 -49 -381 232 -113 -133 -57 173 -69 10 151 88 62 -106 8 -11 -61 51 -103 -237 -21 347 -16
5425 -16 221 -10 -159 -132 10 -160 -70 61 -8 139 -218 103 138 4 -181 -26 -156 160 -138 -323 144 -109
5447a09L60l88P3o0K98J75k36j34M02m18j1L77l02q3p6k25L84L02m28l10O07L4
5469B32l65K41j40K38n1K4l52L17j05j4M3o8K6j62q4k17M27K2J67l37L74j9m22
5492b25L58n59L44J56j68J49j2Q5L8J99n52PK28on8k33K14lN7j04K76k69J81k3
5516H0n9Q3N2j40J23j73J00l40J09J79P6l91K74p3k15K26J19N9k31K35P3k89o
5539a29L27K40l11j28NK44k25j2O5l14N05k49K0j68K05R3Q5m1j44j47P6L3p9J43
5563I4k92J04J34j08J00j43o4J32N2M5O0l75K68J19J37k92K23j52p1j32K78l83
5585b66J24J08J20k07l0K7L3J81l73Q5K52j4j56j86J93J82l20M77j63N1k88J41
5607b9m2J67J42k50P9J1J70l60J95r1k00L7j05K30p6K50l56k36M49R9l46J87P0
$$ plain form
5447 -109 251 -137 -64 -124 174 349 113 -21 381 -37 -48 329 27 -56 -132 -357 27 329 -99 -409 198 232
5469 232 -133 108 -32 206 155 179 -173 144 39 25 68 0 26 -136 -220 -437 -10 12 179 -158 216 197 -225
5492 -225 133 -426 -82 74 -94 55 43 128 166 365 -187 -180 48 42 -16 -249 -35 -38 19 -85 191 -78 103 80
5516 80 21 104 156 16 139 -34 66 -274 -165 14 90 -301 -27 -100 -315 -89 30 89 -142 93 166 -123 -129
5539 -129 198 438 127 -1 4 248 23 11 76 -238 267 18 38 -130 75 168 253 212 68 -79 -3 30 -49 94
5563 94 -198 -94 40 -68 32 -111 -175 -43 9 54 114 -261 7 126 263 -29 194 42 -29 -161 117 -266
5585 -266 -142 -34 86 -121 -151 -124 -91 90 -283 -198 54 40 -116 -302 -109 73 -247 230 67 118 -170 -29
5607 -29 -71 96 238 -12 67 78 248 -112 83 -8 -208 -171 -276 -46 -122 128 -228 -464 -15 84 -262 -75 -5
5630eN3K6j18P6r1p3J82j69K94P2j11o7l01N5L56j80k68K63L9R2k87L0K07k13
5654a38J42R4r4j09R1L5J16p8l25L64l19O1M87l23K77l63J36Q0k08K2rK65j79
5677B5k69R9K60L85k95k9l14J94ko6P3k91K92RJ22l39o9L14k99j46M33mq8j35
5701a40L08k57J83j56j11J73l9L50m14J73K53k08k85J22J15K6j77j3Q3k20O73
5722D39m13j56M79l24j73J25K36j71k49Q1r3K87j6R8l47N15m69K47r1l67K51K18
5744A07j57K4K77k06J12j39M8pj46J49pj10J58j05j1j98K32j56K35k93J56L06
5766B69k19J03k89J74J01j47n5M23k72J75k25k82RK99j25K12r6k2n1j16K44j16
5788fq0K81l10k7J46k08p8K24M2J00o4K22k56J4j80J35l77N32K3l78O38n31n6
$$ plain form
5630 -5 48 74 -44 32 -59 -132 50 -119 175 247 136 69 -232 -177 179 -1 -269 -6 33 125 -162 -132 75 -138
5654 -138 4 98 4 -105 -14 21 137 59 -266 98 -221 -160 327 4 281 -82 54 134 -74 -52 -61 204 25
5677 25 -244 -145 115 500 205 176 -138 56 54 -12 61 -230 62 71 193 -146 -215 99 -200 -346 87 83 -5 -140
5701 -140 168 -89 94 -62 -173 0 -39 311 -103 70 323 115 -170 -48 67 93 -84 -97 -14 -234 439
5722 439 26 -130 349 25 -148 -23 213 42 -207 -126 -219 68 52 150 -197 318 -151 96 5 -362 -111 107
5744 107 -50 -26 251 45 157 18 66 59 -87 62 55 -55 103 -2 -13 -211 21 -135 100 -193 -37 269
5766 269 50 153 -136 38 139 -8 -63 360 88 263 38 -244 -235 64 -61 151 55 33 -18 -134 110 -6
5788 -6 -86 195 -115 -142 4 -204 -282 -58 -16 84 20 242 -14 0 -180 -45 -422 110 133 -245 393 -138 -194
5811a94L29K1k53J82r3o6R1j24P9l2K49n2q4J29R3l59K75M1l07j48O8j09L88J06
5835B30m24L44j15k13L28j92j25K91p2l9k97N93n13L08j12o0K52r2O5k98J56p5
5857f0K41P4j47L4P8k52N8k30K9K93N1l61N13n98M51k58o1J23QK24k92N4J72o9
5881G5qJ41q6L1k73J10M2K29k68K87j94j90K90j54k3j97N12j55l8j34k11K47k85
5904b52L96n5K0m21L02j86L08P3k52K07Q1Q6l60j57L7J24J76r5j38R0j18L62r5
5927A33k05J08J51n31L17P5k3n6N3l12J59J83n4m2K29k43J66l35M18k26r5K55
5949A25j3K2n2Q4j73O2L20m91J16N1J35k79Rr1J48L7M95o03R1M04m27L63l04L6
5973F5N5j24J06m11K42k05M44k21M5L9l5Q3k9J41q1n8l10O1J72j00k00M28l5k99
$$ plain form
5811 -194 135 156 -97 85 -8 -74 17 -107 -28 -60 189 137 53 182 275 -84 191 232 -75 -223 -155 -264 124 230
5835 230 -194 150 35 -178 150 -42 -167 124 52 13 -284 309 -204 104 -8 -68 184 92 157 -141 15 -60
5857 -60 181 255 108 142 220 -32 26 -204 -175 118 169 -192 321 -277 174 -84 -145 -22 -14 210 -82 -28 144 75
5881 75 67 208 122 153 -120 -10 32 261 -7 280 86 -104 186 32 9 -188 324 169 131 -3 -214 33 -252
5904 -252 144 89 109 -312 -10 -196 112 185 -67 140 221 307 -53 -210 -173 -49 127 32 -106 -16 -134 228 133
5927 133 -72 36 187 -344 -27 48 25 -31 22 -290 -131 52 -2 -44 185 -58 108 -227 191 -35 -130 125
5949 125 112 134 82 166 -7 55 375 -116 0 51 186 -93 -84 -175 -27 10 505 -98 -7 397 -30 333 29 65
5973 65 120 -4 102 -309 -67 -272 172 -49 -4 35 0 83 54 195 114 56 -254 -193 -21 -121 -321 107 72 -227
5997b27Q5K25j73K61j96K9O5J46k60o0L02m5p6J01J77l49q7K29P7j06k75R6L10
6020B49m11O44m56r4J20j34J63n0P5l5k06L04K4k0j55j66J83J61j41kk19L01m2
6043I3l20N20k78M0j82L48k96O2J43K7j77J44M4n0j83K38k26N6l5j31J64j11K28
6066A18r1J08n34M38J83l18N3l69M86k34J10P6j19j07J49L34m90j8K23M7k3O0
6088H2J63p8k80L85k38j97K98j50J46m02o3L18P8J61m90N23m34Q7K27n9M5k19
6110i7J52r5N8k96O6K15L28m6m84J20K71l47M45j82j13J17j70K81k88K88k92J12
6132D3q3J12J83j49J5J46l42K2j37J81K0J42k1l21J54K68m60L96m2k49K68k27
6154h1q9P9j82J95M3J7j14J0K31j96J09R5j34K14k64m9K73K90m90j21k8L92q2
$$ plain form
5997 -227 -142 83 -90 171 -25 4 69 215 -45 -105 197 152 76 177 354 5 -82 147 224 118 -157 -61 249
6020 249 -162 482 26 -68 52 -82 81 31 106 71 -135 169 193 173 18 -148 35 196 55 53 -166 135 93
6043 93 -227 293 15 55 -127 221 -75 -13 130 157 -20 124 168 118 -65 173 -53 3 -32 -163 1 -110 118
6066 118 27 135 -399 39 222 -96 -43 -412 74 -160 -50 26 -93 -200 -51 283 -207 -225 -2 45 22 82
6088 82 245 167 -113 272 34 -163 135 -15 131 -271 -334 -16 62 223 -267 256 -178 -91 136 77 122 -97
6110 -97 55 -40 18 -278 -212 3 331 285 -199 -79 192 -155 290 108 -5 112 -58 223 -65 223 -69 43
6132 43 -40 72 255 106 121 267 -75 -53 -190 -9 11 153 132 -189 -35 233 -227 169 127 -122 146 -81
6154 -81 -170 -91 -273 -78 -35 -18 -132 -122 109 -87 22 117 -17 197 -67 -116 157 447 -43 -164 -192 200 118
6177A18j7J32k13K36j40m52K41L39J3j49l43M01N3j11k25J1q5L83k34J75k32n5
6199a54J21J68r1m03L19j67J17R9J0k15J15J75MJ05Q9m61K22r3L31m28J39j39
6221a37K69m9m7j30P7K40m10P6n0M6P4J64k96L14j09O4k55K45l59L40l57L71j76
6244i5L65M2j51l40O9l4n9J52n1J78oJ38k42j33J07R9M0j19n4j8R8j98K81l3l5
6269AK1N2j66M5O3JJ04l14L26k90N22l80J6r0jJ97k28L5p6K17Q4Rj40J10p4o6
6295b2R5l24R3M67k99J78m8k67J61R9k26j39J19K83k77K51j47j82K26j08L8J80
6317A51j28M4Qk21N78l09r8K28q2P7j61k10L01l80J75P9j41l3K30J17n0l27J51
6340aK25l0k76L41m42K87q6l1J26p4r0q8J77k09n7J87L4N9l2rP2J95k75k03M93
$$ plain form
6177 118 101 233 20 256 116 -336 -95 244 257 108 -235 166 219 108 -117 -106 -191 192 -42 133 -99 -154
6199 -154 -33 135 44 -359 -40 -207 -90 9 19 -196 -81 94 98 203 292 -169 53 -40 291 -137 2 -137
6221 -137 132 83 36 -94 -17 223 -187 -111 -161 -115 -41 123 -173 141 32 96 -159 86 -273 67 -290 81 -95
6244 -95 270 312 161 -179 -110 -144 -203 -51 -102 76 70 208 -34 -167 -60 39 79 -40 -94 -112 -14 -212 69 36 1
6269 1 22 74 -92 -47 16 17 121 -193 133 -157 365 -15 1 -89 -90 107 -121 -86 -162 55 139 148 8 118 44 -22
6295 -22 73 -251 -158 309 10 188 140 -127 34 133 -93 -232 -113 170 -107 144 -3 -185 41 -67 -29 151
6317 151 23 67 75 -146 432 123 25 253 171 248 87 -123 178 -202 -27 52 -89 -122 108 225 175 -152 -1
6340 -1 224 194 -82 259 -183 104 18 -13 113 39 -51 -139 38 -171 -228 -41 -7 52 20 11 83 278 3 -200 293
6365B93k32j39J52k18J25k5N9j12J64k42M53m22Q4k13M02k99J89L38J2j22j33
6386A14M0p0K23m29J00K62k99J43p8k71L54k7j35R2p2j00K36j17k0j72K63R8j29
6409Fj68J63o5R0K37n1R0n37J63K6n2j08J33K90n52K78J89j70RK34j38j47j09
6432a89K39k64M73l32J08p2j05K70J57m98K39n8j28J39J1K55l81K02J23J49n7
6453B81j44l57M73j78O3k92K26j79O0J35M4l41J25RK95k19l8o8R3J48J16m19N8
6476a09M2L70m48K76k87O6M31k19q4mj10N6o9j77M83l60J14J02K3k19L21j18m9
6499C1OK02l49K08k25r6K76K00j68J5J40k08Q1l9j02J62R6j42k2j05J63l01K6
6522a51j71M49m4m60K92L27k36o0m3l2J11j91J91m1J60lj37K3q6R9KL2j20K05
$$ plain form
6365 293 61 -78 74 -144 -19 -44 15 -97 67 -175 278 -144 -60 -273 129 -170 19 357 369 247 114
6386 114 154 84 307 -122 -22 240 -59 84 6 -265 89 62 -73 19 -53 -153 83 -34 -54 -226 37 135 6
6409 6 -162 1 -64 26 263 212 302 -235 -72 -46 -98 -206 -73 217 -335 -57 132 -38 -29 205 67 -80 -189
6432 -189 50 -214 259 -73 35 -37 -142 128 285 -213 26 -32 -160 -21 -10 245 -136 66 189 338 281
6453 281 137 -220 253 75 138 -154 72 -107 -47 88 132 -209 -84 -75 220 1 -37 -105 -12 136 252 -167 -109
6476 -109 -67 303 -145 131 -156 -90 341 122 38 34 -76 -20 -89 -266 217 -143 -29 73 96 -123 198 80 31
6499 31 37 239 -110 98 -127 -223 53 253 85 100 240 32 113 74 -28 134 230 88 66 -39 124 -177 -151
6522 -151 -322 127 83 -377 -85 242 6 -54 -97 -129 -18 -209 -18 -59 101 98 -39 -16 -102 -3 -1 31 -89 116
6546A16p7P9J39n0J13l60jj34L0J67K12k69J89q9j39r4o1N07l01J93k19K17l64
6569a96J90R0j74L79m62M43l31j6J63l5j04j92J49L6J80m00L32j79M20j55j3r6
6591B9k68M48n02L89j00j9ok65L67K6J18k71J31Q3l5m17j09M72j53j03OJ79Q3
6614H3mkl98K76n4k4r9L02k48nK79k45N6m3n1R5K56j15J22j64j79L7K93m9k40
6639a21L89k78k2N9L7p7J47k75%j54N32j37m8M7l77M13l68N5K68j80J00J09J35
6662B54j71k07KP5Jj5K30r1K4j53O9K3P0k21Q8Q2K26l86K04n5J12K04k01o8O9
6687A65j15P6n1k14J81j90R4K32qL07n47K45L3P8o0j51l20L62J18j73pN2J56l78
6711a15M1L4K94J06j60q2J92l80L16k93J52J0k08N09m85O2jl2Q5j54J08J04j46
$$ plain form
6546 116 39 118 257 207 320 -40 -41 -175 -145 22 234 -35 154 65 -74 -168 -229 278 -23 170 -49 168 -196
6569 -196 -6 84 -90 289 -173 270 -61 -77 86 51 -53 -245 -96 -60 120 -280 52 -127 293 138 125 29
6591 29 -239 209 -293 96 -4 -23 -29 -294 73 99 217 -54 77 160 125 -292 -401 71 -82 -185 -179 0 83
6614 83 79 77 -321 -45 -99 -123 -222 80 -168 -173 106 -139 -83 -126 -177 -82 174 59 181 17 -162 -125 168 119 -121
6639 -121 268 -10 -32 27 64 -13 134 -141 -141 -295 237 100 52 99 -278 135 -233 -178 90 -90 10 119 254
6662 254 83 -124 -122 -47 -46 -61 169 78 102 -51 18 41 111 -110 -22 60 286 -100 104 49 161 365 164 96 165
6687 165 50 126 75 -139 42 -148 -54 178 170 477 -70 175 208 286 226 75 -245 117 235 62 55 107 263 -115
6711 -115 -74 -40 254 360 200 118 310 -70 246 -47 105 115 -93 416 -69 -7 -8 -40 45 -109 -1 103 -43
6734d3R5J66k41k06J66j06L26n2l38J39K04j95J9j12J77O4o3j1O4M8K16p81M02
6757f2R7l21L29J42l44M02j00j43r3J23L0n3j50K25q0K44K9l16j30J82Q1k44p7
6780b29K72Kr7j26K18l57L79k08K96p2J63n15K25K45m48M25n2k11j84Q1M47l32
6802g8K09O4j09o3L8r9j80J68j34M89k26l0K98m35M5J89p0j09k4k8Q2r7o8l3K45
6827D4K45n05L4L22m03k59L21L19l48K21J22j57q7L14j42q8O1K0Pk16M20k87k84
6850c26M31j10k66R4O8K37j12K53k49j05P8K23j63J44k19K71k85j09J08n11Q52
6871C04m80J11J22j21q1j0J63M9j93K43n6j63N2K86n28K83n1R6j25j15L7J05K55
6894A83j32j7k98K65o3L9Q2J91k51k45K45j17K53j76k1l5K42k88r5nK20K30n01
$$ plain form
6734 -43 52 218 -23 -229 -63 -169 157 105 -233 -94 110 -85 -66 -178 -1 63 0 -11 53 101 317 -464 -62
6757 -62 35 -286 43 185 -159 243 143 0 -93 30 60 7 -143 82 2 246 275 -41 -171 11 92 -152 -229
6780 -229 43 45 -52 -178 40 -317 62 -146 150 78 241 -274 -49 196 -252 173 121 -90 -274 -193 254 -78
6802 -78 131 195 86 23 61 -38 -218 -50 -184 305 79 49 347 -88 -43 146 76 -33 -57 -85 -3 -100 -168 -201 44
6827 44 289 -216 -182 140 -263 -522 -201 118 -230 -9 113 -44 -131 183 41 -47 14 34 41 -175 245 -42 -326
6850 -326 105 -5 -271 -177 -109 128 16 269 20 -85 -7 216 53 197 -22 249 -36 -145 -37 -548 304
6871 304 -176 -65 57 -64 -145 -155 8 57 -136 107 51 -112 -60 226 -302 -19 -70 26 -99 -214 -177 -72 183
6894 183 51 34 -264 1 -62 -23 59 250 -1 -246 -1 -118 135 -41 -62 -97 145 -143 -238 -243 -23 207 -294
6917b94N78m29J51q2Q8n5m4J42L26m55J47j79m8J1N3K09j59p4mJ83k14n2K55j89
6941a35j67M41R2l69M72j55l99K24j4J11k86O3j03J83j92K43l10J92L38k31J01
6962I9J16j88J45j24r1k88J50L11j53NJ36J2K7k03J74k5q3J21l89K85m9M4m6J42
6986A28l8j1j15n2R1j26L30o7n50N64J91k11J08j46j92M83m36J27l31L31l49N44
7008B73R5n79L33k06N55m24j42M03l37K69m33L75k84l5l6K83l9n3l58R0K64l16
7030c02K93j46K11l00K07j4K14j36N2j88j32M71j03mk33R9R0j03m1l3M2K1Q3j11
7054f3j4K88j78j29R0L51n29n7L20N6j35J82p0l15K12J06j30l3J20j32K22j50
7076A2j36m1K43k6K90k65Q0l4j33k00J86L04l67K40m0O2kn4R6j37j90J23o8K9
$$ plain form
6917 -294 284 -145 6 -76 12 -43 -87 55 381 -74 73 -106 -154 -143 -90 119 -40 -114 -118 65 -149 -201 54 -135
6941 -135 -302 139 231 -138 334 179 -220 4 -10 101 -185 -122 -225 -42 -234 9 -301 -109 229 -2 99
6962 99 215 27 172 48 -43 -331 -181 130 -23 -18 118 130 157 -46 128 103 20 141 -248 37 -12 32 -14 128
6986 128 90 79 -36 -88 3 -123 207 140 -410 154 345 134 242 96 -96 387 -49 78 -253 78 -271 273
7008 273 368 -211 122 -84 471 47 -95 308 -29 240 -193 182 -102 -137 -173 110 71 18 -340 -250 14 -302
7030 -302 -9 -155 56 -244 -37 -51 163 27 79 -109 -241 230 127 123 -110 -11 79 -24 -65 -98 -56 -35 48 -63
7054 -63 -77 211 33 -96 -6 345 -184 -241 79 135 0 182 112 -203 9 115 -15 -48 72 -60 162 12
7076 12 -124 -165 78 52 342 77 157 123 -10 -210 -24 280 -87 153 113 175 173 119 215 78 -112 11 -57 -28
7100b8J18j00J43j05K52m07k10J78K17j49J56k24J93l6P8j80J47L9j84J62j70
7121a10K39k14J67J03l4j75J13k14M3J72l78N90j79l72R9J99k26J25p0L21l27
7142a28K7M35j97j4Jj11j53J41l05J78J60k4p0J08j99p4M5M01m00K18p7O8K16
7165B46l62L9J46p2J9L6m10L18J73k37L45k70K13j33R5k04N5K12k68L6k76M20
7187A21Oq7M5r3k06J66Q8m6J60k51K1j44K40K34m33N61k49m8o7m0k65O78k96l36
7211b41J56J31K21o55M61k25J15j9j3J36J7L1j87J15r0K21kl04J37k62M87m01
7233a71J94q4n9L10o10M28j88K72P4j99K2N6Q4l78K76n9N5p5K00l40N3J42R7m5
7257E5oJ28k57j49J65P1O5j61J58l40L30j55J1J85k95k7K40J26l59M96k87q3J61
$$ plain form
7100 -28 90 -10 133 28 280 -127 -337 -159 58 -91 65 -159 34 -2 76 -104 43 82 -102 60 -110
7121 -110 129 -85 82 185 151 -24 89 -125 -82 90 -288 302 123 -249 -150 49 -177 -52 -122 199 -128
7142 -128 -101 334 137 123 124 13 -140 1 -304 -126 34 10 -60 48 -151 -225 -180 221 -179 39 -38 30 246
7165 246 -116 -77 69 -3 16 52 -358 -40 133 -104 241 -29 184 51 146 -58 -3 209 -59 -23 -299 121
7187 121 127 40 85 -8 -214 -48 40 -6 154 -97 -76 -220 20 254 -179 382 133 85 18 -22 -287 391 95 -241
7211 -241 -85 46 267 -388 73 -152 -37 -56 -69 67 84 115 -72 43 -47 174 172 -132 5 -257 230 -171
7233 -171 23 -61 -120 190 -420 8 -180 92 166 -33 -11 45 129 -249 27 -32 23 -52 148 -192 -139 3 100 55
7257 55 49 177 -80 -229 -64 7 72 -89 69 -271 59 -96 -85 100 -195 -222 18 144 -215 281 -6 -89 72
7280G2q8J9J32JO4k1k66n9J83j6J26k42P1N8Q4j60J51p7j58J05rk12J17MQ9j6
7306d8j6J34M5J13j03o7k58J64J7K22j16j15k5m8Q1j41L06o5k68L32O0o3l81J83
7330e7jL23n83K83k00J64J47J68k90j16O27m08Q4k59J48p2j4J07q7K5j4J5j58
7353a68K76k81J00k31L16j01K49l20Q2M22k47P7O2l72K15p4j20J22J67l07L23
7374A90j38N9l62L47K03j23l21K17k07J73j32J9J64K49l01j96L24j67R8j96qk13
7396c21L06r8j30O5K5L16J04j67l17R7L27k99L1P9P9l1r4J83k25N0J56n1k87J63
7420c9K43j09p2j80J44m5J33j51k8L39m10N00k91j49J72j38L72k27j39N5P6l56
7442c00L97k22j6K89L9j56L50k46J15j64oj00j08J50K17k96P4R3k98N17k80m7
$$ plain form
7280 72 -16 3 135 136 200 179 -87 -146 37 21 147 -95 -24 34 118 -42 109 32 -126 -21 -30 -242 -125 -121 -32 -48
7306 -48 -64 70 115 228 125 58 -200 -36 -19 203 87 -28 -53 -101 -20 -161 145 80 -188 144 204 141 -240 -57
7330 -57 -58 265 -318 -35 -235 -71 76 244 -46 -162 465 57 141 -118 30 -42 -56 51 -36 -11 -25 -10 -168
7353 -168 108 -173 -73 -304 12 -89 160 -160 -78 344 97 174 236 -136 79 5 -115 7 174 -133 190
7374 190 52 111 -251 96 299 176 -145 72 -135 38 -94 -75 89 338 37 -159 165 -2 96 -100 -108 -321
7396 -321 -15 -113 -243 -178 -153 163 267 100 -217 -120 207 -92 -61 18 97 66 -28 155 -70 -20 136 85 -202 -39
7420 -39 204 95 23 -157 -13 -58 75 -76 -104 235 -175 325 34 -115 57 -81 291 64 -75 -20 56 -300
7442 -300 97 -125 -141 148 187 31 381 135 250 86 80 -20 -128 22 239 -57 17 110 -188 329 49 2
7464Bp9k15K47j58M5K27o0L7m7J6j34L03l06K4J37K7j04j68K37q7K7j76J30k38
7488c13L60j7l88L85J0j41j02K43j75K94l59K15K49l67pj60M26l85k5L74k52l
7510a38L41k22Nj08J68J25j57o9m8k1j97L12lL3q2K43j00j18J4M74k45l04J64
7533F7l4j53r6N48l14m1j36K93j91O8L17m05j06J38K3K90k69K2K0J62m21J22o9
7556a65l7K05m3k40K20J75l21K28L6J43l53K96k91O7Q3l42P86m77k07L64j11q9
7578g3J45j52j00N6K65m45M75l46L04q3l0r5j6K39j27j69J05L22k05J05k63J98
7600A10j59j73K82l77J95K16N8m62M82j55j70K4J12J56j61m9j60M14j02Kn2m2
7622a1J00K17j81J9l52N3L23j20l07L93n8J24n8j69K6N8L13l92K0l2k30J4K6K64
$$ plain form
7464 2 -77 -292 -45 -203 -158 69 9 46 -1 15 -119 184 -122 -98 39 66 -38 -206 31 -56 -29 -205 -75 -313
7488 -313 47 30 -358 27 37 -104 -206 37 -138 156 -203 12 261 -106 -113 -273 153 -232 -257 117 -135 -138
7510 -138 203 -19 -14 -122 46 171 14 -55 -103 -124 -321 -9 -12 21 -61 182 82 -36 -22 452 207 -97 67
7533 67 33 -120 -216 332 18 -23 -159 134 -57 11 328 -77 -183 -45 -22 268 -1 21 41 203 -218 -96 -165
7556 -165 -202 3 -40 -280 -60 115 -206 22 58 201 -152 144 -147 -80 3 -339 447 -30 -237 127 16 -73
7578 -73 72 -80 -180 -124 141 -304 171 -175 129 46 16 -79 -95 144 17 -152 -47 275 70 175 -88 110
7600 110 -49 -222 60 -317 -122 94 152 -310 172 17 -153 -129 -17 139 -22 -71 -231 183 81 83 31 -11
7622 -11 89 306 125 144 -208 -155 168 48 -259 134 76 200 142 -27 -1 57 370 -22 -2 -34 -264 -250 -224 40
7646D0J61l34L62k00j37K18j82n5J20K48m61K17J8j09j55N08l14r1J21K1j1J20
7668A05N9p6qj00j0lML8k39L60N3r5kJ7k64p3L73n75J09N04j40R4k82M21o26M64
7694A08q7L26l45J02P4Mk03k8J1j03K39K42n66Nmk99N81r4j94K12j6J96r1m4j85
7719a59K94l70J69K91j89R0m65K80j22L34k7q8K10J06l39R5r6Q1J11k57J58R8
7741B05r2m11O21k22j2j20j25J12J02k02k5O5J29J49l04j90K61K5N1O6k48lK63
7764I5l63L81k49J55J58j77j35M00k28j87L39rk08J08qk03L15lk9n10M84M9k10
7787c5L9o8J84p0j44p0j33L18m1j2J59l28J18Qk5nO3J08k19n1OR9K20j56N7J8
7813D0J90k08R0k14L21Rj56Q7k00J24Q0n27L47l6l3k07K60r6R7j77K51K17k67
$$ plain form
7646 40 201 -133 229 29 -108 110 -72 -127 -7 241 -220 -3 15 -94 -249 259 -55 -146 -25 -4 -15 105
7668 105 164 88 80 -20 -30 -33 -29 9 -230 130 183 88 86 103 -161 -234 139 -436 -327 177 37 131 -151 270 -356 108
7694 108 21 347 2 104 178 182 -21 -49 -38 -141 98 340 -226 -221 -225 -524 57 -37 -231 -19 -35 161 70 26 -159
7719 -159 135 -235 -66 225 36 126 -339 -59 -181 153 126 38 248 354 15 110 14 95 206 -51 107 205
7741 205 113 -298 323 101 89 -31 -156 -44 58 -144 -169 -104 25 174 -130 -320 -59 -34 17 83 -165 -168 95
7764 95 -268 113 -136 19 177 0 -135 265 37 -150 189 180 -28 80 72 -131 184 181 152 -358 126 175 -35
7787 -35 4 -64 120 50 -94 -164 -297 21 -20 -32 127 -201 -83 -75 -100 -105 -42 66 -153 -204 -198 -99 121 -35 22 40
7813 40 230 22 112 -102 219 228 72 159 -41 83 163 -364 -17 -53 -86 -293 -33 -129 -32 -209 42 259 -8
7836hOl1K64l79K29k62M01k91k2J33J74j84j70K99M9j34k31J87P5k2j72%J79K7
7860A17J29k81k22N20m46K70j6k37J65M1k93M44Q6m28J73J46k43j05r9L59Q5j08
7882E7oj7k49K30k36R8M8K46j76k76J96L29j49J5k84L08p9p1J3Q0j23k70K37L3
7906d6J14L01j29m18L12k04l08K60K58Q4j06Mj33J53j4J49pl55q2J36l31M95J92
7929C25m60L16j61L2R9p3q4M9m5J97k42j33Q2PP8K79k29n7J39J84l47K28k39K12
7953A57m7j48k50M33j28l3O6K7J00k29K67j04j65M2o6k4P1J72j37j21R7n3K49
7976A76k77N3k30L08l10J59K21j20K43l05p1L6K98l51q8O59r1j58q7j36N5L84
7998C68l33K09l67J09oQ6k91L00K5O2j41n4L33j97k93O5L48j20m9K7k21M0k44
$$ plain form
7836 -8 -2 -33 231 -148 81 -181 220 -71 -93 40 214 30 -140 159 208 74 -157 30 105 83 -89 -89 90 117
7860 117 246 -35 -257 263 -183 87 71 -166 -1 40 -253 191 277 -151 22 168 -75 -180 -279 80 165 57
7882 57 51 34 -215 15 -221 -123 -75 171 -5 -281 -85 244 95 110 -174 134 55 -16 -3 77 -46 -316 -79 -46
7906 -46 68 369 240 -178 134 -70 -378 -118 140 224 118 122 -11 142 128 277 270 -85 -167 -31 -362 133 325
7929 325 -135 181 20 52 151 78 -6 43 -2 195 -47 -180 -98 -91 -13 266 37 -20 119 303 -44 184 -55 157
7953 157 110 -38 -288 145 17 -16 50 77 177 -52 215 111 -54 -12 -78 -102 -31 141 4 -117 -20 -73 176
7976 176 -101 -48 -278 30 -280 -121 100 -20 223 -82 -153 -117 181 -170 -258 401 310 152 65 -71 -16 368
7998 368 35 244 -123 -14 -20 66 -225 75 100 162 21 -33 300 103 -190 -125 223 103 54 81 -140 -100 -344
8021c44j66K21J30N41l19r7Q4q7O8r2j4j51K19o6J27O5k36n2M6j52K71J05k10
8044a09L89l89K68j19j54j96K20K82J58Pl88j27L69l33j26K36k03J4K83o2j72
8065a52L58l58J08k2K11j13j79K39p2j6N2o4j14M01j77J31m6k37J90l77J37K3
8087g7J20j24M0k02M3L96j23K51k32J70k3l00p0R8R9J18j10L2l46K39k58L74j76
8110f1L97l77K83k05M3o8Kp3j2j05J41k48N10k59R5l6R0k06r3MJ77K04j20j51
8134f8M0j7J15J36k23j85J25K41J88k82r8n6P6Kq3J91l6N2k35L87k17o1k93K33
8158f8k22K36K88k28K1N6q9Q9j20o1L15N3m70N7J17M7J31R0J8k30q4M5q8J66L9
8183A08L3k99J53L4k83L76k98Q9
$$ plain form
8021 -344 -510 -289 -159 382 63 -34 50 -37 31 -61 -75 -226 -7 -73 54 119 -117 -169 -123 -275 -4 101 -109
8044 -109 280 -109 159 40 -114 -310 -90 192 350 357 -31 -158 211 -122 -248 -12 -215 -201 82 20 -152
8065 -152 206 -152 -44 -66 145 32 -147 92 20 4 56 -8 -122 279 102 233 187 -50 140 -237 -100 -77
8087 -77 43 -81 -41 -243 -200 196 73 324 92 262 239 -61 -131 -33 66 184 74 106 -240 -1 -259 115 -61
8110 -61 336 -41 242 37 80 12 14 -59 -71 -176 -35 -283 227 -32 63 27 117 -89 -182 -178 -1 203 83 -68
8134 -68 -28 -45 70 206 -17 -202 -77 164 352 70 -28 -84 -8 -6 -89 102 66 118 -117 270 53 -8 -301 -68
8158 -68 -290 -54 234 6 27 83 -6 83 -37 -98 217 270 -200 -143 -26 21 152 242 260 30 -54 -9 -97 69 108
8183 108 141 -158 -5 29 -254 122 -176 -87
8191h7
$$ Imaginary data points
##PAGE= N=2
##DATA TABLE= (X++(I..I)), XYDATA
0@%%%%%%%%%%qJ6j6J6k0K8l2L4m2M8n6O8p8R0j04J20j36J56j76J99k24K49k82
33a50L17l51L91m37M85n37N95o61P33q11Q98r94J101j225J366j526J711j927K188
52A166k509K911l435M151n186O832r867J7291o7722j12740J08605Q3635n0376
65b7244j00712K7415J01099K1052r2640m6789P3274Q3235m1158r2753O179J04471
77A5429L8627p7443n7546O9035Q4186l2230q8695M244R0258L7165p4457o6430
89e7857M9903Q9517j4368r0387j0610R0913M3611p4066p0186M9768Q6657k3105
101F9790r9222j8589Q0349L8176p0445o7815L9601P7222j5816q7913j7490Q0189
113H037M5724o1468o8689L1956P7000m499q0007k3647P2238M6329n4605o4975
$$ plain form
0 0 0 0 0 0 0 0 0 0 0 0 -8 8 -8 8 -12 16 -16 18 -24 24 -32 36 -42 48 -56 64 -72 84 -92 107 -117 132 -150
33 -150 167 -184 207 -230 255 -282 313 -348 385 -426 472 -522 579 -646 720 -806 905 -1022 1166
52 1166 -1343 1568 -1867 2284 -2902 3930 -5937 11354 -56368 -169108 -60503 23132 -27244
65 -27244 -127956 -100541 558 21610 -71030 -117819 -44545 38690 -2468 -95221 -89042 15429
77 15429 54056 -23387 -80933 -11898 72288 40058 -48637 -44393 45865 83030 8573 -57857
89 -57857 -7954 81563 67195 -23192 -33802 57111 100722 26656 -43530 6238 92895 69790
101 69790 -29432 -48021 32328 70504 59 -67756 -28155 49067 33251 -54662 -72152 8037
113 8037 53761 -7707 -76396 -44440 32560 28061 -51946 -75593 -3355 42974 -11631 -76606
125g6606L1323P8772M662p1779k8593O5194N5619m2050o4623K4268P6532N364
137E8083p3278l1062O4674N5890m3075o7787J8839O9521N437o5806k9852N3862
149A5446M6687m0572o3709J5105O3436M928n9402k8780M3168M2873k8092n3110
161d2022R117N7872J1980n1761k9455L9733M6978k1163n1763M149N3117J3350
173D0132m6598k9313L5555M2444j8695n2310j927N2149J7213m7169l1805L5112
185e212L8369k2835m5902N359M6064J1270m1581k6274K9734L5456j4151l8985
197b8688J094M0042J3676l5210k3871K9993L4050j5692l4957K735L5106J2575
209C0853k6895k0720K1543K9800j1034l2719N99L3619J1738k8523k2180K0029
$$ plain form
125 -76606 -45283 33489 38151 -33628 -62221 2973 58592 16542 -48081 -23813 52719 58083
137 58083 -15195 -46257 18417 74307 31232 -36555 -17716 51805 57242 -8564 -38416 15446
149 15446 62133 21561 -42148 -27043 36393 41321 -18081 -46861 -3693 39180 11088 -42022
161 -42022 -32905 24967 36947 -14814 -44269 -4536 42442 21279 -30484 -26335 26782 40132
173 40132 -6466 -35779 -224 42220 23525 -28785 -30712 21437 38650 -8519 -40324 -5212
185 -5212 33157 10322 -35580 -30221 15843 27113 -14468 -40742 -11008 24448 10297 -28688
197 -28688 -27594 12448 26124 -9086 -32957 -2964 31086 15394 -19563 -16828 18278 30853
209 30853 3958 -16762 4781 34581 23547 -9172 -8573 25046 36784 8261 -13919 6110
221F110K7861j2704l1153K806K8735N508k7496j7460J9379K3276j3398k8207L012
234a3731K5439K277k4066j0985J7754J6525j2740k3187M351K4104L291k1354r291
247b1613J7383J5728j0771j7556P204K3766K335k0447o005J9568J6108j0582j7025
260a907O800K2434J256k2424n651K1846J2894j8193j8653J0059K1321m448k4059
273A275m205K1892O744k1291j4927J3250J8208q091k3372k456K1771P987k0838
286d053j4796J5240J8578q822k3059R96K4687P415k1561j3746J7859J9821r046
299I513k0783J512K4651R416k1928j6288J9341K4776j0191k6674K162K8259Q018
312C1784k5495j5682K1474K2679j3665k7523L231K7267P799k5837j8793J9377
$$ plain form
221 6110 33971 21267 -9886 -7080 21655 27163 -333 -17793 1586 24862 11464 -16743 -13731
234 -13731 11708 13985 -10081 -21066 -3312 13213 473 -22714 -18363 5741 9032 -12322 -21613
247 -21613 -4230 11498 727 -16829 -9625 14141 16476 -3971 -9976 9592 25700 15118 -1907
260 -1907 4893 27327 28583 6159 508 22354 35248 17055 -1598 8461 29782 25334 1275
273 1275 -2930 18962 25706 4415 -10512 2738 20946 12855 -10517 -12973 8798 16785 -4053
286 -4053 -18849 -3609 14969 6147 -16912 -15916 8771 16186 -5375 -19121 -1262 18559 9513
299 9513 -11270 -9758 14893 24309 2381 -13907 5434 30210 20019 -6655 -4493 23766 31784
312 31784 6289 -9393 12081 34760 21095 -6428 -3197 24070 31869 6032 -12761 6616
324F616K5285j3520l1285L049L0920O028k9789j8393K1613K5260j3527l1353J873
337a7223L0451Q483k8046j9570K1047K9316j1357l4892J280L6457J1868l1298
349c484k0295K4570L0370j2010l4274J192L6938J2760l1262k2967K3505L2209
361C7252j0858l6472j905L7435J4041l2840k5289K3315L2758j1200l7540l462
373a4765L5521J5472l0889k7819K0282L3960r451l8292o159L5224J8540k9986
385A638l1305J9419L6644p038l9241p237L6500K0747k8933l1345J9122L9382n116
398B3237l9015q075L6624K3064k7106l2160J7627M0440k917m0124j0113L7374
410A8856K4162k6940l3717J5158L9610q38m0570j2702L4830K4742k6246l5663
$$ plain form
324 6616 31901 18381 -12904 -9855 21065 27093 -2696 -21089 524 25784 12257 -19096 -17223
337 -17223 13228 21711 -6335 -25905 -4858 24458 13101 -21791 -20511 15946 27814 -3484
349 -3484 -23779 791 31161 19151 -15123 -13931 23007 35767 4505 -18462 5043 37252
361 37252 26394 -10078 -11983 25452 39493 6653 -18636 4679 37437 26237 -11303 -14765
373 -14765 20756 36228 5339 -22480 -2198 31762 22311 -15981 -22140 13084 31624 1638
385 1638 -29667 -10248 26396 19358 -19883 -27120 9380 30127 1194 -30151 -11029 28353 23237
398 23237 -15778 -23853 12771 35835 8729 -23431 -5804 34636 31719 -8405 -18518 18856
410 18856 43018 16078 -17639 -2481 37129 36291 -4279 -16981 17849 42591 16345 -19318
422a9318J1764L9467J387m1276j6653L3553K6502k5376l6907J0558L9376K563
434B5640l9504j8330L2845K8776k2678l6566R344L9462N624l6319j9463L1933
446G64L1186j9840l6743P368M0319Q194l5437j9859K8901L2383j7496l6358N303
459a1315L8681R857l3814k2319K6517L2941j5523l7641K041L8241J0252l4251
471C667k3316K4023L1770j4254l8268k02L6274J0954l2665k3711K2341L0796j1826
484A5583l6853k219L6268J3384l1495k4056K1821L1283r648l4547k843L4619J4823
497B6120k8270k3858K0139L1734p266l3090m184L2778J6496k5882k4892J8657
509a518L1421o684l2614n347L1255J7162k5097k5579J6003L0316n152l1597o609
$$ plain form
422 -19318 -7554 31913 33300 -7976 -24629 8924 35426 10050 -26857 -16299 23077 25640
434 25640 -13864 -32194 651 29427 6749 -29817 -20473 18989 24613 -11706 -31169 764
446 764 31950 12110 -24633 -17265 23054 31248 -4189 -24048 4853 37236 19740 -16618 -11315
459 -11315 27366 37223 3409 -18910 7607 40548 25025 -12616 -10575 27666 37918 3667
471 3667 -19649 4374 36144 21890 -16378 -16580 19694 30648 -2017 -25728 -3387 27409 15583
484 15583 -21270 -23489 12779 26163 -5332 -29388 -7567 23716 14068 -20479 -23322 11297 26120
497 26120 -2150 -26008 -5869 25865 18599 -14491 -18675 14103 30599 4717 -20175 -1518
509 -1518 29903 23219 -9395 -14742 16513 33675 8578 -17001 -998 29318 24166 -7431 -14040
522a4040K8588J7034k3046k6074J3985L0523m340l1289p007K7964J6139k1612
534F825k4645J2920K8915l123l0034p360K6159J6294k0263k4125J1123K7298j579
547A8405k8895q043K4805J6075j9080k2963R952K6313p25k6924q422K4016J6341
560B0855j7388k2119R876K5391K71k5068q554K3064J6677j6483k1029R518K4347
573A9358Q42k3858q666K1915J7220j5908k1013Q525K3764N24k3013q834K0080
586A0936J5763j5252k1041P088K2824M6k2815r539J8806J4841j4587k1436O733
599g633K2184p84k2608q413J7838J3938j3551k0295O118K1159K41k1435p733J7671
613c303J4218j2909j8472O780K1926P88k0073o153J8866J3547j2112j5505O973
$$ plain form
522 -14040 14548 31582 8536 -17538 -3553 26970 22630 -8659 -15666 12298 28437 6825
534 6825 -17820 -4900 24015 20892 -9142 -16502 9657 25951 5688 -18437 -7314 19984 18405
547 18405 -10490 -18533 6272 22347 3267 -19696 -9744 16569 15844 -11080 -19502 4514 20855
560 20855 3467 -18652 -8776 16615 16886 -8182 -16736 6328 23005 6522 -14507 -4989 19358
573 19358 20200 -3658 -12324 9591 26811 10903 -10110 -1585 22179 22703 -310 -9144 10936
586 10936 26699 11447 -9594 -2506 20318 20364 -2451 -11990 6816 21657 7070 -14366 -7633
599 -7633 14551 13767 -8841 -17254 584 14522 971 -19324 -13206 7953 8194 -13241 -20974 -3303
613 -3303 10915 -1994 -20466 -13686 8240 9028 -11045 -17198 1668 15215 3103 -12402 -5429
626e429K0599J783j8949o506J8069J3496j1412j7126O641J9780K27j9834p044
639e705J7013J1620j3248j6926N412J7500P3j9120q879J5738J2350j3414j8633
652a6219O145J8729n94k0329p396J7098J2120j3448j6507O937J8340K17j8122
665a3029o694J6801J3897j2012j7291P864K0679k11j8670n117J7206J3089j1510
678E002j6064P518J9530K29j8053n662J6468J2664j1596j6622O549J9456l65j9645
692e91n771J6517J1411j3145j6943O131J7962j392j9408o787J5799J0653j2617
705A819j6882N256J7878K05j9070p402J6292J1968j2025j6329O010J9058R81j8158
719a0399p098J6832J3494j1325j5960O055J9046J916j8178p744J7171J4090j1820
$$ plain form
626 -5429 15170 16953 -1996 -8502 9567 23063 11651 -5475 1166 20946 21173 1339 -5705
639 -5705 11308 22928 9680 -7246 -1834 15666 15739 -3381 -12260 3478 15828 2414 -16219
652 -16219 -10074 8655 8061 -12268 -19664 -2566 9554 -3894 -20401 -13464 4876 5093 -13029
665 -13029 -19723 -2922 10975 -1037 -18328 -10464 10215 10004 -8666 -13783 3423 16512 5002
678 5002 -11062 -3544 15986 16215 -1838 -7500 8968 21632 10036 -6586 -37 19419 19054 -591
692 -591 -6362 10155 21566 8421 -8522 -2391 15571 14179 -5229 -12016 3783 14436 1819
705 1819 -15063 -9807 8071 8276 -10794 -18196 -1904 10064 -1961 -18290 -12280 6778 7759 -10399
719 -10399 -17497 -665 12829 1504 -14456 -8401 10645 12561 -5617 -13361 3810 17900 6080
732F080j7193O082J9202J439j8494p909J6209J3750j1469j7971N857J9389J126
745A6098j8704q663J5752J4376j1975j7934N088J8626J382j8448q471J4624J3673
758A5424j0546j8416M160J9107J900j9017q262J4761J3176r743j8352L699J9116
771G007K738j8027q872J4666J3917q939j8020L822J9061L502j7807q881J4637
784a196J4520q534j7152K167J9158M581j7845r518J4530J5218r686j7745K344
797i158J9029M268j7275j0519J3701J4964q367j7935J680J8717N173j7641j1157
810a4520J3544J6216q566j8726K041J8305M618j6626j1472J2602J5657p721j8578
823a3226R36J8739M897j7023j1259J2595J5453p535j7877J270J7813N370j5670
$$ plain form
732 6080 -11113 -5031 14171 15610 -2884 -10793 5416 19166 7697 -10274 -4417 14972 16098
745 16098 -2606 -11269 4483 18859 6884 -11050 -5962 12664 14046 -4402 -12873 1751 15424
758 15424 4878 -13538 -9378 9729 11629 -7388 -15650 -889 12287 2544 -15808 -12109 7007
771 7007 9745 -8282 -17154 -2488 11429 2490 -15530 -11708 7353 10855 -6952 -15833 -1196
784 -1196 13324 4790 -12362 -10195 8963 13544 -4301 -13819 711 15929 6243 -11502 -9158
797 -9158 9871 14139 -3136 -13655 46 15010 6643 -11292 -9612 9105 14278 -3363 -14520
810 -14520 -976 15240 6674 -12052 -10011 8294 12912 -3714 -15186 -2584 13073 5352 -13226
823 -13226 -12290 6449 11346 -5677 -16936 -4341 11112 3577 -14300 -13030 4783 10153 -5517
836e517j0201J1129J5642n590j7758K01J8189O125j5490j1108J1782J5601n719
849G286j7083j94J7487O849j5076j1215J0492J5304m647j7492j517J7211P452
862A4857j5764j2026J0601J5322n309j7752r63J6786O814j4990j1942J0295J5436
875A1365m878j7082j652J6305Q169j4267j3059J0495J6400n470j7461j076J6623
888D412P155j3386j2156R431J6080m500j6675j536J6301P914j3400j2291R285
901c366J6245m287j6779r64J5801O834j3144j1382Q461J4906l514j6214l111J5701
915E187P404j2590j2318Q014J4691l136j6049k754J5176P357j2448j2123P665
928e924J4513j985j5687l872J4937Q848j2292j2267P557J5363k303j5737k860
$$ plain form
836 -5517 -15718 -4589 11053 5463 -12295 -12094 6095 12220 -3270 -14378 -2596 13005 7286
849 7286 -9797 -9991 7496 14345 -731 -11946 -1454 13850 9203 -8289 -9806 7405 14857
862 14857 -907 -12933 -2332 12990 7681 -10071 -11034 5752 12566 -2424 -14366 -4071 11365
875 11365 6487 -10595 -12247 4058 12227 -2040 -15099 -4604 11796 6326 -11135 -12211 4412
888 4412 11567 -1819 -13975 -4544 11536 7036 -9639 -11175 5126 13040 -360 -12651 -3366
901 -3366 12879 8592 -8187 -9151 6650 13484 340 -11042 -2581 12325 8811 -7403 -10514 5187
915 5187 12591 1 -12317 -4303 10388 7252 -8797 -11551 3625 10982 -1466 -13589 -5924
928 -5924 8589 6604 -9083 -12955 1982 10830 -1462 -13729 -6172 9191 6888 -8849 -11709
941a1709J4653Q780j1618j2505Q009J4738j946j5132l569J5112Q900j2262j2578
954a1127P401J5339j916j5703l867J4071Q737j1646j2809P335J4830k287j5756
967g398l467J3678Q008j0672j2852O214J4749j422j5470m136J3565Q911j0559
980h51j2835O175J4874r06j5217l922J3617Q550r856j1926N516J4916J31j4910
994f644m042J3107Q925r122j2166N511J4408j53j4126m879J3229R019r123j2578
1008h634M960J3919J48j4214n802J2980R375r758j2854M591J4083m8j4773n126
1022a1153J2169R201r572j2886M706J4041o01j3836n327J1870R700q526j3069
1035a3283N155J4173j29j3443m700J2268R863q028j2860N005J4024M70j3190m235
$$ plain form
941 -11709 2944 11724 106 -12399 -4390 10348 8402 -6730 -10299 4813 13713 1451 -11127
954 -11127 -3726 11613 9697 -6006 -9873 4198 12935 1289 -11520 -4185 10645 8358 -7398
967 -7398 -10865 2813 10821 149 -12703 -6489 8260 6838 -8632 -12768 797 9708 -851
980 -851 -13686 -7511 7363 6457 -8760 -12682 935 9485 -371 -12297 -6781 8135 8266 -6644
994 -6644 -10686 2421 11346 2224 -9942 -4431 9977 9824 -4302 -9181 4048 13067 3944 -8634
1008 -8634 -3674 10245 10393 -3821 -9623 3357 12732 2974 -9880 -5289 8794 8746 -6027 -11153
1022 -11153 1016 10217 645 -12241 -7535 6506 5905 -7931 -13258 -1388 8312 -214 -13283
1035 -13283 -8128 6045 5916 -7527 -12227 41 9904 1876 -10984 -5979 8045 8515 -4675 -8910
1049h910J0953R873p544j2463L784J3920J366j3526n007J0941R407p260j2716
1062g182L083J3724J405j3565o141J0923R001o789j3244K960J3141J213j3111
1075d582o382J0568R543q105j2067K589J2925K003j2809o846J0731J0123p131
1088E60j2353L089J3484J509j2153o589J1023J0192o842j2155L315J3167K280
1101H527j1735o216J0239J0270o321j2265L153J3353K212j2420n629R703R771
1114A2642o039j2529K473J2835J635j1704o372Q814R717o187j2251J460J2709
1127G203J798j2278o267Q782R275n540j1780O90J2369K359j1273o726Q631R531
1141F774n296j1910Q24J2775L079j1420o750R044J0101n484j1189J533J2437L626
$$ plain form
1049 -8910 2043 11916 4372 -8091 -4307 9613 10979 -2547 -7554 3387 12794 5534 -7182
1062 -7182 -4099 9625 11030 -2535 -8676 2247 11248 4459 -8785 -5825 7316 8529 -4582
1075 -4582 -10964 -396 9147 1042 -11025 -8436 4489 6492 -6317 -13163 -2432 7691 560
1088 560 -11793 -8704 4780 6289 -5864 -12453 -1430 8762 1920 -10235 -6920 6247 8527
1101 8527 -3208 -9424 815 11085 4764 -7501 -4348 9005 11217 -1203 -6832 2871 12642
1114 12642 6603 -5926 -3453 9382 11017 -687 -7059 1755 11472 5285 -6966 -5506 7203
1127 7203 9001 -3277 -9544 -762 8513 2973 -8807 -8117 4252 6611 -4662 -11388 -2757 6774
1141 6774 1478 -10432 -9608 3167 6246 -5174 -11924 -2880 7221 1737 -9452 -7919 4518 8144
1155H144j0685p158R518J0342n282j0936J015J2600L655j0990p419R653R934n406
1169F985j1597J385J1756K876j0953p004P972R960n235j1820P23J1496L032j0895
1183a319p540P759J0007n308j1999N66J1592K731j0145p232P410R842m330j1489
1197i455l7J1625L715r551p279P331J0085l644j1005K03J1995L846j0034p211
1211i416P892R800k834j1466j99J1587M608j0091o980P150R991l258j0977n84
1225d777J1320M464j0109p849P277R957l929j1384n11J0388M687j0012q091O929
1239a640R376l704j0781r37J0525M598r655p958O719J0239l567j0969p55J0487
1253A978M481q943p870O139J0298k789j0923q99J0814M672q658p740O015J0379
$$ plain form
1155 8144 -2541 -9699 -181 10161 4879 -6057 -5042 7558 11213 223 -7196 2457 12391 6985
1169 6985 -4612 -3227 8529 11405 452 -6552 1420 11380 6145 -5675 -4952 6544 9576 -1319
1183 -1319 -8859 -1100 8907 3599 -8400 -7834 3758 6489 -3656 -10888 -3478 6364 2034 -9455
1197 -9455 -9492 2133 5848 -3703 -10982 -3651 6434 2790 -8215 -8012 3983 7829 -2205 -9416
1211 -9416 -1524 8276 5442 -6024 -6223 5364 9972 -119 -7099 51 10042 6784 -4193 -4777
1225 -4777 6543 11007 898 -6951 326 10283 6354 -5030 -5541 4847 9534 -478 -8569 -1640
1239 -1640 7736 4032 -6749 -7686 2839 7437 -2218 -10176 -3457 6782 3215 -7754 -8509 1978
1253 1978 6459 -2484 -10354 -4215 6083 3294 -7629 -8528 2286 6958 -1700 -9440 -3425 6954
1267F954k194j0820n05J0529M648q144p622N886J0345k219j0949j392J0414N449
1281A0380q380q188N388J0109j900j0698k483J0398N155q479q223N145R570j855
1295E939j0980k245R758N490q546q141N241R325j581j0365k477R581N389p919
1309a531p747N002R642j500j0180k277R663N864p668p963N060J0002j465r796
1323d894j872R405N581p100p959M973R994j440r773j990R180N454o713q152M234
1338a072R647q63r985k441Q667N890o942q873L607R868q16j0304l109Q682N283
1353G239o445q575L113R335k73r713l459Q488O216o733p575L037R802R4r796l206
1369h451Q822O148o156p914L615R250K26q636l632Q232O430n804p935L113Q903
$$ plain form
1267 6954 4760 -6060 -6565 3964 8612 468 -7154 -1268 9077 6858 -4091 -5483 4931 10380
1281 10380 2000 -6188 -800 9309 7409 -3289 -5772 4626 9781 1302 -6921 -1776 7794 5939
1295 5939 -5041 -7286 2472 7962 -584 -8725 -3484 5841 4260 -6105 -8582 999 6388 -1531
1309 -1531 -9278 -4276 5366 3866 -6314 -8591 1072 6936 -732 -8695 -3635 6367 4902 -4894
1323 -4894 -6766 2639 8220 1120 -6839 -1866 8128 6688 -3085 -5075 4105 9559 2846 -5306 -1072
1338 -1072 8575 7712 -2273 -4714 3953 9843 2901 -5972 -2365 7503 6687 -3617 -6726 1956 7239
1353 7239 794 -7781 -4668 4667 4394 -5319 -8778 -290 5926 -807 -8382 -5345 4457 4551 -5245 -8451
1369 -8451 371 6519 363 -7551 -3936 5314 5540 -3096 -6728 1504 7934 2130 -5805 -2692 6211
1384F211K37q763l332P908O030n776p941L276Q058O57q375m097P105O573n819
1399A952q274K764R138N7q915l655P134O351n538q388K670Q837M54q772l554P267
1415d72O333n380p849K167R368M38q720l268P100N882m289p456J882Q514J437
1430E687p841m166P222N865m118q126J907Q842J138q801l504O755N918m762p164
1445e148J598P850R28p639m372O840N957m725p256J219Q588J072q137l341O274
1460b92N824l748p703J786P402J739p226m405O457N981m036p516J804P773J462
1475E302p555l898N887O395l405p742J077P840J651p090m014N517O273l296p630
1490d688Q77Q160J303p390l851O223N658l582p492P14P731J494o975m237N352
$$ plain form
1384 6211 6448 -2315 -5647 2261 8291 2515 -5426 -2150 5908 6565 -1810 -5907 1198 7771 1952
1399 1952 -6322 -3558 5580 5637 -3278 -6933 201 6552 1014 -7374 -4704 4133 4587 -4185 -7739 -472
1415 -472 5861 481 -7368 -5201 4167 4605 -4115 -7383 -283 5599 1310 -6146 -4264 4250 5687
1430 5687 -2154 -6320 902 6767 2649 -5477 -3570 5272 6410 -2391 -5895 860 6778 2016 -5148
1445 -5148 -3550 4300 5228 -2411 -6783 57 6014 1289 -5967 -4748 3840 4912 -3225 -6566 -292
1460 -292 5532 1784 -5919 -4133 3269 5008 -2218 -6623 -166 5815 1779 -5737 -3933 3840 5302
1475 5302 -2253 -6151 -264 6131 2726 -5016 -3939 3901 5552 -1538 -5552 -35 6238 2942 -4688
1490 -4688 -3811 4349 5652 -1738 -5589 634 6292 2710 -4782 -4068 3663 5157 -1818 -6055 -703
1505g03O052l518p677J082P820J583p404l969N545O140l529p230R57P502K014
1520D665p052m152N636O486l340o716O87P576J504o831l933N536O001l176o796
1535c905L40P222K110o542m537N293O162l432p268P84P166K204o687m341M549
1550h82O467k700p742M34P347K267o440m923M712O498k686p776P12O843K214o640
1566b295m165M315O388k128p550j64P462L073p081m317N007O179k324p343J60
1581d783P134K920o457m575N128N810k118o951j82O945K778n791n138M909O185
1596E814k393p026l28O748K618n867m777L992O082j674o965o09O388L267o109
1611h39m932L808O318j616p436l28O592K893n564n117L654O618j767p011q96O364
$$ plain form
1505 -703 5349 1831 -5846 -4764 3056 4639 -2765 -6734 -1189 4951 1422 -5808 -4851 2651 4665
1520 4665 -2387 -6539 -903 5583 2243 -4473 -3786 3790 5294 -1537 -5470 66 6067 2891 -3905
1535 -3905 -3565 3657 5767 -775 -5312 -19 6143 2711 -4557 -3773 3393 5597 -1090 -5431 -882
1550 -882 5585 2885 -4857 -4423 2924 5191 -1249 -6172 -1460 5038 2352 -5424 -4712 2131 4345 -2295
1566 -2295 -6460 -2145 4243 2115 -5435 -5599 1863 4936 -2145 -6462 -1455 4724 2400 -4943 -4783
1581 -4783 2351 5271 -1186 -5761 -633 5177 3059 -3892 -4074 2871 5649 -142 -5280 -371 5814
1596 5814 3421 -3605 -3933 2815 5433 -434 -5211 -1219 4863 3189 -3776 -4385 2003 5270 -839
1611 -839 -5771 -1963 4355 2739 -4697 -5025 1567 4460 -1104 -6221 -2567 4051 2284 -4727 -5623 741
1627G41L768n928n121L774O970j665p066o56O572L098n495m291L208O932j142
1642C699p089r37O761L523n648m896L500O515j330o710r21O173L171m937m917
1657d043K943N940o11p049j675O442L407n210n200K996O077j341o478j505N974
1672F67L083m652n489L135N974o70o143k144N527M409m764n359L137O194r86n915
1688c996j260N720L813l973n447K905O434k68o358j743O024M149m361n643L103
1703i01O591r91o232j497N608L442m362n131K178O167m49o309k501N779L827m660
1719E59n694K352N871l0o660j920N553L058l988m995K012N405L36n852j919N005
1735i07L926l778m966K077N731L00n548j934N234L725l028m969J959N777L52n412
$$ plain form
1627 741 4509 -1419 -6540 -2766 4204 2539 -4527 -5183 1389 4487 -1008 -5299 -2091 4841 3699
1642 3699 -3390 -4327 2434 5957 309 -4587 -1087 5428 4098 -2612 -3533 2640 5811 874 -4043
1657 -4043 -1100 4840 4229 -2820 -4495 1947 5354 144 -5056 -2060 4017 2676 -3802 -5307 667
1672 667 3750 -902 -6391 -3256 2718 2048 -4095 -6239 -712 3697 -1067 -6426 -3289 2905 1919 -3996
1688 -3996 -5256 464 4277 304 -5143 -2238 4196 3928 -2430 -4173 1851 6000 1639 -4004 -901
1703 -901 5690 4699 -1533 -3030 2578 6020 1658 -3473 -1295 4872 4423 -1886 -4387 1392 5219 559
1719 559 -5135 -2783 3088 3058 -3602 -5522 31 3089 -899 -5894 -3882 1523 1859 -3993 -5912 -907
1735 -907 3019 -759 -5725 -3648 2083 2383 -3165 -5099 135 3860 832 -4137 -2178 3599 3951 -1461
1751a461k490N426M189l199n766K119N990m3n634k055M704L665l199n481J294
1766a941O071R1n628k579M358M464l457o018J690O083j60n415k710M468M002l196
1782A23n443J679N611N39n555k723M996M255l154n363J182N818J296n910k196
1797d845M685L840k727m941R64N838J130n439k702M730M238k836n206R50N448
1812C127J291n161k577L646M686l111m773L38N653J196n079l321M454M231l000
1827A600n061P78N294Q43m642l220L653M833k785n631P05N670P67m673l136L749
1843a256M747k980m765O32M992J618m972k813M003L982k021m925J28N807J219
1858C396n017k302L845M105j723n181J86N563J280m955k761L667M393j858n304
$$ plain form
1751 -1461 -3951 1475 5664 2465 -3301 -1182 4808 4765 -869 -2924 1780 5445 2246 -3235 -1941
1766 -1941 4130 4221 -1407 -3986 372 4836 1379 -4639 -2949 3134 2974 -2441 -5151 -683 3319 123
1782 123 -5320 -3641 1970 2509 -3046 -5769 -773 3482 328 -5035 -3853 1965 3261 -2649 -4845
1797 -4845 -160 3680 953 -3988 -3024 2814 3944 -1495 -4197 533 4771 1935 -3271 -2321 3127
1812 3127 4418 -743 -3320 326 5012 1901 -2872 -2534 3119 4315 -764 -4085 369 4600 1600
1827 1600 -3461 -2683 2611 3454 -1188 -4408 -755 4078 1293 -4338 -3633 2037 2804 -1869 -5005 -1256
1843 -1256 3491 511 -4254 -3622 1370 2988 -1984 -4797 -794 3188 1167 -3758 -3630 2177 3396
1858 3396 -1621 -3923 -78 4027 2304 -2877 -2691 2872 4152 -803 -3564 103 4496 2638 -2666
1873b666L37N290J259m622l140L756L735j818m872J73M761J512m481l223L201
1888g98M246j801m934l87M959K064m711l233L289M396k241m711m5N046J397l814
1904a278l627L605M342j817m977L38N223J366l842l323L019M945j778m929J20
1919b613M931J719m029l161L149M232j252n221n7M629K120m310l170K613L996
1934C576j054m860o21M881J420l887l003K656L917j184m728p51M723J908l653
$$ plain form
1873 -2666 -2329 2961 4220 -402 -3542 214 3949 2131 -2741 -2568 2193 3705 -776 -3999 -798
1888 -798 3448 1647 -3287 -3674 1285 3349 -1362 -4595 -1306 3090 849 -3862 -3907 1139 2536 -1278
1904 -1278 -4905 -1300 3042 1225 -3752 -3414 1809 3175 -667 -3990 -971 3974 2196 -2733 -2613
1919 -2613 2318 4037 8 -3153 -4 4228 2976 -2245 -2302 2327 4447 137 -3033 -420 3576
1934 3576 2522 -2338 -2959 1922 3342 -545 -3548 -892 3025 1841 -2887 -3638 1085 2993 -660
$$ [...]
8191c6
##END NTUPLES=NMR FID
##END=
