##TITLE=1H_CG-1101-0
 DMSO, 8 sc, 
 4.4.2019
##JCAMPDX= 6.0         $$ Bruker NMR JCAMP-DX V2.0
##DATA TYPE= NMR FID
##DATA CLASS= NTUPLES
##ORIGIN= UXNMR, Bruker Analytische Messtechnik GmbH
##OWNER= root
$$ XWIN-NMR		Version 3.5
$$ Thu Apr  4 14:37:31 2019 Russian Standard Time (UT+4h)  she@DPX200
##.OBSERVE FREQUENCY= 200.1316
##.OBSERVE NUCLEUS= ^1H
##.DELAY= (6, 6)
##.ACQUISITION MODE= SIMULTANEOUS
##.ACQUISITION SCHEME= undefined
##.AVERAGES= 8
##.DIGITISER RES= 18
##SPECTROMETER/DATA SYSTEM= spect
##.PULSE SEQUENCE= zg30
##.SOLVENT NAME= CDCl3
##.SHIFT REFERENCE= (INTERNAL, CDCl3, 0, 15.7039)
##AUDIT TRAIL= $$ (NUMBER, WHEN, WHO, WHERE, WHAT)
$$ ##TITLE= Audit trail, XWIN-NMR		Version 3.5
$$ ##JCAMPDX= 5.01
$$ ##ORIGIN= Bruker BioSpin GmbH
$$ ##OWNER= she
$$ F:/spectra/data/she/nmr/H-F/1/audita.txt
$$ ##AUDIT TRAIL=  $$ (NUMBER, WHEN, WHO, WHERE, WHAT)
(   1,<2019-04-04 14:35:52.81 +0400>,<she>,<DPX200>,
      <created by zg, POWCHK disabled, PULCHK disabled
       configuration hash MD5:
       00 E9 B6 7A A2 85 ED C7 34 08 36 98 17 FE 4E 26
       data hash MD5: 16K
       79 02 82 7D A2 81 5D 41 31 B0 06 F9 46 7C C2 76>)
$$ ##END=
$$ 
$$ hash MD5
$$ C2 9B EA 4F 8B 2B 3C 2D EC B7 91 01 86 D9 BA 75
##$RELAX= 
##$RELAX= 
##$RELAX= 
##$RELAX= 
##$RELAX= 
##$RELAX= 
$$ Bruker specific parameters
$$ --------------------------
##$DU= <F:/spectra>
##$EXPNO= 1
##$NAME= <H-F>
##$PROCNO= 1
##$TYPE= <nmr>
##$USER= <she>
##$AMP= (0..31)
100 100 100 100 100 100 100 100 100 100 100 100 100 100 100 100 100 100 
100 100 100 100 100 100 100 100 100 100 100 100 100 100 
##$AQSEQ= 0
##$AQ_mod= 1
##$AUNM= <au_zg>
##$AUTOPOS= <>
##$BF1= 200.13
##$BF2= 200.13
##$BF3= 200.13
##$BF4= 200.13
##$BF5= 200.13
##$BF6= 200.13
##$BF7= 200.13
##$BF8= 200.13
##$BYTORDA= 1
##$CFDGTYP= 0
##$CFRGTYP= 5
##$CHEMSTR= <none>
##$CNST= (0..31)
1 1 145 1 1 1 1 1 1 1 1 1 1 1 1 1 1 1 1 1 1 1 1 1 1 1 1 1 1 1 1 1 
##$CPDPRG= <>
##$CPDPRG1= <>
##$CPDPRG2= <>
##$CPDPRG3= <>
##$CPDPRG4= <mlev>
##$CPDPRG5= <mlev>
##$CPDPRG6= <mlev>
##$CPDPRG7= <mlev>
##$CPDPRG8= <mlev>
##$CPDPRGB= <>
##$CPDPRGT= <>
##$D= (0..31)
0 1.2 0 0 0 0 0 0 0 0 0 0.03 0 0 0 0 0 0 0 0 0 0 0 0 0 0 0 0 0 0 0 0 
##$DATE= 1554374152
##$DBL= (0..7)
120 120 120 120 120 120 120 120 
##$DBP= (0..7)
150 150 150 150 150 150 150 150 
##$DBP07= 0
##$DBPNAM0= <>
##$DBPNAM1= <>
##$DBPNAM2= <>
##$DBPNAM3= <>
##$DBPNAM4= <>
##$DBPNAM5= <>
##$DBPNAM6= <>
##$DBPNAM7= <>
##$DBPOAL= (0..7)
0.5 0.5 0.5 0.5 0.5 0.5 0.5 0.5 
##$DBPOFFS= (0..7)
0 0 0 0 0 0 0 0 
##$DE= 6
##$DECBNUC= <off>
##$DECIM= 24
##$DECNUC= <off>
##$DECSTAT= 4
##$DIGMOD= 1
##$DIGTYP= 9
##$DL= (0..7)
0 120 120 120 120 120 120 120 
##$DP= (0..7)
150 150 150 150 150 150 150 150 
##$DP07= 0
##$DPNAME0= <>
##$DPNAME1= <>
##$DPNAME2= <>
##$DPNAME3= <>
##$DPNAME4= <>
##$DPNAME5= <>
##$DPNAME6= <>
##$DPNAME7= <>
##$DPOAL= (0..7)
0.5 0.5 0.5 0.5 0.5 0.5 0.5 0.5 
##$DPOFFS= (0..7)
0 0 0 0 0 0 0 0 
##$DQDMODE= 0
##$DR= 18
##$DS= 0
##$DSLIST= <SSSSSSSSSSSSSSS>
##$DSPFIRM= 0
$$ [...]
##$SUBNAM2= <"">
##$SUBNAM3= <"">
##$SUBNAM4= <"">
##$SUBNAM5= <"">
##$SUBNAM6= <"">
##$SUBNAM7= <"">
##$SUBNAM8= <"">
##$SUBNAM9= <"">
##$SW= 24.9336934301222
##$SWIBOX= (0..15)
0 0 2 0 0 0 0 0 0 0 0 0 0 0 0 0 
##$SW_h= 4990.01996007984
##$TD= 16384
##$TD0= 1
##$TE= 0
##$TE2= 300
##$TE3= 300
##$TEG= 300
##$TL= (0..7)
0 120 120 120 120 120 120 120 
##$TP= (0..7)
150 150 150 150 150 150 150 150 
##$TP07= 0
##$TPNAME0= <>
##$TPNAME1= <>
##$TPNAME2= <>
##$TPNAME3= <>
##$TPNAME4= <>
##$TPNAME5= <>
##$TPNAME6= <>
##$TPNAME7= <>
##$TPOAL= (0..7)
0.5 0.5 0.5 0.5 0.5 0.5 0.5 0.5 
##$TPOFFS= (0..7)
0 0 0 0 0 0 0 0 
##$TUNHIN= 0
##$TUNHOUT= 0
##$TUNXOUT= 0
##$USERA1= <user>
##$USERA2= <user>
##$USERA3= <user>
##$USERA4= <user>
##$USERA5= <user>
##$V9= 5
##$VALIST= <valist>
##$VCLIST= <CCCCCCCCCCCCCCC>
##$VD= 0
##$VDLIST= <DDDDDDDDDDDDDDD>
##$VPLIST= <PPPPPPPPPPPPPPP>
##$VTLIST= <TTTTTTTTTTTTTTT>
##$WBST= 1024
##$WBSW= 4
##$XGAIN= (0..3)
0 0 0 0 
##$XL= 0
##$YL= 0
##$YMAX_a= 180554
##$YMIN_a= -247885
##$ZGOPTNS= <>
##$ZL1= 120
##$ZL2= 120
##$ZL3= 120
##$ZL4= 120
##$ABSF1= 10
##$ABSF2= 0
##$ABSG= 5
##$ABSL= 3
##$ALPHA= 0
##$AQORDER= 0
##$ASSFAC= 0
##$ASSFACI= 0
##$ASSFACX= 0
##$ASSWID= 0
##$AUNMP= <proc_1d>
##$AZFE= 0.1
##$AZFW= 0.1
##$BCFW= 1
##$BC_mod= 2
##$BYTORDP= 1
##$COROFFS= 0
##$CY= 11.3945322036743
##$DATMOD= 1
##$DC= 2
##$DFILT= <>
##$DTYPP= 0
##$F1P= 18.9103706918063
##$F2P= -1.10871071338519
##$FCOR= 0.5
##$FTSIZE= 0
##$FT_mod= 4
##$GAMMA= 1
##$GB= 0.15
##$INTBC= 1
##$INTSCL= 1
##$ISEN= 128
##$LB= 0.24
##$LEV0= 0
##$LPBIN= 0
##$MAXI= 10000
##$MC2= 0
##$MEAN= 0
##$ME_mod= 0
##$MI= 1.114404
##$NCOEF= 0
##$NC_proc= 0
##$NLEV= 6
##$NOISF1= 3.799351
##$NOISF2= 2.8
##$NSP= 1
##$NTH_PI= 0
##$NZP= 0
##$OFFSET= 15.70392
##$PC= 1
##$PHC0= -8856.209
##$PHC1= 12.00025
##$PH_mod= 1
##$PKNL= yes
##$PPARMOD= 0
##$PSCAL= 0
##$PSIGN= 0
##$REVERSE= no
##$SF= 200.130013532006
##$SI= 16384
##$SIGF1= 3
##$SIGF2= 2
##$SINO= 400
##$SIOLD= 16384
##$SREGLST= <1H.CDCl3>
##$SSB= 0
##$STSI= 0
##$STSR= 0
##$SW_p= 3612.71676300578
##$SYMM= 0
##$S_DEV= 0
##$TDeff= 0
##$TDoff= 0
##$TI= <>
##$TILT= no
##$TM1= 0
##$TM2= 0
##$TOPLEV= 0
##$USERP1= <user>
##$USERP2= <user>
##$USERP3= <user>
##$USERP4= <user>
##$USERP5= <user>
##$WDW= 1
##$XDIM= 8192
##$YMAX_p= 0
##$YMIN_p= 0
$$ End of Bruker specific parameters
$$ ---------------------------------
##NTUPLES= NMR FID
##VAR_NAME=  TIME,          FID/REAL,        FID/IMAG
##SYMBOL=    X,             R,               I
##VAR_TYPE=  INDEPENDENT,   DEPENDENT,       DEPENDENT
##VAR_FORM=  AFFN,          ASDF,            ASDF
##VAR_DIM=   8192,          8192,            8192
##UNITS=     SECONDS,       ARBITRARY UNITS, ARBITRARY UNITS
##FACTOR=    0.0002004,     1,               1
##FIRST=     0,             0,               0
##LAST=      1.6414764,     0,               0
##MIN=       0,             -247885,         0
##MAX=       1.6414764,     180554,          0
$$ Real data points
##PAGE= N=1
##DATA TABLE= (X++(R..R)), XYDATA
$$ [...]
2019B43K64Q4k91m99j37Q16j57j53k34l90K24O51Q3q70L0n2M45J7k27l87J59K
2041c79L96m23j63J21r9O61k8l86m09N53O3O84l55m98l56O81K37Pq9o06Q21P4
2063E07k00m03O6j09J68L53m66j75q7K53K15j6m50k7k5O57K50k91k11n29N16M52
2085D48m2o99j82M79L46J60p98M9L54L20o0k06n30Qj30P33l19k14j41LK23L79
2107A81j17m82k8K56N06r5j66m0K9M62j80k54O5l64Q14L0m85pl38L38K17K36o84
2130a06l22qM90M07m68m03QJ68N81n44k72O8J47P05m19K1l18R9N12P7j33n23j99
2153d32O51J91k63m26J97K7MJ25J87k63p12P34K38n3o29J67J04J53L45k96m59
2174d10L82M62K03m94n00M45J81m8m49K22j67L43j59M56k83q9j61R9J35j54M4
$$ y = [243, 507, 591, 300, -199, -336, 480, 323, 170, -64, -454, -230, 421, 504, -366, -336, -388, 57, 74, -153, -540, -381, -379, 17, -406, -569, -448, -547, 114, 86, -300, -709, -156, -93, 591, 236, -262, -618, 63, 300, 307, 218, -388, 433, 507, 307, -96, -30, -139, 29, 382, -84, -259, -346, -93, 122, 106, -344, -371, -396, 261, 511, 220, 9, -520, -4, 448, 406, -293, -475, 4, 350, 510, -288, -239, 115, 435, 375, 169, -361, -353, -483, 250, -69, -283, -424, -421, -198, 181, 64, -418, -446, -190, 316, 221, 55, 15, 44, 506, 326, 72, 137, -227, 587, 617, 132, 125, -213, 125, 342, 578, -106, -428, -436, 54, 461, -7, -410, -402, -234, 347, -197, -469, -401, -254, 451, 32, 53, -265, -166, 346, 423, 290, -233, -432, 219, 410, 147, -279, -82, -55, -51, 74, 261, -2, -714, 20, 258, 205, -424, -257, -153, 0, 345, 49, -410, -28, 434, 637, 143, -357, 88, 269, 221, -228, -6, -173, 170, 11, 467, 184, 95, -66, 33, 168, 14, 58]
2195E8n17P9O59L10n05m62J8N92L21n50m83K23K78j25L03n08PM50J14k8j53k05
2217a24K97k8L1J40k83k79J06K30K14l15j97k3M75K61l26k59j50O37m3k25j51
2238a2J2L23K09m07M6k23L7O3k1n7r1l23M89L5K06l71l05Q5N42J94m77k26p7L17
2262c2N27m49j65m05P17L04l23n05j34N58K66k75j85J05k13J33K95q2m47J4K73
2283b3K56j78K51k07l54M32K56Q8p95q1L68L73l2m60k68L02N17l65j95l09L08
2304a16m7L52k6k16k80M53j18J70n8m07K86K08N4q0m85J65k8O51n1q34K97KL53
2327B45o9r1j95n3O51j61l88m61O31J41J03j07p42M03n61M73l6K38j54O3P7J70
2349A77J99l03n98L46L37J85m39m73M24L55j9m44M5L01J64k0K8l98qM02n8N7R9
$$ y = [58, -459, -380, 279, 589, 84, -378, -360, 232, 553, 3, -480, -257, 21, -104, 199, -309, -302, 148, 262, 234, 81, -124, 173, 145, 176, 316, 33, -246, -140, 90, 304, -11, -208, -231, 244, 505, 179, -80, -230, 407, 364, 139, -12, 0, 323, 532, 125, 171, -52, -15, 48, 27, -30, -121, -444, 45, 80, 286, -85, -390, -305, 237, 431, -46, -272, -349, -32, 495, 46, -119, -524, 193, 497, 174, -331, -465, 93, 359, 84, -101, 4, -209, -76, 219, 137, -310, -296, -23, 233, 55, 306, 99, -255, 177, 433, 521, -274, -355, 13, 386, 354, -106, -374, -72, 445, 80, -115, -424, -116, -163, 189, 163, -53, -333, 120, 2, 172, 114, -293, -7, 201, 255, 175, -310, -145, -173, 478, 427, -407, -110, -108, 245, 176, 85, -110, -163, 488, 327, -61, -522, 109, 250, 353, 246, -496, -93, -654, -181, -217, 21, -133, -70, 7, 177, 376, 73, -525, -179, 158, 343, -96, -569, -145, 210, 191, -253, -208, 93, 257, 237, 265, -133, -141, 261, 203, 260, 359]
2372C59r1m25P7m8L96j41l03J08K02J68l4q30J21Q16j46l85l53p4R06j49l88J17
2394i7N5k4j59L57m06J78l20K74L74M9p51R8P2O66j57J25n06P3P54j23n25j62
2416a55j17N01J93n03mk91Q50l91q2l54L57n6P8l95M12J6j50k69L66L41k41j85
2438g9j49L63Q8l40k78O3P13J85l89k43j05J02P26n05j13J62j04K27l02j32L81
2459B71R1l98L40J2q4k04l7L30L80l71m50k86P56J75l15o73J88K64K57L0p13J23
2481c14M67J90l70j27J98m1J02j35J05K33l08l10M31k03M27n77M7O1P37l52m23
2502a62l74O46K74j6p74J39M13L42k13m68J5M02j99P5j95Lk49J14J56k78L91k70
2524b28Q2j45O21j73k38m48M64N92m05n03k35O53L82r4k80p26O90J59N6n67J77
$$ y = [359, 268, -157, -80, -128, 268, 127, -176, -68, 134, 302, 268, -562, -441, 375, 229, -156, -509, -583, 323, 174, -214, -97, -42, -66, -225, 132, -274, -96, -416, -142, 232, 281, -470, -372, -300, 366, 209, 334, -172, -99, 655, 532, 7, -155, -272, 229, 422, -81, -85, -376, 474, 83, 1, -353, 4, -52, 26, -369, 43, 59, -91, -360, 6, 347, 106, -79, -228, 135, 223, -117, -395, -332, 381, 566, 177, -66, -171, -69, 657, 152, 39, 201, 97, 324, 22, -110, 271, 362, -36, 304, 316, 232, 28, -9, 321, 701, 330, -120, -406, 350, 525, 210, -463, -275, -11, 246, 276, -437, -314, 153, 343, -27, -154, 44, 3, 105, -30, 75, 308, 0, -310, 121, -82, 345, -232, -185, -124, 613, 261, -162, -536, 110, 384, 368, -406, -267, 146, 488, 275, -193, -178, 224, 25, 100, -95, -92, -341, -227, -71, -349, 42, -228, -146, -291, 330, 157, -81, -529, -65, 527, 122, -381, -616, 37, 419, 325, 45, -681, 9, 168, 224, -343, -166]
2545a66K14j58o6j09M27k84J7l12P11l44j82l24K29K61N20o50l80P03M28k52o54
2566c71j99K53P56J57m82l55J69O28j23k05J7K1q2P0k30L02l72j30j88N27J12
2587B75l70m70M24L82L69r70L6R0N50k7l40n01K71L70N5m27R1O59j92q4m54O82
2609D19k25r9k2K95p7j76k17l12R82o5l21m97L22M81k33k31k69PN71K59o21r3
2631a22J67K25m8j23J36j23J92m11J66J49j36Pl58K18N11l87o20p4K68N45j13
2652F9m91K07P64Q0o46m83R5P21j62k50O6K71J23j10l21m0L79R9l70K85M1q9m02
2675a64q6Q2J67J61p42p8J45P17m65m53j24O69J43m99m55M98L54J86l52P9K73
2696E6l95P2R2J83J88R2j90j21L87M5m88j60M01K19O0q07k73N45N46m07m53k5
$$ y = [-166, 48, -110, -176, -285, 142, -142, -125, -437, 274, -70, -252, -576, -347, -86, 434, -216, -596, 107, 535, 283, -371, -570, -317, 439, 596, 114, -241, -72, 556, 433, 228, 245, 266, 184, 254, 24, 326, -46, -176, -364, 163, 275, -95, -565, -141, 241, 610, -360, -324, -234, 316, 289, -51, -552, -281, 89, 144, -283, -192, 467, 275, 191, -263, 419, 194, 95, 73, 368, 291, 115, -102, -414, 568, 503, 182, -315, 7, 488, 255, 24, -245, -238, 333, 592, -29, -122, 45, 270, 222, 99, 235, 112, 304, -107, 59, 208, 72, 79, -279, -61, 450, 63, -557, -631, -363, 182, 69, -422, -215, 549, 629, -17, -500, -405, 316, 154, -96, -30, 241, 364, 254, -67, -107, 272, 371, 1, 286, 327, 238, -164, -250, -168, -1, 160, -582, -660, -515, 202, -263, -716, -840, -171, -28, -527, -982, -484, -130, 56, -296, -217, 56, -339, -267, -175, 8, 196, 288, 98, -23, 364, 409, -79, -239, 162, 381, 441, -366, -639, -94, 452, 45, -408, -433]
2718d33L32K41k48l47K43N05m95j22L8J81J37l11J83j29O36q4o34o5O72P2m19
2739d7l37N45K28k02l71k97O07J68k62j88OK57Pm57K11J33J47r1M8q9M43Pp24
2762b58R7P30m5P8o45m1N09J57p49n3N5L41j1n35n0M39K13n4o96J33L60K38j85
2785B8k66J99J35J85m22O4M11j96m50J67N97M37n63m82K10N78L5p26k56P34J29
2806E48j79m68m62M60L68l16m26N11j43R8o0l06N88k54j57j5K04M80k32j82l13
2827b56M90M40l86q02K79O24kn40l72j76J035jq12K68k92N33n92M11P0kK01k92
2849a74O4J62J9k40j73M61J90j71m50O1K84O57n34n05L70N81j53n93n57K64M19
2870a8K2n03k4L94j95k78J70L34p2k22m07O83J28ml37q8N56K48Lo27R0M25N70
$$ y = [-433, -101, 140, -108, -455, -212, 293, -202, -324, -286, -105, 32, -279, -96, -225, 411, 327, -307, -372, 300, 372, -47, -384, 161, 389, 187, -184, -481, 126, 294, 32, -156, -150, 107, 114, -343, -132, 1, 148, 57, 105, 16, 459, 466, -258, -161, 569, 524, 602, -43, -84, 425, 582, -167, -220, -165, 176, 165, -370, -420, 19, 232, 178, -518, -385, -25, 213, 28, -238, -39, 96, 281, -141, -77, 334, 138, -312, -145, 452, 889, 326, -156, 54, 632, 667, -59, -315, 419, 548, 369, -99, -561, -101, 267, -49, -475, 36, -107, -9, -69, -375, 213, -41, -198, -213, -9, 471, 239, 57, -256, 234, 674, 288, -514, -235, 389, 387, -153, -525, -701, 334, 333, -479, -211, -503, 30, -562, -151, -81, -83, 118, -174, -110, 52, 71, -169, -342, 119, 309, 138, -312, -251, 33, 690, 156, -349, 21, 602, 449, -144, -701, -437, -18, 4, -499, -523, -129, -324, -602, -432, -98, -170, -392, -799, -116, 12, 8, -329, -417, 139, 387, 390, -237, -147, 278, 848]
2893H48m58j18k87N45J3k24j94J28P4j95j25j25R7P9m14P9O42k05k89l61K40L23
2915G3l63j86j6j49P15j96m68P9N62J30l39L5j00J41K67l17J82O1J24k29L64k25
2937A45K65J68p07N05K31R2l15j49r6J74J01l17k18K79N67p88j89J79r5K32k21
2958a57m36M2J39%l4Rk5J02P3l08K93K20K9k13J87J22j24j49p2K33M76q8k83k73
2982b37O22K67k54j6j97L52m5r0k60L41J8k62J98k07L41m13o3k28L05l9l27l43
3004e37K76N1N77r03k70M38K83P0k94k63L57J60J55n11o6M73M91o29J06L69J06
3025D39k14J28J85nq2l19K13K72O3j80l18l8L84Rm27P6l25N14l26m55k5j8N65
3048A16l91l21J83L59k08k01kL20j63L31k30J78J63j99R6RL88m17J77Q6k15M92
$$ y = [848, 390, 272, -15, 530, 543, 319, 125, 253, 327, 132, 7, -118, -21, 58, -356, -277, 365, 160, -129, -490, -250, 73, -290, -476, -492, -641, 74, -122, -590, -511, 51, 181, -158, -123, -223, -82, 185, -132, 50, 111, 235, 6, 370, 145, 410, 578, -129, 376, 607, 699, 384, 235, 139, 313, 414, 97, -121, 158, 725, -63, -252, -73, -168, 64, -157, -593, -551, -412, -412, -446, -437, -462, -360, -287, -595, -302, -82, -53, -266, -79, 43, -81, -230, -302, -69, 407, 319, 36, -237, 385, 652, 398, 382, 185, 537, 492, 402, 142, 483, 501, 239, 437, 230, 571, 158, 95, -133, 172, 133, -194, -537, -261, -210, 367, -536, -806, -368, -85, -15, -309, -572, -215, -55, 100, -411, -477, -4, 487, -142, -36, 333, 439, 225, 353, 538, 533, 451, 132, 345, 617, 680, 500, 182, 144, 528, 537, 110, 186, -139, 375, 49, -406, -431, -449, 116, -275, -596, -413, -54, -262, -463, -465, -145, -308, 23, -207, -29, 134, -65, 31, 40, 428, 11, 188, 274, 59, 551]
3070E51n9k52L2L11k52j35J73n69K56J13k5m6l55L29k1k37j58K11J31O1n36L70
3092a07J51k66L09l38J84K33k50l48J98J46m1k92K79j73N91R3l74k17L71k71J63
3113D1P9M7K66j87j06k02K47N4J21m81N07K9k28j61L13R1r3k55k47Q2j55J81Q8
3136C1l43n45Q83j78k05k04N13k28j48O7L19k1n7k41K51o8N42m93K62j31P84m94
3158B96o7J55L29M5n22Kk54P5Q9Q7k08k33J49J13q4r1j2L97o78K48L20l28k78
3181d50K64L27P6n8O6m56L61Q3jl90J81M33j6j65k99K44K81l30l9J9j3J55p8j48
3205D7J09K99m08k24Q0L30j2l11r2J89Q6k3k54J66L04r0J29l98k83M49J04l80
3227a83Lp0K70R7l46K82J51l50K02n3p1p0N94l72k48N04l29o2L9j65L22j04r8
$$ y = [551, 492, 240, 272, 583, 331, 196, 369, -200, 56, 169, 144, 98, -257, 72, 51, -186, -344, -133, -2, 59, -477, -107, 44, -222, 87, -251, -67, 166, -84, -432, -234, -88, -129, -421, -142, -315, 276, 369, -5, -222, 149, -122, 41, 120, 167, 433, 246, 140, -62, 185, 239, 360, -121, 386, 415, 187, 26, 339, 430, 337, 82, -165, -83, -238, -57, 31, -312, -857, 26, -152, -357, -561, -48, -276, -424, -357, -38, -59, -116, -357, -106, -174, 368, -125, 137, 6, 790, 296, 229, 384, 713, 758, 236, 238, -16, 59, 148, 235, 27, -206, -57, 56, -28, -119, -131, 266, -412, -164, 156, -172, -450, -186, 141, 217, 159, 225, -231, 130, 213, 212, -178, 3, 436, 420, 255, -44, 200, 481, 151, 112, 131, 118, 273, 195, 47, 156, 455, 47, -177, -97, 233, 221, -90, -182, 7, 93, 70, -184, -18, 286, 196, 325, -73, -356, 93, 197, -183, -180, -250, 20, 117, -229, 53, 204, -146, 56, 3, -68, -138, 456, 84, -164, 340, 11, -51, -12, -177, 145, 41, -57]
3250e7k57J66J82J13n4n37M49J34k04O0P9m4J98j66l13K02M6r2L07l4k62Q0j72
3273a76OK3J8K75n14N6N13j38J35n16J95L46m46l6q5N62k70J1j27O1L17l28n8
3296a76K52J71l23oO6p9J57n6j28j68K81o7R3l43j65M72no2M3j6P5K49m02L73
3320B36n4k55O0M7M0M26l69J11j05J34m74K46k70L73K8m16Q6r3n2PL50k50j05
3343b99q9K70k79L15L29l55K29j0P4J1k9q5L57k33K42k0k29K25l24L53k74n1K03
3366C31K77l32j18J98l10j04O4l11J87P9L8k9r7j48L27j86K89j21q3J61K5K57
3388C94k19P1k54K29k91J38K86j60k98J51K1l53K15%J0l31J08P5K5l9R9M8L34
3411B59m18M22J35l17p8J33j58K53J51Nj66Q0ol9J36k99j39P6J14k98K65l18k27
$$ y = [-57, -314, -148, 34, 147, 93, -444, 5, 139, -65, -5, 74, 30, 228, 62, -251, -49, -3, -95, 212, 178, -84, -4, -176, -170, -147, -129, 146, -368, -312, 201, 63, 198, -318, -123, 223, -223, -259, -344, 218, -52, -41, -168, -107, 210, -118, -176, 76, 247, -76, -82, -16, -95, 62, 6, -122, -290, -9, -76, 17, -326, -491, -19, -24, -86, -43, -59, 16, 265, -137, 236, 182, -73, -13, 34, 74, 500, 131, 242, 137, 271, -203, 43, -227, 146, 174, -242, -156, -249, -301, -294, 56, -194, -299, -388, -118, -397, -82, 247, -108, 121, 111, 185, 196, 167, 82, 439, 206, 448, 428, 199, 424, 100, 453, 179, 128, 331, 608, 276, 158, 356, 46, -58, 6, -305, -118, -39, -1, -30, -127, -275, 52, -134, 155, 34, -49, 112, 137, 394, 175, 246, -8, 221, -70, 68, 354, 194, -104, 47, 68, -285, -70, -70, -60, -391, -283, -208, -183, -222, -123, -75, 259, -159, 263, 398, 81, 3, 136, -22, 231, 382, 387, 221, 301, 295, 256, 392, 93, -46, 30, 144, -154, 111, -207, -434]
3434d34L70Ml68K63l69J88O7j9J8nM9l6J81r2N83m53k3K72j52RQ6R4J1J09k80
3459G3P1n0O1o4j49j88J90j40k10K36L02j39K5l09M62j67j66j46M33Q5j88o9K40
3482A93n9j05j52J38j49J74J64k05Q4l50M67m85Q9j20L2m0N28m93j26J87K41J23
3504A36l62K55p0M0m3O8L33j57L41j76J31p2J5q9o3l16K46m06J46J21R5m46N7
3527b16K13m5r9p2N3P2k08J23N8J2n6L9j46O8M28r6r0l22N49q3j45K30r1L73l11
3552B38J11k19J98j36K25j83j15K59ll21k94O43n33R7P2j20L09j97l96M3q2K9
3574c75p4J88Kk11q0J28K57j20o1K40k60J88M7J62p5L5J26N7M45o29K74K0J4o4
3598B34K4j0J47j70J31m57K40l14N05k25l3j87O5j03M1J36j91J81n80M22j16j76
$$ y = [-434, -64, -60, -428, -165, -534, -346, -279, -298, -280, -285, -236, -272, -91, -183, 400, -53, -76, 196, 44, 53, 139, 233, 244, 353, 73, 144, 94, 155, 91, -58, -246, -56, -196, -406, -170, 132, -7, 18, -291, 171, 4, -162, -308, 125, 210, 22, -47, 193, 134, 29, -123, 15, -134, 40, 204, -1, 83, -267, 200, -285, -196, -316, -284, -324, 204, -289, -415, -228, 13, 136, -226, 29, -41, -1, -44, 24, 357, 200, 541, 365, 496, 424, 439, 350, 287, -29, 217, -189, -43, 78, 173, -273, -216, -3, -48, -147, -219, -166, -94, -302, -179, -121, -109, -165, -126, -272, -204, 224, 128, 38, -284, 265, 182, 37, 267, 176, 549, 238, 349, 130, 328, 192, 417, 234, 119, 378, 375, 54, -240, 403, -130, -33, 39, -81, 228, 31, -365, -322, -404, -375, -449, -261, -259, -470, -550, -422, -165, -285, -346, -106, -366, -178, -131, 31, -44, -9, 117, 174, 619, -10, 264, 284, 298, 234, 258, 248, 395, 225, 356, -101, 139, -175, 330, 105, 72, -115, -50, -153, -112, 24, -167, 14, -566, -144, -260, -436]
3620d36J07N2j1P7j25J29o1J47m2j62K40J8L02m72L84j5L41m15J03K32j35K41
3642D99l1p8j44q9L0j79L13l14M39j3j81Q1j46l5j37Ok59p3L10J5k82Pq7nj95
3667e48J05K27Kq6J69k91L41k54J53K78l24K49J80m4j30M23N7m53K28Q5L35j89
3689E13j45K83m00K43Kl99L92o41J91r9j5l16L67m43J72P9k13R1o9p7QM22k44
3712b98M02l10m2J25k37L25L88n12O13k08j86L13J20k22k62j50L52J69j72K03
3732D11l51J22j03kj43n9K11j01O4K22m89j32L79j48j01K16M0o1j16l2J20N5K16
3755B18j00m58L12k43K46p4j54n5OJ98K33l27K42M05n38K90l71k0l0K69J45j70
3777B4L41j42k30J25L62n9l25J40j38Qj21N1m50L22J7j47k46k60N12Rk7N9Ro7
$$ y = [-436, -329, -277, -288, -211, -336, -207, -268, -121, -163, -325, -85, -67, 235, -237, 147, 132, 473, 58, 161, 393, 258, 499, 468, 390, 246, 157, 187, 8, 321, 7, 446, 433, 252, 333, 187, 152, 15, 21, -238, -311, -1, 14, -268, -261, -348, -353, -548, -443, -216, -214, -300, -131, -422, -81, -335, -182, 96, -228, 21, 201, 157, 27, 450, 507, 54, 282, 367, 702, 513, 368, 651, 251, 494, 496, 97, 489, -152, 39, -60, -75, -391, -24, -467, -295, -216, -429, -338, -407, -484, -476, -54, -298, 104, -206, -248, -123, -360, -35, 353, -159, 454, 246, 60, 373, 493, 271, 9, -141, 211, 380, 208, 411, 60, 182, 79, 77, -66, -125, 86, -15, 49, 271, -218, -350, 29, -119, -220, -4, 36, -25, -141, -173, -53, 2, 218, 118, -340, -28, -271, -25, -99, -253, -308, -302, -104, 129, -198, 44, 449, -89, 201, -170, -190, -220, 49, 194, 24, 365, 223, -7, 118, 480, 421, 96, 236, 98, 106, -15, 36, -414, -92, -75, -222, -468, -728, -216, -207, -234, -175, -166, -233]
3801b33k3J0M6J43l6J75M4J57l53J3K30K85M9p2J94l80J82J94k06j30J9l45J35
3824I8r4j05K7lJ12j90p7m5j62J01M15k60k24K12L2j33L78j83K35l67o1M29k27
3847i2K76l93M26n8j34R4l44L42j5n8o1J81m75K17j16R5R5K42k70R9J15k06J27
3870H7J99o52N44k24K45m30M89j0n91L60n9K80j55J54l45R9j49J75k4j71p7J3
3892b42j19K11R5J28l75j08Q1J20N0L23j30k19R8P6j15J03n4O50m89JJ10l7k99
3915a41J49n0o9l0K7k5J43l63M20m09J62J94j36J46r0J74L4l45J79k24K35K05
3937A86l70J07L21k18p5K38l70J60k02K53m3q4K1oJ45jL5KJ65j79K9k88J93j59
3961a40J49J23l18M31m5k51J41k60K7M09j78O9j8JJ04k0J45j33k67o7N9Q4k90
$$ y = [-233, -256, -246, -200, -57, -93, 82, 126, 283, -70, -57, 173, 458, 507, 435, 629, 249, 431, 625, 419, 289, 308, -37, 98, 4, -101, -74, -77, 35, -155, -232, -277, -439, -338, 77, -183, -407, -195, -163, -296, 82, -101, 134, -233, -294, 135, -92, 184, -209, 217, 159, 25, 119, -225, 117, 102, 44, -17, 164, -311, -94, -210, -115, -20, 222, -48, 51, 166, -40, 87, 286, -366, 178, -46, 199, -231, 258, 248, -343, 17, -42, 238, 83, 237, -108, -9, -158, 17, -7, -178, -255, -242, -361, -150, -55, 73, -302, -410, -329, -209, -159, 164, 34, -185, -87, -11, -126, -23, -77, 573, 84, 85, 195, 158, -141, 8, -42, -111, -141, -114, -139, 4, -359, 61, -348, -186, 8, -128, 18, -72, 102, 136, -209, -30, -254, -19, 186, -184, -77, 244, 26, -49, 189, -181, -21, -223, 30, -13, -97, -76, -82, 63, 62, 97, 99, 264, 85, 114, -174, 19, -140, 9, 132, -186, 245, 200, -51, 90, -170, -143, 266, 88, 157, 139, 140, 244, 224, 369, 236, -31, -98, -39, 45, -245]
3984b45M06k44K87j67R0P3J7m58L69o1k15J48J73l3k20j72K60k47L31J19m5K01
4006C67m22l0O8m0J36L4K63k94Jj45K14J95k22o9J88j11k08j1J66j68L46m28P2
4029i8j98L46P9q0k24L60j70m9K43r4j15Jk35J97J71l77L05K42m62J81Jk43M44
4052B25j9l29k22N20J2j47k59m7L28j85j06M05k47k21L28j10n5K70m33K83Q1j91
4074a19J38J57q4l03K95j50K42p9k36O6n3J80jl27J68J83l15j29M76k93J65J4
4096ek34J5p5P1j12J72j48K46R4l15J04j41M57j75K85l06J38o3J00K68l50J64
4118A90j03O5qk17O5PK84n96N48j39o4l31M37J50k11l0m8L5M25l02M3j52J40m8
4142A40o7K07l59r2J9J72Q7j40j98K68r5L4j2k19J90k19R6K75q4N2k01N46m84
$$ y = [-245, 161, -83, 204, 37, 127, 200, 217, -241, 128, 67, -148, 0, 173, 140, -80, -252, 8, -239, 92, 211, 166, 367, -55, -85, -17, -57, 79, 113, 376, 82, 83, -62, 152, 347, 125, 56, 244, 133, -75, -86, 80, -88, 258, -170, -98, -296, 50, 129, 49, -175, 185, 15, -34, 209, 115, 0, 1, -234, -37, 134, -243, 62, 304, -158, 23, 24, -219, 225, 206, -123, -345, 175, 187, 40, -219, -266, 62, -123, -229, 176, -71, -292, 36, -74, -129, 141, -292, -9, 72, -119, 19, 176, 92, -211, 84, -66, 176, 97, -139, -73, -126, 54, 53, -274, -106, 77, -238, -367, 109, -184, -19, -5, -239, -224, -299, -228, -340, -168, -316, -70, 24, -291, -187, -328, 129, -46, 239, -67, 71, 8, 108, 376, 26, 190, 87, 152, 144, -73, -8, -1, 283, -313, 235, 96, 32, -299, 138, 288, 77, 47, -1, 34, 459, 157, 200, 48, 188, 140, 73, 280, -79, -171, -152, 20, 107, -33, -231, 37, -58, -24, -36, -255, -65, -284, -188, 87, 3, 55, -146, 400, -84]
4165h4K81j36r2J52J72k89L5K67j18p7j7L23k13O8k68K48m26n4M06%p4j5m10J11
4189b10P0O6j34M1J38M0k87K89j83J92k09O6R1N6K20R3l12J42Q5n68L27l19O20
4212C14k18Q6j16K32l43K65k01k6l1M4Q3j67J14j44J72RLj38J59R6l38M67m77
4235a55J11O4J01l56R8j3J96j58K26j45Q6k00J73l6m0J12J76k69Q3j20l0K77J1
4258A92o1K21l35k02L6K93k76J39j06j26K63m25L01j7J86r9Q4m9K23l2m35o8J50
4281a43l36L90n9K01j35oM6OR8j78M07k97K29j10K49l30j63N03n63K43K5K12p9
4304B10L8j44j18QkM67l92J51j12j24K28j52r1J41k36L0jK75l84k42J21K89k04
4327b44l03M90n73N22k12J37J86k3Q2K45j8l06n0M40k11r8K67r2J18m85M67L30
$$ y = [-84, 197, 61, -31, 121, 293, 4, 39, 306, 188, 111, 94, 417, 204, 272, 4, 252, -174, -228, 178, 178, 104, 89, -321, -210, -140, -74, -208, -167, -29, 11, -276, 13, -170, 22, -187, -121, -30, 26, 246, 339, 27, 169, 254, -314, 13, -306, 314, 96, 182, 66, 298, -45, 220, 19, -7, -38, 6, 89, -78, 36, -108, 64, 73, 76, -62, 97, 193, -145, 322, -155, -44, 20, 121, -235, -137, -150, 46, -112, 114, -31, 55, -145, 28, -8, -48, 64, 240, -29, 54, -66, -96, 181, 192, 131, 352, 17, -185, -149, 144, -132, 7, -99, -225, 38, -387, -86, -103, 83, -16, 68, 19, 242, 210, -225, -293, -143, -479, -89, -148, 53, -82, -88, -42, -36, 62, -116, 291, -6, 223, 113, 362, 32, -131, 372, -191, 52, 77, 289, 210, 248, 104, -14, -6, -8, 459, 67, 218, 106, -18, 210, 58, -33, 108, -128, -98, -99, 176, -208, -450, -329, -40, -244, -547, -57, -630, -108, -320, -183, 3, -20, 62, 307, 289, -17, -67, 373, 162, 64, 331, 239, 357, -128, 339, 669]
4349F69m41r6K70l77J03Q0k23k46M38m48Q6J00j65P9R1j52M6N2J23k12J3J14O0
4372c6k52N21k32l69N80k8j5j9r3q5L25l62L35l03K06k7j5j09J71j98MK48l35
4395h8K71j10J18l93K62j76J14K61k44j75L06q7K1j33J05K04n0l22N1J10q0QL84
4418C57l70n7k02N7L3r0L38m07J35K68N3j62O8r6J10J25r4K84m41M13k21R0J50
4441C41l57K21j49K07j46j5q1K32k25k58L19n28K38k61M56r5k58J24K13l49M89
4462A18o54R7L35n5k52n3L84J69j45L52j87J42M8L0m67L56l39K44K6j01J9K09
4484B76j83l19j70K89m0r2k2j14K61j08J8p2l3J93K87l21N5K03k79Q6Q3K37m7
4507A88k42J14N36m51j69O6l42K10O6L7j48J19k91J34L9p5J89J68l81J81J61j93
$$ y = [669, 228, 132, 402, 25, 128, 208, -15, -261, 177, -271, -185, -85, -250, -171, -80, -232, -186, -134, -11, -223, -210, -96, -36, -288, 233, 1, -368, 212, 184, 169, 150, 57, -28, 297, -65, 270, -33, 173, 146, 131, 22, 193, -5, -1, 247, -88, 183, 73, 191, -202, 60, -116, -2, 259, 15, -160, 146, 59, 80, -53, 52, 256, 206, -116, -65, 45, -35, -27, 357, -13, -70, -272, -215, -182, -272, 66, -341, -206, 62, 115, -47, 21, -75, 35, 160, 66, 350, -91, 322, 101, 191, 341, -16, 205, 56, 263, 117, 102, 21, 253, 28, -230, 89, -439, -201, -462, -6, -101, -359, -235, -22, -371, 118, -536, -439, -104, -159, -411, -464, -80, 89, -56, 296, 109, 251, 299, 329, -138, 218, -121, 123, 149, 48, 67, 276, 93, -226, -396, -107, -147, -239, -261, -375, -114, -222, -204, -276, -309, -116, 171, -150, -95, 108, -171, -85, -2, 235, 188, -54, 60, 596, 145, -24, 42, -300, -90, -24, 13, -135, -16, -307, -173, -134, -209, -20, 148, -233, -52, 109, -84]
4529h4K82j12q5J0K4M71l81K33k79J42k43K3k07L48m4K5Qj19j4j98j60K44M71
4552C55p05R5O10l18q1J04o3J27k53J09K31r2J86j79J0RJ00o9L56l07O8l07K01
4575A87k92K27m8J16j92O3J82o70K24L42k14K27l08M45o68K27Q3J3L31k76qr5
4597a04NP4o8Q0K75k08j78K06o5l07K69K59k58o1k57M97l23J99k0l0J06q3l53
4620c45N00q2k69O28l03J26j22p9K59m26J50k07J60j67M34l46k08J53L53l47J99
4641F1J96l47K73J03l42m11K23k3J70K7Mk96K59l2L9o7J70J75J89n71O02jo46
4664b45J97J3Q7p0J77k20J60j67j7J33l68M27o5j79k35K30K90j61J36m2p2k30
4686b21J31q9L59q8R4k63J1M2j78O7L58k47j17J02L55m9o7j04K13j43J62k63M
$$ y = [-84, 198, 86, 1, 11, 35, 506, 125, 358, 79, 221, -22, 1, -206, 142, 98, 123, 131, 12, -2, -200, -360, -116, 355, -350, -255, 355, 37, -44, 60, -3, 124, -129, -20, 211, 119, 305, 126, 136, 145, 245, 176, 532, 225, 293, -14, 187, -105, 122, 74, 190, -2, 61, 243, -427, -203, 139, -75, 152, -156, 289, -379, -152, -69, -56, 275, -1, -9, -104, -99, -25, -93, -13, 262, 54, -124, 82, 17, -290, -21, 238, -20, -81, -338, 159, -164, 35, 15, -15, 91, 8, -345, 155, 73, -196, 432, 129, 255, 133, 54, 313, -113, 37, -170, -10, -177, 257, -89, -297, -144, 209, -138, 61, 257, -90, 183, 286, -56, -467, -244, -267, -97, -70, -66, -362, -103, -135, -96, -163, 7, 182, 371, -200, 402, 401, -245, -48, -35, 52, -18, 159, -61, 99, -68, -85, 48, -320, 107, 42, -137, -372, -142, 148, -13, 123, 81, 9, -221, -90, -179, 180, 92, 186, -77, -66, -24, -202, -135, 223, -24, -141, -39, 316, 267, 200, 96, 309, 166, 328, 65, 69]
4709F9J66l45oM58k60J3j5j04n8O8J06J05k8j73O4N3Nkp4q4O4q3j43M01l04LN8
4736d6O3j01j5K60k79P4j61Q9J3J79p6K85K08n35l4m8K30j63K08j42K17k15K07
4759B18j54m15J51J16JQj32J42J34k25K01l72N00p1k38J98j29K82k15j54K95j53
4781a2k37m7L10l48m2K63Q0K1M3J20l21K55L41o65O5J01j02M93n51N3R7P3j26
4804a36M63m55J88j84L00l18l87O55J0q8M4k36R5K34j36J72j88j28L79m82M41
4825B43j97L02j58k29p3K15j86rK37KK57q5k35m3J17m9j62l65N07N5m44o0M32
4848G2K3l08j07l5L27k35j10L63k64J81J89p6M1k08n8J72K0j58R1R3L61l83K66
4871B57k33m2M3J68J54m93K44J60m18L2R2l2J54M7n4j09J21k77L25l57KK99j03
$$ y = [69, 235, -110, -116, 342, 82, 95, 80, -24, -82, -14, 92, 197, 169, -4, 60, 113, 118, 116, 42, -42, 22, -61, -204, 197, -107, -104, -46, 17, -84, -99, 161, -118, -44, -205, -116, -103, 76, 0, 285, 493, -42, -76, -124, 106, -57, 151, 9, 226, 11, 218, 64, -351, -200, -84, -83, -75, -207, -65, 69, -156, 45, -327, 173, 102, -136, 62, -67, 215, 0, -154, 141, -12, -249, -296, 14, -334, -376, -113, -33, -12, 31, 151, -170, 85, 426, -239, -174, -73, -175, 318, -233, -180, -83, -10, -136, 327, -128, 60, -124, 176, -142, -529, 126, 136, 48, 92, -144, -49, 185, 49, 221, 33, -95, 284, -198, 243, 46, 348, 190, -39, -112, 103, -83, -92, 145, 147, 404, 319, 84, 41, 158, 109, -53, -418, 89, 144, -300, -360, 72, 95, -213, -320, -355, -28, -263, -373, -10, -274, -93, 96, 20, 61, -147, -205, -33, -13, -171, -80, 13, 374, -9, 257, 24, -18, 25, 193, 347, -146, 98, 258, -160, -128, -36, -68, 86, 133, 79, -30, 91, -186, 139, -218, -216, 83, -20]
4894b0k12J88j19J6n9J33k6mj58J83k08J16K57j60n2J47L5J18k0j05k84N80k59
4917H7k9L16l2n2L3K49m84P8Rm4k22L08j15k11N19k73j68J10j31o6kk5J36K39
4941B30l12K91k08k28M96j67k52J36K48l58K14j11L2J20K45l25j81JL8J60k29
4962a60N3L70jj99k2jK27j78L8l27L72l4k6j94M00k68R4k10j6l8N4P4j94J43m8
4987i1L29m41J20j09K37k04j04J91K19k94J85j83J69j15q7M59m84M27j22k62N91
5008D31Rn28J43j25K48k25J98j85J98j98j33Q6j13L42k43k62K42J26j45L7p5L96
5030B24j81j23or9K14J28j79R0R1q8J25k79K82j88j79Q13o00o7k03K86lk01l0
5053a73r8K08j83l5m0N20j17R3m36J77J26k90m6K41MJ61l6k5O4j21M4q2k27L6
$$ y = [-20, -232, -44, -163, -147, -206, -73, -99, -103, -261, -78, -286, -170, 87, -73, -125, 22, 57, 175, 155, 50, -234, 346, 87, 58, 374, 342, 290, 323, 572, 88, 166, 175, 131, -91, 217, 102, -109, 410, 137, -31, 79, -52, -118, -120, -145, -9, 230, -82, 209, 1, -227, 269, 102, -150, -14, 234, -124, 90, -21, 11, 131, 376, 51, -130, -129, -91, 69, -160, -107, 263, 262, 63, 41, 40, 267, 89, 127, -200, 172, 138, 112, -82, 318, 50, 144, -66, -82, -120, -66, 8, -186, -43, -91, 238, -203, -83, -192, 45, -159, -263, -72, 147, -147, 38, -145, 24, -91, -178, 281, -203, 224, 102, -160, 431, 440, -88, 55, -70, 178, -47, 151, -34, 164, -34, -167, -81, -194, 148, -95, -357, -115, 11, -134, -97, -172, 224, 43, -80, -86, -185, 29, 157, -22, 68, 159, 71, 196, -83, 199, 11, -168, 645, 45, -22, -225, 61, 58, -143, -173, -271, -63, -246, -281, -321, 199, 82, 175, -261, -84, 42, -248, -294, -53, -49, 112, 76, 51, 115, -6, 38, -44, -271, -235]
5077b35K36r0k02L3L85m21K83k25O20m85K36k40M32m23K98k47J44j69N69m37L6
5098I8O7j12R0M1l33M11nn5Q9k14j06J23l7m5l5K19n98L00K1o0j82J43j9M1J35
5123b3k8O6J55j76k3M56k2o50K21N64l63j03k21N82l05r3J53k4j64J8r7J92j78
5146f3j9r3K4Q8m1J41m08K10J34J10l22J82J89Q9j01l09q5L17J38l45K23N3J27
5169B39N3k97J09p0k55J8k6L06l40L19k82L00j3j47O9k43L44R8L6l98R8J92kL9
5193A47q6O6K78j97q5j40K79k65k15J9K92m8r9j09J35m17J8K44M6k07j56N3K26
5216b21K41j98K32jj51K5K48j11jj11k0J26O6j53K4q1L78q6l09J24K5J46l60J96
5240B8J58k90Ll11L83j1J28j67K41j70J1K4n5J54k20L69j94l01M72n94M24P5l34
$$ y = [-235, 1, -89, -291, -258, 127, -294, -11, -236, 384, -101, 135, -105, 327, -96, 202, -45, 99, -70, 499, 62, 98, 165, 53, 143, 184, -149, 262, 257, 202, 291, 77, -29, 94, 57, 12, -23, 196, -402, -102, -81, -141, -323, -180, -199, -158, -23, -51, 15, 170, -6, -29, 427, 405, -245, -24, 540, 177, 74, -147, 435, 130, 37, 190, 166, 2, 20, -77, 115, -63, -82, -175, -151, -63, -104, 37, -371, -161, -27, 83, -239, -57, 132, 221, 120, -189, -274, 43, 181, -164, 59, 112, 239, 292, -5, 104, 34, -221, -203, -229, 77, -263, 56, -226, 74, 61, -86, -17, -260, 84, 182, 218, -180, -82, 110, 108, 147, 61, 127, 405, 208, 123, -17, 262, -3, -218, -199, 93, 45, -54, -163, -28, -445, -427, -183, -137, -344, -500, -447, -221, 20, -178, 54, 53, -98, -73, 175, 64, 63, -48, -68, 58, 124, -29, -5, -86, 292, 206, -103, 21, 46, 192, -168, 28, 186, -104, -101, -412, -29, -40, 88, -79, 162, -8, 3, 27, -28, 126, -94, 275, 81, -220, 252, -342, 82, 157, -177]
5263a77K61k19K09p6l2J12p1m48J78L64j94j43J86k02O04m82J21P3k05O47n43
5284c7NL1J77J27j00P4n06M28K68n02K5J43J54m14p4K92j19J35k25J58l9K7j89
5307a61j9O4L90k01P8p2j97KJ66j27P0l1o8J4J97l3np9j39J1p0K88l17J43NJ16
5333B5j40J75n5q8J93k30K36l06J60J1J49j63K06k47j03J77J71k29l0J74K18l72
5355f8M01m03j37l3K91R0m0m85M1M12m97M81k61L47k36j80K03K73n85M50l76K29
5377h3k05J95P4k06j24M10R8o2j87J14l98N42k91n4L31j66l29K03K57j3K4l57
5399b27K86m4p5K10k08M1L95k25j33qK95j15l48J70j32K31k26j1o1mP9J2J38k28
5423a88J60m4J43j80q9L18j02K43l77j06K38Kj24L6K36M5k70j17J69j55M12l59
$$ y = [-177, 84, -135, 74, -2, -34, 78, 7, -441, -263, 101, -93, -236, -50, -252, 352, -130, -9, 64, -141, 506, -37, -32, -1, 176, 303, 203, 277, -229, 199, 467, -35, -10, 133, 287, -127, -201, 91, -28, 107, -118, 40, 1, 28, -161, -180, -116, 274, 73, 151, 79, -118, -116, 50, -77, -7, -38, -106, -92, 105, 72, 67, -12, -151, -140, -210, 78, -239, -96, -91, 25, -115, 60, 5, -83, 110, -120, 116, -190, -30, -19, 130, -33, 173, -74, -177, 0, 171, -58, -88, 86, 304, -68, 333, -70, -207, -240, 51, 141, 101, -384, -343, 69, -428, 53, -208, 139, -97, -277, -74, 199, -386, 64, -312, -83, -288, -93, -19, -225, -349, 61, 159, 97, -90, 24, -374, 168, -123, -177, 154, -12, -341, -138, 119, 106, 130, -227, 59, 15, -60, 150, -58, -17, 378, 153, 20, 12, 307, 192, -156, 14, -118, 113, -113, -124, -185, -189, -110, -98, 40, -188, -28, -72, 71, -109, -198, 120, 18, 261, -116, -222, 16, 18, -106, -70, 166, 211, -59, -176, -7, -162, 250, -109]
5445a09K31pJ3m1j02M1N7K36k47%j87L83L4k58M2k4l02L2R4J79J80l57Q2K25J7
5470B12j77j0j72Q1n%j77j67N94j62j59j46M13p1p5k20K32l3m8P2p9M18l57o0
5494i6J79l28L95k80K6M80l05j29p9K65j37j46J64L38j92K9j00m9N9j6J06J22
5516C06j20j28J46r7j25r2L56l17J16L6Jj28L5O4l23J64R1J67j11k3J10p6k20
5539a68q0K07j10K26Q2k95N1J19K2m65M77j06J29j90K03J14q6J18k11Kj65J24
5561bN7k3KR7l8m3l8r4k6L97l08j64K65j56J57j32m69N15p8L64k92k78r7M14L9
5586F9k01o9K66j48r5k37L79M9j97J41K71l37J05r0K14L6l35J73l09J79J27K56
5608B47p6l1l0J33q6j73O4R4q1j06M3o4J51j17J23k2L0j0k5q4L52j88J82m34K12
$$ y = [-109, 122, 115, 128, 87, -15, 26, 83, 319, 72, 72, -115, 268, 302, 44, 86, 62, -240, -208, -114, 65, 245, -112, -30, 195, 212, 35, 25, -147, -66, -71, -71, -248, -415, 179, 17, -142, -288, 125, 54, -21, -241, -9, -42, -90, -18, -97, 321, -36, -96, 83, -245, 150, -130, -104, 376, 71, -58, -137, 128, -9, -155, 9, 347, 155, 184, 84, 35, 94, 78, 184, 306, 186, 58, 204, 107, -18, -110, 246, -71, 45, 81, 82, -46, -11, 53, -270, -106, -15, 152, 41, 18, 128, 52, -168, -248, -41, -151, 75, 157, -138, -87, 32, 54, -411, 66, -40, 89, -101, 102, 216, 130, 248, 37, 39, -126, -2, 55, 32, 34, 131, 93, 50, 12, -82, -108, 289, -19, -183, 82, -74, 83, -49, -518, -3, -81, 283, -9, -287, -384, 30, 69, -132, -201, 65, -83, -178, -415, -36, 13, -184, -43, 228, -109, -4, -94, 120, 156, -179, -6, -315, -136, -9, 247, 171, 140, 110, 243, 157, -16, 48, 142, 61, -45, -2, -66, 85, -32, 91, 69, 99, 89, 64, -20, 332, 144, 326, -108, 104]
5633A04j36j20J25R9j86J59j14J62J98k67j72j41J92K82l52Q4n5J99J87l8l20
5654a10J16J11K03j82m43R5M9L53j27j7R3J8l91J99l8L69n69K98J25j43M3j4k87
5677b49K04K01j07l66K97j17k3N3p5K69K5r9j76L07k17K87j83j05L5J01K25j59
5699A28k50J67J55m59L44p9p2K71l56kJ82j62K67m4l02K13K4q1Q5j25j30L14P
5722I5O8j10k09K07k4j06P8J18J21j36r6J13l11J97j88k4L28k07J24j03J43q3
5744en3O5r1K64Q5m48J64K70J8k00J3j9M02m18J47j66L06m99L64K7l99o6J85J56
5768A02l20N82n56k21L17L09k91N0q0qK55Q7k13k92J68pN00k63O4r1j18K16o0
5791A30j90J30j41J06L8j94M16l45j01J86n3k75N1J52J7L40j79k09QK02l10J88
$$ y = [104, -32, -152, -27, 72, -114, 45, -69, 93, 291, 24, -148, -289, -97, 185, -167, -83, -138, 61, 248, 210, -110, 6, 117, 320, 138, -305, -210, -161, 192, 65, 48, 141, 159, -232, -33, -71, 298, -271, 27, 152, 9, 52, 38, -249, -45, 156, 49, -317, -20, -137, -160, -107, -182, 87, 112, 13, -163, 144, -73, 214, 31, -74, -39, 62, 287, 128, -122, 45, 200, -259, 85, 6, -66, 205, -151, -153, 29, -133, 134, 90, -212, 1, 25, -56, 29, -96, -226, 88, 95, 163, 53, -156, 51, 27, -79, -1, 117, 238, 102, 6, 119, -192, 5, -183, -207, 121, -86, 38, -65, 78, -5, -58, 7, -84, 180, 265, -183, -19, 251, 269, 69, 82, 63, 465, 47, 194, 28, 334, -165, 199, 226, -173, -239, -54, 102, -218, 364, -192, -413, -96, 213, -78, -28, -108, -116, 139, 226, 13, -279, -111, -118, 382, 119, 183, 92, -26, 190, 130, -60, 70, -71, 35, 73, -121, 295, -50, -151, 35, -18, -293, -242, -90, -73, 267, 88, -121, -113, 89, -221, -33]
5813c3k57J30K41L13m24r8J88K94j90j55N8p3K98k84N2j01l9K7J0p7k54M15J28
5836A69m45J09J36J99j13j79L32l55J49k6j14K17k92L40l1k12rK30R5j22p0p2
5858f4R8k3j39r8K7J04j91O6K18m6o7J03k92K86k05R02n16k93L23j72P8q7n8O3
5882A7k27M35N0p6K9k09k38L48Q5l65L89l59P5j7j16L71j93j27N2J92n6J19j46
5905C3j06R1j61qJ52j42J37L67l62r6l08L51L19k38oo4p0k58P9L44n2l1J55l14
5929a88L64k04l5Q1P4K01m31K02K7J11J93l72j07L5j11K76k96N57l97K16l57L83
5951B22l04K39q1j19J69l34K10m8p0P3k09J83K06l10l3J78Q8j59j31L68j86K23
5973A75O6k7n4L8J74o95K43L3L6J26k15J63j68J72J50k25L53m17L56k7n15L9j86
$$ y = [-33, -290, -160, 81, 394, -30, -128, 60, 354, 164, 9, 67, -6, 292, 8, 60, -41, -80, -53, -43, -120, -374, 41, 169, -276, -167, -31, 168, 55, -124, 208, -147, 2, -24, -138, 79, -213, 127, 96, -116, -125, 105, 200, 78, 8, -64, 34, 11, -128, -226, -199, -95, -286, -220, -2, -48, -115, -12, -304, -18, -223, 679, 163, -130, 193, 21, 99, 12, -46, 17, -210, 225, 275, 199, 228, 19, -219, 129, 214, -151, 238, -121, -46, -63, -179, 192, -1, -128, -76, 116, 60, 179, 33, -73, 18, -143, -151, 1, -141, -4, 363, 1, -95, -403, -52, 267, 29, 23, -41, -111, -369, -290, 54, 2, -29, 126, -188, 176, -28, -63, 18, 92, 293, -138, 64, 91, 202, 395, 23, -84, -49, -160, 116, -180, 377, -20, 196, -161, 222, -82, 157, 76, -43, 126, -208, 2, -46, -116, -43, -252, -69, 137, -173, -206, -28, 60, -99, -230, 138, -48, 175, 241, 214, 160, 198, 372, -323, -80, -47, -11, 115, -100, 63, -105, 67, 217, -8, 345, -72, 284, 257, -258, -219, -405]
5996d05O56o47K31K01QK86l25j1j24M4P6k54P08k58j28k09L34j90J23k23p9K97
6018A11Q1l95K1J74j31l4L69r1l14J28k9J91k31L63m20N09k27r0j35K96l93L01
6040E4N4k39J2J7J10p5p8M05j65K79m26k69M48k71K15P9j08N3l1j52P1j59M08
6063B32k97K4K6j47J86l16K91J5J62o8n2l95L61J12nj27K94l22j14L50k85R1l52
6086c36L85k4j25O9j0R3m6O1j81Q0j29L52j81Mp9K66k18k26M98l22j21k6N4M79
6110C17n74L43j63j10J57j7J57m43L12k30kL34j88K33j28Q2j44n2J08J04k26p4
6132b04K89J60p4k38Q4L5n8j30R1r0k0J96o3J51k19K80l86p5K74k7Q8pJ84l30
6156h9M8Q4o6q9L34j08j36J90J39j57j55j23N3k10L00j7O4k18J40K71j37k32J37
$$ y = [-405, 251, -396, -165, 36, 44, 330, 5, -6, -130, -86, -10, -264, 444, 186, 58, -151, 183, -7, 116, -107, -186, 111, 192, -203, -182, -8, -139, -173, 196, 105, -209, -81, -110, 81, -150, 213, -207, 302, 75, -15, -150, 146, -247, 54, 108, -131, -119, -102, 8, -67, -145, 260, 95, 374, -52, -321, 127, -144, 71, 150, 42, 95, 64, -88, -17, -176, 232, -65, -41, -15, -162, 24, -292, -1, 14, 176, 108, 56, -339, 22, 134, 129, 2, 296, -26, -140, 210, -75, 16, -336, 49, 25, -100, -31, -41, 52, 6, 67, -114, -34, -163, 189, 8, 12, -67, 199, -19, -245, 253, -69, -190, -216, -162, 317, -257, 86, -77, -187, -30, -47, 110, -333, -21, -251, -253, 81, -107, 126, -2, 80, -64, -116, -8, 96, -130, -204, 85, 245, 171, -67, 17, 52, -6, -136, -45, -135, -155, 41, -22, 129, -90, 190, -196, -271, 3, -24, 64, 57, 241, -89, -41, 43, -23, -112, 222, 114, -22, 168, 307, 150, -5, -128, -75, -285, 15, -2, 62, -156, -16, 255, 118, -114, 23]
6179B3k50J51j46J1J32J71k50K02q1K55o5j65Q2K98n16L93L9n6p6k12K9j18J81
6202C2k4Q5oK21p7j59m2Q6j39J42K7q5R7j39n1J0O7k49J81K3k3l69L69o9K60q8
6228H0k27p9J33k30J07K04j26o2L42k59K15K21n30L48l00K36k95J56k61K16J93
6249H2JJ79k14Q2j79J47j6j98K95k71L60j16k99L24k79K35l20M14k43Oj84K51
6271E7k07J36J43Rq6J44j58j90K8J2L18l04P1j35L63n99L65kK08R3k39k66J40
6294i9K9L0J79j85j47K79j31P8o3M2p7k1K37k53R6p9J25K64l15l03M30j00K36
6317B52o6l42M67j94m6l16l4L98j97J62J4j44J87l60O1K80N4K4m31Q4p6M23nj24
6341G1J35l04N3j50K16l4M25n17M70o5j80j08j6N6J33l96Q1K45l27L68j89P1q
$$ y = [23, -227, -76, -222, -211, -79, 92, -158, 44, -37, 218, 153, -12, 70, 368, -148, 245, 284, 228, 152, -60, -31, -149, 32, 8, 93, 87, 308, 231, 72, 30, 116, -23, 119, 146, 61, 158, 19, -32, -22, 45, -204, -23, 0, -23, -392, -23, -92, 168, 80, -147, -226, -93, -323, -216, -12, -138, -200, 142, -117, 98, 319, -211, 137, -163, 73, -222, -66, -327, -111, 82, 83, 262, 48, 130, -49, 98, 82, -116, 179, -92, 268, 152, -147, 177, -102, 133, -187, 227, -16, -10, -194, 57, -150, -14, 129, 138, 52, 196, 38, -152, -124, -112, 206, -98, -27, -162, 201, -398, -33, -35, 173, 266, 27, -239, -99, -70, -40, 139, -46, -193, 86, -45, 33, -30, 12, -65, -86, 151, -102, -6, -85, 40, 304, -11, -314, 116, 16, 252, 186, -156, 311, 117, 71, -245, -279, 119, -78, 84, 98, -46, 141, -219, -158, 122, 176, 200, -231, -147, -223, 200, 195, 71, 206, -98, -45, -195, 21, -13, 412, -105, 365, 300, 120, 12, -4, 52, 185, -211, -130, 115, -212, 156, -33, 38, 30]
6364C0m8N4j53K7k04L52o3J1K4j19L97k10lO4l4m4j56J61j72q2J70m14L73M03
6388C64m30J64n3j31J31j8n46P81n0j97P6J61j40R6k7l64J74K8k31K38K65l44
6410e3N2l5K08J79k47k75J98o2l31J72K69r4J16L0m39J9K94K45l76P4K2NO5L5
6434G1k00L47p2m11M30l1l38q9K36J03j28M54l50O6P5j52j15L2N23l20k68Q9K59
6457B11k49J6j05J23k80K12n3J07J29j4k64j75J68J10J07K4q9j6L29m67L04j39
6479a1j57L9K99j61m7pJ34j10L2j81K00Q0j36K6K10k85mj77N37O6n85M64p1n08
6503c53M92j07j66J96k78J06K07j93L5j0r0M36n79K26j50K81k23L58j96k77L14
6524B9q5P9j57K82p9j77J2j40K34K07Q6k67J84k29k9O6J9m1J29k00K88J33l40
$$ y = [30, -18, 36, -117, -90, -294, 58, -5, 6, 30, -89, 308, 98, 95, 159, 125, 81, -75, 86, -86, -168, 2, -412, -39, 364, -66, 98, 45, -86, 45, 27, -519, 262, 212, 15, 91, 252, 112, 208, 181, -183, -9, 19, -212, 26, 291, -53, -1, -36, 172, 351, 104, -171, 27, -35, -366, -194, 75, -19, 97, 127, -312, -293, 1, 246, -130, -56, -34, -29, 36, 71, -129, 218, 146, -265, 165, 134, -204, -293, -57, 46, -82, 372, 22, 88, 163, 11, -104, -72, 451, 131, -137, -48, 211, -38, -22, -127, -4, -284, -72, -125, -18, 111, 97, -167, -342, -174, -64, 43, 67, -22, -38, 291, -176, 128, -11, -168, -129, 170, 9, -38, -45, 89, -21, 11, -170, 30, 110, -26, 0, 210, -75, -79, -256, 281, 347, -238, 226, 155, -353, 139, 32, -134, 62, -216, -110, 97, -96, -61, -71, -161, 275, -304, -78, -228, 53, -170, 188, -8, -285, 29, -56, 23, -134, 148, 69, -108, -96, -236, -2, 205, 291, 24, 208, -21, -50, 16, 35, -6, 123, -77, 211, 344, 4]
6547Dj4qM6J83k61K70k75J58j7r1j64K24M8k29K0L92n24N12l03Q5N9j9J33Q1l20
6572a0N6l5R0j05K33j84k1R1K0k32M7L46m76O2M5Q3J63l34L50j31l24M01k79M88
6596C44j54l66K26J5o6j57L43k47J76l8j61m1L15l60K88o7m20ML07j52N0J26P6
6619D1k68K4J12Q6j52K9J33J80k34N1J9p5K36j98K2P3j21k47J06K37j28L18k28
6642A6J67j70j51rJ38k9pk8Q4K57j69p4k15J57p0j30M38o1l96J56M7K52l35K46
6666A14l97L49Q9m9K26l54m9o8j64M40j71k2Q3q1L11m45M2J64j54M7J95l25L50
6689A31p7j20J84k6k84M05j92j65L5J82l45L70Q5r9R8k82J18J24l18L80N9k57
6711FR7N0m0j18R5j74J66j38J81j72l3K13m12N01k8j66l5R5m6k14L71k05J06j8
$$ y = [4, -10, -18, 28, 211, -50, 220, -55, 103, 86, -5, -169, 55, 103, -126, -106, 286, -238, 274, -29, 56, 115, 96, 229, 310, -10, 46, 11, 101, -4, 229, 45, 24, 115, 135, -97, -50, 296, -180, -118, -73, 10, 173, -161, 189, 58, -266, 135, -144, 344, 190, -176, 50, 65, -1, -158, 185, -62, 114, 76, -85, -126, 189, -171, 117, 50, -370, -366, -59, -211, -161, -35, 41, -227, -203, -91, -5, -157, -128, 5, 185, -49, 2, 21, -54, 182, -16, 6, 79, -42, -289, -183, 54, -74, 244, 16, 183, 13, -138, -147, -9, -38, -45, -73, 11, 268, 99, 25, -190, -33, -103, -233, 205, 144, -252, -96, -49, 203, -132, 114, -283, 66, 155, 106, 332, -22, -71, -139, -303, 137, -34, -56, 27, -54, 257, -188, -146, 18, -136, -89, 106, -219, 131, 54, -66, 118, 92, -192, 213, 21, -144, -109, 73, -272, 98, 183, 84, 182, -100, 18, 142, -176, 204, 263, 6, 103, 153, 113, -5, 90, -84, 82, -56, 125, -47, -80, 133, -279, 222, 194, 28, -7, 88, 42, -172, 199, -6, 100, 82]
6735H2p7p1k23O49m39J52l91J59L02K9j36o0OJ70j42k5K24k21m1K10k66k78P76
6758C89k09j18j36M20l22J11k70M71m08J06J08q2l18o8O7K6L22j53L3L96k65Q0
6780A80j50Mj6j0m9K51k62j76J27J67j5j08l2K73J6J2j25jk09J98j7k85L0J98
6804AJ17j22M2j63O7L1n6m24K75M10l59J69k37L82O8m21M63l37K02o1j18J88l37
6827b20L65K07m42J4J29q3M29n34J24j95M37l3l02K00k3l01oK54p7J18N6j64n22
6850e69O05O9j05p0O6j79P2k1N1J31K3j81rJ9P8J76j78N6O9l59J84j06K66j5l7
6875C6o5J34k02J51J3J20l88J5K02q5o6J25J56R7q4J51r6j43l20K00N1L70p73
6898d01L22K67L8K2k66k7K96k55J78K41k20k53K91l61j2n2J89J16m04K94p1K39
$$ y = [82, 5, -66, -289, 360, -79, 73, -318, -159, 143, 172, 36, -24, -18, 152, 10, -15, 209, -12, -53, 157, -109, -387, 389, 180, 62, -74, 346, 24, 135, -135, 336, -72, 34, 142, 60, -258, -326, -259, -233, 89, -64, -31, 365, 100, 180, 30, 34, 18, 8, -41, 210, -52, -228, -101, 66, 51, -57, -89, 184, 200, 212, 87, 86, -123, 75, 58, -227, -197, 1, 118, -4, 38, -125, -58, -27, -83, -507, -232, 178, -181, -12, -249, 133, 201, -220, 243, -94, 108, 47, -71, 117, -220, 145, 352, -90, -76, 53, -30, 399, -135, -11, -206, 231, 198, -104, 96, 73, -228, -234, 20, -57, 61, 117, -47, -569, 36, 105, 0, -70, -4, -183, -111, -132, -81, 50, 73, -108, -117, -98, -20, 156, -22, 34, 103, -256, -72, -178, 88, 73, 36, -29, 105, -97, 54, 67, 187, -201, -186, 16, -69, -135, -10, 146, 243, 159, 310, 214, 71, -249, -49, 2, 372, -401, -79, 188, 226, 248, -18, -45, 251, -4, 174, 415, 195, -58, 233, -128, -140, -192, -3, 113, -291, 3, -68, 171]
6920A71j66P2k90K27J35k11J43j65J07pM3J70J6j05l27K39J26k17j37L53k32p7
6942a32J12j69L14J29k54j48N17o42J51K08J35l60K72MQ8j54P1r0p8J93J16j16
6964A67l07M61l52k13K7N55l42K45l34J25J15o1r4N1RO4n39M44j74Q4N2j03J5
6987a05R9M3j6j43J62k1j38K88q5n2l20L82K5n3n03L94J03p9j31N2Q9k38Q5R4
7011f8M88o38L11m5k7J10O4k46J01k81J82N4J02j06N2P9l04J84j2K10l20J5L10
7034B15J6o04K59l9J99J27m2r4J52j90J21j57j41K66M0k1m5k81oJ57M69l52J43
7057A92k2l97O0J94m70K86K33p0J43j46O4q5J20j63p6k06J68r1L52P0j08o2k6
7080d0r8j0J01RJ2l1m8M5J78j29J76j41K03k23J67j61J32jJ8k49j98L21K12k43
$$ y = [171, 5, 77, -213, 14, 149, -62, 81, -84, 23, 16, 59, 229, 245, 140, -187, 52, 178, -39, -176, 177, -55, -132, -20, -189, 125, 254, 0, -148, 369, -273, -122, 86, 221, -139, 133, 137, 225, 71, 142, 52, -26, 167, 283, 167, -140, 321, -31, -244, -217, 338, -4, 241, -93, 32, 147, 86, -8, 43, 52, 116, -423, 21, -153, -69, -17, -120, -105, -6, 37, 21, -122, 40, 19, -119, 169, 84, 32, -288, 94, 119, 66, -437, -43, 60, -19, -150, -98, -9, -247, -162, -68, 420, -218, 93, 48, 21, 131, 195, -51, 50, -231, -49, 5, 107, 1, 53, 132, -172, 12, 0, 210, -110, -95, 215, 231, -373, -114, -153, 46, 173, 131, 37, 189, -1, 120, -37, -178, 88, 128, 107, 62, -219, -225, -68, 401, 49, 192, 170, -227, -167, 27, -443, -157, 76, 6, 149, 3, 67, -18, 102, -61, -137, -343, -175, -266, 86, 156, 48, -14, -40, -138, -148, -47, -38, -26, -57, -105, -60, 118, -11, 165, 24, 227, 4, 171, 10, 142, 141, 159, -90, -288, 33, 245, 2]
7104Bj6j33OK92j35j42K00k32K60Q6j74J80r9j11l5R0J42k15j53K74O6J58m27
7127a16K2L19k01k13K9J04k40L89m49K06R7K57l49J98K6K64k46J36j70J48nk41
7149c5NK61l91L68K7l78l4p4K93j2K89J41n23L34m82rL11j66j62Q8j92L10L7k72
7173b66r6K35K13l62K12J43j33J89k35J59J07l5R2J0J0k37J37j78Q4m90K56K37
7195E2m3k2No2K27l22L70k07K79n83J76K69r2k65K73J51L2j39N3K45l37k45K00
7218A5M6J3Nj43M22m99K33m3K27k15j33l74K04M49j44j93R6K56j82n2k35M14n4
7241A13J07j67l96M87k11J40J06l02L03N8m55K81j48K7M36k16j50N3j33j33K72
7262G2K9l7O2J21l24nj3J33j30J67K11k17p0J71k43L21Lk04N0k68J08J10j01J14
$$ y = [2, -14, -147, -141, 151, 16, -126, 74, -158, 102, 188, 14, 194, 95, -16, -51, 39, 181, -34, -187, 87, 153, 311, -116, -94, 225, 24, -189, -160, -56, -296, 93, -356, -150, -53, 204, -145, 53, 79, 343, 97, 233, 63, 211, 206, -35, -30, 231, -160, 208, 235, -143, -177, -251, 42, 30, 319, 460, -63, 271, -211, -220, 91, -75, -237, -149, -341, -31, 6, -266, -362, -127, 86, -276, -64, 79, -54, 135, -100, 59, 166, 131, 223, 233, 243, 6, 143, -35, 49, -441, -185, 52, 9, -13, -8, -70, 157, -165, 205, -2, 277, -306, -130, 139, 47, -218, 55, 206, 238, 99, 152, 397, 60, -185, 15, 61, 74, 79, -64, 358, -141, 92, 49, 276, 61, -72, -446, -242, 207, 63, -130, -34, 222, 40, -12, -247, 167, 113, 220, 53, -343, 144, -67, 73, 179, -123, 180, 238, -217, 64, -84, -57, 379, 163, 13, 66, -67, -200, 72, 101, 64, 126, 247, -77, -82, -95, 38, -92, 75, 286, 69, -1, 170, -73, 248, 251, 47, 97, -171, -63, 47, -54, 60]
7286F0m14M83l36L1K79j62L05k0k2k08j16K4k4K16j92o2j18K39KO2l18L16J13
7309A38j24J00l08M33m82k3L23j44j70J81L76l08q5N1J30k42K88m38M51n2k12
7330a17J34j8L4N7j55P9O5R0qn7j35j48JK06k73K58k6p8K61k67K03O3j51M9J20
7355A87m81M17rRJ77n03J49O0j13j53L02J7N8q5l06J77J04K14k20J2j57J17K61
7378B34R4k21j41n6M25k96P6J8N0k15j0j07Q2j31R1O9k14K48K72k65J61j18n3
7401gn7K16k7k87k00M17L6M4k61J97K37k87J13L2l74P8M20m34L46j81q1K37n33
7424c56J43j5J50J14j3J48k97J08J31K5j85j64k7N0J64K1L0K88j31m05K62j38
7446i7j75K79p0j08J63J8K4M4m34K72K30k74R5j53J26j8K32%m39M27l22K02M1
$$ y = [60, -354, 129, -207, -176, 103, -59, 246, 226, 204, -4, -120, -96, -120, 96, -96, -158, -276, -37, -35, 27, -291, 25, 138, 14, 114, -194, 239, -243, -266, 57, -87, -257, -76, 300, -8, -93, -42, 88, -154, 134, -304, 147, 95, -117, 17, -1, 33, 90, -65, 14, 79, 169, 161, 104, -31, -179, -178, 28, -245, 13, -13, -91, 170, -97, 106, 169, 18, 67, 187, -294, 123, 114, 123, 300, -203, -54, 6, -107, -260, 42, 59, 117, 32, -274, -97, 7, 221, 1, 13, -144, -27, 234, 328, 107, -34, -90, 335, 39, 115, 133, 183, -32, -42, -149, -67, -198, -107, -38, -252, -4, 268, 3, 164, 46, -7, -64, 152, 125, -162, -362, 55, 91, 135, -126, 71, 308, 21, 134, 166, -208, -130, 290, -144, 202, 21, -60, 177, -356, -213, -228, -78, 36, 23, 171, -126, -18, 113, 138, -47, -211, -238, -188, -24, -3, 27, 315, 184, -221, 41, -97, -272, 7, -63, -171, -8, 10, 34, 78, -356, -84, 146, -128, -33, -186, -60, -78, 154, 154, -285, 142, -180, 22, 63]
7469F3j82P1m8Rj1K25k10J27j05J17K09p9k7N1j28k41j80O32j61p6N4r3J62l82
7493b03M0M55n54K50j19L80j8k57M6j64P2%n9K51Lj85K52J25k67k40J91N5M7j66
7517f5j48J67J32k50J39L8N0j0M93p42M28k17j21J16%R8Qj49j52K20j3J20J26
7540B68j74J95k93m6Q7O0j93L93q3k20Q1n33M42k87M13L9J6l38J55K08n66L90
7562A4j8k4J98k34j26k1Q7j2J01j00P6k91L98P5j9k0J35k08j32K61l22K44m5J86
7586B03l64J75q6K41l96M34m04K44J6l20L64j01J0j52J08J1M4N5j30j12j69L97
7608F8j23Qj22J62K06j6l90j5K19k4N9qj25J28J24l85N1P6R5K0k05K20o7k6j56
7633b26J58J30K8k31L01j72K7j9J28j28p9k9K79m25n5O30n58M6L17l54K45R5l01
$$ y = [63, -119, -48, -96, -87, -98, 127, -83, 44, -61, 56, 265, 186, 159, 210, 82, -159, -339, 293, 132, 56, 110, 17, 179, -203, -163, 292, -262, -12, -131, 249, 231, -26, 20, -144, -72, -72, -131, 120, 123, -62, 190, 315, 48, -192, -1, 54, 101, -65, -213, -46, 86, -164, -25, 13, 63, 53, 546, -196, 232, 15, -106, 10, 10, 108, 116, -33, -185, 35, 22, 142, 268, 94, 289, -4, -50, 37, 97, -96, 297, 214, -6, 75, -458, -16, -303, 110, 149, 165, -173, -18, 190, -376, 14, -4, -28, 170, -64, -190, -211, -124, -136, -35, -135, -59, -350, 48, 123, 104, 84, 219, 11, -121, 140, -182, 62, 17, 203, -161, 14, -72, 169, -227, 207, -197, 47, 63, -257, 107, 6, 16, -136, -28, -17, 27, 82, -48, -160, -329, 68, -55, -47, -169, -7, 199, 183, -207, -222, -3, -27, 32, 24, -101, 27, 151, -234, -183, -107, -12, 8, -197, 23, -44, -70, -226, -68, 62, 90, -141, 160, -12, 15, -4, 124, -4, -83, -112, 167, -258, -313, 317, -241, -195, 122, -232, 13, 108, -193]
7656a93K03k35L96l85M49J7m48K22n7l9K7P4J23l20K00Q3k35J93J0j47L8Q4l5
7679B5M4J00Nl00J77K02l0l49M72j17k34j19N2k59L31R6j04O7J34p2r0K36l07
7702d0K16m09J75R5P3K44k22l14M8L32L5k50O7M7k73j1L39o6k63J27J23l8l17
7725b82K63K04j67P4m28N33j52m0J75l21N6k5K89l09J21r9M0k3rK07J64n49L94
7748A16m18J23K52k69M03j70l2k26K27k03L58k14P0r8K5j49N5R%K71k91K06J33
7771A78j20l5Q3k93N2J32NJ24k41q6M99l34k49K54n8K05Mm20L30Q9n27M25J89
7794B06j57n9J73p3q9R0Qk11J07K40m01L31o6J11k88J68j73K63j0p6O9k48K13
7817A28mj50M8J6n6m1r3J36L07l47J88n2j11K8J09k21L77l04K47k59K81q3k65
$$ y = [-193, 10, -225, 171, -214, 235, 252, -196, 26, -31, -70, -43, 31, 154, -166, 34, 117, -118, 75, 85, -62, -24, 60, 25, 69, 169, 174, -126, 51, 253, 223, -126, 346, 229, -5, -124, -72, -331, 0, 96, -8, 59, 193, 121, 31, 267, -40, 176, -233, -58, 37, 110, 354, 132, -182, -134, 198, 233, -17, 50, 97, -176, -187, 152, 86, -177, -50, 73, 35, -282, -19, 185, 18, 92, -336, 197, 45, 5, 180, -141, -85, -110, 179, -130, -9, -108, -68, -91, -100, 107, 271, -278, 116, -302, -179, 73, -196, 207, 37, 5, -221, 6, -197, 161, -53, 17, -81, -56, -205, -150, -141, -141, 130, -161, 45, 178, 58, 23, 106, -187, -135, -3, 2, 126, -115, -201, 298, -36, -285, -31, -89, 116, 120, -300, 30, 119, -408, 17, 206, 49, -10, 163, 90, 1, 91, 99, -112, -5, 235, -166, 165, 99, 210, -78, 90, -83, 180, 170, 94, 163, -85, 128, 124, -26, 22, 38, -18, -59, -152, -16, 291, -56, 132, 80, -31, -3, 106, -115, 262, -42, 205, -54, 227, 144, -121]
7840a21K64j81J0P1J44N0Ml75K82l9j36K4P4m5J24K2j06j75K27k07J06K45q3j02
7864G7Mp9j69qK5M91m73k7L28L88m34j5k6J88j63j19n7k05L06J96l9m68M48j42
7888B7R1l08K45k1l74O00k71k27J64Q9m8k35J35M77k98M1k25O4j68M98k41m6k26
7911b57N21q9l31j38M24n9j54K78o0j79Nj17J29k08J40K20j07R9KJ18n57M28r2
7934A6RJ72k4l82L73j39rJ32k20j5j79L66n01M72L2l30J80m2K07l27pM68j69q5
7958blJ50n1k95J44K08j51R7J26l31N7P6R7k81K21j0P8Q0q8l7J75q9r0j95K98
7983A84Qj05o7L00n86L20k40L80k71n61O30j26O0K78l50K97ol17R4j92K69l19
8005c20J96J39j54J59j85N1K1K67J64k78j08O0J45l47J09J26l40L57Ok34P9lR7
$$ y = [-121, 143, -38, -28, 43, 187, 237, 241, -134, 148, 109, -27, -3, 71, 26, 150, 172, 66, -109, 118, -89, 17, 262, 179, 77, 81, 2, -167, -175, -150, 341, -132, -159, 169, 557, 123, 108, 82, 270, 107, -12, -69, -274, 32, 228, 189, -279, 169, 27, 118, -190, 55, 34, -340, 260, -11, -238, -74, 15, -33, -268, -133, 344, 46, 87, -138, -74, -242, 256, 15, -31, -257, 264, 175, -156, -294, 130, 71, -83, 195, 135, -44, -39, -156, -27, -235, -95, 125, 18, 117, 119, 237, -320, 108, 16, 25, 197, 173, -209, 164, 25, 16, 148, -72, -87, -266, 100, -401, 71, 103, -227, -47, -89, 118, -209, -216, 252, 83, -2, -5, 145, 94, -201, -57, 151, 0, 97, 223, -108, -51, 25, 122, -159, 62, 52, 130, 210, 122, 85, 260, 171, 81, -114, 184, 192, 87, 20, 320, -266, 54, -186, 194, -77, -638, -8, -134, -74, 204, -146, 151, 145, -172, -78, -270, -1, -320, -124, 15, -139, 20, -165, -114, -93, 174, 338, 60, -48, 12, 157, -190, -81, 45, -295, 62, 68, -166, -87, -90, 7]
8028GkK28k13K25m33M33m20K95Kj39q9rKR6P1k15R5J15j90l3N4j57J82r9K36j74
8054a32j51L93J95j92k97J20J97K60j89m81K64j22r4L39m32K77K0M76M9o15r8
8075b13m8L32J11o7J08m08J17K72l20j7j43L55Pp0J4j30J92j52M1L4M7P2r3P2
8099A13k1l3q8K15j57K26n97K13K38q2K91m45L78m36L16J0k18M6J07K23k50k23
8121a74J19J55L6k31J05j00J63j79QJ12j55k68L62Q4o4N4P8n7j40j08P7L18o4
8144A31j74j8J16J89k15l8k77j3K44J7K74n57K15l0K86Q2oq2l33K96Nj50M7PN4
8169G0k57K59l49J87M6nK33o8oj58J45q4j15K91q8l62Q8Q8p8M27l10q7
$$ y = [7, 5, 233, 20, 245, -188, 245, -175, 120, 122, -17, -106, -115, -113, -17, 54, -161, -66, 49, -141, -174, -120, -277, -95, -194, 42, -132, -283, 110, 305, 113, -184, -64, 133, 393, 204, -277, -13, -135, -229, 110, -322, -45, -25, 451, 500, -115, -213, -261, 71, 182, 115, 223, -185, -68, 204, -116, -133, -276, 79, 86, 16, 30, -100, 92, -60, -19, 15, 62, 134, 41, 113, 92, 59, -29, 186, 29, 255, -342, -129, 109, 27, 318, -127, 251, -185, 131, 141, -77, -31, 76, 299, 49, -174, -55, 100, 136, -95, 10, -90, 73, -106, -98, 14, -141, -409, -47, 37, -27, 27, 105, 48, -92, -200, -123, 195, 131, -43, -61, 55, 244, 29, -9, -286, -299, -55, -38, 236, -321, -106, -136, 150, 232, 226, 144, -189, 107, 112, -38, 9, 16, 70, -187, 72, -277, -90, -44, -49, 184, 116, 110, -48, 97, 13, -102, 189, 101, -261, -173, -85, -163, 264, -46, -133]
8191a33
$$ Imaginary data points
##PAGE= N=2
##DATA TABLE= (X++(I..I)), XYDATA
0@%%%%%%%%qJ6j6J6j6K2l0L3m1M9n7P2q6R6j09J29j48J67j92K21k52K85l18L58
32A91m03M49n00N57o20O89p65Q48r39J039j151J276j414J566j741J939k162K425
50A284k736L108l562M131m874N888p355R687j3985K4505r6745j67231J12431Q7114
64d8340l4152q0379J8083J9486m2650l1838P6969Q1969j1790n1197J7486M0181
76d6172L194J0519P5346N9033l0471o1078J0457N3584K7621J5584L4069j7063
88A34623r2962m3398R0634Q9408n0226r6427P338N4283l2605o7453L6526R2221
100A21962j2844j03561l2654N8320K9733k3598J0840M2034k5435q7119k0646Q3442
112D0474O4254l6036o2353j6556j409p618K2186L8095j6012n8390j4292L3999
$$ y = [0, 0, 0, 0, 0, 0, 0, 0, 0, -8, 8, -8, 8, -8, 14, -16, 17, -24, 25, -32, 40, -46, 50, -59, 70, -78, 89, -103, 118, -134, 151, -167, 191, -212, 237, -263, 294, -326, 363, -402, 446, -493, 546, -605, 671, -743, 823, -918, 1021, -1141, 1284, -1452, 1656, -1906, 2225, -2649, 3239, -4116, 5571, -8414, 16091, -80654, -247885, -135454, -48340, -82492, -162871, -144788, -125302, -167952, -199790, -122821, -40852, -52642, -103839, -86353, -46172, -42978, -32459, 42887, 101920, 71449, 10371, 20828, 74412, 102033, 117617, 151686, 134623, 41661, -1737, 88897, 178305, 128079, 31652, 38990, 93273, 60668, -6785, 29741, 121962, 109118, 5557, -27097, 31223, 60956, 37358, 48198, 90232, 64797, -22322, -42968, 40474, 104728, 68692, 6339, -10217, -11626, -19244, 2942, 41037, 25025, -33365, -47657, -13658]
124a3658k442l7104K6054P8647j924r5300l5486Q4168P4294j7413k7096K6712
136E9452J0104m6110r124Q5347O7966n2934q6936O522N9882K607m0432J40K7187
149H3671k2413o0196k1028K3888J1634o117P43k1573n9779k6158N7439N9146k3015
162c758n6124l690K9058l578p913M2635M4294l3490o2199J5620O5740Q185m5273
175a0493o31M8668m008p3305l2236O0822N4440l2983o1771j6651J0046J596J0529
188d5977K2378o737m0906k0003K4982K4333k346L776K0780m497k7666K206M0664
201i013K0933j4715R64K5271o320m6812n605O9166M6558n2561p4207P673N5484
214A6816P178l4484p085J8397j2908l6551p33L3396Q763k2050p695Q582q128j5501
$$ y = [-13658, -16100, -53204, -27150, 51497, 49573, -45727, -81213, 2955, 77249, 59836, 32740, 59452, 69556, 23446, 14322, 99669, 167635, 114701, 27765, 34287, 94169, 96776, 56344, 56484, 83671, 61258, 1062, -19966, 3922, 15556, 9439, 10182, -11391, -71170, -97328, -39889, 19257, -3758, -59882, -63572, -34514, -38092, -46005, -3370, 40924, 7434, -54765, -39145, 26595, 34780, -10493, -11124, 37544, 33536, -39769, -72005, -11183, 43257, 10274, -51497, -68148, -58102, -56506, -45977, -23599, -30336, -71242, -91245, -66263, -41930, -44276, -40500, -19720, -24217, -51883, -49677, -9013, 11920, -2795, -1831, 23440, 17120, -29692, -35297, 33869, 80427, 27866, -46341, -38668, 16816, 23994, -10490, -17575, 822, -12086, -48637, -49370, -15974, -7211, -29261, -36956, -28374, -36502, -52003]
228e2003J0922K9199J0652j6203j7099n313L219J7964L2168P828m0419l6176K4685
241c0576M8051l31l7360m512L3262M365l7026j0056M1485K7492k2993k3559J2847
254A089J3989r223J662L0557J8303k7241l2882J0929L9462J6083j5086j7911o800
267B2931J222R263P992p648j4758j022J0126q303k9419q244L0431J9568k9298
280B841l6089M470K2971r6r199R246R269k0487k4028J9947M1355K994l2400j0955
294b0161K4811J8524j0023j1820J1628J9080Q46j4577r635L909J2452J5092J505
307D1631k0438k0458O593K1930M539j4301q539K534m557j1064P226J7883n651
320A7328k6234m872K2036N435k4014j2884K2191K1278j7144l3376j133K8278J5323
$$ y = [-52003, -41081, -11882, -1230, -17433, -34532, -39845, -36626, -18662, 13506, 21334, -19085, -55261, -30576, 17475, 17144, -20216, -24728, 8534, 12899, -24127, -34183, 7302, 34794, 11801, -11758, 1089, 15078, 5855, 7517, 38074, 56377, 29136, -3746, 7183, 46645, 62728, 47642, 29731, 22931, 24153, 33416, 41408, 33760, 19002, 17980, 28106, 19803, -9616, -17860, 12571, 32139, 2841, -33248, -28778, -5807, -5903, -15102, -5856, 3413, -17074, -41102, -21155, 20200, 23194, -9206, -20161, 4650, 23174, 13151, 1331, 12959, 32039, 32885, 18308, 8673, 12582, 25034, 40126, 41631, 21193, 735, 7328, 29258, 33797, 19496, 10957, 13491, 8934, -2130, 5096, 22979, 17328, -8906, -13778, 8258, 13693, -10321, -23205, -1014, 20264, 3120, -30256, -31389, -3111, 12212]
333A2212j2401j7226m048M530O525N813J956m654p119J062O480J494n08M255J739
348A10l862L76P076j319q603M329J9766O220k3645k0532J6634L2123L42k8681
362C34j3743J5515J4807o102j1924J732O945m557q479J832N413m192n026L774
376c671L524n883r238j538R304Q909j712j2135j1336L503J8393J1329j2755j9538
390b2844L975K1193O481j3824r029J1328J4021m979j1884K196J1662K574m504
403F366J639L531m810p289N248J4915K277j6423j2738P831J4365K267j2090j1290
417f201P47R823L921j0017j1421J634J1016K604j2357j1658M498J1743Q33q703
431a3538m937J775P8O8M592O289m379j1448n97J5664R641r231j2476M413J5194
$$ y = [12212, -189, -17415, -21463, -16933, -10408, -4595, -2639, -7293, -14412, -13350, -6870, -5376, -5884, -1629, 110, -3752, -3376, 3700, 2381, -6222, -1893, 17873, 24093, 448, -20084, -3450, 28673, 29015, 334, -13409, 2106, 16913, 10811, -1113, 619, 7564, 3007, -5472, -3640, 1773, -2419, -7445, -3671, -147, -6030, -15268, -16806, -7502, 1407, -305, -12440, -23776, -20273, -1880, 9449, -3306, -22844, -18869, 2324, 8805, -5019, -14048, -2720, 11301, 6322, -5562, -3366, 8296, 10870, 6366, 8005, 11536, 6726, -563, 4685, 19600, 21877, 5454, -7284, 547, 14912, 17179, 5089, -6201, -5454, 4369, 8290, -1727, -13148, -11514, -498, 2106, -10251, -21909, -17411, -5668, -4835, -13538, -18475, -16700, -16622, -16554, -11962, -5673, -10052, -21500, -22097, -6433, 3208, -6023, -18499, -14086, 1108]
446A108N184r855q491O574J2673L271q244q530J539R758P211m227r204k127L984
461F24M209k13j872k310l313l010K988N881j803j1061l371J0208P276p900j3480
476a7147N46J5558O955j1368j3654K384J2264N507n683p691j108M370L711M02
490d954k067k120p27K234K889P21m69k391m14O111O974k070q242K05J2294J2226
506B0200l488j2926j144J5148J2545m491r927k47R398N429l219m469O85J332j443
521B3383m29p18l977m960j136K075Q78o539j0194k549O677N401n827j2100n126
536a5141P728J0551k273j0942m180Q238R144j572p100k11P398N700k022k805J702
551D215J652J568L843L006k198o405l69Q364Q642l397r741k262P948Q915l70q006
$$ y = [1108, 6292, -3563, -12054, -5480, 7193, 10464, 2220, -6310, -4771, 4987, 12198, 7971, -1233, -3360, 624, 4833, 4620, 2748, 438, -2875, -5885, -2897, 2984, 1181, -9880, -13251, -3043, 4233, -3667, -17147, -16601, -1043, 5912, -5456, -19110, -16726, -4462, 1045, -4638, -12329, -13437, -9067, -5356, -4954, -7021, -9141, -9868, -7634, -4745, -4024, -4493, -6884, -7298, -1187, 5787, 3717, -4525, -4320, 7974, 20200, 16712, 3786, 2642, 17790, 30335, 25844, 15917, 15670, 25068, 30497, 27278, 22809, 23494, 24826, 23383, 22954, 22236, 18259, 13299, 12163, 14238, 15116, 8577, -1617, -4166, 2511, 7912, 2085, -10015, -15141, -7413, 3138, 865, -10077, -14257, -6019, 3125, 1553, -5547, -5758, 1640, 7340, 5318, 2513, 4215, 5867, 7435, 11278, 14284, 12086, 5681, 5312, 13676, 22318, 18921, 9180, 6918, 14866, 23781, 23411, 15405]
567A5405l660N898P356r95p355l791L748N785j695r050o617R03K630k302n323
582I37o677p091m238p55J622l608j1692q429L510O074k705q667l888O383Q252
597c0972M57n340L13R426J0037M633j363o99N503J0870P994L39k154l79M544M976
613A8185J265k331l636l970j389K067p91q899q276N97L986l576j1625p449L678
628b2164P329j183r461n366K778P032M105j633l407k28L394M933L705j081k550
643a3797J203M452J140j141j741j266K192M424M20n596n481K955J0324N002p677
658d587p036M281J0481N625j871k516K379O100M130N23J189J477M84K009K765
673B5433j602n584k084M215K435m613r263n177J392L746K4n970q676k657O154
$$ y = [15405, 11745, 17643, 24999, 24004, 16649, 12858, 16606, 22391, 20696, 11646, 5029, 5932, 8562, 6260, 937, -5740, -12831, -17069, -17824, -16202, -19810, -31502, -39931, -36421, -30347, -33052, -41719, -45607, -39224, -30972, -30515, -35855, -35542, -26116, -16079, -11446, -12809, -13508, -8005, 2865, 10859, 11198, 9044, 8665, 13209, 18185, 19450, 17119, 13483, 9513, 8124, 10191, 9400, 501, -7775, -7178, -3192, -6768, -18393, -25842, -22164, -14835, -16018, -25479, -30845, -28067, -21035, -16930, -18563, -21970, -22198, -18804, -13871, -10166, -11247, -13797, -12594, -8142, -7002, -8143, -9884, -11150, -8958, -4534, -4114, -9710, -15191, -12236, -1912, 3090, -4587, -11623, -7342, 3139, 8764, 6893, 4377, 6756, 12856, 16986, 17509, 18698, 20175, 20659, 22668, 25433, 23831, 18247, 16163, 20378, 22813, 18200, 8937, 3760, 5152, 8898, 8922, 2952, -5724, -8381, -2227]
688b227N880l107n746Q76O262N273j071j050L008O493M008J67J29n75P49L590
704B2659M172l18p449p928J500O817j127r738p850r07J044j5l218n226k305K410
720g479K962o96l562L42O702P650J204k891Q70N040Q119N329%k066j331J920M777
737B6890L576m306q973k871L411m52q300p746j939J48l735p245n887l198K34K493
753a7900p20o475n934J951P225M362j658l673NN185N337J837R1L93L93K391L594
770c596k30l729Q8M838L835m154q101O19O460M336k433m113k523J292M373M781
786A743j03m071j099L523M450J057k890j697K873J530j808m132k558m58R29p52
802c463l855p451o272J491N628j784j0133n253K865M089O28j310q59K191K760
$$ y = [-2227, 3653, 546, -5200, -4324, 1938, 7211, 6140, 5090, 8098, 14591, 18599, 18766, 18895, 18320, 19069, 22659, 26831, 26513, 19064, 11136, 12636, 19453, 18326, 8588, 738, -169, 875, 860, -2358, -7584, -9889, -7479, -4517, -5213, -8775, -8433, -1731, 5919, 7123, 4232, 5102, 10142, 18261, 23590, 23590, 21524, 20193, 22113, 26890, 30466, 26160, 17187, 14316, 17727, 17275, 8975, 1229, -710, -562, -4297, -11542, -17429, -20627, -20393, -17900, -18620, -25095, -31029, -29078, -21853, -17491, -19149, -22822, -22817, -17632, -12295, -10458, -10367, -9974, -9581, -7190, -3596, -3826, -7555, -7467, -2629, 1206, -2948, -11049, -10430, -3970, 366, -2067, -6180, -8703, -7411, -3038, 1743, 1640, -2431, -3530, -7, 4443, 5500, 2610, 913, 3786, 5316, 3508, -624, -3182, -3640, -2711, -3463, -7318, -14769, -21041, -19550, -13922, -15706, -25839, -31092, -28227, -24138, -23510, -24820, -25679, -23488, -20728]
817b0728M267L881J756K138N547O885L379j53J64M955Q092M211l236l986N27L853
833B1552K548J14m328o859k342K857N42n218o257j083K007j838m810k269P47J446
849c191O71O02k932k845K110N868M150j559n155r96O025O109r40l573j002J636
865D978J703J81k69j346j459J470K520k346m481R5N272L161k543l850o15K392
881D863M352K809j266l167j318K964M317P55l881k653J433K625j557m198k201
896C877J442J092k596l664l024k140Q59L534j038o085m508K548M974J459l151
911f421k620P94L065J877J462r32n8J865K688R15j688j145J550M253J042m320
927B327m375J490L718J335j916l533l014J41K486K476l018m025p48L404J420k648
$$ y = [-20728, -16461, -12580, -10824, -8686, -3139, 3746, 7125, 6972, 7136, 12091, 20183, 24394, 21158, 17172, 17699, 21552, 24100, 24214, 19886, 13027, 10685, 13542, 14084, 8866, 2609, 1526, 3533, 1695, -3115, -5384, -4637, -3191, -2520, -1918, -4850, -7695, -5585, 283, 4433, 2874, -2281, -3277, 2748, 8857, 7917, 4344, 3342, 4978, 6681, 6862, 6593, 5247, 3788, 5258, 7778, 5432, 951, 1046, 6318, 9479, 6936, 3086, 2471, 4863, 9215, 12024, 10758, 7591, 6273, 9237, 13554, 14309, 10428, 7775, 9208, 11833, 10276, 6078, 3877, 5319, 6411, 3815, 151, -2873, -5013, -4154, -620, -1658, -7743, -12251, -9703, -4729, -3270, -6421, -9041, -8247, -5182, -3305, -1843, -2775, -2833, -968, 1720, 2635, 947, -198, 1352, 5605, 6647, 2327, -2048, -558, 3160, 4495, 2579, -954, -3968, -3827, -1341, 1135, -1883, -5908, -6656, -3252, -1832, -4480]
943d480j700J192K415L98m44k171q62K177K864J313k284l784j213M052M049j764
959b42m702j350K761K126l70j870r15J3J168J757l09k402n17L767K688j770k843
976c010r36L411L730M51k615k141j32L175K765n40l094k162J652K517K90l103
992B58k252J739K625j479k555q14N41J018J789m63l448k432K294L825J029l495
1008a820l227J163L194J680j149j925n77K034J314K54j191r38P77K328J077k372
1024F22k773J287L996J278k060k834j52J423K233O73j601k754o91L413J472k264
1040A268k373J88J525J070j038k500m39J853J650p92j484j700m88K696K468j532
1056C72l652j167K275L389n58l037l63P57J374P68k00j984q59K244J719q35k475
$$ y = [-4480, -6180, -4988, -2573, -2175, -2619, -4790, -5652, -3475, -611, 702, -1582, -5366, -6579, -2527, 1522, -242, -4944, -6294, -3533, -1407, -1777, -3647, -4562, -4549, -3381, -1624, -1933, -4335, -4852, -1085, 1603, -167, -3010, -3946, -535, 3195, 3646, 1031, -1110, -1242, 1933, 4698, 4158, 1064, -1098, 554, 3071, 3361, 258, -1994, -255, 2370, 891, -1664, -2478, -1937, -919, 870, 407, -3041, -5473, -3179, 646, 1675, -1820, -5047, -3884, -690, 990, -159, -2084, -2661, -627, 687, 941, -250, -1188, -411, 1917, 2994, 622, -2151, -864, 3132, 4410, 2350, -484, -636, 787, 3020, 3693, 2092, -662, -1353, 2060, 3532, 1268, -1105, -917, 608, 1678, 640, -1860, -2299, -446, 1204, 412, -1072, -2772, -3260, -564, 1904, 372, -3280, -4447, -2172, 1217, 659, -2378, -2741, -1984, -610, 158, -42, -2026, -2885, -641, 1078, 243, -2232]
1073b232j025K111K837j1k528k003J311K543J642q24k029k81J433K434J104j735
1089B747j819J055L341k8j949j082J174J267R50j013j956r29Q71K155L21k845
1105B260l229Q63K590P53k206k883o3J558Q02r30j774r5O3J362J045j236k076
1122c196P44K293J709j299k413O61K483K074N2j021j205N71K456K088j592j782
1138B623M61K199O06n23j595o31J615J042q22j280j656n2J240P73j378k212j980
1155a570J315K335q10l378j884J290J377k25j710j513K4J439P26p45j826n50J219
1172d486J807P6j869j291P42K431Q84j266j562N23J386J526N06j179j407O00K784
1189B05L57j271j169P43K205O01r70j317k01J373J101J05j851j512L43J811J87
$$ y = [-2232, -3257, -1146, 1691, 1680, -848, -2851, -1540, 1003, 2645, 1821, -208, -489, 944, 3378, 4482, 2747, 928, 1983, 5324, 5296, 3347, 2265, 3439, 4706, 5656, 4643, 2687, 1758, 2629, 4784, 5105, 2260, -969, -106, 2484, 3237, 1031, -1852, -1915, -357, 445, -485, -2259, -2354, -2291, -929, 116, -1120, -3196, -2452, -159, 1550, 251, -2162, -1501, 982, 3056, 3108, 2087, 882, 1453, 3909, 5997, 4405, 2623, 3084, 5283, 5889, 5366, 3771, 3140, 4755, 5797, 4975, 3695, 2039, 1987, 3227, 4000, 2622, 410, -1570, -255, 2080, 1270, -2108, -3992, -2702, -1325, -1550, -3260, -4773, -4749, -3310, -2584, -3329, -5155, -5705, -4486, -2679, -2603, -4472, -5763, -5021, -2590, -1706, -2972, -4534, -4011, -2625, -1099, -593, -1772, -3179, -2579, 205, 562, -709, -1878, -1135, 1070, 1671, 701, -616, -817, 556, 1657, 1762, -89, -1601, -1258, 553, 740]
1206G40j350k183m13J278O62j201j875m63K67O74O39j556j346K47J495J655j058
1223c788k180M49K118K119m79j134k22P78K124P16p97j307P7J435J454N1j951
1240e37p03J203J438m83r46q50K44J740R18j039q99r8J896K053K65j571n03J905
1258D033J939K81j024p75O32J521J15l67j322n22k22R88l96k476j455m79J288
1275A759m92j682k408l38J022N86n30j475p13N73K321Q76j297m54J252K430R89
1292B419m27j61J236J423J090J90k37q53M58J809L85r54k038n01J471J072j788
1309D594j902l68L69M66m68j434r74J37R10k4l48j520o17J180J335j305j153j079
1327b201M50Q00o0j048j590q11M07J167o11k151j120J450J299p04j621j85J478
$$ y = [740, -610, -2793, -3206, -1928, -1266, -2467, -4342, -4805, -4538, -3864, -3225, -4781, -6127, -5880, -4385, -2730, -3788, -5968, -5519, -3401, -1282, -1761, -2895, -3117, -2339, -215, 501, -296, -1603, -1526, -91, 1363, 1414, -537, -1240, -37, 1401, 918, -28, -878, -634, 1106, 2024, 985, 86, -12, 1884, 3937, 4202, 2631, 2128, 4033, 5972, 6253, 5229, 4454, 5086, 6607, 6722, 6355, 5033, 4511, 4289, 5277, 4881, 2405, 950, 471, 1759, 1267, -415, -2823, -3161, -2139, -1553, -2083, -3558, -4271, -3698, -1377, -501, -1798, -2252, -1000, 1430, 2419, 1992, 1831, 3067, 4490, 5580, 5770, 5533, 4680, 5138, 6947, 7332, 6378, 4340, 3839, 5310, 6382, 4594, 2692, 2324, 2693, 3159, 2691, 1257, 283, 420, 1330, 1306, 958, -562, -1179, 1, 1336, 31, -1122, -2201, -1751, -951, -1011, -2059, -3649, -4460, -4053, -2886, -3497, -5648, -6768, -5318, -4019, -4723, -6344, -6529, -5051]
1344e051J389N02m78P9P05J607J645O97n99LR17K423O60j101o27O5J375j02r06
1363C203j359r87l89K84p82k051k243Q0J034n40j931j777L93J078M78n13p59J13
1381f668J080J430P49m2k53Q69J483J652j17j094P20J638N25l85q66k39K07J075
1399A764j4j048j549n34J449J015r93j738k0J267P66o7q01J29J054N53L29M14
1417A976m58l4R39J324k65j374n92P30J308n10j529r21k94O65N13m65j645r42
1435a574J039Q80k90j201n38J073Q91M34n69J88N64R00R86o2k88m04L08J815M37
1454D589j103j586M3J589O2j545q44m33J98M1l48j232j73l4N52K22j045p71O64
1473a154J447P39q07l74K1R46J047J020j000k89j52O34J107n34j559m73R47K99
$$ y = [-5051, -3662, -3160, -3638, -3559, -2854, -1247, 398, 1095, 496, 499, 1416, 3839, 4499, 3398, 2771, 2836, 4211, 4109, 3203, 1844, 857, 468, 752, -30, -2081, -4324, -4244, -3210, -3750, -5681, -7458, -7065, -5987, -5509, -6022, -6781, -6668, -5588, -4158, -3409, -3451, -3704, -2835, -1352, 300, 183, -911, -191, 1447, 1972, 1587, 721, 482, 689, 1764, 1750, 702, -847, -1381, 68, 1083, 90, -1648, -1668, -401, 365, 298, -503, -374, 680, 1233, 1562, 1976, 1518, 1484, 2423, 3747, 3482, 2108, 1516, 2246, 3554, 3044, 1515, 594, 300, 965, 1478, 1013, -632, -1574, -535, 345, 55, -1146, -1684, -611, 280, 714, 145, 333, 897, 1797, 2783, 2721, 2433, 2029, 2337, 4152, 4589, 3486, 1900, 1943, 3532, 3594, 2049, 1205, 772, 970, 1011, 663, -569, -742, -776, -224, -2, -1047, -1818, -1154, 293, 1032, 225, -149, -128, 818, 1865, 2885, 1885, 1596, 1444, 2078, 3185, 2651, 1092, 619, 1566, 1865]
1491A865j361j492j58O40j88n96q11m48p33P12P56l14r88k77P62J398M49q94k72
1510a950L47J276L40k41P0M0O09O17o8r46n14O80J127m09j601p53N26O32n5m10
1530f83p77o35O16L84O09q87q01M74J130L48l99m87N85P99K66m56j202N22M09
1549a85N72K53p53j467K8J613N70j499q67nO96L92j68m07K05k02O79L66k14q76
1569a269O62J076P30k96p17j98R25J242m11q34l53j26P75P30k31j374n75P30N00
1588I86k49j339J71M36K09l70k67k42l73N85O78n95o48o2J53J385L61j194n16
1607h91O33J053L5m84k48l1N54K70j53l59m24L88R25K56j222n72N11O49J13j10
1627H93p49k55P3J109J61p18q50q9Q56P07r71n68L38J03N64q17n82J86N61j54
$$ y = [1865, 504, -988, -1146, -506, -694, -1290, -2101, -2549, -3282, -2570, -1814, -2128, -3116, -3393, -2631, -1233, -784, -1678, -1950, -1603, -327, 13, -228, -158, -118, 491, 1108, 1040, 94, -420, 260, 1387, 978, -623, -1376, -850, -218, -273, -683, -1460, -2095, -1479, -1095, -486, -1373, -2174, -1700, -570, -222, -621, -1108, -523, 276, 542, 86, -1116, -594, -185, 387, 640, -113, -1580, -1552, 61, 631, -868, -1735, -1740, -1044, -652, -820, -1227, -1022, -1224, -545, -179, -393, -1269, -607, 469, 1199, 903, 186, -12, 913, 2155, 1744, 910, 557, 431, 1206, 1936, 1705, 331, -244, 486, 986, 737, -602, -431, 5, 214, -156, -423, -665, -1038, -453, 225, -370, -1018, -1080, -927, 458, 819, -375, -891, -258, 795, 830, 346, 98, 67, 621, 891, 738, 379, -45, 343, 1268, 1524, 302, -270, 241, 890, 1003, 893, 144, -111, -38, 1071, 1232, 514, -336, -425, 431, 1138, 167, -401, -63, 40, 604, -213, -795, -609, -48, -202]
1647b02K99m78o77j04R60M06n67o74j51Q69O10l73l74J6K67M64n9R7l31L6M61
1668D95L67j81p81J07N42J049o10j137J17K73N05m1J29p80j49M19P16l46n48n42
1688c96J57L03j61m01m52L19L41K17l37n95k68L22R39k44n28p09L35Q85M97o37
1708d13m22M18M30J21J72N1l17K31Q68o9n69l54N61N66j83l56m67k65O31M98k74
1729H58k99o58J29L05Q4m24n25k10O69m0l90m58QP22P3o41R2k05K46L34L85q0
1751b5q87K8N10N09M2p66j48M91M54P0m15l84K80M33m6L8k51k15L34N49j45o53
1773a97k94N14L45K39l05l22k94K43Q13j75p08j76M21L99l31m12n02M05M98j43
1793A8j96o01r3M01M14L0l57n69K16M83L73n45n27L51O23K57o57J88k5NK67M95
$$ y = [-202, 97, -381, -1058, -1162, -202, 204, -363, -1037, -1188, -319, 291, -82, -456, -440, -173, 291, 232, 329, -2, 34, 495, 862, 681, -100, 7, 549, 1598, 988, -149, -32, 241, 746, 705, 834, 54, -95, 324, 1040, 694, 146, -396, -239, 64, -97, -498, -950, -631, -290, -73, -410, -1005, -1273, -951, -12, -256, -784, -1493, -1158, -273, 224, -413, -835, -417, 13, 134, 306, 357, 40, 271, 1139, 1070, 501, 147, 708, 1274, 1091, 735, 268, 3, 634, 1132, 858, 559, -99, 30, 335, 419, -5, -530, -740, -71, -111, -501, -959, -951, -229, -156, -797, -705, -910, -664, -330, 55, -25, -912, -884, -374, 135, 177, -589, -737, -246, 208, 278, -137, -521, -241, 192, 146, 184, -67, -282, 52, 601, 456, -197, -491, 23, 368, 607, 302, -20, -314, -71, 742, 567, -141, -317, 104, 503, 172, -240, -742, -337, 161, 18, -178, -779, -872, -471, -57, -27, -384, -953, -737, -254, 119, -426, -953, -602, 21, 278, -379, -191, -216, -211, 56, 551]
1815E51o67m90J23Q25L29l04m65j62M18M20J27o35o14L93P45J0k3m93k99N83J98
1836E70l4o86k39J039J60k54m89k56L21L47p4J58n39j77L22M54k20o51j55K88
1856a15J53J02l26k18k6N98J61j32p49o9K88N25%o04k45L88N47J63m92k58K26
1877h3Q1N45P5l74j60J39M43N4k57k68o7N30J89m98o18K2N88N73k28n45q9klM31
1901D78l09j165M34K98P62p55l95k83P49Q6J11m14p24N02N79J42l74k49l42Q43
1921b6J21k07k44l13K72O89%l21l17k10O83Q7r4m20m47P63M96k82o30J08J89L87
1943B84R9l16k80J96k34P35K37n87k58K2L09L32l01n26R2K79L06m83j85j07K11
1964a75K82j49l71l07j29R55j18n97J30o2L67J85P3l05k88K34O39j97n1l07M57
$$ y = [551, -116, -606, -483, 342, 671, 367, -98, -260, 158, 578, 705, 70, -544, -151, 594, 604, 581, 88, -211, 372, 570, 536, -150, -389, 650, 810, 556, 67, -189, 132, 479, 405, 563, 24, -153, 169, 623, 403, -248, -403, -115, 38, 140, -186, -404, -430, 168, 329, 197, -552, -621, -333, 192, 192, -412, -657, -269, 278, 441, -51, -309, -83, -2, 543, 618, 244, 84, 223, 666, 720, 463, 195, 128, 658, 847, 349, -269, -247, 341, 914, 686, 141, 52, 50, 47, 478, 169, -996, -562, -264, 498, -257, -652, -935, -186, -100, 11, -403, -1127, -625, -46, 96, -278, -527, -869, -26, 95, -112, -356, -669, -397, 292, 292, -29, -346, -556, 127, 214, 120, -300, -747, 16, 512, 230, -400, -292, -103, 284, 383, 67, -213, -17, -251, 484, 721, 134, -124, -102, 207, 539, 238, -288, -196, 83, 389, -94, -279, -386, -175, 107, -42, -413, -720, -849, 106, -12, -609, -479, -541, -174, 11, 84, -221, -509, -275, 364, 167, 116, -191, 266]
1985B66l4K42o2o07R0L22L69M1o78j94K93M40O4n2r40L72K22K55J9o68k00O01
2007A61J97l52k3q2P5L39N5k09j82k64M72K74J19m63l97J51N56j09m71l7n3J14
2029a29N6k49P2m72O58L27k58j69l05N84J32l4k84J7j97N05N49k90k43m14K00
2050E6L33N29o37n61J7O85K21l56m01k01o9P21n98M6J24q5J13L25n15k65l0O08
2072F0q4j9O8j48J74J1q8L8n22K79K83L98m94l78K40j16O60k07k11m36L54K10
2094G2k37P0m80L25q1O47j49k39k49K99M79P6m10k55j31M37M06j16p90K90O07
2115E71J02l99l00j34J83L00l81o0j07o7L99l92K34q7j49J45N03l48n1k8l22Q74
2137D86J37m54j38l26N68J42k31m91J08L43K96om04r0q6K53P9p2n07J53n3L50
$$ y = [266, 232, 474, 412, -195, -105, 217, 586, 627, -51, -245, 48, 488, 552, 500, -440, -68, 154, 409, 428, -240, -440, 161, 358, 6, -17, -99, -24, 315, 370, 161, -21, -285, 187, 461, 580, 117, -280, -129, 427, 318, -153, -190, -243, -129, -73, -322, -250, -722, -64, 263, 5, -164, -469, 115, 247, 213, -71, -54, -251, 254, 803, 513, 270, -144, 56, 389, 918, 281, -280, -263, 422, 643, 287, -114, -315, -384, 337, -261, -215, -91, -176, -63, 262, -253, -518, -548, 60, -24, -43, 25, -123, 51, 62, -26, 12, -510, -231, 52, 450, -44, -422, -182, -298, 362, 155, -56, -492, -138, 72, -165, -95, -575, -250, -331, 316, 167, -72, -321, -22, 457, 533, 123, -132, -263, 174, 580, 464, -326, -36, 571, 673, 274, -26, -160, 23, 323, -58, -118, -225, -292, 107, -285, -51, -138, -287, -142, 361, 13, -38, -66, -388, 486, 623, 169, 31, -295, 273, 415, 184, -307, -199, 144, 440, 434, 30, -60, -146, 107, 186, 114, -393, -240, -293, 57]
2159E7K34k50j92Jq1O63l43l67J08M45J76j45l90k9N8N22j13j38m61J98K96p3
2181A76j68l16J76l3K29RJ00m91J3K70L3J24n03j62O03L16q3m87m12M31P39J00
2203F64r37O7J75K53K05k60l31j15L64K88k91j93J26J9J77l0n08L21J8j72M58
2224B98R4m81l06j0O44Q7r0m89K45L41P5k83p23O77N9J61l50l63J87M10k22q1
2246a20K37n00O1K61J95j09k7m00J75O11k37J80p15J34M12K65m61k01J34M30K32
2267E57o34l81K70L09N36m08o65L19n3P1P4J01m75J22K12K56k05j68k67J74P49
2288D94m58J39o46rO45J10k51k05j2J57L16J41n32Q6r5J31K48n44J55L28k08L1
2310B1L43m26olJ35K25k49j24m0J60N27n08k96Q8M42J95m71j11k51M10o9Q6l76
$$ y = [57, 291, 41, -151, -150, -231, 432, 89, -278, -170, 275, 451, 306, -84, -113, -55, 467, 354, 216, -245, -47, 249, 176, 8, -308, -132, -165, 64, 73, 173, -318, -305, -35, -2, 122, -381, -543, 60, 376, 293, -194, -606, -175, 564, 664, -273, -206, -31, 222, 427, 167, -164, -279, 85, 373, 82, -111, 15, 34, 211, 181, -327, -6, 12, -160, 298, 392, -89, -395, -405, 239, 326, 236, -253, -8, 333, 408, 125, -598, 79, 138, 299, -51, -414, -227, 183, -39, -120, 117, -383, -322, -61, 134, 25, -2, -402, -227, 384, 147, 327, -388, -254, 158, 423, -38, -239, -105, 325, 557, -77, -458, -188, 121, 657, 249, -416, -97, -150, -79, -5, 96, -379, -257, -45, 211, 6, -162, -429, -255, 494, 36, 175, -471, -480, 165, 275, 24, -181, -193, -36, 280, 421, -111, -25, -120, 11, 259, -285, -130, 198, -10, 21, 364, -62, -68, -71, 64, 289, 40, -84, -124, 36, 563, 55, -241, -153, 289, 484, 13, -98, -349, 61, -8, 78, -298]
2333b98k55L31K33j31K9l11L55J85k74J63J25l99j07K05M59l34j8m01L16P51j46
2354D78l94l71K92N06j70o47K15M25K02j46m24j57J57KQ4O3k16r2m0j2J09K83
2376A47m38k05K64N56K27n84r7j9P12j92q10j16N14N91m36k23j07L72R5J10j71
2397A90J7k99L01j22m6J4k0k30K44K00o5k41m12M33M30j0p57j2J35J28J33j73
2419a62m5j38L87J47l99l34N19K14l58R9k6j4Q6m54M49L80o25j25J30O98j92m08
2441a71m64L96O37K83j064m66O49M72J04m76n3j1J47M55l96q7K73L1K6n16J79
2462e2P6m96J98M77L28o12m77K18K20O81l35o13P6L11L06k98m51L86K59j64k8
2483A0j98L07j8R2R0o5O6k47K93q7K36j74q28K87M54M66j25o11j1K88M32k92o01
$$ y = [-298, -553, -222, 11, -120, -91, -402, -47, 138, -136, 27, 152, -247, -354, -149, 310, -24, -42, -443, -127, 624, 478, 84, -287, 5, 511, 341, -306, -91, 334, 536, 390, -34, -191, -34, -32, 52, 115, -101, -193, -233, -245, -136, 147, -291, -496, -232, 324, 551, -33, -130, -149, 563, 371, -439, -555, -41, 550, 114, -109, -216, 156, 251, 361, 190, 207, -92, 209, 87, 41, 55, 35, -195, 49, 249, 184, -57, -469, -36, 394, 384, -373, -385, -250, -122, 11, -162, -207, -345, 42, 189, -210, -544, -25, 189, -169, -70, -96, -110, -24, -478, -29, 351, -274, -399, -269, 429, 237, -171, -635, -239, 398, 681, -383, -849, -200, 272, 376, -100, -153, -164, -17, 438, 42, -45, 228, 259, 285, -231, -52, 24, -472, -274, 203, 531, -81, -558, -340, -120, 561, 226, -387, -311, 0, 306, 8, -443, -57, 202, 38, 10, -188, 119, 101, 193, 283, 218, 284, 37, 330, 243, 479, 305, -523, -236, 218, 684, 559, -52, -63, 225, 657, 365, -236]
2506b36j34L25N38k40n41K27O01k66n31j13M89m32K34L37l0qk86J9L8M64m24j84
2528a53J25K80q6o7n52O2J73P28l61p15J88M05K30k68l33o2M12j01k87J83J95
2549dm7l36m3L60p6J51l72M01j42K92k30n87L71O51k77n70j24Q05M3N1k84m89
2571d56O08p1J36l79J40J95m39j31J14L49K0p02J37M54k1n36j11L96K0J39l56
2592d94PL51K90P1n29k87Q19L48m46o02K45K76L88j41l43m5Q0m6k00N01j91r7
2614d5l28J42K33N79o39k90L57M10k41m37k09L26M69P7n76k31P01L23o29j64K80
2635A08J44j6l98R7L73k48j37o0K83J79o3l87l46O56O21o19p58N48L92K57n51
2656G5n11O08O22K0n31k77M0O03k41l86j25K28J77l46q0K79k52j54j13M51L54
$$ y = [-236, -370, -45, 493, 253, -288, -61, 540, 274, -257, -370, 119, -313, -79, 258, 228, 220, -66, -47, -9, 455, 31, -153, -28, 252, 166, 99, -453, -391, -218, 510, 149, -566, -378, 27, 257, -11, -344, -406, 6, -95, -382, -199, -4, -51, -387, -430, -70, -146, 5, -367, 34, -108, 184, -46, -633, -262, 389, 112, -458, -582, 223, 266, 317, 33, -456, 152, 81, 217, -162, -22, 173, -266, -397, -283, 66, 86, -616, -479, -25, -46, -582, -693, -297, -277, -138, -494, -487, -136, 154, 225, -304, -591, 228, 576, 130, -472, -227, 49, 437, 296, -47, -92, -12, -58, -258, 243, 52, -45, -373, -231, 2, 581, -58, -348, 9, 419, 178, -259, -468, -142, 327, 404, -172, -403, 298, 621, -8, -172, 108, 252, 236, -162, -65, 308, 60, -77, -137, 146, 325, 262, -125, -471, 185, 806, 187, -571, -23, 369, 626, 75, -436, 172, 794, 814, 283, 6, 46, 649, 408, 22, -103, 125, 302, -44, -124, 155, -97, -251, -364, 87, 441]
2677D41m35p50N08L41j56m34J81J6P16K7m81j82J26N35L88j013L17J70J2m40J68
2698E5L11K30m32k76o6M69k18m56J45L86K20m91l94j50N52K02n56l80J05P25J7
2719bk52k28J21M55K43j67J03j97m18L62j95L98K30m68n11O55M6q1l40m76N99
2740a23J99j14j43l28O17Q7l7k84m08P66P7k44k82m6N14n5k56n9L24O0l62r4M6
2763a45M62o38j9l3L35K4n64j45N73K16k37m47J6O31k2j74k02L48K44n1p3L9J15
2786B53mJ39k59K9L79l22kk37L26N8k20n83J96P06J08q14k01L21P55j17p52k07
2808d48J50N23k35j65M4L04J85m22j20L33L05k29m79L84K00m69n8M47J47R6q74
2829c81J14%N24o7k86n24O83L87j83p36J01M77K81j59l26J59N00n23J18J02j2
$$ y = [441, 6, -744, -236, 105, -51, -485, -304, -288, 428, 455, -26, -208, -82, 453, 841, -172, 145, 315, 327, -113, 55, 366, 596, 164, -112, -178, 291, 73, -383, -238, 148, 368, -123, -517, -667, -115, 87, -469, -849, -744, -19, -2, -254, -482, -361, 94, 337, 170, 273, 76, -342, 20, -175, 223, 453, -15, -526, 129, 175, 94, -246, -722, -123, 76, -38, -181, -509, 108, 195, 158, -126, -534, 232, 309, 65, -217, -263, 251, 196, -60, -119, 205, 265, -97, -191, -145, 317, -321, -340, -373, -38, -14, -578, -723, -150, 66, -171, -618, -602, 29, 7, -167, -369, -21, 223, 172, 99, 138, 253, 249, 388, 129, 158, 537, 215, 213, -24, 302, 360, 140, -443, -247, 459, 567, -247, -448, -127, 628, 511, -241, -448, -298, 225, -10, -175, -131, 173, 358, -64, -184, 149, 454, 225, -254, 130, 330, -139, -197, 250, 397, 493, -381, -267, -267, 257, 190, -96, -620, 63, 450, 267, -469, -368, 109, 390, 231, -95, 64, 564, 41, 159, 261, 249]
2850B49J19l96J9M96r0o20K6l41P39J56m61o84O76J70o6p73K88R2N67j06o16j61
2872g17R31l60J72L2J4N39n67J0K45M86l62l2l01K21R7k40o36L43P81k57l70m12
2894c83K31M52j41k66k23M13O7m01m24L22L26l43L8k08K39L14o93R4O24K19o34
2915c77J45J26J61R2K7j84l11Q50k04m05k8J97M42k26j18k33N90j15j92j84J24
2936A77K57K5k84j63L20k66m30R9L60K62o68j47j63N17K09o55k9J2N19J28m67
2957c87k55M53L55j45n09L14l9K30o0K55n1K40o9m24M15K17k4j85j01L36K36k14
2979E88l83l15O1O60l70n04RM97Q3l24o98K92M56k64m05J49M99m18m18K02N3M19
3001a31k39l90M79J24N7k61k94O20m8K89k62m0OO09k83Q9k28O03m6p4P8j3J7j47
$$ y = [249, 368, -28, -9, 487, 397, -223, -197, -538, 201, 357, -104, -788, -112, 58, -8, -781, -493, -401, 166, 60, -556, -717, 214, -146, 26, 58, 72, 611, 44, 54, 299, 785, 423, 391, 90, 311, 408, 168, -468, -125, 656, 399, 29, -383, -152, 300, 159, -107, -330, 83, 150, -251, -675, -353, -27, -370, -332, -540, -301, 13, -680, -586, 38, 257, -377, -232, -106, 55, 147, 174, -10, -321, 529, 325, -80, -108, 89, 531, 305, 187, -46, 544, 429, 237, 53, 177, 434, 459, 175, 12, 332, 66, -364, -265, 95, 357, -311, -458, -621, -104, 105, -550, -579, -567, -48, 80, -387, -642, -189, 166, 21, -488, -174, -213, 17, -43, 212, 161, 401, 332, -92, 323, 540, 516, 331, 230, 566, 802, 588, 205, -110, -49, 611, 241, -263, -254, 243, 326, 2, -696, -404, 52, -212, -617, -468, 31, -387, -805, -603, -550, -131, -370, -760, -281, -157, -100, -361, -655, -35, -83, 206, -56, -96, -90, 519, 236, 325, 97, 700, 654, 580, 658, 645, 662, 515]
3025E15M0l34J41L8n48Q4N8K97k14n58L36k15N3j32j1O7K50j2n31M59j07J89n6
3048a91l74K66L46J7j26O3L35Q8q4L5Q6K56p5k64j22N02o9k7p39L07j15J44J28
3071C87r65P36L02k23n17n3L41J24n44P1O5L75m45l51Q85o50N46q2m85N50k5J13
3093A55n68N58J01Nm06K04k58L23K29k24nK22N0K9k54k06M51j44J94k56N0p6Q2
3116B56J50m82O6J80j84m2j50K3j84JQ6j86P8j43K02j61j6L23r6k66Q5K46k66
3139d80Q9J74M01J61m60K67p8L44k77J10J38J10o6l42m22N32L04j69n24j17O71
3160C66m85J02n96M07N2J97k63k80J45L3k37K4J16L40k00J56K0k8J38m71N24j12
3182e2J83j22J28l37L29K03l8m29K46K99l48K4N2%R0m1j64j70K12k61J87m2J1
$$ y = [515, 555, 221, 362, 400, -148, -64, -6, 291, 77, -481, -145, -360, -307, -439, -450, -383, -133, -145, -676, -217, -324, -135, -191, -565, -299, 47, 64, -62, 1, 336, 424, 340, 375, 461, 717, 642, 378, 256, 758, 689, 662, -77, 230, 115, 259, 387, -578, 158, 460, 237, -280, -333, 8, 132, -412, -341, -276, 99, -346, -697, 188, -462, 84, 2, -483, 67, 42, 155, -413, 145, 246, 251, -155, 49, -209, 114, 343, 119, 114, 336, 386, 415, 161, -45, 406, 262, 456, 200, 250, 174, 256, 406, -76, -10, 170, -14, -56, -206, -183, -367, -366, -280, -466, -388, -531, -329, -490, -506, -183, -279, -545, -460, -214, -480, -391, -217, 184, 345, -115, 152, 74, 418, 141, 251, 389, 499, 433, 91, -331, 201, 505, 336, -188, -305, 366, -119, -17, -613, -206, -154, 43, -220, -500, -355, -322, -559, -535, -419, -79, -279, -123, -103, -131, 7, -464, 60, -52, 131, 9, 137, -200, 129, 332, 294, -135, 111, 410, 62, 86, 138, 138, 228, 187, 23, -147, 65, -196, -9, -51, -40]
3205d0J22j4oj93J7K24j92J03o9J98p3J04m65L68l7J49k32J06K30p9R1m04J35
3228D3j1j15r7J73J70l4j51M13l13m2k3M5l17M34P0j09m0%J40j67k43J45N4K45
3252B70n9q4j44P9K92O4o77M38j19O7N5%j00O1l81K4L52m42P4J31J09N3m7p8p
3277f9l12J69N00n59L22M1J14j95P9k17P3q3L08k58J5r2n3Q7q7K04l96K09k35
3300d35M37Kk31L2j8r8K06kj37M1L91K07l66k93K97j03M96m84L2J94O7j21J68
3323B82k10k18Q5J04k47J38k9R6N1k21J28l54K31j49J03K71o7R1m17N00M1j73
3345C6p7K48K2k36J01p9J51R6j25L3l32M26P0k32j65P0m5l27J96J49O6l94j08
3368d56K08R5O6M9K6m0R6K16j36j90J48J3P9Q8n0o4K02j05k25J33l5k40K39m0
$$ y = [-40, 82, 68, 62, -131, -114, 110, -82, 21, -48, 150, 77, 181, -284, 84, 47, 196, -36, 70, 300, 221, 312, -92, 43, 32, -83, -180, -7, 163, 129, -22, 391, 78, 36, 13, 58, -259, 175, 245, 136, 96, 96, 236, 69, -174, -29, 25, 270, 211, 127, -17, 62, 354, 418, -259, 179, 60, 127, 182, 182, 82, 143, -238, -214, 138, -304, -230, -99, 10, 63, 16, -62, -69, -381, -212, 288, -271, 51, 92, 206, 11, 90, -127, -54, -137, 171, -87, -72, -164, -217, -130, -217, -13, -409, -200, -435, 2, 4, -227, -195, -213, -311, -105, -107, -244, -203, 188, 395, 29, -264, 33, -70, 426, -58, -26, 168, 235, 114, 282, 72, -146, -61, 43, -204, -66, -95, 1, 52, -169, -41, -395, -164, -313, -210, 61, -6, 85, -332, 168, 209, 36, -41, 207, 229, -7, 94, 15, 166, 262, 137, 170, -162, 264, 334, 102, -63, 7, -38, -365, -169, -20, 46, -348, -456, -248, -153, -87, -38, -12, -52, 44, 260, 124, -66, 82, 95, 174, 262, 212, 148, 350, 245, 20, 153, 118, -122, 117, 77]
3392G7o3k24M8q3j04O95l39j62o2M06q2j28j02n1O3m5L49m2o4J29J36j67j30L83
3416D38K3k71k9J12l75O5K62j78j66J65j30j09k52K77Q5n24N94m26M45j24o2n4
3438b34Q2L49Jo1j20j99K39P6J8J21k76K97L0k44J12l25R3L02j57k68J30O8Pl7
3462DR1l22M9K84j07Q6K51n50O6N3k28M62n38L02L48l86L8J27o2j71K09r2J74
3485H8k24J92m41R1j08J21o5L82K6j26L56l63P2M38n15J60j50J74j6L75j40j38
3507A89j05k17M62kl07J0j22j22k3k3k5k41K31l8JJ23q7j97J55j34N57l41j27
3530c83L07j0J63kK42J17j79Ln3J25J40l23J74J75r3k91q2M7M22k71J20m63J07
3553hL03j95l70J60R2k08R6Q2o7k40J67N2k72m2J09o2j25M00j48k0N57j02k98
$$ y = [77, 14, -210, -162, -245, -349, 346, 7, -155, -217, 189, 107, -21, -123, -174, -111, -156, 193, 151, 87, 216, 352, 185, 55, 438, 461, 190, 161, 273, -102, -37, 225, 47, -119, 46, -84, -193, -445, -168, -83, -607, -13, -439, 6, -118, -180, -234, -152, 197, 198, 137, 17, -182, 57, 133, 151, 272, -4, 293, 323, 79, 191, -134, -41, 261, 104, -164, -34, 34, 41, 4, 95, -227, -178, 106, -1, 85, 336, -214, -148, -95, -323, 139, -399, -97, 251, -135, -97, 30, -32, -203, 6, -86, 88, -136, 56, -385, -294, -402, -281, -346, 36, 62, -64, 292, -71, 1, 439, -76, 84, -66, 108, 92, 467, 327, 189, 84, -133, 329, 327, 20, 30, -92, -214, -237, -260, -285, -526, -295, -333, -332, -209, -296, -493, -338, -472, 85, -256, -383, -76, -86, 77, 75, 317, 434, 255, 258, 205, 330, 470, 147, 321, 496, 403, 112, 30, 77, 499, 228, 348, -115, -8, 295, 100, -270, -110, -18, -226, -130, -48, -115, -355, -188, -136, -408, -450, -341, -403, -528, -128, -276, -296, 261, 159, -139]
3576a39M31k2j93l03M99k00j0J77o2J32J8k7m3j38M9L11l01j09r6J97q7k50j25
3599b91K97j72K48K16m54LK3l89N65p26L13P1j16QJ83K33l72R8K33j59j15M80
3621A77m3k04J77J09k50K32j14q5J48j91M02J9J89l59k73J50m2K21o4n9r3o6r5
3644a14J31k96L20j14J47l78K23o2l39L38M0n19J02K25l62N49R9m49L45l85N37
3665C8o2j75J98j55N60k72K03K3K44j80j70M58j74j02p0K9K27j89l22K13N4k38
3687A38j92K72n16J1J66K6k36J12j64o25P28j77j15J69J83J37o4j21m8K51j72
3708b37J05L11o2K08k59R9j00J00P1K20j98K06k25P2o6Lo1j11J24j91n8M2j30
3731a37J68j59o1%K3l8q3Q2nJ6P7j38L99n39M11j2k85J8q5J26M29k4o2k49j03
$$ y = [-139, 292, 270, 77, -226, 273, 73, 63, 240, 178, 310, 328, 301, 258, 120, 169, 480, 179, 70, -26, 171, 84, -166, -291, 6, -166, 82, 298, -156, -153, -130, -519, 46, -680, -367, -296, -412, -404, -221, 12, -360, -262, -29, -188, -303, 177, 134, -70, 107, 216, -34, 198, 84, -1, 147, -44, 358, 377, 566, 207, -66, 84, 42, 263, 199, 140, 47, -19, -114, 17, -279, 41, -73, 74, -304, -81, -143, -482, -144, -104, -623, -521, -296, -658, -109, -10, -459, -114, -499, 38, -24, -199, -1, -156, 404, 132, 335, 358, 602, 422, 252, 710, 536, 434, 364, 393, 620, 431, 109, 322, 376, 138, -54, 218, -298, -287, -121, -95, -331, -219, -383, -1008, -280, -457, -572, -403, -220, -83, -147, -268, -316, -65, -237, -132, 179, 117, 325, 66, 165, 65, 165, 236, 456, 258, 464, 239, 311, 245, 248, 187, 76, 200, 9, -49, -7, -137, 31, -128, -189, -189, -166, -204, -287, -205, -210, -194, -117, -255, 144, -395, 16, 4, -281, -263, -348, -222, 207, 183, 121, -128, -231]
3756b31L3K95j09J50K2j39J28j05j13R3K28k56k44O80j08l07O14n89N1q7M08m68
3778e4P0R9k19J72l87J05j67qk16J89k79O89j94k6k13j16L23O8L06l55K35M7J11
3801A80O3J60k66R3j63L15k00J51k29J41O2m42J52N9n0J26K7m83K42q5k68K91
3823a24n3p2J17l87K07M23l17k96O09M9M7l42L1n7J78K45rl12n3Or8O83m21K34
3847B88j46k79J8K35q1j38k96M17J9J4o7j29%N1J11J01M6k48J50J1PN1k78o5J29
3872g9J37J11J90k89k11K80n5k69m5J32J01j92k94J90m4N28l57j48J94N1J15k01
3894a55K44J57l56J13p9J26K20jl4k30J87J45l81J40J45j07k45K15O3k73j85J04
3916a87J23N4M2j32k35N0L07j16J31k28Q9K36n04L45M19k16m56M25J00k23J01
$$ y = [-231, -198, 97, -12, 138, 160, 21, 149, 44, -69, 24, 252, -4, -248, 432, 324, 17, 631, 42, 93, 6, 414, -54, 16, 115, -104, 68, -319, -214, -381, -389, -605, -416, -695, -6, -200, -226, -439, -555, -232, -164, 142, -213, 22, 69, 180, 243, 403, 137, 230, 67, 382, 182, 333, 104, 245, 307, -135, 17, 76, 26, 152, 179, -304, -62, -147, -415, -124, -177, -249, -132, -519, -312, 111, -206, -502, 107, 156, 203, -139, -108, -165, 13, 258, 249, -63, -116, -110, -208, 475, 54, 288, 142, -137, -119, 116, 35, -103, -399, 18, 37, 51, -16, -145, -145, -94, 17, 118, 164, -84, 66, 77, 84, 135, -143, -208, -79, 58, 169, 359, 70, -141, 139, 84, -185, -230, -98, 3, -189, -483, -293, -337, 191, -166, -314, -120, -69, 46, -155, 89, 246, -110, 3, -76, 50, 270, 269, 235, 5, 192, 337, -44, 96, 241, 134, -111, 104, 167, -106, -291, -187, -64, -10, 32, -100, -335, -285, 22, -94, 37, -191, -102, 134, -370, -25, 394, 178, -278, 147, 247, 24, 125]
3937A25K9j22j43QM9j55J49O5k09R8n2R0l07K81K84l82L89k68O02q88L01l11M7
3960c20N01l98K05j99L21r5j59J52J12n82M46K00l56K71p4k59R4K56RO3o8j42
3982b2J20l83O4K03p6k0L62l43j43K89n3R0m37K04K31m22M41n4O6L0K00k91K61
4005C17N7m02R5P4O5m46L93k08L69m7l60L66l85Q7k1K02n36N11O0k19M6J30j96
4028d8m07K53O2l6n4L99j57j23R7M1N5j73L24m37K77Pj38L80m61K39j60j31J49
4051d2j03K70j48oM4m25J76K75J47p3j66K23j89k14O29n49K51j74K62J7n6k96
4073a47L11N2m65L30R2k16k4N3j30J52j49P9r9n2n0J68p5O3j3J64l93L44j0q1
4097i6j67K37k79K25k26K90K41k74j23R5L25k20j29L42j47L06q4j71k74KK7j36
$$ y = [125, 154, 32, -111, -103, -54, -209, -60, 5, -204, -106, -158, -68, -375, -94, 190, -192, 197, -71, 531, -357, -56, -367, -320, 181, -217, -12, -211, 110, 15, -144, 8, 120, -462, -16, 184, -172, 99, 25, -234, -140, 116, 125, 188, 120, -22, 98, -285, -221, -18, -94, -114, 248, -95, -238, 51, -2, 88, -349, -145, 86, -336, 105, 51, 117, 147, 347, 56, 317, 374, -28, 67, 141, 206, -240, 153, -55, 314, 267, -93, 273, -112, -25, -46, 156, -380, 131, 191, -28, 18, 148, -48, -455, -202, -140, -176, -230, 169, 12, -111, -14, 27, 82, -91, 233, -204, 73, 80, -58, 322, -139, 100, -60, -191, -42, -145, 125, -23, -29, 15, -410, -234, 41, 188, 115, -51, 172, -17, -231, 398, -151, 100, -74, 188, 205, 149, -147, 164, 216, -249, 81, 173, -43, -67, -14, -144, 8, -141, -62, -161, -213, -263, -95, -170, -107, -120, 44, -349, -5, -15, -96, -263, -26, -305, -80, -306, -16, 225, -49, -172, -77, 248, 28, -101, 241, 94, 400, 316, 145, -129, -127, -100, -236]
4119b36J98J79k70jL52l49j73L24k17Q7J65l77L58K7j61J42m25J38K92k52L6K54
4141I1j91pO3k02J23k27M29k16j84O2K41p8p9l0n9l6M30q3J7j27K92k42k1L44
4165C10l39K53J3J73N2k76j93J64J8k84L1K48k25m28J94j88L22r2M9O8J11l4L9
4188a4j85K7J97R7J9Q6j92K0o5K89k31J55L1km31L69J16j17J17q9J7J59l76K09
4212B06p8k45L60j00j28m39K97k7j6j21j15M49k87K56j0n9k77J11K88k79L6P0
4234a08j01J93j11j21L71o0N9k03P1q6N7J98O6P1j5M2n62O66n28J70K13k68j82
4257a68K7pJ84o3Q7l51J61q1O8p7p7K00j55N2j28K53o8J47n5K6J45j91K75k23
4281a9J20J17l19o2L31j41lk3P5R9j96J44o9J50J06j94M0Ol68M26l32J55P0j70
$$ y = [-236, -38, 141, -129, -130, 222, -127, -300, 24, -193, -106, 59, -318, 40, 67, -94, 48, -377, -239, 53, -199, -163, 91, -100, -107, -44, -246, -123, -350, 79, -137, -321, -259, -18, -96, -175, -205, -264, -300, 130, 47, 64, -63, 229, -13, -34, 310, -29, 224, 237, 410, 462, 186, -7, 157, 175, -109, -78, 170, -55, -483, -289, -477, -155, -247, -198, -130, -19, -53, -14, -199, -172, 25, 122, 141, 227, 35, 55, -10, 279, 48, 203, 234, 232, -199, 170, 286, 169, 286, 197, 214, 373, -3, 206, 128, -117, 243, 143, 15, -424, -127, -154, -170, -291, -406, 43, -244, 12, 2, -57, -334, -223, 65, -214, -178, -108, -209, -16, -127, -248, 123, 63, 122, -81, -10, -96, -39, 159, 225, 296, 281, 323, -239, 427, -101, 69, 282, 14, -168, -141, -148, 36, -27, 60, -291, -130, -211, -143, -220, -297, -97, -252, -200, -328, -75, -143, 4, -51, -25, 120, -71, 204, -19, 101, 218, -101, -163, 168, 27, 24, 1, 76, 175, -21, 123, 54, 204, 310, 116, 156, 162, -206, 220, -112, 43, 113, -57]
4305e7J08j12j50J8J46J13p7l80O5L03j42lJ46j10n6O3K22l42N8J93k37R4j05
4328b42N1L39J88k82P7L16l69L44J12k72K42j43p6K04j16k57k3J65j03m06Q1Q1
4350h9k91L99m35J20J18Mn7k05K12l80N82j46K4j04K11k34j08M85K6N9M4l44J87
4373G8L98k09q4k17K0J21L26l80n3J07j47J69k7j02N0P6j40j88K02Ol48L93L1
4396H2k05M44j65m0K37m28j4J02jJ97k37L3R7j03Q3J39l43O6j75J66O5J60k06
4419d6L2lJ86mj54K70j12PK12m52L77j6j42o0N8J16k34L4J84r9Q4l36p9M90k45
4444F8J68n85L14Q3J0l04K99k82J66j4R5J57n5l67K74j5J55M89m14R1K6k62J09
4467B06J48l41l1K87Q5J78n24J32j73j41K86j5o2k14m9J8J79j70L20j75j28K49
$$ y = [-57, 51, -61, -211, -193, -47, 66, -11, -391, -326, -23, -165, -168, -22, -132, -188, -125, 97, -245, -187, 6, -231, -137, -242, -191, 148, 336, 54, 131, 447, 78, 422, 534, 262, 504, 361, 285, 489, 373, 116, 93, 258, 155, -251, -170, -89, -380, 19, -416, -296, -178, -174, -231, -436, -224, -604, -22, -168, -144, -248, -37, -271, -379, 106, 132, 191, 235, -109, 78, 476, 267, 183, -34, -14, 107, 433, 53, 0, 107, -40, 129, 102, 0, 50, 126, -14, -202, 0, 6, -342, 51, 82, -123, 321, 156, 116, 353, -75, -89, 13, 12, 209, -28, 5, 102, -1, 82, 221, -122, -56, -231, -65, 0, 160, -46, -14, -17, 169, 165, 11, 281, 169, 176, 388, -64, 313, 297, 155, 95, 153, 269, 35, 69, 253, 154, 238, -98, -177, 313, 68, 236, -349, -35, 48, 58, -246, 53, -229, -63, -77, 18, 175, 120, -247, 27, 12, 167, 656, 242, 333, 359, 97, 206, 354, 13, -18, 269, 354, 532, 8, 140, -33, -174, 112, 97, 35, -179, -228, -210, -31, -201, 119, -56, -184, 65]
4489F5N5l0j9n3k38l8M46j87n9J31M1L35m36j48J18J39P0k94J98l66K26l16j46
4512e06M50l67J61Q1m3J29j33J59k18L96J8j93J08r3P9K84l37L4R4l7j94K19l54
4535b63L48p6J52p3M5j88m0O3q9j94P8K99m39K23J61l6J65O5j80K21l41L26l41
4558a14J82J14J93k19k06J66J17j40j04O7k81j36K55k9p8K49Jk88L05m48J50K32
4580a2j20K41r6k06J87j32L09q6k72N81l23m4R5J56j02J92J06j35l60K67k79K02
4602A69o0j66J62K5k96J95k13j68K93K72j5m63M29j14k13K10j36K54j06P2j95
4623f4R6R4j38P1J2K6J49j73r8K03k81J59k46K68k80K97j68j64j6L92k33K72n01
4646c23N58K7l49L2j09L60o97J25K97m1K06L2j79K97o17K50J19j14K23k33M82
$$ y = [65, 120, 90, 71, 18, -220, -258, 188, 1, -58, 73, 114, 449, 13, -135, -17, 122, 192, -102, 96, -270, -44, -360, -506, -56, -423, -262, -181, -224, -95, -228, -69, -287, 109, 127, -66, 42, -51, 28, 312, -25, 9, 103, 66, -128, 91, -263, 85, 9, 161, 88, 133, -55, -95, -32, -121, -315, -237, 62, -377, -154, 7, -29, 136, 201, 21, 242, -99, 227, -114, 68, 182, 375, 156, -50, 116, 233, 93, -11, 56, -225, -361, -106, -135, -213, 36, 37, -251, 54, -394, -244, -12, -132, 109, 13, -193, -6, -138, 171, 85, -187, 394, 71, 27, 122, 278, 176, 368, 474, 339, -21, 246, -33, 169, 109, -57, 105, 130, -166, 29, -184, -352, -59, 213, 198, -265, 164, 50, -163, 47, -89, 165, 59, 131, -64, 32, 126, -12, 59, 71, 97, 246, 73, -25, 178, -103, 56, -190, 78, -202, 95, -73, -237, -253, 139, -94, 178, -323, 235, 262, -87, -55, -164, 196, -501, -376, -79, -120, 86, 118, -61, 236, -381, -131, -12, -126, 97, -136, 346]
4667C46n87J86l7j2j27K7K27k66K23k60J27K56k59q9J29K03j42J15j81K59l35
4688a97N59l21j6k39L26J48o15K49Q0l9K3k6J19j07J03r3k83L05j13K81j84J85
4710A45k15J51k9P3j19Q5K4j30j8L9j13J12j95K02J49k1k13P3j57M3R3j2J46K1
4734A34k56J00j55K39m4N3Q5k34Q7J03k72K19K4J04k8j17J88j60J23N1k76J35
4756A03j81L7J61l35K93p2J3n4J97j96lj23J67J58j40m2p3K16m21K55l1k71M39
4779I7k81j2N42o39L15K35k48O0Pl5k13L11L34m40N36o96J98j39P7L8KJ31R0j2
4803B58kl91l28M07k86K32J64J83m63L69J49p8p2j07l14K07R3kK04m1k38Q7K62
4826B93l30K32J9j00j92n8Pj57K6L58L2m11K36j72K0J71n5R2Qj12J68J31m81L97
$$ y = [346, -241, -55, -92, -104, -231, -204, 23, -243, -20, -280, -153, 103, -156, -245, -116, 87, -55, 60, -121, 138, -197, 362, 41, 25, -214, 112, 260, -355, -106, -26, -65, -42, -68, 51, -56, 47, -46, -329, -24, -137, 144, -40, 145, -70, 81, 52, 125, 6, 91, 115, -15, -33, 6, -107, 5, -190, 12, 161, 140, -73, 0, -157, -114, -21, -33, 113, 134, -122, -22, -177, 62, 18, 71, 156, -78, 9, 112, -160, 59, 83, 187, 159, 42, 230, 70, 193, 244, -32, 103, -78, -41, 120, -215, 78, 6, 19, -35, 162, -34, -37, -160, 7, 165, 25, -17, -90, 126, -295, -40, -71, -342, 97, -184, -196, 346, -293, 22, 257, 9, 69, 76, 41, -172, 139, 473, 33, 569, -127, 71, -68, 9, 47, 49, 180, 270, 258, 256, -135, -463, -56, -342, -110, 54, 237, -226, 143, 292, 214, 142, 35, -279, -72, 21, 19, 223, 182, -56, 31, 293, -37, 195, 214, 114, -78, -136, -129, -286, -260, 98, 130, -281, -45, -217, -197, -26, -81, 11, 19, -93, 75, 206, -275, 122]
4850A22j55M8J69r1P7k11K29r2M2K59l93L78k78j03r7K65j8J37j83J1l10J89J72
4873A67k04k47L21Q4j15J17k21J18j83J38r0k4j04q3J24K56j39j29J08J74Q8j71
4895a5M5j40j9K36J3l34O86m99Q4o6K34K7m28J52L75k30r2L07j21l8k57K20O2
4918B02j62m4L02l74L94l85K31k63o4o9K10J8j29Lk30J10L62n32L16K64N8n33
4940c15K10J54m36P20l30j01m9K07l6J8J23j19P6k70R3j50J49P0L6R5k55M21l71
4963f0oK73k57j67L07K2n1J87j1j03l9l81J64J60j49k84K96J95l04K55j94M19
4985B72q2j81M5m03M01K88m57K55l06K97K08p2J24m07K16q4l60L43q6oj59K07
5007E3j12nk59P6L04k80J56k11J64kP5r5J89l24M0J97j37L89l36O5K96K3j97p5
$$ y = [122, -33, 15, 184, 93, 170, -41, 188, 96, 138, 397, 4, 382, 104, 1, -96, 169, 151, 288, 105, 116, -194, -5, 167, -37, -284, 37, 121, 6, 123, -98, 20, -163, -25, -115, -139, -243, -326, -202, 54, -85, -214, -106, 68, 156, -15, 30, -110, -129, 107, 120, -214, 472, -27, 57, -9, 225, 252, -176, -24, 351, 121, 29, 336, 215, 177, -80, 140, 202, 40, -4, 298, -76, 318, -67, 164, -99, -163, -232, -22, -4, -133, -130, -360, -250, 112, -420, -104, 160, 218, -315, -105, 49, -387, 333, 3, -98, -147, 60, 24, 42, 165, 46, 122, -148, -55, -205, -56, 14, 50, 145, -110, 311, -60, -66, 207, -50, -217, 90, 112, 61, 248, 237, 134, 95, -286, -122, 38, -111, -395, -99, 96, -208, 47, -147, 272, 190, 9, 54, -349, 52, 340, -117, 138, -168, 129, 337, 265, 389, -18, 198, 114, -246, 97, 11, 5, -154, 53, -59, -64, -323, -247, 57, -223, -67, -278, -114, -116, -41, -136, 53, -271, -231, -34, -171, 218, -118, -53, 243, 266, 69, -6]
5031fK3K77J64m46K6L91n55K82m19J60j23J23J48J0J31n87L14l3J18M2j46M54
5053C48l42l59L45lj94J84o7J26j20J9j15J08j49qL63m1l71K05p8J77j36J59l65
5076c14K44L04k83r5j58L64j57K3n9L24k15J73p5K9j63M33o9j08M2k84R2llp4
5100c2q9j82J48J90k05P5k22Q8J47j30o9K51r0q8J22o9R0j51j06M44k14L99O2
5123C69Rj90L3m2K43l28k19K78k0o4k21L93m56L99k88L16l14J94l44K72l5QR3
5146H6rj25K95k55O6j78N04l94n4K45k83L75k12K81m11k7J53K56k11J69j25O9
5168B15k07l45P0J50J21j63j74K48q6J94j08J85o1M48k03k93K4K57j89K5K67M7
5190D22l5j22l33J5N84r12M91k38L4r4N0J14J6j60K55j44m8j41K86j96j0K45O
$$ y = [-6, 17, 294, 458, 12, 38, 429, -126, 156, -263, -103, -226, -103, 45, 55, 186, -401, -87, -120, -2, 40, -106, 348, 6, -353, -8, -11, -205, -21, -88, 38, -82, -63, -178, -70, -219, -227, 136, 95, -276, -71, -149, 28, -108, 51, -314, -70, 234, -49, -144, -302, 62, -95, -72, -131, 193, -22, 151, 76, 105, -58, 375, 306, 198, 240, -44, 48, 45, 42, -32, -121, -303, -155, 35, -170, -95, -317, -229, -82, -212, -281, -30, -120, -208, -86, -155, -65, -216, -322, 122, -92, 307, 369, 378, 188, 221, 179, 422, 94, -125, 153, 133, 69, -152, 241, -215, 184, -104, 212, -102, 92, -252, 20, -15, -7, 86, 77, -48, 247, -8, 58, -120, 384, -10, -64, 181, -102, 273, 61, 342, -69, -96, 57, 313, 102, 271, 146, 215, 8, -337, -267, -117, 4, -159, -333, -85, -171, 23, -85, 100, 39, 487, 284, -9, 15, 272, 83, 108, 375, 422, 387, 265, -68, -53, 531, -381, 110, -128, -94, -188, -138, -24, -8, -168, 87, -57, -105, -246, 40, -156, -166, 79, 85]
5213H5m05N94k54K09q5j58J35j57NJ51r5L7M1j82K45l57L08j03P0k94J06k41K03
5236a42O0L7j2L34l01k36P2rL55K06m18l16P36k03j65k80L25J5j06K39m37L41
5258I5l13J48l05J98K66l84J45p5J49K78l38L7J35l20M08j95J8N5J91o4l47M1
5280a77j8N14j12k54J6r6M27K19n34L5K01l09L18l23M3M2j36k4n7K28q8K81Q0
5303B76k94n5L88k34j54L5k9K0N4n4K30R3l65M9N20m97M34o26O8N90o30J52K26
5326A97J53n50J64J26K1j19j90K28j13RJ51L7K61m91P3J05j97J73O8N5n8l12P9
5349a30L42k8k35K3J10l7J14k89K03k98L48k97O9J25K10k87k10K66oK41k31J56
5371A59J1j33m1Q9J12j58j49J33k30J36K9r5K4l5m9L48k22n4J02K47j48J23l18
$$ y = [85, -320, 274, 20, 229, 144, -14, 121, -36, -31, 120, 25, 62, 103, -79, 166, -191, 117, 14, 84, -210, -104, -345, -142, -82, -45, -57, 277, -24, -260, -188, -197, 158, 364, -54, -370, 366, 163, -2, -282, 43, 58, -48, 191, -246, 95, -218, -70, -375, -177, 89, -295, -150, -225, -76, 202, -136, -99, 36, -284, 124, -71, -53, 2, 193, 129, -218, -177, -195, 319, 207, -47, -31, -127, 300, 519, -15, 20, 221, -88, 230, -93, -50, -8, -144, -168, -225, 3, -85, 196, 276, -18, -73, 315, 81, -73, -38, -67, -47, 7, -47, 183, 276, -89, -40, 480, -17, 417, -209, -141, 449, -181, -29, 197, 350, -200, -36, 90, 111, -8, -198, 30, -83, -74, 77, 114, 375, -116, -43, 62, -135, 38, 106, 161, 103, -209, -130, 212, 184, -51, -28, 82, 45, 159, -130, 73, -225, 123, -174, -105, 20, 230, -57, -267, -1, -7, 234, 3, 159, 170, 37, -4, 85, 197, 39, -110, 23, -207, -71, -42, -137, -113, -148, -197, 151, -71, -125, -23, 224, 76, 199, -119]
5394a19J21m57O57k16l5J21n8j64J98Rk06K40l13N0P3K81j53R7n48N28j83q0K68
5417A11j92qL23l86lJ69J1j60l41M09J85l47P0k41L71J9J1q2J5J36J4p0j92K63
5441H5J97n19J71l95N03L5M3j52P9r0J13k57J87p8J18j89Q1J03kj76K15k65K07
5464A4m4k16N92m35J10j18MJ06M6l7J87m51J13L57k21RoJ25Q7p1M3o9n1M4k90
5489a72J78P3j89K37j98K05O5j03J46k07M0P3l11K42k1j03l4P7J53j28j25N6R1
5512D5J76j91K91m49lj91L52l01K89Q4p0J02Jm83K56M19n85KR2J57lj64M78k54
5536E0Lk46J2P3K14j6k50K1J56J56k37N4j30P6l13K12O7K91l54K36j55K99r7j00
5560B2j66K99l49N38m26p7K07k82M11j27k2k79K89J82l1o4l17K17j17m09N43j09
$$ y = [-119, 2, -455, 202, -14, -49, 72, 14, -150, 48, 57, -149, 91, -222, -172, -99, 182, 29, 126, -422, 106, -77, -157, 111, -81, -89, 234, -152, -155, 14, 25, -135, -476, -67, 118, -229, -159, -400, -29, -10, 1, -81, -66, 70, 84, 14, -178, 85, 282, -237, -66, -461, 42, 77, 120, -32, 47, -43, 70, -187, 0, -78, 40, -149, -68, 35, 33, -143, 72, -193, 14, -30, -246, 346, -89, 21, -97, -93, 13, 59, 22, 209, -242, -129, 228, 7, 16, 10, 135, 222, 151, 194, 125, 74, 118, -172, 6, 79, -110, 127, -71, 134, 199, 96, 242, 35, 75, 148, -163, 79, 58, -45, -79, -2, 151, 23, -102, -46, 45, 221, 30, 321, -128, -131, -322, 30, -271, 18, 102, 32, 134, 135, -348, -92, 327, -258, -256, -164, -7, -10, -174, 304, 50, 53, -193, -181, -108, 106, 90, -160, -139, 17, 173, -64, -10, -140, -64, -377, -165, -98, 193, -161, 75, -80, 219, 122, 22, -144, 155, -194, 344, -82, -159, 48, -234, 177, 50, 28, -251, 38, 220, 189, 125, -192, 25, -92, -501, 42, -67]
5582f7J4J05k33L07q3l52L47k20J64k81N02p9l12K79j40J08m54N26J13o9k56Q2
5604Aj3L81k58r3j38L44j45q3j12J44j63j01Q1J95j04j6J0j23M48j59j26j51K11
5627C0q5L81q27K28O3K2L01Q7l24J72k32J73K98k82Q8k2j35q6J26NK09k61q6J30
5651b7Q3M8j44J31Mk01P6L58l93K54Kl7K05k14Q2n05M02k18r0L70n81L33R1r6
5675f7J11k66K78j03m8J03j59K29j34K25k21O1k23J14j10K53r4J05J71k93L5J16
5697H3m42L36P0n2n6j64K35m9R0J45k35p6M7M75k23k88j26M71m01L93n7j98J93
$$ y = [-67, -53, 52, -181, 126, 43, -309, 38, -182, -18, -299, 203, 124, -188, 91, -49, 59, -395, 131, 244, 175, -81, 1, -12, 369, 111, 18, -120, 224, 79, -4, -116, 28, -135, -236, -155, 40, -64, -80, -70, -193, 255, 96, -30, -181, 30, -55, 326, -501, -273, -210, -188, 113, 200, -124, 48, -184, -11, 287, 5, 93, 71, -64, -150, -24, -19, 190, -71, -157, -27, 56, 104, -40, 91, 95, -106, -30, 328, -65, 189, 191, 154, 359, 145, 227, -278, 124, -94, -184, 186, -395, -62, 29, -67, 44, -222, 56, -47, -95, 8, -151, 78, -56, 169, -52, 9, -214, -100, -210, 43, -51, 54, 225, -68, -33, 83, -359, -23, 47, -5, -61, -225, 10, -39, 51, 196, -39, -115, -68, 407, 184, -104, -230, 241, -160, 233, 176, -22, 171]
$$ [...]
8191c14
##END NTUPLES=NMR FID
##END=
