##TITLE=1H_CG-1049-B
 CDCl3, 8 sc, 
 23.11.2020
##JCAMPDX= 6.0         $$ Bruker NMR JCAMP-DX V2.0
##DATA TYPE= NMR SPECTRUM
##DATA CLASS= NTUPLES
##ORIGIN= UXNMR, Bruker Analytische Messtechnik GmbH
##OWNER= root
$$ XWIN-NMR		Version 3.5
$$ Mon Nov 23 12:53:53 2020 Russian Standard Time (UT+4h)  she@DPX200
##.OBSERVE FREQUENCY= 200.1315066352
##.OBSERVE NUCLEUS= ^1H
##.ACQUISITION MODE= SIMULTANEOUS
##.ACQUISITION SCHEME= undefined
##.AVERAGES= 8
##.DIGITISER RES= 18
##SPECTROMETER/DATA SYSTEM= spect
##.PULSE SEQUENCE= zg30
##.SOLVENT NAME= CDCl3
##.SHIFT REFERENCE= (INTERNAL, CDCl3, 0, 15.9875)
##AUDIT TRAIL= $$ (NUMBER, WHEN, WHO, WHERE, WHAT)
$$ ##TITLE= Audit trail, XWIN-NMR		Version 3.5
$$ ##JCAMPDX= 5.01
$$ ##ORIGIN= Bruker BioSpin GmbH
$$ ##OWNER= she
$$ F:/spectra/data/she/nmr/H-F/1/pdata/1/auditp.txt
$$ ##AUDIT TRAIL=  $$ (NUMBER, WHEN, WHO, WHERE, WHAT)
(   1,<2020-11-23 12:52:38.37 +0400>,<she>,<DPX200>,
      <created by zg, POWCHK disabled, PULCHK disabled
       configuration hash MD5:
       00 E9 B6 7A A2 85 ED C7 34 08 36 98 17 FE 4E 26
       data hash MD5: 16K
       0B 2B D1 0A DD A0 C1 1B 4A AC 6B 18 3E BB 54 CC>)
(   2,<2020-11-23 12:52:41.43 +0400>,<she>,<DPX200>,
      <Start of raw data processing
       efp BC_mod = 2 LB = 0.24 FT_mod = 6 PKNL = 1 PHC0 = -11046.36 PHC1 = 11.00089 SI = 16K 
       data hash MD5: 16K
       D1 0F 7E A1 80 61 3F 30 20 1F BC 51 F2 D7 04 DC>)
(   3,<2020-11-23 12:53:03.73 +0400>,<she>,<DPX200>,
      <abs ABSG = 5 
       data hash MD5: 16K
       F3 73 0B 1F AE 5D 33 7D C0 C5 C0 14 91 84 8B 38>)
(   4,<2020-11-23 12:53:15.78 +0400>,<she>,<DPX200>,
      <pk PHC0 = -1.322572 PHC1 = 0 
       data hash MD5: 16K
       70 2F 5F 4E F8 44 73 DA A4 D7 77 00 78 00 80 48>)
$$ ##END=
$$ 
$$ hash MD5
$$ 74 D2 95 8C 1A 17 39 93 4E 34 D1 21 13 48 66 1C
##$RELAX= 
##$RELAX= 
##$RELAX= 
##$RELAX= 
##$RELAX= 
##$RELAX= 
$$ Bruker specific parameters
$$ --------------------------
##$DU= <F:/spectra>
##$EXPNO= 1
##$NAME= <H-F>
##$PROCNO= 1
##$TYPE= <nmr>
##$USER= <she>
##$AMP= (0..31)
100 100 100 100 100 100 100 100 100 100 100 100 100 100 100 100 100 100 
100 100 100 100 100 100 100 100 100 100 100 100 100 100 
##$AQSEQ= 0
##$AQ_mod= 1
##$AUNM= <au_zg>
##$AUTOPOS= <>
##$BF1= 200.13
##$BF2= 200.13
##$BF3= 200.13
##$BF4= 200.13
##$BF5= 200.13
##$BF6= 200.13
##$BF7= 200.13
##$BF8= 200.13
##$BYTORDA= 1
##$CFDGTYP= 0
##$CFRGTYP= 5
##$CHEMSTR= <none>
##$CNST= (0..31)
1 1 145 1 1 1 1 1 1 1 1 1 1 1 1 1 1 1 1 1 1 1 1 1 1 1 1 1 1 1 1 1 
##$CPDPRG= <>
##$CPDPRG1= <>
##$CPDPRG2= <>
##$CPDPRG3= <>
##$CPDPRG4= <mlev>
##$CPDPRG5= <mlev>
##$CPDPRG6= <mlev>
##$CPDPRG7= <mlev>
##$CPDPRG8= <mlev>
##$CPDPRGB= <>
##$CPDPRGT= <>
##$D= (0..31)
0 1.2 0 0 0 0 0 0 0 0.06 0 0.03 0 0 0 0 0.0002 0 0 0 0 0 0 0 0 0 0 0 0 
0 0 0 
##$DATE= 1606121557
##$DBL= (0..7)
120 120 120 120 120 120 120 120 
##$DBP= (0..7)
150 150 150 150 150 150 150 150 
##$DBP07= 0
##$DBPNAM0= <>
##$DBPNAM1= <>
##$DBPNAM2= <>
##$DBPNAM3= <>
##$DBPNAM4= <>
$$ [...]
##$SUBNAM3= <"">
##$SUBNAM4= <"">
##$SUBNAM5= <"">
##$SUBNAM6= <"">
##$SUBNAM7= <"">
##$SUBNAM8= <"">
##$SUBNAM9= <"">
##$SW= 16.9725356469052
##$SWIBOX= (0..15)
0 0 2 0 0 0 0 0 0 0 0 0 0 0 0 0 
##$SW_h= 3396.73913043478
##$TD= 16384
##$TD0= 1
##$TE= 0
##$TE2= 300
##$TE3= 300
##$TEG= 300
##$TL= (0..7)
0 120 120 120 120 120 120 120 
##$TP= (0..7)
150 150 150 150 150 150 150 150 
##$TP07= 0
##$TPNAME0= <>
##$TPNAME1= <>
##$TPNAME2= <>
##$TPNAME3= <>
##$TPNAME4= <>
##$TPNAME5= <>
##$TPNAME6= <>
##$TPNAME7= <>
##$TPOAL= (0..7)
0.5 0.5 0.5 0.5 0.5 0.5 0.5 0.5 
##$TPOFFS= (0..7)
0 0 0 0 0 0 0 0 
##$TUNHIN= 0
##$TUNHOUT= 0
##$TUNXOUT= 0
##$USERA1= <user>
##$USERA2= <user>
##$USERA3= <user>
##$USERA4= <user>
##$USERA5= <user>
##$V9= 5
##$VALIST= <valist>
##$VCLIST= <CCCCCCCCCCCCCCC>
##$VD= 0
##$VDLIST= <DDDDDDDDDDDDDDD>
##$VPLIST= <PPPPPPPPPPPPPPP>
##$VTLIST= <TTTTTTTTTTTTTTT>
##$WBST= 1024
##$WBSW= 4
##$XGAIN= (0..3)
0 0 0 0 
##$XL= 0
##$YL= 0
##$YMAX_a= 702773
##$YMIN_a= -463434
##$ZGOPTNS= <>
##$ZL1= 120
##$ZL2= 120
##$ZL3= 120
##$ZL4= 120
##$ABSF1= 15.91084
##$ABSF2= -1.061822
##$ABSG= 5
##$ABSL= 3
##$ALPHA= 0
##$AQORDER= 0
##$ASSFAC= 0
##$ASSFACI= 0
##$ASSFACX= 0
##$ASSWID= 0
##$AUNMP= <proc_1d>
##$AZFE= 0.1
##$AZFW= 0.1
##$BCFW= 0
##$BC_mod= 2
##$BYTORDP= 0
##$COROFFS= 0
##$CY= -3
##$DATMOD= 1
##$DC= 0
##$DFILT= <>
##$DTYPP= 0
##$F1P= 0
##$F2P= 0
##$FCOR= 1
##$FTSIZE= 16384
##$FT_mod= 6
##$GAMMA= 0
##$GB= 0
##$INTBC= 1
##$INTSCL= 1.245715e-10
##$ISEN= 128
##$LB= 0.24
##$LEV0= 0
##$LPBIN= 0
##$MAXI= 10000
##$MC2= 0
##$MEAN= 0
##$ME_mod= 0
##$MI= 1.114404
##$NCOEF= 0
##$NC_proc= -5
##$NLEV= 6
##$NOISF1= 3.799351
##$NOISF2= 2.8
##$NSP= 0
##$NTH_PI= 0
##$NZP= 0
##$OFFSET= 15.98749
##$PC= 1
##$PHC0= -11047.68
##$PHC1= 11.00089
##$PH_mod= 1
##$PKNL= yes
##$PPARMOD= 0
##$PSCAL= 0
##$PSIGN= 0
##$REVERSE= no
##$SF= 200.130005428144
##$SI= 16384
##$SIGF1= 3
##$SIGF2= 2
##$SINO= 5.538805
##$SIOLD= 16384
##$SREGLST= <1H.CDCl3>
##$SSB= 0
##$STSI= 16384
##$STSR= 0
##$SW_p= 3396.73913043478
##$SYMM= 0
##$S_DEV= 0
##$TDeff= 16384
##$TDoff= 0
##$TI= <>
##$TILT= no
##$TM1= 0
##$TM2= 0
##$TOPLEV= 0
##$USERP1= <user>
##$USERP2= <user>
##$USERP3= <user>
##$USERP4= <user>
##$USERP5= <user>
##$WDW= 1
##$XDIM= 16384
##$YMAX_p= 454325729
##$YMIN_p= -513791
$$ End of Bruker specific parameters
$$ ---------------------------------
##NTUPLES= NMR SPECTRUM
##VAR_NAME=  FREQUENCY,     SPECTRUM/REAL,   SPECTRUM/IMAG
##SYMBOL=    X,             R,               I
##VAR_TYPE=  INDEPENDENT,   DEPENDENT,       DEPENDENT
##VAR_FORM=  AFFN,          ASDF,            ASDF
##VAR_DIM=   16384,         16384,           16384
##UNITS=     HZ,            ARBITRARY UNITS, ARBITRARY UNITS
##FACTOR=    0.207333158178281, 1,           1
##FIRST=     3199.57640050691, 0,            0
##LAST=      -197.162729927866, 0,           0
##MIN=       -197.162729927866, -513791,     0
##MAX=       3199.57640050691, 454325729,    0
$$ Real data points
##PAGE= N=1
##DATA TABLE= (X++(R..R)), XYDATA
$$ [...]
6759B623950n9180j4633k6118l6570Q6299O0674j0837J29255M0905j3986J27384
6748B907143R0950K02568J36087R4699J15854J32339K68278J29684J73562K34887
6738D486051K76870L87817L72327M14579L87711P5513p5424m7385O9043N496j31591
6727F221007j34177n8868Q2441J99411K13540K82690J81960R1424Q8189P4572
6717G242189J35500J37381M9509j52637k48865j93437m8062j84362j11645n604
6707F619967J5877N2244J01309p0321j04491n2799p9756P586K3168J69299K59227
6696F941310L09044K48789K48561K63025K37095L0871j7132J75880L42543M16264
6686I196250K21029k26434m24763k27556M2837j00644l74991l34853k57085j39546
$$ plain form
6759 2623950 2564770 2550137 2524019 2487449 2573748 2634422 2623585 2752840 2793745 2779759 2907143
6748 2907143 2998093 3200661 3336748 3431447 3547301 3679640 3947918 4077602 4251164 4486051
6738 4486051 4762921 5150738 5523065 5937644 6325355 6400868 6325444 6278059 6347102 6352598 6221007
6727 6221007 6086830 6027962 6110403 6309814 6523354 6806044 6988004 7079428 7167617 7242189
6717 7242189 7377689 7515070 7564579 7411942 7163077 6969640 6921578 6737216 6625571 6619967
6707 6619967 6635844 6688088 6789397 6719076 6614585 6561786 6482030 6489616 6512784 6682083 6941310
6696 6941310 7250354 7499143 7747704 8010729 8247824 8278695 8261563 8437443 8779986 9196250
6686 9196250 9417279 9190845 8766082 8538526 8581363 8480719 8105728 7770875 7513790 7374244
6676G374244o1067N2138Q0268Q3975J53827J22444K35314K22849J38646J10419
6666H513057J41157J34495J10328j8785k1601N1297L05034K74158J34067J71088
6656I794295J50997J56898N5869L39408L51463o5921l56132k13521j1533J66888
6646A0368711L02752L30488K09328J45243R750j87961p6989K06854L75814L82518
6636A2066508K01018P1377p0554j73962l58537l55618j50110j41837r4947k83590
6626A0709748k30706j40698m5566J2546o1992k35373k63130k38770k59918j73075
6616I073066j09763L1195O9117J83158K83114K40221J70482j30147k88164j11632
6606I410647J49428J44628R8329k88336n15145m81110k83740k32998k35202k03551
$$ plain form
6676 7374244 7313177 7365315 7445583 7529558 7683385 7805829 8041143 8263992 8402638 8513057
6666 8513057 8654214 8788709 8899037 8880252 8858651 8909948 9214982 9489140 9623207 9794295
6656 9794295 9945292 10102190 10158059 10497467 10848930 10783009 10426877 10213356 10201823 10368711
6646 10368711 10671463 11001951 11211279 11356522 11366272 11178311 11101322 11308176 11683990 12066508
6636 12066508 12267526 12338903 12268349 12094387 11735850 11380232 11230122 11088285 10993338 10709748
6626 10709748 10479042 10338344 10292778 10305324 10243332 10007959 9744829 9506059 9246141 9073066
6616 9073066 8963303 8994498 9063615 9246773 9529887 9770108 9940590 9810443 9522279 9410647
6606 9410647 9560075 9704703 9803032 9514696 8999551 8518441 8234701 8001703 7766501 7562950
6596G562950j84944l0639j30286r295L9130N5633L5260M1663J72049J18055J3811
6585G683387O4765o961k9417r8678j27874j65359o9936J19569k6010k4360N5609
6574G374735o2435k67275k97959k84802k22346j46995o1139O9123P353J14803
6564F223063J29799J79538K66088K10337q0023l10500l49828k41572l19160j13163
6554E594579K6389m1897r005j09932k2749q2394k28865o9650K9067j3417J9703
6543E091829O0028j6455r5923j8170p7413o1366j74946l06604k78351l30577k20752
6532C571300j92266j74173K276l4832j30629l4438j55520q9947l9054k0847n434
6521B696436m2375o7587k4733j42732p4393L2164r1766Q4207J5003r7452N3714
$$ plain form
6596 7562950 7378006 7347367 7217081 7207786 7246916 7302549 7337809 7379472 7551521 7669576 7683387
6585 7683387 7748152 7741191 7711774 7613096 7485222 7319863 7249927 7369496 7343486 7319126 7374735
6574 7374735 7312300 7045025 6747066 6462264 6239918 6092923 6031784 6100907 6108260 6223063
6564 6223063 6352862 6532400 6798488 7008825 6928802 6618302 6268474 6026902 5707742 5594579
6554 5594579 5620968 5579071 5570066 5460134 5437385 5354991 5126126 5056476 5085543 5072126 5091829
6543 5091829 5151857 5135402 5039479 5021309 4943896 4882530 4707584 4400980 4122629 3792052 3571300
6532 3571300 3379034 3204861 3207137 3172305 3041676 3007238 2851718 2761771 2722717 2701870 2696436
6521 2696436 2654061 2586474 2561741 2419009 2344616 2376780 2285014 2369221 2384224 2286772 2340486
6510B340486L3538J5574m2897j01484K8657k5334k921k1903o0204o5575m889m025
6498B089023q7832l6231J3625r1293J32204k5821O1866r525p6860J439j37519
6487A833076l719Q2028J6411N303j5777o2798l2619N1704n1543P7291Q4574j7786
6475A966145L200J0875L1400j29074j44869K6352o3157n9452K3565K8038O16M5606
6463A739245j7971j09734M1432L9479P2432Q4591Q517l1176r7622n4984N8981
6452A733190l8049k1784j4874J04178l2569n7492Q93n3800L829M0529q703M8011
6440A703359O0527P2721j861k4870k6112l4978j2422J1439O1158J37379R0753
6429B037093J35198N247Q7325J55197Q9981J36620K71981J61727J11232r6008
$$ plain form
6510 2340486 2374024 2389598 2346701 2245217 2273874 2248540 2245619 2223716 2163512 2097937 2093048 2089023
6498 2089023 2001191 1964960 1978585 1887292 2019496 1993675 2055541 2046016 1969156 1970595 1833076
6487 1833076 1829357 1911385 1927796 1933099 1917322 1854524 1821905 1873609 1822066 1899357 1983931 1966145
6475 1966145 1969345 1980220 2011620 1882546 1737677 1764029 1700872 1641420 1664985 1693023 1693639 1739245
6463 1739245 1721274 1611540 1652972 1692451 1764883 1849474 1857991 1826815 1729193 1674209 1733190
6452 1733190 1695141 1673357 1658483 1762661 1730092 1672600 1673493 1619693 1623522 1664051 1655348 1703359
6440 1703359 1763886 1836607 1834746 1809876 1783764 1748786 1736364 1747803 1808961 1946340 2037093
6429 2037093 2172291 2177538 2264863 2420060 2510041 2646661 2918642 3080369 3191601 3095593
6419C095593j54011j25939j2852J9415j2386K06657J69253j43784k92253j83353
6409B566340k13674j10930j11670O333p0210j15297r0755p2719k9386J2877k1830
6398A749079k3407m3026J4274L0100J7898M6205L4448K5525K6708j3350m6620
6387A817834k5894O5377J02193p8282K6976L1781p7195Q3987M2063L0428k9944
6376A989324P3975R5843O7497k37N9195J22441L8825J25997K00109K34675K21370
6365C229014J30439n1030j30042j48842k8099J85418J89931K32278K48679M6189
6355C903935j19121l59948l34050j90837j61730p0714n620O9317j13321Q303j81207
6344B445007j46732j71354o7024j8626r8064q4826j5373k1076m2525R3901k9007
$$ plain form
6419 3095593 2941582 2815643 2802791 2822206 2809820 3016477 3185730 3041946 2749693 2566340
6409 2566340 2352666 2241736 2130066 2136399 2066189 1950892 1860137 1787418 1758032 1770909 1749079
6398 1749079 1725672 1682646 1696920 1727020 1744918 1791123 1825571 1851096 1877804 1864454 1817834
6387 1817834 1791940 1857317 1959510 1881228 1908204 1939985 1862790 1946777 1988840 2019268 1989324
6376 1989324 2063299 2159142 2226639 2226402 2285597 2408038 2446863 2572860 2772969 3007644 3229014
6365 3229014 3359453 3308423 3178381 3029539 3001440 3186858 3376789 3609067 3857746 3903935
6355 3903935 3784814 3424866 3090816 2899979 2738249 2667535 2661915 2731232 2617911 2626214 2445007
6344 2445007 2298275 2126921 2059897 2041271 1943207 1858381 1843008 1821932 1779407 1873308 1844301
6333A844301q8706p1379M7753J0108l647K747N2271j7949k7781M9873j6904n5954
6321A724733m9394J9030Q3858k252K8641K9042O7448k1526k9893N9822O5189R0
6309A974788Q5394K4293k7897P7371N6781Q3901J113J1813K11385P3831J32874
6298B705647n9362r0765j23926j02133l1857n780J30820q593n9039j20202k20608
6287B014202j23567j8862m1305r8864j68235m5127J6973k2226n1069m4321k7762
6276A389837j2921n1499L8165l6818l603J2394j25860P4555L9410k7943n71M2971
6264A338117o130q254l3340L9657M6552K7864M2001J1002m4118Q0938k6067K3560
6252A491782o738O272n1489n1460O1330q498N1727R483J3899M9409j05543O069
$$ plain form
6333 1844301 1755595 1684216 1731969 1742077 1738430 1741177 1793448 1775499 1747718 1797591 1780687 1724733
6321 1724733 1675339 1694369 1778227 1775975 1804616 1833658 1901106 1879580 1849687 1909509 1974698 1974788
6309 1974788 2060182 2084475 2056578 2133949 2190730 2274631 2275744 2287557 2498942 2572773 2705647
6298 2705647 2646285 2555520 2431594 2329461 2297604 2291824 2422644 2414051 2355012 2234810 2014202
6287 2014202 1890635 1871773 1830468 1731604 1563369 1518242 1535215 1512989 1461920 1417599 1389837
6276 1389837 1376916 1325417 1363582 1326764 1323161 1335555 1209695 1284250 1323660 1295717 1295146 1338117
6264 1338117 1331987 1323733 1290393 1330050 1376602 1404466 1446467 1457469 1413351 1494289 1468222 1491782
6252 1491782 1485044 1491316 1439827 1388367 1449697 1441199 1492926 1502409 1516308 1565717 1460174 1466243
6240A466243K2340n3750Q7759q3676k4250J2728J9669l3687l6909l6138K9619
6229A369948q0670q600P6211M7786q4199K4518m9927J2785j04893Q9768j0288
6218A282439K1874r5726n0801P2312j6016L5976n7022Q1272n975j654O741R551
6206A282971J2218K8092J0971Q0203L6406Q6800P7216k7900l970J1681o6471l486
6194A524731k4201J0816j240L5265L6858L072J0606r574K2832n3619P8818Q2511
6182A716875n790M5634P4815o4303m5622N043K5582l5153P6170O4765k0248j8229
6170A819539q4598k2147N369n7452L8094M4768j1698m768j18119L274j6466o2819
6158A532977q0230J6685K0225L6696J2135K0784p0461k5281J6638k9600j9616
$$ plain form
6240 1466243 1488583 1434833 1522592 1438916 1414666 1427394 1447063 1413376 1376467 1340329 1369948
6229 1369948 1289278 1280678 1356889 1404675 1320476 1344994 1295067 1307852 1202959 1292727 1282439
6218 1282439 1304313 1208587 1157786 1230098 1214082 1250058 1193036 1274308 1268333 1266679 1273420 1282971
6206 1282971 1295189 1323281 1334252 1414455 1450861 1537661 1614877 1586977 1583007 1594688 1528217 1524731
6194 1524731 1500530 1511346 1510106 1545371 1582229 1585301 1595907 1586333 1609165 1555546 1634364 1716875
6182 1716875 1711085 1756719 1831534 1767231 1721609 1726652 1752234 1717081 1793251 1858016 1837768 1819539
6170 1819539 1734941 1712794 1718163 1660711 1698805 1743573 1731875 1727107 1608988 1612262 1595796 1532977
6158 1532977 1452747 1469432 1489657 1526353 1538488 1559272 1488811 1463530 1480168 1450568 1430952
6147A430952L1241N2557J44423q8209q7753m9629q4575K686O225K0567q349J3798
6135A383934M9745l0262M9501L7169o3949p235M4592m1914P6226P4766l3069l2119
6123A507385n1122o997j27238o3575M5313j0799R0981P0551m6665j8860M6266
6112A435240Q4282L7711m5116K7769j7426o8108n129O0843p2159j692J14018m9883
6100A500350k1635K6696j8249K8329L6236J5850J5705o019L4038o987K2784M9159
6088A676257l820M6579P8278J2568J428J033J14616J2688o4m5560J1478r8886
6076A806595O3040O5695K8862l3462L6038o0890L2959n9107m2227Q643N0632j2652
6064A884126M4262K4367M2768M8935n5628J05783J21669p3832n9350K4091m0361
$$ plain form
6147 1430952 1462193 1514750 1659173 1570964 1483211 1433582 1349007 1351693 1357918 1378485 1370136 1383934
6135 1383934 1433679 1403417 1452918 1490087 1426138 1418903 1463495 1421581 1497807 1572573 1539504 1507385
6123 1507385 1456263 1449266 1322028 1258453 1303766 1292967 1383948 1454499 1407834 1388974 1435240
6112 1435240 1519522 1557233 1512117 1539886 1522460 1454352 1449223 1510066 1437907 1436215 1550233 1500350
6100 1500350 1478715 1505411 1487162 1515491 1551727 1567577 1583282 1577263 1611301 1604314 1627098 1676257
6088 1676257 1672437 1719016 1797294 1809862 1811290 1812323 1926939 1939627 1939563 1894003 1905481 1806595
6076 1806595 1869635 1935330 1964192 1930730 1966768 1905878 1938837 1879730 1837503 1846146 1896778 1884126
6064 1884126 1928388 1952755 1995523 2044458 1988830 2094613 2216282 2142450 2083100 2107191 2066830
6053B066830M3018k8591J4617K7614O8110l3535O62J37997J20041l7824j5079
6042B363860J38500K4900K5336J78294o556P5955k2785J53417J12404O6168P3599
6031C183092R6659J51173J79799K17789J51782J82256J47990K26432J67936J84276
6021D889184K00102J70237K43484K81513K36856J96845J50839Q1413R2055J33780
6011F676308J58017N7163J31861K9048q2790k0026l6204j73070j93923j42216
6001F404168j41574k12110j37826j69616j46250j62440j91580j38038o6037j51137
5991D887560j43151o0926l726k7701K6796L0263n4161p0825N3049K2297Q8990
5980D748465P1950j4108J05885n0513L9843J71560Q3753R6017J91583O1895O6704
$$ plain form
6053 2066830 2109848 2081257 2095874 2123488 2191598 2158063 2158725 2296722 2416763 2378939 2363860
6042 2363860 2502360 2527260 2552596 2730890 2724334 2800289 2777504 2930921 3043325 3109493 3183092
6031 3183092 3279751 3430924 3610723 3828512 3980294 4162550 4310540 4536972 4704908 4889184
6021 4889184 5089286 5259523 5503007 5784520 6021376 6218221 6369060 6450473 6542528 6676308
6011 6676308 6834325 6891488 7023349 7052397 6969607 6949581 6913377 6740307 6546384 6404168
6001 6404168 6262594 6050484 5912658 5743042 5596792 5434352 5242772 5104734 5038697 4887560
5991 4887560 4744409 4683483 4679757 4652056 4678852 4709115 4654954 4584129 4637178 4659475 4748465
5980 4748465 4820415 4806307 4912192 4861679 4901522 5073082 5156835 5252852 5444435 5506330 5573034
5969E573034J63051J70112R3034J11723J09148K23810J47792J38812J46826J59053
5959G036395J41453J20043P9926P9510J12056J12640M5885J21717J52290J42828
5949H144743J15773J23701J75901K48112K13949J89728L11795K80453L70099L26870
5939A0501124K24655K77653M11022M06215L43394L25301L17681K43127K15980
5930A3266152J64729n2494P2935J00412K0979L8987r1106p4664o1816j94322j39817
5919A3049975j34569j15450k26219k90052j75777j48791k56284j54201q1941k8940
5909A1437751L3537l1865L5985J11174J21975J64815J94576J90093J79018K31065
5899A2668124K45036K99078L14211L14647K68511P5885m8403j44773L1619L08264
$$ plain form
5969 5573034 5736085 5906197 5999231 6110954 6220102 6443912 6591704 6730516 6877342 7036395
5959 7036395 7177848 7297891 7377817 7457327 7569383 7682023 7727908 7849625 8001915 8144743
5949 8144743 8260516 8384217 8560118 8808230 9022179 9211907 9523702 9804155 10174254 10501124
5939 10501124 10725779 11003432 11414454 11820669 12164063 12489364 12807045 13050172 13266152
5930 13266152 13430881 13378387 13451322 13551734 13572713 13611700 13520594 13445930 13384114 13189792 13049975
5919 13049975 12915406 12799956 12573737 12283685 12107908 11959117 11702833 11548632 11466691 11437751
5909 11437751 11471288 11439423 11475408 11586582 11708557 11873372 12067948 12258041 12437059 12668124
5899 12668124 12913160 13212238 13526449 13841096 14109607 14185492 14137089 13992316 14023935 14332199
5889A4332199K44722J8130k56905l82703l70901k94767k11920r1002k4476k68987
5879A2693390k74413l09534j94200k34511j68310p8507N4163M8989J94603J70410
5869A1902080j52686j78159J9776P7553K73703L45702N17923M88455K70803j30441
5859A3434709l78964j66443J06926K85261M33215O03970N27254Q5096m87299o27702
5849A3816023n20322r3390L1509J07600L3002j58318n50784o83442m58658j79579
5839A1343641k57345l94247n88130n38019m61642n24223l59148l50298k55621
5830G614968l14496m19284k62194k23813j68602k24334k25917j03052j24451m9679
5820E499146P461L3535K3067r9261O3246J38053M5809L0892J80663K43892K63308
$$ plain form
5889 14332199 14576921 14595051 14338146 13955443 13584542 13289775 13077855 12986853 12962377 12693390
5879 12693390 12418977 12109443 11915243 11680732 11512422 11433915 11488078 11537067 11731670 11902080
5869 11902080 11749394 11571235 11591011 11668564 11942267 12287969 12805892 13294347 13565150 13434709
5859 13434709 13055745 12889302 12996228 13281489 13714704 14318674 14845928 14931024 14443725 13816023
5849 13816023 13295701 13202311 13233820 13341420 13374422 13216104 12665320 11981878 11523220 11343641
5839 11343641 11086296 10692049 10103919 9565900 9104258 8580035 8220887 7870589 7614968
5830 7614968 7300472 6881188 6618994 6395181 6226579 6002245 5776328 5673276 5548825 5499146
5820 5499146 5506607 5540142 5563209 5463948 5527194 5665247 5711056 5741948 5922611 6166503 6429811
5809F429811L57139L40801L62160K96151R3731J43645K32807L64777N56741P24326
5799I902089L14989j69128k12881l30516j80298J62253K19496K82653J67401O0168
5789A0216226j95174l95729l53375k41793j04328O88J39253J70375J54662J50264
5779I541069M0161k36667m19599l33016k0412l588K58318K63772L02222L9011
5769I431271l89138n71245l47104l33756q1903M495K01510K13959M2560j07162
5759H063487j42359j92190j02388L0490J42377K18410L65008L98597J91188k37881
5749H734739l91748l95476l20305j2458M1429Q3332j76818j47057m85481n67742
5739F362415m62365l77351l51419j23553j65816k16924k37211k71447l01216j92658
$$ plain form
5809 6429811 6786950 7127751 7489911 7786062 7879793 8023438 8256245 8621022 9177763 9902089
5799 9902089 10217078 10047950 9835069 9504553 9324255 9486508 9706004 9988657 10156058 10216226
5789 10216226 10021052 9625323 9271948 9030155 8925827 8926515 9065768 9236143 9390805 9541069
5779 9541069 9581230 9344563 8924964 8591948 8571536 8567948 8826266 9090038 9392260 9431271
5769 9431271 9042133 8470888 8123784 7790028 7708125 7712620 7914130 8128089 8170649 8063487
5759 8063487 7921128 7728938 7626550 7657040 7799417 8017827 8382835 8781432 8972620 8734739
5749 8734739 8342991 7947515 7627210 7614752 7656181 7739513 7562695 7415638 6930157 6362415
5739 6362415 5900050 5522699 5171280 5047727 4881911 4664987 4427776 4156329 3855113 3662455
5729C662455j14391j84283j10834p3847n9086j21896n6009r4630l3025l1036Q666
5718B792084r6211q2785N9528k9888r7223o6451o1705J8134L3506q4787M8765
5707B432967n5107o0422Q702L2644p6938N7035J0483q5315N7633Q2995l6650J7815
5695B385842p410M4180m8068J3809N7053N5272k8129L2801M265K3019J25724J01231
5683B759589M5157k19J0679L5652O2573P1696R4082J08430J21012J30365Q7401
5672C526417Q1432J28420N3859J43221K00769K23179J60958J33954J70471K06839
5662E029519L64085K82588J25571K54619K33776K85373L52367M42010K56700L64518
5652G991126K85646m7672j75119j5436N8788K22004L7968k45698k72543k77027
$$ plain form
5729 3662455 3548064 3363781 3252947 3179100 3120014 2998118 2942109 2847479 2814454 2783418 2792084
5718 2792084 2695873 2613088 2672616 2642728 2545505 2479054 2417349 2435483 2468989 2384202 2432967
5707 2432967 2377860 2317438 2326140 2358784 2281846 2338881 2349364 2264049 2321682 2404677 2368027 2385842
5695 2385842 2378432 2422612 2374544 2388353 2445406 2500678 2472549 2505350 2509615 2532634 2658358 2759589
5683 2759589 2804746 2804527 2815206 2850858 2913431 2985127 3079209 3187639 3308651 3439016 3526417
5672 3526417 3607849 3736269 3790128 3933349 4134118 4357297 4518255 4652209 4822680 5029519
5662 5029519 5393604 5676192 5801763 6056382 6290158 6575531 6927898 7369908 7626608 7991126
5652 7991126 8276772 8229100 8053981 8038545 8097333 8319337 8357305 8111607 7839064 7562037
5642G562037m60919k97532k22905k54468j53446k24884l94578l69968k95926k61633
5632D625778k81655k23904j38098j15597j36906j55873j75410p4356P0765n8811
5622C335933l0784j6545q4335n5570J1992n6943m3848k0846O5778P0892L0094
5611C205818O6059J4920J4385M9271K5543j27729J15162Q2297P4437J6174O4413
5600C600750J24825J89M7173J01116r795j4806P4662j4536K18660Q1454J12609
5589D322301R2719O9725J09354J21317J70399K46003N3318K26283K50677K68982
5579E931078J60695K11594J27138J40275L34465L23425L32613L35321K70424L40631
5569H507659J13054j09655o9306J26765L02421J31314j06286k91632l24279j88886
$$ plain form
5642 7562037 7101118 6803586 6580681 6326213 6172767 5947883 5553305 5183337 4887411 4625778
5632 4625778 4344123 4120219 3982121 3866524 3729618 3573745 3398335 3323979 3394744 3335933
5622 3335933 3305149 3288604 3204269 3148699 3160691 3103748 3059900 3039054 3104832 3175724 3205818
5611 3205818 3271877 3286797 3301182 3350453 3375996 3248267 3363429 3445726 3520163 3536337 3600750
5600 3600750 3725575 3725764 3772937 3874053 3864258 3849452 3924114 3909578 4128238 4209692 4322301
5589 4322301 4415020 4484745 4594099 4715416 4885815 5131818 5185136 5411419 5662096 5931078
5579 5931078 6091773 6303367 6430505 6570780 6905245 7228670 7561283 7896604 8167028 8507659
5569 8507659 8620713 8511058 8441752 8568517 8870938 9002252 8895966 8604334 8280055 8091169
5559H091169k05112k41179j61614q5281k11706k78040k91917k12061k17965k31170
5549E955124j74922j91026q0702J67886j9295j24571J8253M9171P4359Q4453K14643
5538E973373M5090J17660O4831k2459k9043K0652K8055J30687J9222J33052N7393
5527F538513L4277q3624n4038r2258j9693l2950N514J39375K03915J38997N6134
5516F834162M4147o3021j25j9464Q3360J22741J10140K19640J69379P0498k2459
5505G548998r0431j56855j37762q8712M9043K7623K3283n1323P3020j056o0868
5494G134960P0643J51607J07308J77336P6039J72603J96181J61400J99680K46865
5484H694622K78683K28235K40347K45858J77887K50617K85518K79162K39909K20645
$$ plain form
5559 8091169 7886057 7644878 7483264 7397983 7186277 6908237 6616320 6404259 6186294 5955124
5549 5955124 5780202 5589176 5508474 5676360 5657065 5532494 5550747 5599918 5674277 5758730 5973373
5538 5973373 6018463 6136123 6200954 6178495 6149452 6170104 6198159 6328846 6348068 6481120 6538513
5527 6538513 6572790 6489166 6435128 6342870 6323177 6290227 6295741 6435116 6639031 6778028 6834162
5516 6834162 6878309 6815288 6815163 6795699 6879059 7001800 7111940 7331580 7500959 7571457 7548998
5505 7548998 7458567 7301712 7163950 7075238 7124281 7151904 7175187 7123864 7196884 7195828 7134960
5494 7134960 7205603 7357210 7464518 7641854 7717893 7890496 8086677 8248077 8447757 8694622
5484 8694622 8973305 9201540 9441887 9687745 9865632 10116249 10401767 10680929 10920838 11141483
5474A1141483M15013K93126L09785K40609L57850L88057L98616M85198N58716
5465A4588453M97388P74791P72302R57892J110027J415768J748913K011562K513753
5456B6390849K967016L345225L740538L604231K830025J015161j130963l060988
5448C9701094l895688l717215l033554k436850j991176j564035j408124j236206
5440B0418246r28347p92910o85922o19349n49110m02918m30826k54553j58572
5431A5595739k24744j93578r4927j98033l29842l21312l35142l71577k22399j57019
5421A3147166j41914m1950N3466N0501Q2504J08631P5670J78478L63198M64406
5411A4340156N30124O87217P60017P37271N29727L39896J16917O1455K57547L95372
$$ plain form
5474 11141483 11556496 11849622 12159407 12400016 12757866 13145923 13544539 14029737 14588453
5465 14588453 15085841 15860632 16632934 17590826 18700853 20116621 21865534 23877096 26390849
5456 26390849 29357865 32703090 36443628 40047859 42877884 43893045 42762082 39701094
5448 39701094 35805406 32088191 29054637 26617787 24626611 23062576 21654452 20418246
5440 20418246 19489899 18696989 18011067 17391718 16842608 16439690 16008864 15754311 15595739
5431 15595739 15370995 15177417 15082490 14884457 14554615 14233303 13898161 13526584 13304185 13147166
5421 13147166 13005252 12963302 13016768 13067269 13149773 13258404 13334074 13512552 13875750 14340156
5411 14340156 14870280 15557497 16317514 17054785 17584512 17924408 18041325 18102780 18360327 18755699
5401A8755699N88164Q16918P24019L04155k24419p52381q97530p45429m04121
5392A8165075l1784J06601J44786l1797j70481j93038k01061m5395j52759k66326
5382A7323821m91244l66167j48847P8755K59944L97724M17848L3813o05452j036983
5372A5863212j085066j023718o36606l73716k84984j49568m42792p86429p72276
5363A0308057q57839o49711n89884n54297l63706l88777k74141k06477k38154
5354F185071l05735j92627j12765r5113j80021q5568j59602p3361m8888q0459
5344D850932j11597o8877r0879l9256o4385K765q293l3250m1432p0203l6029k6450
5332D263046O5531k5805m0757L9951m3289l8740K9846N3491J7651o5388J8167
$$ plain form
5401 18755699 19343863 20160781 20884800 21188955 20964536 20212155 19314625 18569196 18165075
5392 18165075 18133291 18239892 18384678 18352881 18182400 17989362 17788301 17742906 17590147 17323821
5382 17323821 16832577 16466410 16317563 16396318 16656262 17053986 17471834 17505647 16900195 15863212
5372 15863212 14778146 13754428 13117822 12744106 12459122 12309554 11866762 11080333 10308057
5363 10308057 9450218 8800507 8210623 7656326 7292620 6903843 6629702 6423225 6185071
5354 6185071 5879336 5686709 5573944 5478831 5298810 5213242 5053640 4980279 4931391 4850932
5344 4850932 4739335 4670458 4579579 4540323 4475938 4478703 4470410 4437160 4395728 4325525 4289496 4263046
5332 4263046 4328577 4302772 4262015 4301966 4258677 4219937 4249783 4303274 4320925 4255537 4273704
5321D273704j20803l9928K3315M8622L927r9401j0290p2585n8935j5664O9452
5310D001414J57l0708n5000K796j0453n7994N7290R3688j5616l4099j3045M1386
5298C979816J673J5569K5760k1107l0300m2969R130k4730r33M0530R2581Q0418
5286D125438j58n4777K5821K705J15388J22662P3077n8441J26358Q5780P3891
5275D637744Q4765R4625P5894Q896O1964m1645k2813O6806n729L720J18524R2353
5263E175104N7733M6578J45793J35624J13975N9095j9067O7913J36191J96290
5253F115229J54557R3940Q2512J34221Q3910O3047k4529Q9384M4458J24237J06470
5242G067436J07222J23965J87833J21311O9491J75127J10307J85567K61961K16801
$$ plain form
5321 4273704 4152901 4112973 4136288 4184910 4188837 4089436 4079146 4006561 3947626 3931962 4001414
5310 4001414 4001571 3970863 3915863 3918659 3908206 3850212 3907502 4001190 3985574 3951475 3938430 3979816
5298 3979816 3981489 3997058 4022818 4001711 3971411 3928442 3937572 3912842 3911909 3952439 4045020 4125438
5286 4125438 4125280 4070503 4096324 4099029 4214417 4337079 4410156 4351715 4478073 4563853 4637744
5275 4637744 4722509 4817134 4893028 4901924 4963888 4922243 4899430 4966236 4960507 4964227 5082751 5175104
5263 5175104 5232837 5279415 5425208 5560832 5674807 5733902 5714835 5782748 5918939 6115229
5253 6115229 6269786 6363726 6446238 6580459 6664369 6727416 6702887 6792271 6836729 6960966 7067436
5242 7067436 7174658 7298623 7486456 7607767 7677258 7852385 7962692 8148259 8410220 8627021
5232H627021M4453K35423L24832Q3771J43501J96183J38169J85612K26707J82331
5222A0388003J10721K3247O0016K2153J21725P6533J03749K00931K50246K48905
5212A1606229K26103K77405L07296L56216K57232K79492K78292K89255L27284
5203A4204804K28941K41207L44215L03110L22639L18073M94046N08627N42738
5194A7508400M91412M55652N25628M88585P09358Q48858R20609J215029J345362
5185B4508893J522093J759169K044042K483338K872437L520224M358433N215729
5177D8284358N996874O762346P704935P864543L757772m289189q620348q022293
5169E9438998o063313m309322l085499k256676j816651j368472p74362l35542
$$ plain form
5232 8627021 8671474 8906897 9231729 9315500 9459001 9655184 9793353 9978965 10205672 10388003
5222 10388003 10498724 10521971 10581987 10604140 10725865 10802398 10906147 11107078 11357324 11606229
5212 11606229 11832332 12109737 12417033 12773249 13030481 13309973 13588265 13877520 14204804
5203 14204804 14433745 14674952 15019167 15322277 15644916 15962989 16457035 16965662 17508400
5194 17508400 17999812 18455464 18981092 19469677 20179035 21027893 21948502 23163531 24508893
5185 24508893 26030986 27790155 29834197 32317535 35189972 38710196 43068629 48284358
5177 48284358 54281232 61043578 68748513 76613056 80370828 76081639 67461291 59438998
5169 59438998 53375685 49066363 45980864 43724188 41907537 40539065 39764703 39429161
5161C9429161K12855N44524J007554J139138J767893K293886K804613L759227
5153E2958851M671106O029630P456569R068477J0875707J2347231J3168897J1986955
5145A28563423O012422m946461j3575394j5487054j3843248j0937159q271945
5138F7514584o358981n175890m342422l412246k502112j849897j143821q90467
5130D1838748o91783l40183R6042M62269Q45539J573463K238495K958079L791406
5121E2772075M785163N597985O431561P051404N328010j636572r038567j0626394
5113F0664665q732671o355118m739296l712487l157275k762634k427753j843838
5105B6933593j440932j324430j092006r57761j000534q12474o35036o49046m57657
$$ plain form
5161 39429161 39642016 40186540 41194094 42333232 44101125 46395011 49199624 52958851
5153 52958851 57629957 63659587 71116156 80184633 91060340 103407571 116576468 128563423
5145 128563423 134575845 129629384 116053990 100566936 86723688 75786529 67514584
5138 67514584 61155603 55979713 51637291 48225045 45722933 43873036 42729215 41838748
5130 41838748 41146965 40806782 40902824 41365093 42210632 43784095 46022590 48980669 52772075
5121 52772075 57557238 63155223 69586784 76638188 81966198 80329626 71291059 60664665
5113 60664665 51931994 45576876 40837580 37125093 33967818 31205184 28777431 26933593
5105 26933593 25492661 24168231 23076225 22118464 21117930 20305456 19670420 19021374 18563717
5096A8563717k94688k14010k51530j94709l04637l82636m46723o16309n53565
5087A5304910n83379m82665n13917n27067m66021l46673l38002k82880l21545
5078A1442761j40074p0305j55778p1750j31976j72489k09589j38357o5027l1469
5068A0255947j1879j37041j11856J1848l9137L8829Q7240N3413k8105k2798j2648
5057A0083813j02525j09447k14185l47141j60544j47115j23804N720p0357k1548
5047H792867k4503M5333p581m2238M9965J3633k1825k5499p9632q8466r6971l9941
5035H475142p8968M829N677l0500p5535p556L6898M0400M8086j6039N8322L9898
5023H500654j1281P0937J7029m1787Q1192K6479K5360m7450J19607m924O3777
$$ plain form
5096 18563717 18269029 18055019 17803489 17608780 17304143 16921507 16474784 15858475 15304910
5087 15304910 14721531 14238866 13724949 13197882 12731861 12385188 12047186 11764306 11442761
5078 11442761 11302687 11232382 11076604 11004854 10872878 10700389 10490800 10352443 10287416 10255947
5068 10255947 10244068 10107027 9995171 10007019 9967882 10006711 10093951 10147364 10119259 10096461 10083813
5057 10083813 9981288 9871841 9657656 9310515 9149971 9002856 8879052 8884772 8814415 8792867
5047 8792867 8768364 8813697 8806116 8763878 8813843 8827476 8805651 8780152 8700520 8612054 8515083 8475142
5035 8475142 8396174 8401003 8406680 8376180 8300645 8293089 8329987 8370387 8418473 8402434 8460756 8500654
5023 8500654 8489373 8560310 8577339 8535552 8616744 8643223 8668583 8621133 8740740 8735816 8799593
5012H799593J07614R8701J45675J19389K2757J79261J89586K51590K05478J95223
5002A0314867L77454K57166L50448L97241L51939K26380J06219j42388j82084
4993A2057242k76730k51550k31757j00523m9523j91233q7455q8059j28738j08313
4983A0543361j12777N0169R9451K2616O7193J60391K51139J29948J76134K65734
4973A1653359L88964M96162M87759N87028Q07346Q22915Q21800P59207O98842
4964A7523382M32178K40194K8807o2772j62536r5234j41179k00033k73875l84072
4954A6904860m38276k77848j84224k31357j32046q1309k04986l21885j20711k16681
4944A4695537j55935n5342M497J01081J78446L04729M46240N29712O43925Q16999
$$ plain form
5012 8799593 8907207 9005908 9151583 9270972 9293729 9472990 9662576 9914166 10119644 10314867
5002 10314867 10692321 10949487 11299935 11697176 12049115 12275495 12381714 12239326 12057242
4993 12057242 11780512 11528962 11297205 11196682 11147159 10955926 10868471 10780412 10651674 10543361
4983 10543361 10430584 10480753 10580204 10602820 10670013 10830404 11081543 11211491 11387625 11653359
4973 11653359 12042323 12538485 13026244 13613272 14420618 15243533 16065333 16824540 17523382
4964 17523382 17955560 18195754 18224561 18161789 17999253 17904019 17762840 17562807 17288932 16904860
4954 16904860 16466584 16188736 16004512 15773155 15641109 15559800 15354814 15032929 14912218 14695537
4944 14695537 14539602 14484260 14488757 14589838 14768284 15073013 15519253 16048965 16692890 17509889
4934A7509889J053108R46527R12782Q08678L49388n9795k82431n89280o79913
4925A9968953p02984n92929m17937m34966m30623n94536o27772o08388p93278
4916A4765540o50539n70886m62416m44789k10280j82713j74438r9909l6986O4133
4906A1996717K60798K62904K54925L09026J89488P2206p1458l16568l91533m32115
4896A2134390k93706j99856k42260j89950l20611l15720l11421m01032m13806
4887I446028m11540k67537m01159k44905j60763k69635r1374j04614j44798j61591
4877G188112j03142n1009r4288l156L8600o8170o1568q3275j8982l4373M4552
4866F753301q1920N827r0208R797k6980K4467K2536N0918j72713J7105m5612M4015
$$ plain form
4934 17509889 18562997 19509524 20422306 21230984 21580372 21520577 21238146 20648866 19968953
4925 19968953 19265969 18673040 18255103 17820137 17389514 16794978 16167206 15558818 14765540
4916 14765540 14115001 13544115 13081699 12636910 12426630 12243917 12069479 11969570 11932584 11996717
4906 11996717 12257515 12520419 12775344 13084370 13273858 13346064 13274606 12958038 12566505 12134390
4896 12134390 11840684 11640828 11398568 11208618 10888007 10572287 10260866 9859834 9446028
4887 9446028 9034488 8766951 8365792 8120887 7960124 7690489 7599115 7494501 7349703 7188112
4877 7188112 7084970 7033961 6939673 6936517 6975117 6906947 6845379 6762104 6743122 6708749 6753301
4866 6753301 6671381 6677208 6587000 6596797 6569817 6594284 6616820 6667738 6495025 6512130 6466518 6510533
4854F510533K1975P6274P7837N6588L4854j10697j08743j2387r7350j41333o1591
4843F245960p6354j23227j28992K3064J5809R2403K5952K2405P3543R2598Q8519
4832F351680K0108p2921R550j50088o8491k1987p9294j20182l1039j42082j40000
4821E555254m2465n2610j09079L820O8588m7793j5124q8568K752o6992K3443J58438
4809E389664J03197Q8182O1225K7270J05821Q4471J26404J08437P7707J91949
4799F364327J8886L9238m2284r7189k56344j43790j91380o6184j89520j0116j08299
4788E317345p0459n1470l0794n6297J7527J5777N4155M3936R1838R1887O2481
4777E485926q9328o3647p4184k0015N188k5525O9394j08909m3088p7790K9641
$$ plain form
4854 6510533 6532508 6608782 6686619 6743207 6778061 6667364 6558621 6546234 6448884 6307551 6245960
4843 6245960 6169606 6046379 5917387 5940451 5956260 6048663 6074615 6097020 6170563 6263161 6351680
4832 6351680 6371788 6298867 6308417 6158329 6089838 6067851 5988557 5868375 5837336 5695254 5555254
4821 5555254 5512789 5460179 5351100 5354920 5423508 5375715 5360591 5272023 5274775 5207783 5231226 5389664
4809 5389664 5492861 5581043 5642268 5669538 5775359 5859830 5986234 6094671 6172378 6364327
4799 6364327 6383213 6422451 6380167 6282978 6026634 5882844 5691464 5625280 5435760 5425644 5317345
4788 5317345 5246886 5195416 5164622 5108325 5125852 5141629 5195784 5239720 5331558 5423445 5485926
4777 5485926 5396598 5332951 5258767 5238752 5243940 5218415 5287809 5178900 5135812 5058022 5087663
4766E087663J4624M7311M9793K6925p1406K1933J7224J09434k7814O6708O5367
4755E407762j0132K4388J18040R6140n5J0549P7186o9315L149O1795K5725L9518
4743E784750J09499m0969o2906L4192r705l2010J12448R0147j08728l8561K4901
4732E863058o3897l6867Q4332m8154m9488o508o7329l537j1582Q0347q175N752
4720E737952m3960q82L8667l1522P3075J8580K7163P8242p2141p702k8185K3591
4708E812878J2352K4637M7349m1396n4100P7461m5264M4818P9314P9801m7219
4697E990631N5101m872n5035J28848l4737O9245m2547r0296j4454l3731r9179
4686E868974N4855p5033p4281q1644n8019l4054J88297n8640Q262q2728j11315
$$ plain form
4766 5087663 5102287 5149598 5199391 5226316 5154910 5176843 5194067 5303501 5275687 5342395 5407762
4755 5407762 5397630 5422018 5540058 5636198 5636143 5646692 5723878 5654563 5657712 5719507 5745232 5784750
4743 5784750 5894249 5853280 5790374 5824566 5814861 5782851 5895299 5985446 5876718 5838157 5863058
4732 5863058 5799161 5762294 5846626 5798472 5748984 5742476 5675147 5671610 5660028 5740375 5732200 5737952
4720 5737952 5693992 5693110 5731777 5700255 5773330 5791910 5819073 5897315 5825174 5817472 5789287 5812878
4708 5812878 5825230 5849867 5897216 5855820 5801720 5879181 5833917 5878735 5958049 6037850 5990631
4697 5990631 6045732 6040860 5985825 6114673 6079936 6149181 6106634 6016338 6001884 5968153 5868974
4686 5868974 5923829 5848796 5774515 5692871 5634852 5600798 5789095 5730455 5738717 5655989 5544674
4675E544674n7707o8026k064M1903K796o5941j06939k2330l5242j5133q18L124
4663E218297n8699L2139m9395j16659p531m1190n2614J3224N3602n6842r20m7318
4651D886094m0838k6167m4522o0646n9878m0676K0549n1549m5617N4320j33058
4640D458012j07714l0628k9696J6542q271O2031j6953L255O3554p3564j17246
4629D219322l886K1119L6742j9254J4176o3792l3428Q6K8551j21685j60983J9496
4617C936464J14114K8368J00493p3576j17003j2756j17883j30182J6513N6707
4607C801259m963L6758N1959o3908o8135j010K3571K5927J11927M969K2684j0923
4595C930115j160k522M5407M4664P8376N1144K9402N604Q1187N4167j7847M0631
$$ plain form
4675 5544674 5486967 5418941 5416877 5458780 5461576 5395635 5288696 5266366 5231124 5215991 5215173 5218297
4663 5218297 5159598 5191737 5142342 5025683 5018152 4976962 4924348 4937572 4991174 4934332 4933412 4886094
4651 4886094 4845256 4819089 4774567 4713921 4654043 4613367 4633916 4582367 4536750 4591070 4458012
4640 4458012 4350298 4319670 4289974 4306516 4298245 4360276 4343323 4346578 4410132 4336568 4219322
4629 4219322 4215436 4236555 4273297 4254043 4268219 4204427 4170999 4171085 4199636 4077951 3916968 3936464
4617 3936464 4050578 4078946 4179439 4105863 3988860 3976104 3858221 3728039 3744552 3801259
4607 3801259 3796296 3833054 3885013 3821105 3752970 3751960 3775531 3801458 3913385 3918354 3941038 3930115
4595 3930115 3928955 3926433 3971840 4016504 4094880 4146024 4175426 4181030 4262217 4316384 4298537 4339168
4583D339168j9931j9142k8556m895N3944k6930j9425k0419J5333m2081m6627J5175
4571D195614J43203k682o1414J49798o2659k2155O078N9954R5710R7660O3601
4560D662708Q4799J41314M6266q1147o2101o0833j10095r34Q0996J0663l314L1152
4548D739474M5185M103P2997j1340P7004j0257R1046J03696K778R937n5888p6459
4536D992276k0890k2726K4727l8998J9595N7178L8668J2713J42618m7044Q5964
4525E244081R9552L9400O3936k8716J8040J56205J36678K9645L7879Q506k5228
4514E779978m8038L4860J13913M7233J15447R0712J88265K01516K32011k2979
4504F732918p9731j11327j34387K6657n5422L727J7124L3451R5728L6382L5209
$$ plain form
4583 4339168 4319237 4300095 4271539 4266644 4320588 4293658 4274233 4253814 4269147 4227066 4180439 4195614
4571 4195614 4338817 4336135 4274721 4424519 4361860 4339705 4345783 4405737 4501447 4599107 4662708
4560 4662708 4747507 4888821 4935087 4853940 4791839 4731006 4620911 4619977 4700973 4711636 4708322 4739474
4548 4739474 4784659 4788762 4861759 4850419 4927423 4917166 5008212 5111908 5114686 5124623 5068735 4992276
4536 4992276 4971386 4948660 4973387 4934389 4953984 5011162 5049830 5062543 5205161 5158117 5244081
4525 5244081 5343633 5383033 5446969 5418253 5436293 5592498 5729176 5758821 5796700 5805206 5779978
4514 5779978 5731940 5766800 5880713 5927946 6043393 6134105 6322370 6523886 6755897 6732918
4504 6732918 6653187 6541860 6407473 6434130 6378708 6382435 6399559 6433010 6528738 6565120 6600329
4493F600329K40168J46202J90643J50439J56861M6983M9873q583O5356O5963J96229
4482G900463K51195R8662K12135K08532J93225L39265M25117L81182L94958M70686
4472A0875420N09523M01992L3414J29907L07573L43936L55638N08181N29449P73161
4462A4768194Q48601J051389J133425J216471J345057J477128J568479J514195
4454B4922939J474111J403613J364382J388507J359667J340329J022931N99121
4446C4875600J74533k02530l07149m38742l83627l11504k09992k48340k63406
4437C2684843m06210o72399p88738n58778n62466m40930l47280m26401o03304
4428B7878337o64225p20430q38020n74758o21719m85130k19406k61041j05506
$$ plain form
4493 6600329 6840497 6986699 7177342 7327781 7484642 7531625 7581498 7572915 7638271 7704234 7900463
4482 7900463 8151658 8250320 8462455 8670987 8864212 9203477 9628594 10009776 10404734 10875420
4472 10875420 11384943 11786935 11820349 11950256 12257829 12601765 12957403 13465584 13995033 14768194
4462 14768194 15616795 16668184 17801609 19018080 20363137 21840265 23408744 24922939
4454 24922939 26397050 27800663 29165045 30553552 31913219 33253548 34276479 34875600
4446 34875600 35050133 34847603 34540454 34101712 33718085 33406581 33196589 32948249 32684843
4437 32684843 32278633 31606234 30817496 30258718 29696252 29255322 28908042 28481641 27878337
4428 27878337 27214112 26493682 25655662 25080904 24459185 23974055 23754649 23493608 23388102
4419B3388102L0349q8536k37745l01579m90301r61357j250926j204832j108081
4410A7775094r26394q78736p35189n44916n78406n07475n59642o01337n41246
4401A1901753n13483l25201l95118l74874l20062l19375k86776m06885k33042
4392H726937j32765j66224j42582k00994j51370j00259k07235j84502r5283j05920
4382G239803j17151o2274r4210j68475j34668m1660j26649k11317j21739J2762
4372F174422j9966O4622O2762l2683j65343j20486J5912J00221L6814m6127L1216
4361F101364m5012m6477q6068j42995o8918l9810l6061p1389N4241j1293j11639
4350E495943k7471l0987r1784q6737o1725j17455k5783M6957n793j208R1946j39369
$$ plain form
4419 23388102 23418451 23329915 23092170 22790591 22300290 21338933 20088007 18883175 17775094
4410 17775094 16848700 15969964 15234775 14689859 14111453 13603978 13044336 12442999 11901753
4401 11901753 11388270 11063069 10667951 10293077 9973015 9653640 9366864 8959979 8726937
4392 8726937 8594172 8427948 8285366 8084372 7933002 7832743 7625508 7441006 7345723 7239803
4382 7239803 7122652 7060378 6966168 6797693 6663025 6621365 6494716 6283399 6161660 6174422
4372 6174422 6154456 6219078 6281840 6249157 6083814 5963328 5979240 6079461 6116275 6070148 6101364
4361 6101364 6056352 6009875 5923807 5780812 5711894 5672084 5636023 5564634 5618875 5607582 5495943
4350 5495943 5468472 5437485 5345701 5258964 5197239 5079784 5054001 5100958 5095165 5093957 5185903 5046534
4338E046534l7901R310k2384j5083O8581k5611r3692o686l0443j0204N6330O2811
4326E001562L6301q4906L4534n1926l1389J8256j07162j05441o7551p0182k3604
4315D548492r9153p2936N3227r010R4776j31804m316n6216j00673o7226J6954
4304D172115j7488o194O3217l9535K7389n0379L3907l4911J31199J18366J3417
4293D411103r1106k271R984M0842K6538L452P7769Q0365p3673j8956P0070k5728
4281D508389j2343N9044K1931P7219k1056N8656J5748j1830R3406O5785Q4337
4270D939286R620J58241J04988J6070J19548J26526L4571R4542J53949J77226
4260E934567R6890J80677J08646J13330J75370K40753J95372K52625L63945L50099
$$ plain form
4338 5046534 5008633 5017943 4995559 4980476 5049057 5023446 4929754 4923068 4892625 4882421 4938751 5001562
4326 5001562 5037863 4952957 4987491 4935565 4904176 4922432 4815270 4709829 4642278 4572096 4548492
4315 4548492 4449339 4376403 4429630 4420620 4515396 4383592 4379276 4323060 4222387 4155161 4172115
4304 4172115 4154627 4148433 4211650 4172115 4199504 4149125 4183032 4148121 4279320 4397686 4411103
4293 4411103 4319997 4317726 4327710 4368552 4395090 4398542 4476311 4556676 4483003 4464047 4534117 4508389
4281 4508389 4496046 4555090 4577021 4654240 4633184 4691840 4707588 4695758 4789164 4854949 4939286
4270 4939286 4948906 5107147 5212135 5228205 5347753 5474279 5508850 5603392 5757341 5934567
4260 5934567 6031457 6212134 6320780 6434110 6609480 6850233 7045605 7298230 7662175 8012274
4250H012274M24679N95941N87970N26107O95225Q70090R64745R66917N42610K14174
4240A4400732L34810L76725K42520K53114J14709J99396M17547O43071Q39461
4231A7822085N35348K00576l28786p32537p60550n79112k45187r4185r8452l68059
4221A5351141m39197n25519m34011k02351l4407Q5961K09648N07572M85718J65836
4211A5170391J23394L63234L77294J80144m5934j1663J41313L24814N42982O16522
4201A7782491K89367k09404o71099r28761q08490o33578m13060l38363l20688
4192A3748415o26310q62455q90036o55917o55810n48333m41954l61475l09779
4183H396346l44381k14135k85472j66812p1302k57421j46080j57238j28811l4649
$$ plain form
4250 8012274 8436953 9032894 9620864 10146971 10842196 11712286 12677031 13643948 14186558 14400732
4240 14400732 14735542 15112267 15354787 15607901 15722610 15922006 16339553 16982624 17822085
4231 17822085 18357433 18558009 18229223 17496686 16736136 16157024 15911837 15817652 15719200 15351141
4221 15351141 14911944 14386425 13952414 13750063 13715656 13801617 14011265 14518837 15004555 15170391
4211 15170391 15293785 15657019 16034313 16214457 16168523 16156860 16298173 16622987 17165969 17782491
4201 17782491 18071858 17862454 17191355 16262594 15454104 14820526 14407466 14069103 13748415
4192 13748415 13122105 12259650 11369614 10713697 10057887 9509554 9067600 8706125 8396346
4183 8396346 8051965 7837830 7552358 7385546 7314244 7056823 6910743 6753505 6624694 6590045
4173F590045j18150P927j00032p7602k5661j26486p6030j14002o6636j03775o8732
4162E720866m760L4310J3452O6963n352L4184J161p0804l9662N760K0646l4588
4150E742176n2120O4778R3574m1470Q762L1114Q927L6592M771Q0306R3934J00842
4138F172186R0763q484N0507P8569J12960Q9915J57960J14707P4979J15017J85491
4127G234570J77020K08701K75908K87810K37508K48740K23275K88560K85777L26289
4117I794158L16736L97318M09929L07402J89224L37184K20770K57046L97206K81740
4107A2908713K09776J92696J22897K6850o6177j04743k35129l26345m27618m29630
4097A1871290n05805m23313n10489n10730k46647l29861l74978j86065j63288
$$ plain form
4173 6590045 6471895 6479822 6379790 6302188 6276527 6150041 6074011 5960009 5893373 5789598 5720866
4162 5720866 5716106 5750416 5763868 5830831 5825479 5859663 5860824 5790020 5750358 5756118 5776764 5742176
4150 5742176 5690056 5754834 5848408 5806938 5815700 5846814 5855741 5892333 5897104 5977410 6071344 6172186
4138 6172186 6262949 6254465 6304972 6383541 6496501 6586416 6744376 6859083 6934062 7049079 7234570
4127 7234570 7411590 7620291 7896199 8184009 8421517 8670257 8893532 9182092 9467869 9794158
4117 9794158 10110894 10508212 10918141 11225543 11414767 11751951 11972721 12229767 12626973 12908713
4107 12908713 13118489 13311185 13434082 13460932 13394755 13290012 13054883 12728538 12300920 11871290
4097 11871290 11365485 10942172 10431683 9920953 9674306 9344445 8969467 8783402 8620114
4088H620114j58428j14399k41006k15591k09274k08833j77414j11775j64651j08924
4078F909819Q2498m0510j15692j28366p153m3558m0134m3939M4191p3489P1679
4067F615346n7739o9872O3755J10890J8866N037Q4260j185k4439J05297J00346
4056F950562N2732m9031R3080N3173P4492N5741J28511J2190j0621J35060M2748
4045G538637K9973p0Q5898k0880k7492m595K7549R3769J14623p4906l2089R0164
4033G820581N8390r340L3957O0692k4383j1878J61010Q8168q669L1195P9857j4666
4021H264914P7639J8475m7451l6812O4288M5141J06214j2892j9760m8579N6688
4010H467865J05110P5349K2878J10704N8534l3805j42621L9872J4568N7890L3318
$$ plain form
4088 8620114 8461686 8347287 8106281 7890690 7681416 7472583 7295169 7183394 7018743 6909819
4078 6909819 6992317 6951807 6836115 6707749 6700596 6657038 6616904 6572965 6617156 6543667 6615346
4067 6615346 6557607 6487735 6551490 6662380 6681246 6686283 6770543 6769358 6744919 6850216 6950562
4056 6950562 7003294 6954263 7047343 7100516 7175008 7230749 7359260 7371450 7360829 7495889 7538637
4045 7538637 7568610 7568540 7654438 7633558 7606066 7601471 7629020 7722789 7837412 7762506 7730417 7820581
4033 7820581 7878971 7869631 7903588 7964280 7939897 7928019 8089029 8177197 8168528 8199723 8279580 8264914
4021 8264914 8342553 8361028 8313577 8276765 8341053 8386194 8492408 8479516 8459756 8411177 8467865
4010 8467865 8572975 8648324 8671202 8781906 8840440 8806635 8664014 8703886 8718454 8776344 8809662
3999H809662J41717J5610J09374R2720L6505M5645R2866O0414J08479Q1155Q8137
3988I682284O4672K10867J66604N8443k5781M3144M9108J06420J62724K24627
3978A0743112K31505K28780J65797J38359J53749K47347J63870K02741J83001
3969A2458261K75558K38239R7677O9182J72007J96055P7932K10540K40099K16092
3959A4251642L56337K09498K36294L22550L05125K20638K29423L40712K55806
3950A6728025M11396M13691L84906M24898N35671M45933L36541M75428M83310
3941B0639799M93448M59394N33631N50587N58340N95681O53464O68195O81112
3932B5833651P06147O54945O69750P94147P90102P71920Q81985Q00878Q52615
$$ plain form
3999 8809662 8951379 8966989 9076363 9169083 9205588 9251233 9344099 9404513 9512992 9594147 9682284
3988 9682284 9746956 9957823 10124427 10182870 10157089 10200233 10249341 10355761 10518485 10743112
3978 10743112 10974617 11203397 11369194 11507553 11661302 11908649 12072519 12275260 12458261
3969 12458261 12733819 12972058 13069735 13138917 13310924 13506979 13584911 13795451 14035550 14251642
3959 14251642 14607979 14817477 15053771 15376321 15681446 15902084 16131507 16472219 16728025
3950 16728025 17139421 17553112 17938018 18362916 18898587 19344520 19681061 20156489 20639799
3941 20639799 21133247 21592641 22126272 22676859 23235199 23830880 24484344 25152539 25833651
3932 25833651 26539798 27194743 27864493 28658640 29448742 30220662 31102647 31903525 32756140
3923C2756140P64763P77665N78219N82229N35573O93616N43218Q08187Q97899
3914C8937509J178071J179719J230751J081179J057970J264307J387119J553655
3906D8870280J959487K125612K610540K840678L127444L337042L651455L881140
3898G2403678M379458M740576N115723M549707M319956M718118O278750P915894
3890A14421860J0045994J1260113J3496299J6596155K1574067K7285366L4157854
3883B48837708M0204935M8575381N8888803N7818902j0092276p9140883p5368113
3876B89724457n3304108l5527534k5819680j9860288j7946022j5535943j2560520
3869A09170362r253385p282764n631664n274423m804886m537636l882613l929750
$$ plain form
3923 32756140 33520903 34298568 34876787 35459016 35994589 36688205 37231423 38039610 38937509
3914 38937509 40115580 41295299 42526050 43607229 44665199 45929506 47316625 48870280
3906 48870280 50829767 52955379 55565919 58406597 61534041 64871083 68522538 72403678
3898 72403678 76783136 81523712 86639435 91189142 95509098 100227216 106505966 114421860
3890 114421860 124467854 135727967 149224266 165820421 187394488 214679854 248837708
3883 248837708 289042643 337618024 396506827 454325729 444233453 365092570 289724457
3876 289724457 236420349 200892815 175073135 155212847 137266825 121730882 109170362
3869 109170362 99916977 92634213 87002549 81728126 76923240 72385604 68502991 64573241
3861F4573241l565032l173676k531233k214982j862409j556323j132408j120070
3853D7417108j048898j194077q06123o12404l42036m42942q85488j338442j064094
3844C9682604q42073o85403n71755l07291l65569m16063k84104j09741j55108
3835C5945497m05269n43018m35799k99803j13737K727J32044M06370N79796O40972
3825C5909780R10885J071454J232719J338440J482741J362041P80640L0615r3067
3816D4026248M86086J186547J867382K560853L275886L942063M941411N595851
3808F7882327O479466O861781O721555M754521R28119l830639o944743p746150
3800G5106237o918483n506175l906185k911474j802747r64122R1348R23106K056760
$$ plain form
3861 64573241 61008209 57834533 55303300 53088318 51225909 49669586 48537178 47417108
3853 47417108 46368210 45174133 44368010 43755606 43413570 42970628 42085140 40746698 39682604
3844 39682604 38840531 38155128 37583373 37276082 36910513 36494450 36210346 36100605 35945497
3835 35945497 35540228 34997210 34561411 34261608 34147871 34150598 34282642 34689012 35268808 35909780
3825 35909780 36820665 37892119 39124838 40463278 41946019 43308060 44088700 44119315 44026248
3816 44026248 44512334 45698881 47566263 50127116 53403002 57345065 62286476 67882327
3808 67882327 74361793 81223574 87945129 92699650 93627769 89797130 82852387 75106237
3800 75106237 68187754 62681579 58775394 55863920 54061173 53097051 53188399 54111505 56168265
3791E6168265K909727L668419J061815n020134o974871n313648l748792k407623
3783D0343158j724998j286490j064041p54893p65925m65050K033L78733O95578
3774C5358105J213088J613885J805971j00991l045680l481343k485249j779428
3766B9098358j404896j129793r56814q05106o30883n95615l91860l85188k58185
3757B2540018k72318l10962k20524k72490k90470k21008r950M4781R719p1977
3747B0924819O9815P1217M4550J2132J58290R9829n2169K3383P7071J30855O5003
3736B1624795N154L4387M5488O3758N2362P0844J42757J15048N5300J16034J78378
3725B2504305K55166K75583K96284K20173L51571L60040N38210M57224N72503
$$ plain form
3791 56168265 59077992 62746411 63808226 58788092 51813221 46499573 42750781 40343158
3783 40343158 38618160 37331670 36267629 35512736 34746811 34281761 34283794 34662527 35358105
3774 35358105 36571193 38185078 39991049 39890058 36844378 33363035 30877786 29098358
3766 29098358 27693462 26563669 25606855 24801749 24170866 23575251 23183391 22798203 22540018
3757 22540018 22267700 21956738 21736214 21463724 21173254 20952246 20942296 20987077 20996796 20924819
3747 20924819 20994634 21065851 21110401 21122533 21280823 21380652 21328483 21351866 21428937 21559792 21624795
3736 21624795 21629949 21664336 21709824 21773582 21825944 21896788 22039545 22154593 22209893 22325927 22504305
3725 22504305 22759471 23035054 23331338 23551511 23903082 24263122 24801332 25258556 25831059
3716B5831059P16003P86438Q70499J076458J128670J217610J263556J456223J606557
3707C5953073J646439J809045J871120J815949J789240J508981J091909Q63730
3699D8349486M30843k6624n52425n99327r17118j014611j128475q75253m97414
3690D3169082r1219L85860R45537J289903J590692J646000J516127J423600J365880
3681E3241462J507540J448652J181562J010841N60714j18690q95052j794307k423124
3672E3719598k684865k674667k437556k204927k233133k390874k389167k190732
3664C4513677k002380j685593j453790j334415j213078j140245j079863j059605
3656B3544708r98700q67472q09313p78650p59061o22613n01821n25517m62470
$$ plain form
3716 25831059 26547062 27333500 28203999 29280457 30409127 31626737 32890293 34346516 35953073
3707 35953073 37599512 39408557 41279677 43095626 44884866 46393847 47485756 48349486
3699 48349486 48780329 48753705 48201280 47601953 46684835 45670224 44541749 43666496 43169082
3690 43169082 43077863 43463723 44409260 45699163 47289855 48935855 50451982 51875582 53241462
3681 53241462 54749002 56197654 57379216 58390057 58950771 58832081 57937029 56142722 53719598
3672 53719598 51034733 48360066 45922510 43717583 41484450 39093576 36704409 34513677
3664 34513677 32511297 30825704 29371914 28037499 26824421 25684176 24604313 23544708
3656 23544708 22546008 21678536 20869223 20090573 19331512 18708899 18207078 17681561 17219091
3647A7219091l48165l92184l71200l29877l08555j51449j77686k02258j88130
3638A4749587k21497j78759j80717j05873q6785j07121j20669j14079k61376j55077
3628A3217634j01460j08827j58495j12994o4440j25173j43281o4607j66006j30919
3618A2041432r0546l7692j88373j06085j07500j78853M1260k5139n9244l3681
3608A1255579p0366j2244m0859R613J9707K082m8106l6620M0611J49901P1873
3597A1341171N3341P6002Q6897q9882m5622L9181M5988J20518M4612J54926J50283
3586A1977415J85111J56130M8048J60031K04389L22583L33339K93558N19058N87400
3576A4787062N86936O63873R92984J194290J300664J648797K062567K427698K886451
$$ plain form
3647 17219091 16870926 16478742 16107542 15777665 15469110 15317661 15139975 14937717 14749587
3638 14749587 14528090 14349331 14168614 14062741 13975956 13868835 13748166 13634087 13372711 13217634
3628 13217634 13116174 13007347 12848852 12735858 12671418 12546245 12402964 12338357 12172351 12041432
3618 12041432 11950886 11913194 11724821 11618736 11511236 11332383 11373643 11348504 11289260 11255579
3608 11255579 11185213 11172969 11132110 11141723 11161430 11163512 11115406 11078786 11119397 11269298 11341171
3597 11341171 11394512 11470514 11557411 11467529 11421907 11461088 11507076 11627594 11672206 11827132 11977415
3586 11977415 12162526 12318656 12366704 12526735 12731124 13053707 13387046 13680604 14199662 14787062
3576 14787062 15373998 16037871 17030855 18225145 19525809 21174606 23237173 25664871 28551322
3567B8551322L300400L437407L469973K416068o09577l615469m435458l878453
3559B8636213l148927k483771j932533j705884j502571j220768r05652p37624
3551A4998483o09269n07463m54051l85744k69526j60102j74074K4564J24293j71817
3541A2415294n49228m96156m65828l58624l00716k40427l00222k13291r7955k26920
3531I165927j90567j51702k05597j67764j11245j8572j15070J3066j4714j66515
3521H037247j8519r0264j11799K365q682K6155R0216O6701M0200P0173J00109
3510H203902J4337k6339J0980m1860K8911o9842O5112k9657k7193q4572m1758
3499H002021m408r5663M7400J26967Q0840M9651k2865M5632J16019J11702J12819
$$ plain form
3567 28551322 31851722 35289129 38759102 41175170 40565593 36950124 32514666 28636213
3559 28636213 25487286 23003515 21070982 19365098 17862527 16641759 15736107 14998483
3551 14998483 14389214 13881751 13427700 13041956 12772430 12612328 12438254 12462818 12587111 12415294
3541 12415294 11866066 11369910 10904082 10545458 10244742 10004315 9704093 9490802 9392847 9165927
3531 9165927 8975360 8823658 8618061 8450297 8339052 8320480 8205410 8218476 8203762 8037247
3521 8037247 8018728 7928464 7816665 7819030 7810348 7836503 7926719 7993420 8033620 8103793 8203902
3510 8203902 8218239 8191900 8202880 8161020 8189931 8120089 8185201 8155544 8128351 8043779 8002021
3499 8002021 7997613 7901950 7949350 8076317 8157157 8206808 8183943 8229575 8345594 8457296 8570115
3488H570115L3599J69905O7875M1406J5695R2865O7379J47348K27309J9200Q7027
3477I539723Q8221P7963J04007K16297K22252J17380J18784L5944J00730K17922
3467A0839223J29065K69181J89029K82951L72059L78557L57369M20740M98337
3458A3736511N15401N63156P29958M41593r4786j2292K28712K66625K36649L85121
3448A6996648L12707M39968N65770O53419O81742Q35953P67155Q64266Q98082
3439B3015710R31453J124583J309546J387598J572274J855386K135989K375991
3431C5708530K749640L257544L793793M532460N404318O545492P949592R563256
3423G9504625J1212894J2920883J3930250J2288281O078800j123535p242062j2721935
$$ plain form
3488 8570115 8603714 8773619 8841494 8882900 8898595 8991460 9058839 9206187 9433496 9452696 9539723
3477 9539723 9627944 9705907 9809914 10026211 10248463 10365843 10484627 10520571 10621301 10839223
3467 10839223 10968288 11237469 11426498 11709449 12081508 12460065 12817434 13238174 13736511
3458 13736511 14251912 14815068 15545026 15986619 15891833 15879541 16108253 16374878 16611527 16996648
3448 16996648 17309355 17749323 18315093 18968512 19650254 20486207 21253362 22117628 23015710
3439 23015710 23947163 25071746 26381292 27768890 29341164 31196550 33332539 35708530
3431 35708530 38458170 41715714 45509507 50041967 55446285 61991777 69941369 79504625
3423 79504625 90717519 103638402 117568652 129856933 135935733 134812198 127570136 114848201
3415A14848201j4783207j3259697j0788582q675182o973076n790676m825484l941108
3407D5811189l269685k737748k349637k155231j917303j733962j454241j241277
3399B8952105r74879q72135o58427m29519k59399j84126j58355j38366j20327
3390B5156572j10959k69495m50694n47859q94892j183329j168996j023544q10905
3381A8695899p98694o92284n62496n36807m95342n75770m89822l43741k29178
3372A3971765l51957l09587l17587l05638k64857k50289j84647p5323j33892j48084
3362A1629904p0337j88285j58018p8472j31324k38162q9330q5025k15678k23128
3352A0152145o8831o7910j41433k3081r2893j61694J0034j19202j15166n749l487
$$ plain form
3415 114848201 100064994 86805297 76016715 67341533 60368457 54577781 49752297 45811189
3407 45811189 42541504 39803756 37454119 35298888 33381585 31647623 30193382 28952105
3399 28952105 27977226 27105091 26446664 26017145 25757746 25573620 25415265 25276899 25156572
3390 25156572 25045613 24776118 24325424 23777565 22882673 21699344 20530348 19506804 18695899
3381 18695899 17897205 17204921 16642425 16105618 15610276 15034506 14544684 14200943 13971765
3372 13971765 13619808 13310221 12992634 12686996 12422139 12171850 11987203 11911880 11777988 11629904
3362 11629904 11559567 11371282 11213264 11134792 11003468 10765306 10675976 10590951 10375273 10152145
3352 10152145 10083314 10015404 9873971 9850890 9757997 9596303 9606337 9487135 9371969 9366220 9362733
3341I362733k10874j30496j3692j05436j43602m6872M2537q067o8579o7725K0799
3330H630726k5588l7125m0473L4642m9055J0870o8772m3464R0229R989L1745J6726
3318H560450k4959m1413m5569m3180m8856k2410L4789M2718R2623P229R2901n8222
3306H546101q7900o8187Q837j4624Q9944O2605l2743J3255L2898j37188m4515
3295H368483R5287O8110P9781M7087J02565l8159l5226j257o2705Q6588O6470
3284H777024P5434L1743L7671K3206k4144N8985L4275k8526k1082L5342P1735
3273I071663p6611m8869M5340j41776K1748J8943l2043n4391k7430Q7666l303
3262H860937K9187Q8149l499M707O7886J28370M0870J43497Q7619J46572J58091
$$ plain form
3341 9362733 9151859 9021363 9007671 8902235 8758633 8711761 8754298 8746231 8677652 8609927 8630726
3330 8630726 8605138 8568013 8527540 8562182 8513127 8523997 8455225 8411761 8501990 8511979 8543724 8560450
3318 8560450 8535491 8494078 8448509 8405329 8356473 8334063 8368852 8411570 8504193 8511422 8604323 8546101
3306 8546101 8458201 8390014 8398851 8384227 8474171 8536776 8504033 8517288 8550186 8412998 8368483
3295 8368483 8463770 8531880 8611661 8658748 8761313 8723154 8687928 8686671 8623966 8710554 8777024
3284 8777024 8852458 8884201 8921872 8945078 8920934 8979919 9014194 8985668 8964586 8999928 9071663
3273 9071663 8995052 8946183 8991523 8849747 8871495 8890438 8858395 8804004 8776574 8864240 8860937
3262 8860937 8890124 8978273 8974774 8979481 9047367 9175737 9216607 9360104 9447723 9594295 9752386
3251I752386J52033R8841O0736J35720M6700k685M3919J07910J96026P2578N7921
3240A0722085l6970j63843j34707q3580j8118p7956N9799l7344q433J7131N9007
3229A0297071j6692q1403M1652l6790q9448m8742p24N296k5840P4868L0739R369
3217A0159356k8667j82943q2960n1397j22200m6522o6285l5631j43915j96767
3207I202069n1993r7322m1496p7729k3549J17654l0840R9006K9566k1776l028
3196I100562J2524p1745j28205p273N2820R8145o3092j16965j43917o6359j5079
3185H651416j1295q9500K4701L8283P7083Q2827J18193N6101O9300J93366J10420
3174I320895J90059K30070K71762K52800K51919L64325K38735M5859j06794l38722
$$ plain form
3251 9752386 9904419 10003260 10063996 10199716 10246416 10243731 10287650 10395560 10591586 10664164 10722085
3240 10722085 10685115 10521272 10386565 10302985 10284867 10206911 10266710 10229366 10220933 10238064 10297071
3229 10297071 10280379 10198976 10240628 10203838 10114390 10065648 10064924 10070220 10044380 10119248 10149987 10159356
3217 10159356 10130689 9947746 9864786 9813389 9691189 9644667 9578382 9542751 9398836 9202069
3207 9202069 9150076 9052754 9011258 8933529 8909980 9027634 8996794 9095800 9125366 9103590 9100562
3196 9100562 9113086 9041341 8913136 8905863 8958683 9056828 8993736 8876771 8732854 8666495 8651416
3185 8651416 8640121 8550621 8575322 8613605 8690688 8773515 8891708 8947809 9017109 9210475 9320895
3174 9320895 9510954 9741024 10012786 10265586 10517505 10881830 11120565 11166424 11059630 10720908
3164A0720908k87127k82434j51218j05154n8169p8893j39569m7196p7186r0236
3154I403726j01423K4972P6324m0451n6801j9232m3103J5395M9859P2222r494
3143I371994M8311J30752L2565l6196J11488J17050P6687R6706J27249P6667J56462
3132A0309735M7924R7372J53574J50264J85520J23412K31607K05515K73976K42551
3122A2021450J51768K35952L11969L31738L53235L75538L41169M44913M47598
3113A5015330L93566M83811O33038P09130Q18997Q71772J071885J103477J138518
3104B2239524P04344o9169n38985n93167m31090j38417l2856J05215K55466K45738
3094B1746603K12192L01227M04253M79582O62919O99220P78441J009136J195814
$$ plain form
3164 10720908 10433781 10151347 10000129 9894975 9836806 9757913 9618344 9571148 9493962 9403726
3154 9403726 9302303 9327275 9403599 9363148 9306347 9287115 9244012 9259407 9309266 9381488 9371994
3143 9371994 9420305 9551057 9583622 9547426 9658914 9775964 9852651 9949357 10076606 10153273 10309735
3132 10309735 10357659 10455031 10608605 10758869 10944389 11067801 11299408 11504923 11778899 12021450
3122 12021450 12173218 12409170 12721139 13052877 13406112 13781650 14122819 14567732 15015330
3113 15015330 15408896 15892707 16525745 17234875 18053872 18925644 19997529 21101006 22239524
3104 22239524 22943868 22874699 22335714 21742547 21311457 21173040 21140184 21245399 21500865 21746603
3094 21746603 21958795 22260022 22664275 23143857 23806776 24505996 25284437 26293573 27489387
3085B7489387J289209J597237J864251K294918K536122L052507L447595L730033
3077D7301259L165173J686298m65686k406944l287636k780219j989699j365800
3069C9856746q17120l99461q1689K67914N18335O95083J002669J289636J636497
3060D3968610J633345J665136J657636J639009J861855K588245L319513L997775
3052F2331124M648616M808443M027579K612821Q87003j729077m057824n137189
3044F8391496n517988n128064m386136l564288k976818k424900k070247j765563
3036D0557492j372165j177927j106773j008030o95968n39266k53001o1760K78462
3027C4621064P72211J085352J468796J857171K259962K515784K222349J337377
$$ plain form
3085 27489387 28778596 30375833 32240084 34535002 37071124 40123631 43571226 47301259
3077 47301259 50466432 52152730 51687044 49280100 45992464 43212245 41222546 39856746
3069 39856746 39039626 38640165 38558476 38826390 39344725 40039808 41042477 42332113 43968610
3060 43968610 45601955 47267091 48924727 50563736 52425591 55013836 58333349 62331124
3052 62331124 66979740 71788183 75815762 78428583 79315586 77586509 73528685 68391496
3044 68391496 62873508 57745444 53359308 49795020 46818202 44393302 42323055 40557492
3036 40557492 39185327 38007400 36900627 35892597 35196629 34657363 34404362 34342602 34621064
3027 34621064 35393275 36478627 37947423 39804594 42064556 44580340 46802689 48140066
3019D8140066j62838j916511l747151m118700l622086k689086k064135j793239
3011B8026320j426686j056774j009043r09374o30408o00650o54927o47265n78706
3002B0512487m94882l86470l64449j88564q6142R8911K37823K63710L20192M59911
2992B0372527K80654o4527o99526j072421j098763r04724q48749o44870o34226
2983A4685375m08278m29156m30982k13824k30648j73061k86126l63609k58085
2974A1891606k76677k62573k13083k67883k56971k07537j87281l40246j53823
2965I725532j99205k43920k38536k13339k06280j12675j54128j93857j67263j84813
2955G811516k2742k9846j2379l5622k8539j84539q5027j77275j22002n6235p8372
$$ plain form
3019 48140066 47977228 46060717 42313566 38194866 34572780 31883694 29819559 28026320
3011 28026320 26599634 25542860 24533817 23624443 22994035 22393385 21738458 21091193 20512487
3002 20512487 20017605 19631135 19266686 19078122 18991980 19090891 19328714 19592424 19912616 20372527
2992 20372527 20653181 20588654 19889128 18816707 17717944 16813220 15964471 15319601 14685375
2983 14685375 14277097 13847941 13416959 13203135 12972487 12799426 12513300 12149691 11891606
2974 11891606 11614929 11352356 11139273 10871390 10614419 10406882 10219601 9879355 9725532
2965 9725532 9526327 9282407 9043871 8830532 8624252 8511577 8357449 8163592 7996329 7811516
2955 7811516 7788774 7758928 7746549 7710927 7682388 7497849 7412822 7235547 7113545 7057310 6978938
2944F978938o8994j2432k2343o5863m7348o6989r7080n8665k8530N4781Q518p109
2932F566884P4006m9074j09256j6357m6426l6326l6480M2997J7305j5350N444
2921F397367j00970j10897j03085Q667J03282j3248O885l8632o9182l2838p7398
2910E969951l7703j7993K3150k357k127M3576P7525L202P5862J8894M0214M91
2898F192685K0895J44792R174q1233q7237j50663j74050j26314o2925P989Q96
2887E694009o6945r4313j25489q1072q4526o0466J731J03512K5085J3687K0803
2876E346016j5648L432K5097P496K4532K5291K8058l3685Q1786j0130l0349l5889
2864E416007j28473j01366k9917r6805j56415o2147k8358o6873K8468m0515o1910
$$ plain form
2944 6978938 6909944 6897512 6875169 6809306 6761958 6694969 6597889 6539224 6510694 6565475 6573993 6566884
2932 6566884 6640890 6591816 6482560 6466203 6419777 6383451 6346971 6389968 6407273 6391923 6397367
2921 6397367 6296397 6185500 6082415 6091082 6194364 6181116 6188001 6149369 6080187 6047349 5969951
2910 5969951 5932248 5914255 5937405 5935048 5932921 5976497 6054022 6057224 6133086 6151980 6192194 6192685
2898 6192685 6213580 6358372 6367546 6286313 6199076 6048413 5874363 5748049 5685124 5693113 5694009
2887 5694009 5627064 5532751 5407262 5326190 5241664 5181198 5182929 5286441 5311526 5325213 5346016
2876 5346016 5330368 5333800 5358897 5366393 5390925 5416216 5444274 5410589 5492375 5482245 5451896 5416007
2864 5416007 5287534 5186168 5156251 5059446 4903031 4840884 4812526 4745653 4774121 4733606 4671696
2853D671696k0270k4183N1347J1340M3790P6633m3852n1534J6725J11868Q1318
2842D924878n2669K1115m3290k0110q6555m0009r3862o3595l6212k9544l9056
2831D441091n8275m6067r3722p7462p878j4709m3319M550r5547o9458m188K0209
2819C955225K6641Q9496O0005p8641l1261m287L574k4590J3295L6360M123p57
2807D049183j3107K4970L0526n9290n3237r7516k9045K903j0645j12443j0793
2796C721506k3010p3808J3139K1474l9778o5285J4865n1367n9512L4391K294K6051
2784C520960O1406m9805o0145l3107L3752M587j2806N3872j9745l7631J6097j4063
2772C463372N475k7479o0225p5569Q19O2982R855K7572J75952o0407o9141j998
$$ plain form
2853 4671696 4651426 4627243 4678590 4689930 4733720 4810353 4766501 4714967 4731692 4843560 4924878
2842 4924878 4872209 4893324 4850034 4829924 4743369 4703360 4609498 4545903 4509691 4480147 4441091
2831 4441091 4382816 4336749 4243027 4165565 4157687 4142978 4099659 4104209 4008662 3939204 3935016 3955225
2819 3955225 3981866 4071362 4131367 4052726 4021465 4017178 4020752 3996162 4009457 4045817 4049940 4049183
2807 4049183 4036076 4061046 4091572 4032282 3979045 3881529 3852484 3855387 3844742 3732299 3721506
2796 3721506 3698496 3624688 3637827 3659301 3619523 3554238 3569103 3517736 3458224 3492615 3494909 3520960
2784 3520960 3582366 3532561 3472416 3439309 3473061 3477648 3464842 3518714 3498969 3461338 3477435 3463372
2772 3463372 3468847 3441368 3381143 3305574 3306393 3369375 3379230 3406802 3582754 3522347 3453206 3451208
2760C451208l1606j14167n0160L6003M4115N4818R750r021L8395J8873K4213l3932
2748C438489J46271l2139N126J084j07460o388n8152M816L485M8640J05928M4754
2736C594454J23886J16656O3245R7856j9684q9271j68566j64933j32769j53042
2726C267832j39254n6110p242J2492l8272L0846l8552k2694P9632j7885n0775
2715C020018p6747o6036p8940j00466L7785n4783l1418m2806m532j2723l9254
2704B550098j2127k0805J0887J04180j28139K672j35742j10974M7064J442K1610
2693B330166j02329K1333P2071m5252j8378j21637m2160j28551R6212j4155l4406
2682B012914K6621l1297m2064l6699q9136R903Q2735r638k8468j4170j1679n1033
$$ plain form
2760 3451208 3419602 3305435 3255275 3291278 3335393 3390211 3399961 3390940 3429335 3448208 3472421 3438489
2748 3438489 3584760 3552621 3557747 3558831 3451371 3444983 3386831 3391647 3395132 3443772 3549700 3594454
2736 3594454 3718340 3834996 3898241 3996097 3976413 3887142 3718576 3553643 3420874 3267832
2726 3267832 3128578 3072468 3065226 3077718 3039446 3070292 3031740 3009046 3088678 3070793 3020018
2715 3020018 2943271 2877235 2798295 2697829 2735614 2680831 2649413 2606607 2602075 2589352 2550098
2704 2550098 2537971 2517166 2528053 2632233 2504094 2506766 2371024 2260050 2307114 2308556 2330166
2693 2330166 2227837 2249170 2321241 2275989 2257611 2135974 2093814 1965263 2061475 2047320 2012914
2682 2012914 2039535 2008238 1966174 1929475 1840339 1850242 1932977 1923339 1894871 1880701 1869022 1817989
2670A817989K9682j3260P9852j00197k8726R2701L665n5125k7301P740j5520l491
2658A788009P980m1805J6894K9843L6176M3773l8279L9065j4329j16964r3644
2647A656719M7660J44601j9985n390N3756l5249J3340k172K4522l8253m2693k2408
2635A774448n0578m2252K5751J33687l5122O9930l855L0723j11593j6179P944
2624A782904K2060M0792J736m7926M3544J2790L6536p5752J42831m8471K0824
2613A931868N4929m0534M0706r781q1852J9929r2413R730R057k9959k302M1462
2601A850840M6681m4726K8279J7211l0268l1207N4886N4085O365l6329o4597J77
2589A851397J6112k0119j5677N0058L5902m1069N253m0912O97k7313K1800j8159
$$ plain form
2670 1817989 1847671 1834411 1914263 1814066 1785340 1878041 1881706 1826581 1799280 1807020 1791500 1788009
2658 1788009 1795989 1754184 1771078 1800921 1837097 1880870 1842591 1881656 1867327 1750363 1656719
2647 1656719 1704379 1848980 1828995 1823605 1877361 1842112 1855452 1853280 1877802 1839549 1796856 1774448
2635 1774448 1723870 1681618 1707369 1841056 1805934 1875864 1872009 1902732 1791139 1774960 1782904
2624 1782904 1804964 1845756 1847492 1799566 1843110 1855900 1892436 1816684 1959515 1911044 1931868
2613 1931868 1986797 1946263 1986969 1977188 1895336 1915265 1822852 1832582 1841639 1811680 1809378 1850840
2601 1850840 1897521 1852795 1881074 1898285 1868017 1836810 1891696 1945781 1952146 1915817 1851220 1851397
2589 1851397 1867509 1847390 1831713 1881771 1917673 1876604 1881857 1840945 1841642 1814329 1836129 1817970
2577A817970M470l5981J3572J917n8103j8519J05384p3989m9291l459M4015L6032
2565A784018M8497m5447m0355O9524M5659K2347N2098o1406k9724p1676l588j0593
2553A759354N4171L224k2858R194J0523j00644k6266n8672L5222q457O6218j33559
2541A587450O3513L8528n5766l3684K4648L6495M3337r4613n085K7785o3218L3009
2529A602399Q7304L8373j23384r6916r5189M9002N0243N8167n9622K3387L7188
2518A570952n4980j2048n2529L2729O3889l8142j0845m9509K6754o4657l363j1776
2506A396475l7536k2032K8422M5215K9013p8936O9045P6631j595n4281L1813j1709
2494A470525n5554k4905Q3124q1113M3060n436k8219n1931M2950N0741k9374N8685
$$ plain form
2577 1817970 1822440 1786459 1800031 1801948 1743845 1725326 1830710 1756721 1707430 1703971 1747986 1784018
2565 1784018 1832515 1787068 1746713 1816237 1861896 1884243 1936341 1874935 1845211 1773535 1769947 1759354
2553 1759354 1813525 1816749 1793891 1803085 1813608 1712964 1686698 1628026 1663248 1654791 1721009 1587450
2541 1587450 1650963 1689491 1633725 1600041 1624689 1661184 1704521 1609908 1604823 1632608 1569390 1602399
2529 1602399 1689703 1728076 1604692 1507776 1412587 1461589 1511832 1569999 1510377 1533764 1570952
2518 1570952 1515972 1503924 1451395 1484124 1548013 1509871 1499026 1449517 1476271 1411614 1408251 1396475
2506 1396475 1358939 1336907 1365329 1410544 1439557 1360621 1429666 1506297 1504702 1450421 1482234 1470525
2494 1470525 1414971 1390066 1473190 1392077 1435137 1429701 1401482 1349551 1392501 1443242 1413868 1472553
2482A472553N4773l3372O3509M8720M2015j10074n1628J0561O084J2365j607l6907
2470A476992o660q2129o2453J2222Q4047J8099J5655l4100J7468O8514j4385O7798
2458A561068K5368j164q22M1228q2327L8738M7071P5384k0925m6340O458j15085
2446A528652p8489Q1110O2186Q0453P348n7683m1135j07677o2027k0781Q6893
2435A478850P7048m2732L2304l3222l3406q1651R9791J38593M9725k7603m3568
2424A614129q3620r703l8727o8054L163J25303M6326n5137l3954J26510k8708
2413A597528M0406P317j21397m3432Q5808j3651K380K140K805j7764o6616K4325
2401A499849l2494k9200J53083n45o9131l0237o1488l5300m5014M3800Q9002N7963
$$ plain form
2482 1472553 1527326 1493954 1557463 1606183 1648198 1538124 1486496 1497057 1503141 1515506 1513899 1476992
2470 1476992 1470332 1388203 1325750 1337972 1422019 1440118 1455773 1421673 1439141 1507655 1493270 1561068
2458 1561068 1586436 1585272 1584450 1625678 1543351 1582089 1629160 1704544 1683619 1637279 1643737 1528652
2446 1528652 1450163 1531273 1593459 1673912 1681260 1623577 1582442 1474765 1412738 1391957 1478850
2435 1478850 1555898 1513166 1545470 1512248 1478842 1397191 1496982 1635575 1685300 1657697 1614129
2424 1614129 1530509 1520806 1482079 1414025 1417188 1542491 1588817 1533680 1499726 1626236 1597528
2413 1597528 1637934 1645251 1523854 1480422 1566230 1552579 1554959 1557099 1559904 1542140 1475524 1499849
2401 1499849 1467355 1438155 1591238 1590693 1521562 1491325 1429837 1394537 1349523 1393323 1482325 1540288
2389A540288L3138k763m9393j885K9553r4328k5680J01621K507M9020j2438j8781
2377A550859l1075k0401k4601o8765o3717M6492P5395L748k3871K8553k9478K1291
2365A464430k946p633L3533K7530K7299K8l6909P737o567j1489N164j5320M6343
2352A531200N059M8194j7063l2797k3798k6984K5957K5894Q4499l264L896K5357
2340A646150K0557m1070l7003l9294K7327j3211J18644J6512j6512q872M6557
2329A719785K5904O7329O0455k8363l6215P6853L6057J9560O4131L9530N032l1473
2317B018585L889L068j8779K7329J16376Q6922j4722p463O330J6068m284K9835
2305B263154K7531Q5190o5764J2505J5285o9439N1541M4559J10919k4989o4089
$$ plain form
2389 1540288 1573426 1570663 1521270 1519385 1548938 1454610 1428930 1530551 1533058 1582078 1569640 1550859
2377 1550859 1519784 1499383 1474782 1406017 1342300 1388792 1464187 1467935 1444064 1472617 1443139 1464430
2365 1464430 1461484 1453851 1487384 1514914 1542213 1542241 1505332 1513069 1506502 1495013 1500177 1484857 1531200
2352 1531200 1536259 1584453 1567390 1534593 1510795 1483811 1509768 1535662 1620161 1616897 1620793 1646150
2340 1646150 1666707 1625637 1588634 1549340 1576667 1563456 1682100 1698612 1682100 1673228 1719785
2329 1719785 1745689 1813018 1873473 1845110 1808895 1885748 1921805 1941365 2005496 2045026 2050058 2018585
2317 2018585 2022474 2025542 2006763 2034092 2150468 2237390 2222668 2215205 2221535 2237603 2233319 2263154
2305 2263154 2290685 2375875 2310111 2322616 2337901 2268462 2320003 2364562 2475481 2450492 2386403
2294B386403J6683R2414n736j417J06900L3899q0265J77725K5497l7804J1115
2283B725414O5286J0604Q0079P9305n7433J21363M8785Q4606K3424p92m4o5019
2271C115578L8694O7918L4097K9836M8302J5930j6235k294o16J2842J86233O9783
2259C600068l3420N8884J32253Q0973j4547Q3203Q0396L975L7606J16773Q1765
2248D227929N2485J73578J1498N5309J40483J17678K9999Q5227K37962M4844j4362
2237E162630Q0284J63579N2738J24331J44213L9857J11438L5326K4034O8202K26931
2226F233563J26497O9966L0900J40915L5292J35260K22891J77289J41609J29924
2216G444106O8566O2145J24385J87550J77786J45263J56744J72054J37812J33967
$$ plain form
2294 2386403 2403086 2495500 2489764 2488347 2595247 2629146 2548881 2726606 2752103 2714299 2725414
2283 2725414 2790700 2801304 2881383 2960688 2903255 3024618 3073403 3158009 3181433 3180641 3180597 3115578
2271 3115578 3154272 3222190 3256287 3286123 3334425 3350355 3334120 3331826 3331210 3344052 3530285 3600068
2259 3600068 3566648 3625532 3757785 3838758 3824211 3907414 3987810 3991785 4029391 4146164 4227929
2248 4227929 4280414 4453992 4465490 4520799 4661282 4778960 4808959 4894186 5132148 5176992 5162630
2237 5162630 5242914 5406493 5459231 5583562 5727775 5767632 5879070 5914396 5938430 6006632 6233563
2226 6233563 6360060 6430026 6460926 6601841 6637133 6772393 6995284 7172573 7314182 7444106
2216 7444106 7512672 7574817 7699202 7886752 8064538 8209801 8366545 8538599 8676411 8810378
2206H810378K05962J79991K42717K76738K20873J88620K22160K81745L33336K96529
2196A1259049K07048K43600K29028K23338K80194K48264L22965M28289M14395
2187A3856170M84866M24742M37439M91688N97578O52166O81628Q39689J012649
2178A9478615R19399J022796J182889J286616J340827J398738J540231J411079
2170B9581190J539174J426494J411209J151053P74145L44284k74784r20664j238386
2161C3793715j523942j499605j526970j507084j363685j130422j030823r72665
2153B3238519q89141p56867n84461n63780m71276l33020m25405k71868l10104
2144A8632597l48010n50444n92450o55683n49771m11302k82269k97356k56745
$$ plain form
2206 8810378 9016340 9196331 9439048 9715786 9936659 10125279 10347439 10629184 10962520 11259049
2196 11259049 11466097 11709697 11938725 12162063 12442257 12690521 13013486 13441775 13856170
2187 13856170 14341036 14765778 15203217 15694905 16292483 16944649 17626277 18465966 19478615
2178 19478615 20398014 21420810 22603699 23890315 25231142 26629880 28170111 29581190
2170 29581190 31120364 32546858 33958067 35109120 35883265 36227549 35952765 35032101 33793715
2161 33793715 32269773 30770168 29243198 27736114 26372429 25242007 24211184 23238519
2153 23238519 22349378 21592511 21008050 20444270 19972994 19639974 19214569 18942701 18632597
2144 18632597 18284587 17734143 17141693 16486010 15936239 15524937 15242668 14945312 14688567
2135A4688567l18104k86732l35338k29772j61306l34645k28356k91783k24276
2126A2278255j22698k56077k62083k23770j73480k63606k34024k5831l731o3250
2116A0649705j17517N1126R0809J27692K34813K59258j21184n83846o13761n39545
2106I437550n32565k96921k84679k91111k22564j60998j13232j67475k13817k11060
2096F943128j28151n4329j66114j35852l9333k3442k10617o9234o8339L4659m3827
2085F038549l7768Q104J6396q4688J29880N4745M9452J37702J18148n4254k04871
2074F171395l12060k43155k51362j10006j70777k10496q6083p8855l5166k7454
2064D645981j6558m6900m1847j21647j39863j17558o8619P3470j9225m2940k6321
$$ plain form
2135 14688567 14370463 14083731 13748393 13518621 13357315 13022670 12794314 12502531 12278255
2126 12278255 12155557 11899480 11637397 11413627 11240147 10976541 10742517 10716686 10712955 10649705
2116 10649705 10532188 10583314 10674123 10801815 11036628 11295886 11174702 10590856 9977095 9437550
2106 9437550 8904985 8608064 8323385 8032274 7809710 7648712 7535480 7368005 7154188 6943128
2096 6943128 6814977 6760648 6594534 6458682 6419349 6395907 6185290 6116056 6047717 6082376 6038549
2085 6038549 6000781 6008885 6025281 5940593 6070473 6125218 6174670 6312372 6430520 6376266 6171395
2074 6171395 5859335 5616180 5364818 5254812 5084035 4873539 4787456 4708601 4673435 4645981
2064 4645981 4629423 4582523 4540676 4419029 4279166 4161608 4092989 4166459 4147234 4104294 4077973
2053D077973j33152q3387j8967k0882k05334J6903K3455r984o365m5961m28q7813
2041C506058j41948o6247r3864P1038J2804j8559L4485l4751o0704K9193j3881
2030C223624o8863q0929Q1842q233j29924o0738L7268L9577n3698m6098L822p0614
2018B867036n4506L6990P197m2655Q455l1821n8900n3590j3103J4215j7107O1673
2006B723884k3503l2316m0254j4102L8846O1916n8710l2479n8868l3081n2506
1995B478827J7046K4003L6864p825m1177n3949p7726l0109p31M2629K2697M9751
1983B460300j0550m5134n4082k8174m7724K5827n4679J4122l4458J3546l9992
1972B199002l1384k5953l9248j0406k1076n2120j185L280L1215m7232l736j8942
$$ plain form
2053 4077973 3944821 3861434 3842467 3821585 3616251 3633154 3656609 3646625 3640260 3594299 3593871 3506058
2041 3506058 3364110 3297863 3203999 3275037 3287841 3269282 3303767 3269016 3208312 3237505 3223624
2030 3223624 3154761 3073832 3155674 3147441 3017517 2956779 2994047 3033624 2979926 2933828 2937650 2867036
2018 2867036 2812530 2849520 2856717 2814062 2822517 2790696 2731796 2678206 2665103 2679318 2662211 2723884
2006 2723884 2700381 2668065 2627811 2613709 2652555 2714471 2655761 2623282 2564414 2531333 2478827
1995 2478827 2495873 2519876 2556740 2548915 2507738 2453789 2376063 2345954 2345223 2387852 2410549 2460300
1983 2460300 2449750 2404616 2350534 2322360 2274636 2300463 2245784 2259906 2225448 2238994 2199002
1972 2199002 2167618 2141665 2102417 2092011 2070935 2018815 2017630 2020910 2052125 2004893 2001157 1982215
1960A982215j2208N1472j1416L0703r2597k0703k7577j8356j4268K2946j01344
1949A788867o7316l7590j5292K0186l8668L5395L8620P0331p2549k0058J08056
1938A809982j39904n1434M8954k7727Q824q7639O7588L1478O4337l1569r6934
1927A595956N0805q826n8075j07435P8893K3789m38j6210o3567l0328O2086N9084
1915A585734k6443P0782J799l3826k3412K9623l2490m3099N1051Q5443k5493n2752
1903A586917q668o2652j7143K4288P7275m4378K1370J3361R770P8640P8878J4863
1891A772521N2571J5244k3332L4749p7901O0470M5755k2512J9860l0566M0097
1880A886956R9842N9523j9971r310L9871L5043n6419m2607O8698M1986l6498m5311
$$ plain form
1960 1982215 1970007 2021479 2010063 2040766 1948169 1927466 1899889 1881533 1867265 1890211 1788867
1949 1788867 1721551 1683961 1668669 1688855 1650187 1685582 1724202 1794533 1721984 1701926 1809982
1938 1809982 1670078 1618644 1667598 1639871 1648695 1561056 1628644 1660122 1724459 1692890 1595956
1927 1595956 1646761 1637935 1579860 1472425 1551318 1575107 1574669 1558459 1494892 1464564 1526650 1585734
1915 1585734 1559291 1630073 1631872 1598046 1574634 1604257 1571767 1528668 1579719 1665162 1639669 1586917
1903 1586917 1578249 1515597 1498454 1522742 1600017 1555639 1577009 1590370 1600140 1678780 1757658 1772521
1891 1772521 1825092 1840336 1817004 1851753 1773852 1834322 1880077 1857565 1877425 1846859 1886956
1880 1886956 1986798 2046321 2026350 2017040 2056911 2091954 2035535 1992928 2061626 2103612 2067114 2021803
1868B021803P4560J11120K1306J3959j2146P2484P1960N3041P6825O9320m6652
1857B527580P7857P672L6228P2988P1829J19825J03406O2158Q4828R4150J2319
1846C270840q1953J50631J95960R2492J33168P8125J28723P2501J15801Q0513
1836D236801J10867J86088J38917J00998J63822R7008L9732Q8687N7864L4367
1826E255151K6532M7798J51433M1046Q9644M7837J13405J39589j0497P9823J16002
1815F097763K23529L07502K65753J85374J86499K11972K94527K91141L20813K92099
1805H676972K68480L82472K66875L22607K08468R15j56187k04832k68776l32986
1795I164008l07491k37711k80623o8710l6673J433j6359J09527O0894Q966K06819
$$ plain form
1868 2021803 2096363 2207483 2228789 2242748 2230602 2303086 2375046 2428087 2504912 2574232 2527580
1857 2527580 2605437 2613109 2649337 2722325 2794154 2913979 3017385 3079543 3164371 3258521 3270840
1846 3270840 3188887 3339518 3535478 3627970 3761138 3839263 3967986 4040487 4156288 4236801
1836 4236801 4347668 4533756 4672673 4773671 4937493 5034501 5074233 5162920 5220784 5255151
1826 5255151 5281683 5329481 5480914 5521960 5611604 5659441 5772846 5912435 5901938 5981761 6097763
1815 6097763 6321292 6628794 6894547 7079921 7266420 7478392 7772919 8064060 8384873 8676972
1805 8676972 8945452 9327924 9594799 9917406 10125874 10126789 9970602 9765770 9496994 9164008
1795 9164008 8856517 8618806 8338183 8269473 8232800 8234233 8217874 8327401 8388295 8397261 8604080
1784H604080K31537J23400K63285K86973J64619J93410K14610K15866J87506J60621
1774A0645907J05691L0201n1719j07016k38049k57774j96123k71397k52563l19994
1764I087164l68939k82568k99420k40025k43285j61269p046l4127k6790n6028
1754G367667k5153j7737M3742P3793L560r969j0596p0984j36713j19087j92779
1743F905744k72007k72799k63495l79782k32809k36370k67908l62105j72144j00373
1733D345952j86388j45098j43693j43280l6991j69263n8537j95374o1630k6513
1723C179185q7139q7478l8808m8912p1091o4087j12579j42757q6887o8946l6596
1712B333905j50991r1330p8530j0980q004r1856o6919o9994j722K1697j27882
$$ plain form
1784 8604080 8835617 8959017 9222302 9509275 9673894 9867304 10081914 10297780 10485286 10645907
1774 10645907 10751598 10781799 10730080 10623064 10385015 10127241 9931118 9659721 9407158 9087164
1764 9087164 8718225 8435657 8136237 7896212 7652927 7491658 7484612 7450485 7423695 7367667
1754 7367667 7342514 7324777 7368519 7442312 7445872 7435903 7425307 7354323 7217610 7098523 6905744
1743 6905744 6633737 6360938 6097443 5717661 5484852 5248482 4980574 4618469 4446325 4345952
1733 4345952 4159564 4014466 3870773 3727493 3690502 3521239 3462702 3267328 3205698 3179185
1723 3179185 3092046 3004568 2965760 2916848 2845757 2781670 2669091 2526334 2439447 2370501 2333905
1712 2333905 2182914 2091584 2013054 2002074 1994070 1902214 1835295 1765301 1763579 1785276 1657394
1701A657394K0537K6243j18614l8408q2993r293p5185o8448k1144K23M631n9599
1689A235344n7687k4838J8420r095o8030j6930m2765M8270k2350M87l8479m9417
1677I72930q038J2301n7198J0312l2510l7960P653K093l08m9193j7647o7764l671
1664G31000L7736l0654N4869q6014q3198n1568J5180k8821r063J0158l4709M3724
1652E68640M4984q035Q2908m7856k1653k3639j22298o2465n118K9273J7037N1177
1640E02955K4348j41384j3853J0183M3808m9134O6784O7513M768j47748r6364
1629B71876O8814Q460r8765J3527L4955J2786J4902n3690j09809O0321Q1715o6046
1617B39046k3433J4081K9695L5492o7303j0880n9153k5567L4269Q668L4485J5285
$$ plain form
1701 1657394 1677931 1704174 1585560 1547152 1464159 1454866 1379681 1311233 1290089 1290312 1294943 1235344
1689 1235344 1177657 1152819 1171239 1162144 1094114 1077184 1034419 1082689 1060339 1060826 1022347 972930
1677 972930 964892 977193 919995 930307 897797 859837 867490 869583 869275 820082 802435 734671 731000
1664 731000 768736 738082 792951 706937 623739 572171 587351 558530 549467 559625 524916 568640
1652 568640 613624 605589 688497 640641 618988 595349 473051 410586 405468 434741 451778 502955
1640 502955 527303 385919 372066 382249 426057 376923 443707 511220 515988 368240 271876
1629 271876 340690 349150 250385 263912 298867 311653 326555 272865 163056 223377 305092 239046
1617 239046 215613 229694 259389 294881 227578 216698 157545 131978 166247 174915 209400 224685
1605B24685m945o1252n8759o271j9263K3782O9100l7223N6785L9523m1797r088
1593A75277n2571n5660N0303k7129J5613K6469K7740m5664K7713r989j8276n6028
1581E7798N2540j3375J22116n4980J1870o6061o748k611r5825Q433O6513N585
1569H5255L6966m5609j7384m1324m484Q3256K6841n8388n72M3469K0337L183l4120
1556I7426k7375o9854m115P173N4675J14266k6086p1389j8931m2082j4369L6969
1544C6308j0350k9096N7125M8315j3758J500q4939J04478k791k9592p440k1472
1532D8288m6947J3999O8909m2564k3421J5007k6313J1832J5578Q012p1232r231
1520c8083K5670M4886J0744r7382N267O366O2471p309O957j0919L3624m4037O0557
$$ plain form
1605 224685 219740 158488 99729 93458 74195 97977 167077 129854 186639 226162 184365 175277
1593 175277 122706 67046 117349 90220 105833 132302 160042 114378 142091 132102 113826 57798
1581 57798 110338 96963 219079 164099 175969 109908 103160 100549 4724 13157 79670 85255
1569 85255 122221 76612 59228 17904 13420 96676 123517 65129 64557 108026 128363 131546 97426
1556 97426 70051 197 -3918 3255 57930 172196 146110 74721 55790 13708 -661 36308
1544 36308 25958 -3138 53987 102302 88544 90044 5105 109583 106792 77200 69760 48288
1532 48288 1341 15340 84249 41685 18264 33271 6958 18790 34368 42380 -28852 -38083
1520 -38083 -12413 32473 43217 -54165 -48898 -42532 19939 12630 19587 8668 42292 -1745 58812
1507E8812m8242K5051j4807P0803m0219p4925o7082R1466m2494L1154k7410N961
1495c1932k7794l1756M5039k4621K8694K4515P868J8691O529J6961l1748o5718
1483f5272L3592N206j6826m3081K94P313p082K5315J983N7571q351q2003m5436
1470a36777j5036N3849r126j7353N1963r50m7789M8468J4143k9926N3016L7158
1458A640l5414j7646j2123j03494k028J01991J05q548M0039m9552m1455P9313
1446d7172R694R472N523l8683O5085j8205r9287k9224k7050R8648K0347j8227
1434f9079N11L237m4269p439m2868P2203q8159M1332o6523L2759l8355m1949Q0483
1421a68116k7867N625L0518l2413L0226R9191o5691K7170n3268L3720l446k2293
$$ plain form
1507 58812 10570 35621 20814 91617 51398 -23527 -90609 857 -41637 -10483 -37893 -31932
1495 -31932 -59726 -91482 -46443 -71064 -42370 -17855 -9987 8704 15233 32194 446 -65272
1483 -65272 -31680 -26474 -43300 -86381 -86087 -78774 -85856 -60541 -58558 -987 -9338 -91341 -136777
1470 -136777 -151813 -97964 -107090 -124443 -72480 -73430 -121219 -72751 -58608 -88534 -35518 1640
1458 1640 -33774 -51420 -63543 -167037 -169065 -67074 -66969 -75517 -35478 -85030 -126485 -47172
1446 -47172 -37478 -28006 -22483 -61166 3919 -14286 -113573 -142797 -169847 -71199 -50852 -69079
1434 -69079 -68568 -65331 -109600 -117039 -159907 -87704 -175863 -134531 -201054 -168295 -206650 -248599 -168116
1421 -168116 -195983 -190358 -159840 -192253 -162027 -62836 -128527 -101357 -154625 -120905 -124351 -146644
1409a46644n5713N2801K5099k0316Q079k8728P4402Q1772q3868P5565o2798m5436
1397a25785k1574P2416k6749p263O3532P756m7883j0226j8830N6526j9532j03361
1385a80973l8307K5029L1911k227J78218j6476l1262l8983o0757M01J2283o3677
1373a84820m73j9657P0442P4602j8309l7516J2827J4996k346n0017N4215j1118
1361i7174k6827O8508M8491n5717o5054m410q6625L2164O5717R6202M7538k3332
1349e19l4129p0040o5867P4440o2624J4091O5584j36603P2771J9494k8291o9319
1337b21012n3910K4719M4636M8233M980p0350P0838l5564K1381r472n788O797
1325a74512j0760K6433j721K9702P811m8136o8887p4578P2813N0197p9665Q7724
$$ plain form
1409 -146644 -202357 -149556 -124457 -144773 -136694 -165422 -91020 -9248 -93116 -17551 -80349 -125785
1397 -125785 -147359 -74943 -101692 -108955 -45423 -37667 -85550 -95776 -114606 -58080 -77612 -180973
1385 -180973 -219280 -194251 -162340 -164567 13651 -2825 -34087 -73070 -133827 -133426 -121143 -184820
1373 -184820 -185293 -204950 -134508 -59906 -78215 -115731 -102904 -87908 -90254 -140271 -86056 -97174
1361 -97174 -124001 -55493 -7002 -62719 -127773 -132183 -218808 -186644 -120927 -24725 22813 -519
1349 -519 -34648 -104688 -170555 -96115 -158739 -144648 -79064 -215667 -142896 -123402 -151693 -221012
1337 -221012 -274922 -250203 -205567 -157334 -152354 -222704 -151866 -187430 -166049 -175521 -181309 -174512
1325 -174512 -185272 -158839 -160560 -130858 -123047 -171183 -240070 -314648 -241835 -191638 -271303 -183579
1313a83579O6807K243k0956L218p130p5014J051k9039m487m7670P1218K7842O789
1300a88707j9847k156j6672L5236l7493l0142J3814l7959J6411l220N9877k6114
1288b36972r75K7321N4010p8636L489K7560m347O1964L6878p3429N08j2648J2163
1275a83114O8230j3002J7056m029J8674l6653L2699q7623q3015J3880P2550J6951
1263a67396l8919N9938M3044j6960j1476k0738q37J3590j9609O4490K141J1029
1251h1703q6447k4978N8240P4753n012j9330m0297O3395o6856M501N9920J02330
1239C8516K5064J1293M6595J7323J2565N1214o4460o7824l47m1722m9310R157
1227a1936j8082L1960m9436l4978k0100M2886o603l5855Q8316Q5566m4726o2727
$$ plain form
1313 -183579 -116772 -114529 -135485 -132267 -139397 -214411 -213360 -242399 -246886 -294556 -223338 -195496 -188707
1300 -188707 -208554 -210710 -227382 -192146 -229639 -259781 -245967 -283926 -267515 -270735 -210858 -236972
1288 -236972 -237947 -210626 -156616 -235252 -231763 -204203 -208550 -146586 -109708 -183137 -182629 -195277 -183114
1275 -183114 -114884 -127886 -110830 -114859 -96185 -132838 -100139 -187762 -270777 -256897 -184347 -167396
1263 -167396 -206315 -146377 -103333 -120293 -131769 -152507 -153344 -139754 -159363 -94873 -92732 -81703
1251 -81703 -168150 -193128 -134888 -60135 -65147 -84477 -124774 -61379 -128235 -123734 -63814 38516
1239 38516 63580 74873 121468 138791 151356 202570 138110 70286 69939 28217 -21093 -11936
1227 -11936 -30018 1942 -47494 -82472 -102572 -59686 -66289 -102144 -13828 71738 27012 -35715
1215c5715n8063j3958p6465L061L5109O213l3709L5237J797R7129l7355o0482
1203a37201J6366r513l833k1726k3450J0783L7113m7503L3965P4315k2043o9031
1191a61758L7385o7665j2506M5593Q5899J1640P1075R720o9387p7580J6863j1232
1179a21953M2639K2946Q7103n4174q7718n487m6002n9672O5929l2872N6822L5617
1167i6822k6877J4325N9618p8014p7625n2011Q3206L3542J0251k8437J1215N6050
1155i1579j8480o2988K6287r732k4509L6084J16493O283m1761m6079o7995M8179
1143a29797k8663p4589Q5693J06376J1371k0558r5651M0097j9223n8376J2745
1132a70575R1122j69k2522q1372L7155K7484j04167m5118O6594Q021N3925N5264
$$ plain form
1215 -35715 -93778 -107736 -184201 -181140 -146031 -139818 -173527 -138290 -136493 -39364 -76719 -137201
1203 -137201 -120835 -130348 -134181 -155907 -179357 -168574 -131461 -178964 -144999 -70684 -92727 -161758
1191 -161758 -124373 -192038 -204544 -158951 -73052 -61412 9663 19383 -50004 -127584 -110721 -121953
1179 -121953 -79314 -56368 30735 -23439 -111157 -116644 -162646 -222318 -156389 -189261 -132439 -96822
1167 -96822 -123699 -109374 -49756 -127770 -205395 -257406 -174200 -140658 -130407 -158844 -147629 -91579
1155 -91579 -110059 -173047 -146760 -156492 -181001 -144917 -28424 -22141 -63902 -109981 -177976 -129797
1143 -129797 -158460 -233049 -147356 -40980 -29609 -50167 -145818 -105721 -124944 -183320 -170575
1132 -170575 -79453 -79622 -102144 -183516 -146361 -118877 -223044 -268162 -201568 -193547 -139622 -84358
1120h4358k1353k4317L9213k709r55N133J3431l1320O051K798n4497J19115m3156
1107g6924o1573Q9528l3641k1129Q513K607Q3185o4582m3270P211L9791L0750
1095c9534K6996J8784P1724o8481j33309P0769K6015R203M5380j6159J8934q3495
1083e3173n1134L1255P5504P129J1729N7108J1993L1245J1605n0836J20396l1822
1071A70999N1690N2809J1334P879r8933M7934n149p3761K7278j0412k5804N4710
1059B10574K0708J6028L936l0132j1949N2232q075J7270J3166l9490O1329Q4090
1047C89687M4826J14005J5586N8523J02526n7289m4475O3944m9988k1167K7533
1036F43711l3295p380M0781n2073m543J00095L6191J2966O3031n716j8972J2453
$$ plain form
1120 -84358 -105711 -130028 -90815 -93524 -94479 -89346 -75915 -107235 -101184 -98386 -152883 -33768 -76924
1107 -76924 -138497 -48969 -82610 -103739 -95226 -92619 -9434 -74016 -117286 -110075 -70284 -39534
1095 -39534 -12538 6246 77970 9489 -123820 -53051 -27036 -17833 27547 11388 30322 -53173
1083 -53173 -104307 -73052 2452 9581 21310 78418 90411 121656 133261 82425 202821 170999
1071 170999 222689 275498 286832 294711 195778 243712 238563 164802 192080 181668 155864 210574
1059 210574 231282 247310 251246 221114 209165 261397 253322 270592 283758 244268 305597 389687
1047 389687 434513 548518 564104 622627 725153 667864 623389 687333 637345 616178 643711
1036 643711 610416 603036 643817 591744 587201 687296 723487 736453 799484 793768 774796 787249
1024G87249N0820j0683O7805j392J9073k6831J31915L2165N0938M5941o269k5056
1012A115675K8410k744K3339M6366Q3573k8128J34238N8273N768O1071J35723
1001A661564L1563J1766O2603O3239J29730J24612j824j868N7706J45757N157
990B290005K9387J16627J10946J29867J87972J79266K02455J26386K59692J70669
980C803272J55649J98360J44786K52471L65000L69512L88266L11205L65409M26312
970F780242N00305N45743Q12256O61291L88108M49632O46575Q54875J245125J437458
960A4321610J855679K178405K864068L476271M585773N263409O968051R056476
952E0569742J2009478O832886j1505006j4697932r297979n903356l899699l148530
$$ plain form
1024 787249 838069 827386 895191 893799 912872 886041 1017956 1050121 1101059 1147000 1140731 1115675
1012 1115675 1144085 1141341 1164680 1211046 1294619 1266491 1400729 1459002 1464770 1525841 1661564
1001 1661564 1693127 1704893 1767496 1830735 1960465 2085077 2083253 2081385 2139091 2284848 2290005
990 2290005 2319392 2436019 2546965 2676832 2864804 3044070 3246525 3372911 3632603 3803272
980 3803272 3958921 4157281 4302067 4554538 4919538 5289050 5677316 5988521 6353930 6780242
970 6780242 7280547 7826290 8638546 9299837 9687945 10137577 10784152 11639027 12884152 14321610
960 14321610 16177289 18355694 21219762 24696033 29281806 34545215 41513266 50569742
952 50569742 62579220 69412106 57907100 43209168 33911189 28007833 24108134 20959604
944B0959604k770930k464535j935936j426424j055015p04512n36183n86067m26523
935I053479l68424q26705r37478p53965m92176l91666l54662k74213j96213k58084
925D199893l06778l09392k42011j34103j53814r9293j33913r6267k01936j39318
915B383068j16977J125j24743r9661j22578q31q9880j9439j31286k6105J605l2678
903A621620j28959o1798j32165o521p8105K4304m3938m0586k2966m7465l5791
892A047630j100j8252K0129j02174n3654J97R766j29828j9345L5972j6468k2334
$$ plain form
944 20959604 18188674 15724139 13788203 12361779 11306764 10602252 10066069 9480002 9053479
935 9053479 8685055 7858350 6920872 6166907 5674731 5283065 4928403 4654190 4457977 4199893
925 4199893 3893115 3583723 3341712 3207609 3053795 2954502 2820589 2724322 2522386 2383068
915 2383068 2266091 2267216 2142473 2042812 1920234 1919403 1829523 1810084 1678798 1652693 1654298 1621620
903 1621620 1492661 1430863 1298698 1292177 1214072 1238376 1194438 1153852 1130886 1083421 1047630
892 1047630 1046530 1028278 1048407 946233 892579 892776 902542 772714 753369 789341 772873 750539
$$ [...]
##END NTUPLES=NMR SPECTRUM
##END=
