##TITLE=1H_CG-1049-A/ spectr
 CDCl3, 8 sc, 
 18.11.2020
##JCAMPDX= 6.0         $$ Bruker NMR JCAMP-DX V2.0
##DATA TYPE= NMR FID
##DATA CLASS= NTUPLES
##ORIGIN= UXNMR, Bruker Analytische Messtechnik GmbH
##OWNER= root
$$ XWIN-NMR		Version 3.5
$$ Wed Nov 18 12:47:23 2020 Russian Standard Time (UT+4h)  she@DPX200
##.OBSERVE FREQUENCY= 200.1315066352
##.OBSERVE NUCLEUS= ^1H
##.DELAY= (6, 6)
##.ACQUISITION MODE= SIMULTANEOUS
##.ACQUISITION SCHEME= undefined
##.AVERAGES= 8
##.DIGITISER RES= 18
##SPECTROMETER/DATA SYSTEM= spect
##.PULSE SEQUENCE= zg30
##.SOLVENT NAME= CDCl3
##.SHIFT REFERENCE= (INTERNAL, CDCl3, 0, 15.7039)
##AUDIT TRAIL= $$ (NUMBER, WHEN, WHO, WHERE, WHAT)
$$ ##TITLE= Audit trail, XWIN-NMR		Version 3.5
$$ ##JCAMPDX= 5.01
$$ ##ORIGIN= Bruker BioSpin GmbH
$$ ##OWNER= she
$$ F:/spectra/data/she/nmr/H-F/1/audita.txt
$$ ##AUDIT TRAIL=  $$ (NUMBER, WHEN, WHO, WHERE, WHAT)
(   1,<2020-11-18 12:46:06.43 +0400>,<she>,<DPX200>,
      <created by zg, POWCHK disabled, PULCHK disabled
       configuration hash MD5:
       00 E9 B6 7A A2 85 ED C7 34 08 36 98 17 FE 4E 26
       data hash MD5: 16K
       EE 78 83 42 B2 5C D3 07 A4 37 96 00 93 96 A0 2D>)
$$ ##END=
$$ 
$$ hash MD5
$$ 17 C1 5A E5 27 D5 42 EE 39 C4 9F DA F0 65 EC E3
##$RELAX= 
##$RELAX= 
##$RELAX= 
##$RELAX= 
##$RELAX= 
##$RELAX= 
$$ Bruker specific parameters
$$ --------------------------
##$DU= <F:/spectra>
##$EXPNO= 1
##$NAME= <H-F>
##$PROCNO= 1
##$TYPE= <nmr>
##$USER= <she>
##$AMP= (0..31)
100 100 100 100 100 100 100 100 100 100 100 100 100 100 100 100 100 100 
100 100 100 100 100 100 100 100 100 100 100 100 100 100 
##$AQSEQ= 0
##$AQ_mod= 1
##$AUNM= <au_zg>
##$AUTOPOS= <>
##$BF1= 200.13
##$BF2= 200.13
##$BF3= 200.13
##$BF4= 200.13
##$BF5= 200.13
##$BF6= 200.13
##$BF7= 200.13
##$BF8= 200.13
##$BYTORDA= 1
##$CFDGTYP= 0
##$CFRGTYP= 5
##$CHEMSTR= <none>
##$CNST= (0..31)
1 1 145 1 1 1 1 1 1 1 1 1 1 1 1 1 1 1 1 1 1 1 1 1 1 1 1 1 1 1 1 1 
##$CPDPRG= <>
##$CPDPRG1= <>
##$CPDPRG2= <>
##$CPDPRG3= <>
##$CPDPRG4= <mlev>
##$CPDPRG5= <mlev>
##$CPDPRG6= <mlev>
##$CPDPRG7= <mlev>
##$CPDPRG8= <mlev>
##$CPDPRGB= <>
##$CPDPRGT= <>
##$D= (0..31)
0 1.2 0 0 0 0 0 0 0 0.06 0 0.03 0 0 0 0 0.0002 0 0 0 0 0 0 0 0 0 0 0 0 
0 0 0 
##$DATE= 1605689165
##$DBL= (0..7)
120 120 120 120 120 120 120 120 
##$DBP= (0..7)
150 150 150 150 150 150 150 150 
##$DBP07= 0
##$DBPNAM0= <>
##$DBPNAM1= <>
##$DBPNAM2= <>
##$DBPNAM3= <>
##$DBPNAM4= <>
##$DBPNAM5= <>
##$DBPNAM6= <>
##$DBPNAM7= <>
##$DBPOAL= (0..7)
0.5 0.5 0.5 0.5 0.5 0.5 0.5 0.5 
##$DBPOFFS= (0..7)
0 0 0 0 0 0 0 0 
##$DE= 6
##$DECBNUC= <off>
##$DECIM= 32
##$DECNUC= <off>
##$DECSTAT= 4
##$DIGMOD= 1
##$DIGTYP= 9
##$DL= (0..7)
0 120 120 120 120 120 120 120 
##$DP= (0..7)
150 150 150 150 150 150 150 150 
##$DP07= 0
##$DPNAME0= <>
##$DPNAME1= <>
##$DPNAME2= <>
##$DPNAME3= <>
##$DPNAME4= <>
##$DPNAME5= <>
##$DPNAME6= <>
##$DPNAME7= <>
##$DPOAL= (0..7)
0.5 0.5 0.5 0.5 0.5 0.5 0.5 0.5 
##$DPOFFS= (0..7)
0 0 0 0 0 0 0 0 
##$DQDMODE= 0
##$DR= 18
##$DS= 0
$$ [...]
##$SUBNAM2= <"">
##$SUBNAM3= <"">
##$SUBNAM4= <"">
##$SUBNAM5= <"">
##$SUBNAM6= <"">
##$SUBNAM7= <"">
##$SUBNAM8= <"">
##$SUBNAM9= <"">
##$SW= 16.9725356469052
##$SWIBOX= (0..15)
0 0 2 0 0 0 0 0 0 0 0 0 0 0 0 0 
##$SW_h= 3396.73913043478
##$TD= 16384
##$TD0= 1
##$TE= 0
##$TE2= 300
##$TE3= 300
##$TEG= 300
##$TL= (0..7)
0 120 120 120 120 120 120 120 
##$TP= (0..7)
150 150 150 150 150 150 150 150 
##$TP07= 0
##$TPNAME0= <>
##$TPNAME1= <>
##$TPNAME2= <>
##$TPNAME3= <>
##$TPNAME4= <>
##$TPNAME5= <>
##$TPNAME6= <>
##$TPNAME7= <>
##$TPOAL= (0..7)
0.5 0.5 0.5 0.5 0.5 0.5 0.5 0.5 
##$TPOFFS= (0..7)
0 0 0 0 0 0 0 0 
##$TUNHIN= 0
##$TUNHOUT= 0
##$TUNXOUT= 0
##$USERA1= <user>
##$USERA2= <user>
##$USERA3= <user>
##$USERA4= <user>
##$USERA5= <user>
##$V9= 5
##$VALIST= <valist>
##$VCLIST= <CCCCCCCCCCCCCCC>
##$VD= 0
##$VDLIST= <DDDDDDDDDDDDDDD>
##$VPLIST= <PPPPPPPPPPPPPPP>
##$VTLIST= <TTTTTTTTTTTTTTT>
##$WBST= 1024
##$WBSW= 4
##$XGAIN= (0..3)
0 0 0 0 
##$XL= 0
##$YL= 0
##$YMAX_a= 555752
##$YMIN_a= -426090
##$ZGOPTNS= <>
##$ZL1= 120
##$ZL2= 120
##$ZL3= 120
##$ZL4= 120
##$ABSF1= 10
##$ABSF2= 0
##$ABSG= 5
##$ABSL= 3
##$ALPHA= 0
##$AQORDER= 0
##$ASSFAC= 0
##$ASSFACI= 0
##$ASSFACX= 0
##$ASSWID= 0
##$AUNMP= <proc_1d>
##$AZFE= 0.1
##$AZFW= 0.1
##$BCFW= 1
##$BC_mod= 2
##$BYTORDP= 1
##$COROFFS= 0
##$CY= 11.3945322036743
##$DATMOD= 1
##$DC= 2
##$DFILT= <>
##$DTYPP= 0
##$F1P= 15.9154993809931
##$F2P= -4.1035820241983
##$FCOR= 0.5
##$FTSIZE= 0
##$FT_mod= 4
##$GAMMA= 1
##$GB= 0.15
##$INTBC= 1
##$INTSCL= 1
##$ISEN= 128
##$LB= 0.24
##$LEV0= 0
##$LPBIN= 0
##$MAXI= 10000
##$MC2= 0
##$MEAN= 0
##$ME_mod= 0
##$MI= 1.114404
##$NCOEF= 0
##$NC_proc= 0
##$NLEV= 6
##$NOISF1= 3.799351
##$NOISF2= 2.8
##$NSP= 1
##$NTH_PI= 0
##$NZP= 0
##$OFFSET= 15.70392
##$PC= 1
##$PHC0= -11053.83
##$PHC1= 24.0009
##$PH_mod= 1
##$PKNL= yes
##$PPARMOD= 0
##$PSCAL= 0
##$PSIGN= 0
##$REVERSE= no
##$SF= 200.130013532006
##$SI= 16384
##$SIGF1= 3
##$SIGF2= 2
##$SINO= 400
##$SIOLD= 16384
##$SREGLST= <1H.CDCl3>
##$SSB= 0
##$STSI= 0
##$STSR= 0
##$SW_p= 3612.71676300578
##$SYMM= 0
##$S_DEV= 0
##$TDeff= 0
##$TDoff= 0
##$TI= <>
##$TILT= no
##$TM1= 0
##$TM2= 0
##$TOPLEV= 0
##$USERP1= <user>
##$USERP2= <user>
##$USERP3= <user>
##$USERP4= <user>
##$USERP5= <user>
##$WDW= 1
##$XDIM= 8192
##$YMAX_p= 0
##$YMIN_p= 0
$$ End of Bruker specific parameters
$$ ---------------------------------
##NTUPLES= NMR FID
##VAR_NAME=  TIME,          FID/REAL,        FID/IMAG
##SYMBOL=    X,             R,               I
##VAR_TYPE=  INDEPENDENT,   DEPENDENT,       DEPENDENT
##VAR_FORM=  AFFN,          ASDF,            ASDF
##VAR_DIM=   8192,          8192,            8192
##UNITS=     SECONDS,       ARBITRARY UNITS, ARBITRARY UNITS
##FACTOR=    0.0002944,     1,               1
##FIRST=     0,             0,               0
##LAST=      2.4114304,     0,               0
##MIN=       0,             -426090,         0
##MAX=       2.4114304,     555752,          0
$$ Real data points
##PAGE= N=1
##DATA TABLE= (X++(R..R)), XYDATA
$$ [...]
2332a368K319L740m941QK829L163o475M27N540j540l476L67N999n533j619L961
$$ -1368 951 4691 -250 -242 2587 5750 -725 -298 5242 3702 226 593 6592 1059 -560 3401
2348C401J796n541r94P006k893l323L80M967l597l122M221k7k508k234N722k389
$$ 3401 5197 -344 -1338 5668 2775 -548 -168 4799 1202 -1920 2301 2274 -234 -2468 3254 865
2364H65k855M25L085m82m810K932N90k3l821K844K278m114m51K210K019o003J786
$$ 865 -1990 -1565 1520 1038 -3772 -840 -250 -273 -4094 -1250 1028 -3086 -3537 -1327 692 -5311 -3525
2381c525L303k85l596N37N621m988j296L326L053o114L54N760k217l369J285O319
$$ -3525 -222 -507 -4103 -3566 2055 -2933 -4229 -903 2150 -3964 -3610 2150 -67 -3436 -2151 4168
2397D168n531j493L742J333l583q91O129l230k094J336M132k887l077M093L36
$$ 4168 -1363 -2856 886 2219 -1364 -2255 3874 644 -1450 -114 4018 1131 -1946 2147 2483
2412B483n54k796L728o0j979k30K201Q48m741K424K007Pn009K587L988m340j073
$$ 2483 1929 -867 2861 2801 822 592 2793 3641 -1100 1324 3331 3338 -1671 916 4904 564 -509
2429e09J896L112o118Q32M245j544m438J571N624n822j359K886K344m753q05M987
$$ -509 1387 4499 -1619 -787 3458 1914 -2524 -953 4671 -1151 -2510 376 2720 -2033 -2838 2149
2445B149k623k465M53M825m162k181L042J160k088k897N049j188j609j069L260
$$ 2149 -474 -2939 -2486 2339 -1823 -4004 -962 198 -1890 -4787 262 -926 -2535 -3604 -344
2460c44m7l927K170K002l2m764L919K415l254j446K846K976o089J807L794p19
$$ -344 -391 -4318 -2148 -146 -178 -4942 -1023 1392 -1862 -3308 -462 2514 -3575 -1768 2026 1307
2476A307m586K999M469n137p59L074L017o042J022M878k027l162J653M728m818
$$ 1307 -3279 -280 4189 -948 -1707 1367 4384 -1658 -636 4242 2215 -947 706 5434 616
2491F16j128L168J796l931j373N371k350j750n64M179k017k715J855J625j110
$$ 616 -512 2656 4452 521 -852 4519 2169 419 -145 4034 2017 -698 1157 2782 1672
2506A672l533L822L04j846j837K830J243n014J764K180k0n113K910K858l536j958
$$ 1672 -1861 1961 2265 419 -1418 1412 2655 -2359 -595 1585 1565 -3548 -638 2220 -1316 -3274
2522c274K584K908o653J635L350r62m284J732M826m785j204K222K914m933J27
$$ -3274 -690 2218 -4435 -2800 550 -412 -4696 -2964 1862 -2923 -4127 -1905 1009 -3924 -3797
2537c797M502j692k037j2M951l469j252J892K082j383k643L989k85q18j991L794
$$ -3797 705 -987 -3024 -3036 1915 -1554 -2806 -914 1168 -215 -2858 1131 846 28 -1963 1831
2553A831M1l370J613K070K89m915M254J638k605k094L414J896n646K388K271j76
$$ 1831 1872 -1498 115 2185 2474 -2441 1813 3451 846 -1248 2166 4062 -1584 804 3075 2899
2569B899m597L130L521m535j160K606K518n391J294K722q94k443O07L784m144
$$ 2899 -1698 1432 4953 418 -742 1864 4382 -1009 285 3007 2113 -330 277 4061 -83
2584h3m30J328J886l126j365L119o31j210k058L879j729j869M89K368j078l848
$$ -83 -513 815 2701 -425 -1790 1329 698 -512 -2570 1309 -420 -2289 -1800 568 -510 -4358
2600d358L688M24j477k636L530J096l846Q59K055Q50m695L089K661l022j947K822
$$ -4358 -670 -246 -1723 -4359 -829 267 -3579 -2720 -665 185 -4510 -1421 1240 -1782 -3729 -907
2616i07L191n681R77L308J11m231K088L600l796k71J779K591m356N15L159o9k131
$$ -907 2284 -3397 -2420 888 999 -3232 -1144 2456 -1340 -1611 168 2759 -1597 -1082 2077 2008 -123
2633a23m91L837k018q62K41L125k163k337L518N90j880k674M771l41l528M41K950
$$ -123 -614 3223 1205 343 584 3709 1546 -791 2727 3317 1437 -1237 3534 3193 -335 106 3056
2650C056m86m342L397Q51j749k480L662J165n005J454K489J47m948L046K317l327
$$ 3056 2570 -1772 1625 2476 727 -1753 1909 3074 -1931 -477 2012 2159 -2789 257 2574 -753
2666g53q75J891K041n124J396K156m50l090O86L075k712p32L2K903k945j162K600
$$ -753 -1628 263 2304 -2820 -1424 732 282 -2808 -2122 953 -1759 -2491 -2459 444 -2501 -3663 -1063
2683a063K91j212j845M375j445j769O32K982q89l537L672O05r85k593M217L76
$$ -1063 -772 -1984 -3829 546 -899 -2668 -2036 946 57 -3480 192 797 -188 -2781 1436 1812
2699A812l570N86K672L29m781L667J736k310j960L414J159m507K157J993j40l564
$$ 1812 -1758 -1172 1500 1829 -2952 715 2451 141 -1819 1595 2754 -1753 404 2397 2257 -1307
2715a307K724K171k834o53J219K660l780N00J889M29k537m04L523k278j210j35
$$ -1307 1417 3588 754 101 1320 3980 200 700 2589 3018 481 77 3600 1322 112 -23
2731b3L229k689j722K510K08j649j859L681r77k270l3K513n54l963L477R95j841
$$ -23 3206 517 -1205 1305 1513 -136 -1995 1686 709 -1561 -1594 919 365 -3598 -121 874 -967
2748i67k774L932P66m387J397J899P6l909L064J097k122j156K207J495l920J349
$$ -967 -3741 191 957 -3430 -2033 -134 -58 -3967 -903 194 -1928 -3084 -877 618 -3302 -1953
2764a953J327O08k641R48K472j505n86J83K812k281q72K004J088j759j504L670
$$ -1953 -626 -18 -2659 -1711 761 -744 -1330 -1147 1665 -616 -1488 516 1604 -155 -1659 2011
2780B011q02j472m03L621j203l044L015J184j663k378M342m67l071N74L080n09
$$ 2011 1209 -263 -666 2955 1752 -1292 1723 2907 1244 -1134 3208 2741 -330 244 3324 2815
2796B815m471L496J260j726k427L238P99l941J471J390L80l962K164J474j765
$$ 2815 -1656 1840 3100 1374 -1053 2185 2984 -957 514 1904 2284 -1678 486 1960 195
2811A95j418J087K062l539N52J137N91k541J12K860j823j003m79L504k469j624
$$ 195 -1223 -136 1926 -1613 -1061 76 667 -1874 -1762 1098 -725 -1728 -2207 1297 -1172 -2796
2827b796J981R52j439k497M374j053k243k92L837j284l374L230J062j450k358
$$ -2796 -815 137 -1302 -3799 575 -478 -2721 -3013 824 -460 -3834 -604 458 -992 -3350
2842c350L962Q7l160J492J728l9l279K977Q46j147j463K174J294k985J175Q92
$$ -3350 612 699 -2461 -969 759 720 -2559 418 1264 117 -1346 828 2122 -863 312 1204
2858A204J000k899J039K212j301j217O08K966k950k17J087J669k294j512L689
$$ 1204 2204 -695 344 2556 1255 38 646 3612 662 445 1532 3201 907 -605 3084
2873C084j121j759n28L654j931k395K292Q19j405l170M710p76k579K21K458j310
$$ 3084 1963 204 -324 3330 1399 -996 1296 2115 710 -2460 2250 1474 -1105 -884 1574 264
2889B64k884L165L64j806j976L435P5k918P74J328M26l209K145R13j146j345J226
$$ 264 -2620 545 909 -897 -2873 562 637 -2281 -1507 -179 247 -2962 -817 96 -1050 -2395 -1169
2906a169J938k874J70R06J550k854m6K745q64j115p68L258k127o67J394J580k081
$$ -1169 769 -2105 -1935 -1029 521 -2333 -2379 366 -498 -1613 -2381 877 -1250 -1917 -523 1057 -1024
2923a024j295L907r20j449n20L450j064k745K817Q44j311k241M171r12j862N98
$$ -1024 -2319 1588 668 -781 -1301 2149 1085 -1660 1157 2001 690 -1551 2620 1708 -154 444
2939D44J963K9l454K799P18j008j731J835J105k540L48N62J664l481J027J513
$$ 444 2407 2436 -1018 1781 2499 1491 -240 1595 2700 160 508 1070 2734 -747 280 1793
2955A793m83j833k8L019k820m35O86J908k606q99L101r50j721q53M022k446k251
$$ 1793 1310 -523 -551 2468 -352 -787 -101 1807 -799 -1698 1403 453 -1268 -2121 1901 -545 -2796
2972b796K208J383k127j733L824r39k203j3L026j537k515K850L66p29k485L140
$$ -2796 -588 795 -1332 -3065 759 -180 -2383 -2396 630 -907 -3422 -572 -206 -935 -3420 -280
2988b80J18j598O8J350R21k996J746R22J01k039J376J919k482K26Q21J946l046
$$ -280 -162 -1760 -1692 -342 579 -2417 -671 251 352 -1687 -311 1608 -874 -648 173 2119 -927
3005i27N13K025k16j761k67L714k561r45J528J663k246j640L841o80j786n35L794
$$ -927 -414 1611 1395 -366 -633 3081 520 -425 1103 2766 520 -1120 2721 2041 255 -280 3514
3022C514k100k072K247N21p82k260L368p28j826m76J974K00l039J809O01k77k575
$$ 3514 1414 -658 1589 2110 1328 -932 2436 1708 -118 -594 1380 1580 -1459 350 951 674 -1901
3039a901K085R43k177l86J213J302l451R76J414K0k015M77K811k868n32J113K175
$$ -1901 184 1127 -1050 -1436 -223 1079 -2372 -1396 18 38 -1977 -1500 1311 -1557 -2089 -976 1199
3056A199l221l54K895n93k095m06L744k206j358J355J621k009j261L634j229r18
$$ 1199 -2022 -2376 519 -74 -2169 -2575 1169 -1037 -2395 -1040 581 -1428 -2689 945 -284 -1202
3072a202j30K605j087j729J835Q05o54j833L148m81j165k39J651M26k658J563
$$ -1202 -1332 1273 186 -1543 292 1097 443 -1390 1758 1277 112 -127 1524 1950 -708 855
3088H55R14O7k331J432J548j739o86P96K059l336M21K266k67k322J05L314k277
$$ 855 1769 1836 -495 937 2485 746 60 856 2915 -421 0 2266 1999 -323 -218 3096 819
3105H19j369R02K019k629r13K915j115j254o46L153k069j266J088J094j169j953
$$ 819 -550 352 2371 -258 -1171 1744 629 -625 -1271 1882 -187 -1453 -365 729 -440 -2393
3121b393K859r54o87j196K413j74k363J297R37q4k490K206P48j258q52J305J529
$$ -2393 466 -488 -1175 -2371 42 -132 -2495 -1198 -261 -345 -2835 -629 119 -1139 -1991 -686 843
3138H43k921O80J132O75k538J131K415k383n75J023K244k909k55K580k25j794
$$ 843 -2078 -1398 -266 409 -2129 -998 1417 -966 -1541 -518 1726 -1183 -1438 1142 917 -877
3154h77K0L147k273n55J125J620k028o06K615o35r95j164K978p66j675R71J086
$$ -877 -857 2290 17 -538 587 2207 179 -427 2188 1553 558 -606 2372 1606 -69 902 1988
3171A988k99k239K213j27p89j071J909O17k631N66R78O10l094J414J504j186j547
$$ 1988 1689 -550 1663 1536 747 -324 1585 2202 -429 137 1115 1725 -1369 45 1549 363 -1184
3188a184Q52K293l456L15J652J65k671N19K775k163p58M85K210k992K8J892j57
$$ -1184 -332 1961 -1495 -1180 472 637 -2034 -1515 1260 -903 -1661 -1176 1034 -1958 -1930 -38 -195
3205a95j403o88L088j791p96N56J799j200j596K082j11n38j135K434l12j816R34
$$ -195 -1598 -2286 802 -989 -1785 -1229 570 -630 -2226 -144 -255 -793 -1928 506 194 -1622 -688
3222f88R43L14k445J949J023p60j391J696J338k867P86J390K99k646J334K198
$$ -688 255 569 -1876 73 1096 336 -1055 641 1979 -888 -102 1288 1587 -1059 275 2473
3238B473j794r75J009J924k804K95J456L53j897r3K803k101o75L93J956k030q28
$$ 2473 679 -296 713 2637 -167 128 1584 1937 40 -53 2750 649 -26 367 2323 293 -535
3255e35J728j11q09q28K241j369p96J87J055n40j799J647K24m91j630J838J78
$$ -535 1193 1082 273 -555 1686 317 -479 -292 763 223 -1576 71 295 -196 -1826 12 190
3272A90j688K25Q67O84k888J748J113r70j555J121K041k874M94R97O28k250R76
$$ 190 -1498 -1273 -406 278 -2610 -862 251 -719 -2274 -1153 888 -1986 -1492 -495 133 -2117 -1141
3289a141J754j413q16P83J907k261M0J410J43r00n36K290j417m23L29J637r39
$$ -1141 613 -800 -1616 -833 1074 -1187 -1147 263 406 -494 -1030 1260 -157 -580 -251 1386 447
3306D47j029J645M8m60j510K673m91j218N5J312L21k258J536O84p07j618J795
$$ 447 -582 1063 1111 651 -859 1814 1323 105 160 1472 1793 -465 1071 1755 1048 -570 1225
3323A225J157k408L01J012N80k440J120R40j135r91Q77J505k529L04Q47N82j966
$$ 1225 2382 -26 275 1287 1867 -573 547 1487 352 -639 238 1743 -786 -482 365 947 -1019
3340a019j82K126j231o62r1J809j894j95J217n0q45j108K507r47r97k63J731j38
$$ -1019 -1201 925 -306 -968 -1059 750 -1144 -1339 -122 -172 -1017 -2125 382 -565 -1562 -1825 -94 -232
3358b32j970J713N52n36j949K193M70j565j50J463O25k644J876O26n78j376J646
$$ -232 -2202 -489 63 -473 -2422 -229 241 -1324 -1474 -11 614 -2030 -154 472 -106 -1482 164
3375A64J127k289O18Q18J101k545J233J502j282p69N22J982k262K89J023K99j312
$$ 164 1291 -998 -380 438 1539 -1006 227 1729 447 -322 200 2182 -80 209 1232 1531 219
3392B19k83J973j005m88k94J851j114j071J415J47m92j367K106q36p57k25J514
$$ 219 -64 1909 904 416 122 1973 859 -212 1203 1350 858 -509 1597 761 4 -221 1293
3409A293m78k323J867K79n90j446J565M25j543J13Q60N81k611J732L86m28j517
$$ 1293 815 -1508 359 638 48 -1398 167 592 -951 -838 22 603 -2008 -276 110 -318 -1835
3426a835R90J515k263M34M70P70j868N15J521j031o79K36J904j854m6J105K92
$$ -1835 -845 670 -1593 -1159 -689 81 -1787 -1272 249 -782 -1461 -1225 679 -1175 -1221 -116 176
3443A76n68j096J956m94p80J61J750q29j150J254O32m75j622K352k16j214O0J504
$$ 176 -392 -1488 468 -26 -806 -645 1105 276 -874 380 1012 537 -1085 1267 1051 -163 -103 1401
3461A401j3k228J557P57m05j550J611P57j907K41R37N99j961P26R63p22j070O59
$$ 1401 1388 -840 717 1474 1069 -481 1130 1887 -20 221 1158 1757 -204 522 1485 763 -307 352
3479C52J209j797J53N55O54j577J86J197r32l68k23J491j437l33J94J063r92j174
$$ 352 1561 -236 -83 472 1126 -451 -265 932 0 -368 -591 900 -537 -870 -676 387 -605 -1779
3497a779J931m87p21k38J451l64j593J273P66p20j772K234Q6j342J84J033K48
$$ -1779 152 -335 -1056 -1294 157 -207 -1800 -527 239 -481 -2253 -19 67 -1275 -1091 -58 190
3514A90k188J133R28k09j384J087J330j670J37P05Q98j658L76J081n26m43J01
$$ 190 -1998 -865 63 -146 -1530 -443 887 -783 -646 59 957 -701 -325 756 230 -213 -112
3531a12J607j441N3J32J365j105q16J731m34p74n09K051q23j072O88J130j002
$$ -112 1495 54 107 239 1604 499 -317 1414 980 206 -303 1748 925 -147 541 1671 669
3548F69j384K004l6j083l52J441l05j687J188M26k34j576J264O15j513J6N90O56
$$ 669 -715 1289 1253 170 -182 1259 954 -733 455 881 647 -929 335 950 -563 -547 43 699
3566F99j903J161K15m44j041J068Q94j687J53KJ201j667J77J136m51q50l9J671
$$ 699 -1204 -43 172 -272 -1313 -245 649 -1038 -885 -883 318 -1349 -1172 -36 -487 -1337 -1376 295
3584B95j185n32N93J160r96j061J996l75o51m66J784o03j261J161Q07o27j171
$$ 295 -890 -1422 -829 331 -665 -1726 270 -105 -756 -1222 562 -41 -1302 -141 666 39 -1132
3601a132K017r8j013k63J626r9j815J459L56j70j465J570N69j381M5N98Q45j602
$$ -1132 885 787 -226 -489 1137 1038 -777 682 1038 868 -597 973 1542 161 206 804 1649 47
3619D7L28N56K51j112PJ587j276k83J57J114j163p08J597l12r80m77J773r08j008
$$ 47 375 931 1182 70 77 1664 388 105 262 1376 213 -495 1102 790 -190 -667 1106 198 -810
3638h10P24J020j020j358J983n51n29q43J638l73j408J078M08j17j588J540J12
$$ -810 -86 934 -86 -1444 539 -12 -541 -1384 254 -119 -1527 -449 -41 -158 -1746 -206 -94
3655i4q86m26J005N84j583N59M30K37j067N01J093j164Q0O6J280j554K31J141
$$ -94 -980 -1406 -401 183 -1400 -841 -411 -174 -1241 -740 353 -811 -731 -665 615 -939 -708 433
3673D33O1j204K54J387j072k26M4J583j027p67J478q9p01m20J725n72p99M50Q79
$$ 433 494 -710 -456 931 -141 -367 -323 1260 233 -534 944 855 154 -266 1459 887 88 538 1417
3692A417p31j119J384L97q50o33J139K90j526P22L17J44j678J663Np59m65L89
$$ 1417 686 -433 951 1348 498 -135 1004 1294 -232 490 807 951 -727 936 941 182 -283 106
3710A06P24j395P1O59L62j351J83J241o56q43K87J338j749J1R85rj137j39J892
$$ 106 830 -565 -494 165 527 -824 -641 600 -56 -899 -612 726 -1023 -1012 -27 -36 -1173 -1312 580
3729E80j016o96J57J198o32q74J266j73p22l72J521m76r64O05P69r0j220J167
$$ 580 -436 -1132 -975 223 -409 -1283 -17 -190 -912 -1284 237 -239 -1203 -598 171 81 -1139 28
3747B8j23J58n45Q13N06j694Q41M61M18j249P04Q24o07l93L77J053j557J16R34
$$ 28 -95 63 -482 331 837 -857 -16 445 863 -386 318 1142 535 142 519 1572 15 131 1065
3766A065l4r43j37J695j271m31L73J140j246l37J122j58o44m50J527o91j127O89
$$ 1065 1031 88 -49 1646 375 -56 317 1457 211 -126 996 838 194 -256 1271 580 -547 142
3784A42O69o70r32J494j81q74l63J101l67j225P17L85J93j548J230J66k11p31
$$ 142 811 141 -791 703 522 -352 -715 386 19 -1206 -489 -104 89 -1459 -229 -63 -274 -1005
3802a005P21O56j633N46M93M00j429N56J160j057j93J13J228j384K07O84nq23
$$ -1005 -284 372 -1261 -715 -222 178 -1251 -695 465 -592 -785 -672 556 -828 -621 63 58 -765
3820g65K7J426r21l33L05R22o14r27J219M8m28k98J291k81o47L24O33k09j214
$$ -765 -738 688 -233 -566 -261 661 47 -880 339 387 -41 -339 952 671 24 348 981 772 -442
3839d42J333j62q6p55O62Q09j318J55L79M74j586R39P32o44o93N21R56j360p9
$$ -442 891 729 643 -112 550 1359 41 196 575 1049 -537 402 1134 490 -203 318 1274 -86 -165
3858a65O13L80j289K14J007p71m61J66J111j163m30Q94K57r60o21J595p20m54
$$ -165 448 828 -461 -247 760 -11 -472 -306 805 -358 -788 106 363 -597 -1218 377 -343 -797
3876g97J66O34n34p30J112M3l87j017J544j41r27M28M92p9q95J067J40k85p67
$$ -797 -631 3 -531 -1261 -149 -106 -493 -1510 34 -107 -1034 -606 -114 -193 -1088 -21 119 -166 -933
3895i33Q55N92r68J14K86Q02j355N54O61l32m17K27J264j424m5P16O16j220j24
$$ -933 -78 514 -454 -340 -54 748 -607 -53 608 276 -141 86 1350 -74 -119 597 1213 -7 -131
3914a31J581q93m67K87J108j170m55J032m0l84n58J259l48n09k17O65k65p45O02
$$ -131 1450 557 90 377 1485 315 -140 892 852 468 -90 1169 821 312 95 760 495 -250 352
3933C52J38R5j125R86j50p74J26L29K62j214O39M98k18j139O84P77j169j54O83
$$ 352 490 585 -540 446 296 -478 -352 -23 239 -975 -336 162 -56 -1195 -511 266 -903 -1057 -374
3952c74N90j079J69Q76p38k69J82J206j412r4P56Q6o05j35J055l87j73p1Q69m46
$$ -374 216 -863 -694 182 -556 -825 -643 563 -849 -943 -187 -101 -706 -841 214 -173 -346 -417 452 6
3972Fo86Q94p0J51r08J259l77o33M55N88L4j214R02L33l48m59P33M30r33J77M94
$$ 6 -680 214 144 295 -613 646 269 -364 91 679 713 -501 401 734 386 -73 660 1090 157 334 828
3993H28K56j261O56L69l07k73m3Q93j262J17N35L13j099j31J148l91n25pR73q22
$$ 828 1084 -177 479 848 541 268 225 1118 -144 -27 508 821 -278 -409 739 348 -177 -184 789 -33
4013c3o41P77J57m51n75J166n61l86m7P35j47j098J037j65o4n27P93j14l40m24
$$ -33 -674 103 260 -191 -766 400 -161 -547 -594 141 -6 -1104 -67 -232 -296 -823 -30 -144 -484 -908
4033i08O34J66j167J058qL18j203Q75N41r79J79L84P11j211J47O69K3p69L51J211
$$ -908 -274 -108 -1275 -217 -225 93 -1110 -235 306 -673 -494 -110 601 -610 -463 206 229 -540 -189 1022
4053A022j184M4L98M58o57l74J026j42k60m39J035n89m53O08K41j34r78J164m
$$ 1022 -162 -118 280 738 81 -293 733 591 331 -108 927 338 -115 493 734 600 -378 786 782
4072G82m94l14P19j33p19N69P8O2r36Q40N21j035J02K13M86j461O06M55k21r54
$$ 782 288 -26 693 560 -159 410 488 550 -386 454 975 -60 42 255 741 -720 -114 341 120 -834
4092h34O00P91j159L18J48M79j238J77P42l93j85l60J181o26l05j59R27m56n41
$$ -834 -234 557 -602 -284 -136 343 -895 -718 24 -369 -554 -914 267 -359 -664 -823 104 -352 -893
4111h93J044l35l73k68J187m74o02N44K10j38n62J177l24m19L7M49L0o95P66J76
$$ -893 151 -184 -557 -825 362 -112 -714 -170 40 -98 -660 517 193 -226 -189 260 290 -405 361 537
4131E37q2n52L72L80m95j55M44M70j089M34N43k60m88L40O35r61P0K38N76q87
$$ 537 455 -97 275 655 160 5 449 919 -170 264 807 547 59 399 1034 73 143 381 957 70
4151G0q0O26k53k58j65Q19o73m10L09N50l25q77J035j02m71j73N96Q3j066K36
$$ 70 -10 616 363 105 -60 759 86 -324 -15 535 210 -667 368 266 -205 -378 218 301 -765 -529
4171e29M90Q8j230J028J63m44k06R1O72r58M58K71m6q08N30P81r20K48k5M79q83
$$ -529 -39 49 -1181 -153 10 -434 -640 -549 123 -835 -377 -106 -152 -960 -430 351 -569 -321 -346 133 -750
4192g50O67J85L0m13j37P70n05j00J61O84p04l32J040l78m2r2O28l43m63J81O26
$$ -750 -83 102 132 -281 -418 352 -153 -253 -92 592 -112 -444 596 218 176 84 712 369 -94 87 713
4213G13r1q56Q44J9k89k66P11k24p96N60J18K28p14M86K56l01n21K61P00j243
$$ 713 622 -234 610 629 340 74 785 561 -235 325 443 671 -43 443 699 398 -123 138 838 -405
4233d05M83K98k99l49L05O08p78k33L25L27p88l5N01J25m06m31Q41l51l34J13
$$ -405 78 376 77 -272 33 641 -137 -370 -45 282 -506 -541 -40 85 -321 -752 89 -262 -596 -483
4253d83N23l24n55Q07J41m73m25Q01j75n81M38L93j2p69P46Rl85j83Q03P9q85
$$ -483 40 -284 -839 -32 109 -364 -789 12 -163 -744 -306 87 75 -694 52 61 -324 -507 296 375 -510
4274e10N45K91J38r79P04J79j23o2R0L11p84M19K11N7o93K46O36n97oJ72N49n76
$$ -510 35 326 464 -515 189 368 245 183 273 584 -200 219 430 487 -206 40 676 79 73 245 794 218
4296B18k54P26l00j34j66P66p00l11J72L69j05n32Q17k59m21n47J144j53o07L28
$$ 218 -36 690 390 256 90 856 156 -155 17 386 281 -251 566 307 -114 -661 483 330 -277 51
4316E1K72M6r73L79P2n8j42j18L77r97P19K17M18p26j9N26j63k21J01L01p62N6
$$ 51 323 369 -604 -225 -153 -211 -353 -471 -94 -1091 -372 -155 263 -463 -482 44 -119 -340 -239 62 -700 -644
4338f44O63L7n19p4Q50m85j42K61O5k01n97J120l71j11M16J52m28l19M62K99k71
$$ -644 19 56 -463 -537 313 -172 -314 -53 12 -189 -786 334 -37 -148 268 420 -8 -327 135 434 163
4359A63k20N18k79K87o02L77O11r42l20J051j53p78N68J11J78n53M3Q22j254P37
$$ 163 -57 461 182 469 -133 244 855 -87 -407 644 491 -287 281 392 570 17 60 882 -372 365
4379C65j13J26q47O46J80n11L91o67J186r11L73q23R24q2o41J219n10k37l99M48
$$ 365 252 378 -469 177 357 -154 237 -430 756 -155 218 -605 319 237 -404 815 305 68 -331 117
4399A17q9m77pP57j122P04O15l05J30j197J016l71m03N36M94j59j465J546k5r28
$$ 117 28 -449 -456 301 -821 -117 498 193 323 -874 142 -229 -632 -96 398 239 -1226 320 295 -633
4419f33P69j15j43k77O55o00j66K04O88O3p21L9M05L05n72j75P39o51K88r64P47
$$ -633 136 21 -122 -399 256 -344 -510 -306 382 445 -276 -237 168 473 -99 -274 465 -186 102 -862 -115
4440a15L58k07N91K20p85j060J796j88m27M2N83J57j174O78L93q08K2o4Q48p45
$$ -115 243 36 627 847 62 -998 798 610 183 225 808 965 -209 469 862 54 76 12 860 115
4460A15l91M35Q21j492L42O48j443J351n31P71n58m72N7R78j302O88J36n61r1
$$ 115 -276 159 980 -512 -170 478 -965 386 -145 626 68 -404 -347 631 -671 17 153 -408 -499
4479d99L41M44q78K77k81P07l69k95P96p88L15R2J89j31m59P65K09q54j34Q83
$$ -499 -158 286 -592 -315 -596 111 -258 -553 243 -545 -230 -138 51 -80 -539 226 435 -419 -553 330
4499C30n0m85PO51k72m72L87Q8J64l89L11J43j48j78J1L62m72J84L11k1l01j25
$$ 330 280 -205 -198 453 181 -291 96 184 348 -41 270 413 265 87 98 460 -12 172 483 462 161 36
4521C6P45n56j42rO21o60n5M20k41l86K52N52l58k60N8K18q8m17N08k72l43J53
$$ 36 781 225 83 74 695 35 -20 400 159 -227 25 577 219 -41 17 235 147 -270 238 -34 -377 -224
4543b24L68J04p74L97K75k67n23N50K23n26J00P0J96m62J81K34j6l69J66L37m04
$$ -224 144 248 -526 -129 146 -121 -644 -94 129 -397 -297 -227 -31 -493 -312 -78 -94 -463 -297 40 -364
4564c64J79J4K67o15L08L58l3l87J20N33m53j24J88M32p62R3N15k15J0l10P52
$$ -364 -185 -171 96 -519 -211 147 114 -273 -153 380 -73 -197 -9 423 -339 -246 269 54 64 -246 506
4585E06l48l46M17L28l86o6N10l51m4j07L05k67k01M12Qj22m11N49m5k44J42M3
$$ 506 158 -188 229 557 171 105 615 264 220 113 418 151 -50 362 370 248 -163 386 341 97 239 282
4607B82K50p45L05N3J35m16J17K01k27j74K62L93o69p7N23m14k48K0M47k01m81
$$ 282 532 -213 92 145 280 -136 -19 182 -45 -219 43 436 -233 -310 213 -201 -449 -429 18 -183 -664
4628f64K97N97m82l79O46p0l09j61P66l40n01M87K02J5o37N58L1k48l8K15J22
$$ -664 -367 230 -252 -631 15 -55 -364 -525 241 -99 -600 -113 89 104 -533 25 56 -192 -230 -15 107
4649A07m21K82J51p4j83K59M9j80mK78K65o33K11K00o5K2j87M97m91r9J10M86
$$ 107 -314 -32 119 45 -138 121 170 -10 -14 264 529 -104 107 307 242 264 77 574 83 -16 94 580
4671E80o05J72K51o6l18j76N12j61j92L69O3k64k32K96K18k64l00K50J68o13M21
$$ 580 -25 147 398 332 14 -162 350 189 -3 366 429 165 -67 229 447 183 -117 133 301 -312 109
4692A09J23J64r23M08N2l74J24K7K56l47O4K36L6o18K19L19l40j33L85L66k83
$$ 109 232 396 -527 -119 -67 -441 -317 -290 -34 -381 -317 -81 -45 -663 -444 -125 -465 -598 -213 153 -130
4713a30r9K26l5j94l8K93j00k08K97K55l68k31N23j43P7m00Q12m95j06J57K52
$$ -130 -229 -3 -38 -232 -270 23 -77 -285 12 267 -101 -332 191 48 125 -275 537 42 -64 93 345
4734C45k12k75L64Q2j45j77L70R1n66K26K23o4l42L79K88o11k4J88L37m82J31
$$ 345 133 -142 222 304 159 -18 352 443 -123 103 326 262 -80 299 587 -24 -48 140 477 -5 126
4755A26o4J92m04K58J09j81j20p8L40j39j14K53j14j08l20P33n94k1P4L08M3q18
$$ 126 62 254 -150 108 217 36 -84 -162 178 39 -75 178 64 -44 -364 369 -225 -246 -172 136 179 -639
4777f39M86ml0l06L02j43o4K36J06n9n33O23J80k50p2J47J89o55K79J17L67m98
$$ -639 -153 -157 -187 -493 -191 -334 -398 -162 -56 -115 -648 -25 155 -95 -167 -20 169 -486 -207 -90 277 -221
4799b21J22J98j88k91L99L97n68K35L36J77p34K15L70j47j41J8K77l37j29K80
$$ -221 -99 99 -89 -380 19 416 -152 83 419 596 -138 77 447 300 159 177 454 117 -12 268
4819B68k28L6j52N56k52k01J90K17m7o67N85j80Q6j56J73Kl14K83O1om03J40N2
$$ 268 40 76 -76 480 228 27 217 434 387 -280 305 125 211 55 228 230 -84 199 260 254 -149 -9 43
4842D3k09p3n1L07k19j75K98N8m20O8N51l65j0k87P54o90LL40j16J0j7L71m06
$$ 43 -166 -239 -290 17 -202 -377 -79 -21 -441 -373 178 -187 -197 -484 270 -420 -417 -77 -193 -183 -200 171 -235
4865b35j2lL60j85j32K47K18m45k80M38m8k54L24K12ok32L24M0m6m07L61K77m04
$$ -235 -247 -250 110 -75 -207 40 258 -187 -467 -29 -77 -331 -7 205 199 -33 291 331 285 -122 239 516 112
4888A12PJ40ol09J67O9j60N7Q6N10r83N96j00J25m22j20N39ok31m4L14m99k9M84
$$ 112 119 259 253 -56 111 180 20 77 163 673 -310 286 186 311 -111 -231 308 302 71 27 341 -158 -187 297
4912B97k09k2m22O60l92R8j64K25j77j75O3N6q8K8L30l2j27q3MK6k37K28J93j09
$$ 297 88 66 -356 304 -88 10 -154 71 -106 -281 -218 -162 -250 -222 108 76 -51 -134 -130 -104 -341 -113 80 -29
4936b9k02J22K30l73P2o6K84n02K00M55l35J71o8L20l54m2K05R0k89n7N13k74
$$ -29 -231 -109 121 -252 -180 -246 38 -464 -264 191 -144 27 -41 279 -75 -117 88 178 -111 -168 345 71
4958G1l4k04K00K1o0K26J2J10j65J70k35J41k85M07j75l68N58k48o5r5L49k5k25
$$ 71 37 -167 33 54 -6 220 232 342 177 347 112 253 -32 375 200 -168 390 142 77 -18 331 306 81
4981H1j84K86j7l86K01K60l77j4R0J93k42J67j32K47m46K19K08k93K3j51N37m47
$$ 81 -103 183 166 -220 -19 241 -136 -150 -60 133 -109 58 -74 173 -273 -54 154 -139 -116 -267 270 -177
5003a77L2o7L52m40j18N44k20J06p6j35K25m06J79J22j86m8L18J17m11J17j72
$$ -177 -145 -212 140 -300 -418 126 -94 12 -64 -199 26 -380 -201 -79 -265 -313 5 122 -289 -172 -344
5024c44M88m18M6R9K90m23M03nk43K4kJ88j65K89k4K3J51k45J99j03k18P8J85
$$ -344 144 -274 -228 -129 161 -262 141 136 -107 -83 -85 103 -62 227 203 226 377 132 331 228 10 88 273
5047B73o4j60J20PQ8k50L20k53k03J80K65j46n41N37l63J90j19K78J03m42J88
$$ 273 209 49 169 176 264 14 334 81 -122 58 323 177 -364 173 -190 0 -119 159 262 -180 8
5068HJ27j05k43L03k10j08J99K1J85l48J57R5j68k18o7N38m64M3K38j64j89K34
$$ 8 135 30 -213 90 -120 -228 -29 -8 177 -171 -14 81 -87 -305 -372 166 -298 -255 -17 -181 -370 -136
5090a36J50j91K68j97j2J8Mr0M1K21j59J39N1k50n1K08M0j39J35O1k2k84M28k1
$$ -136 14 -177 91 -106 -118 -100 -96 -186 -145 76 -83 56 107 -143 -194 14 54 -85 50 111 89 -195 233 212
5114B12L1j00J49mn65M63J0o9k12L34J25j84l0K46j09k54j06K38J47l74J1L94
$$ 212 243 143 292 288 -277 186 196 127 -85 249 374 190 160 406 297 43 -63 175 322 -52 -41 353
5136C53m44L9m1L25j43l90M47j32n3k80L08L8j38L6J10j75J68J12l42Rk74L70
$$ 353 -91 -52 -93 232 89 -301 146 14 -39 -319 -11 27 -111 -75 35 -140 28 140 -202 -193 -467 -97
5158i7P0j06K7K4j42JJ37l9j88J09K69nj43j31Q1K42k27J46Nj08K00Q9Q6m60Q9
$$ -97 -27 -133 -106 -82 -224 -223 -86 -125 -313 -204 65 60 -83 -214 -133 109 -118 28 33 -75 125 214 300 -160 -71
5183g1J18J00l82J79K50r3K36k94N8j50J54J6k29L15k18K02rl09K95J99j69j72
$$ -71 47 147 -235 -56 194 101 337 43 101 -49 105 121 -108 207 -11 191 182 -127 168 367 198 26
5205B6J7K22r5m24K84K57l03R2j1M0k24J87n9k08JL77L4l35J86j60O2l7l2m5n
$$ 26 43 265 170 -254 30 287 -16 76 65 105 -119 68 9 -199 -198 179 213 -122 64 -96 -34 -71 -103 -148 -153
5230a53q3J8L46k32q9J91J26Km27P7j4J96j26K28j23k53N7n6M99p20Q80n02L70
$$ -153 -236 -218 128 -104 -193 -2 124 126 -301 -224 -238 -42 -168 60 -63 -316 -259 -315 184 -536 344 -158 212
5253B12J2J63k88k46ql86L68J11K33rk24J21j26P3J28n9L58l65J85j26K32m89
$$ 212 224 387 99 -147 -155 -541 -173 -62 171 162 -62 59 -67 6 134 75 433 68 253 127 359 -130
5275a30K27K4J45J11k25O2k59K38l43N66l52k7K46k24j58M4M4P0k01J46j83R5
$$ -130 97 121 266 377 152 214 -45 193 -150 416 64 37 283 59 -99 -55 -11 59 -142 4 -179 -84
5297h4j82l5J06O0k29L14K38o71L54o8J95j68J30J46j37k87J69L69m11K62j81
$$ -84 -266 -301 -195 -135 -364 -50 188 -483 -129 -197 -2 -170 -40 106 -31 -318 -149 220 -191 71 -110
5318a10K36n30M17J17k16Kj51M81m40K52n3P6k54J16L14n2j73J38J38k63J5q1
$$ -110 126 -404 13 130 -86 -84 -235 246 -194 58 5 81 -173 -57 257 205 32 170 308 45 60 -21
5340b1K04k46m3J37j44K75M2M5p5j19qJ52O2k59p2K98m8p9M4j17l1m3J29Q1j63
$$ -21 183 -63 -106 31 -113 162 204 249 174 55 47 199 261 2 -70 228 180 101 145 28 -3 -46 83 164 1
5365Ap6K95k98K01Q0j13k71l4L07J7l54K27J35j94l61K86J05o7j36L71j03k29
$$ 1 -75 220 -78 123 203 90 -181 -215 92 109 -245 -18 117 -77 -438 -152 -47 -114 -250 121 18 -211
5387b11J13J67k66o9L14J09k61Q3Q5n4k25J30j8K03k92K01K14j09m42K06K50k52
$$ -211 -98 69 -197 -266 48 157 -104 -21 64 10 -215 -85 -103 100 -192 9 223 114 -328 -122 128 -124
5409a24P4o1K66k71J87m0l7m7K46L0k47J52n7n8J46m61M17p7Q3j90K53m0j20j
$$ -124 -50 -111 155 -116 71 31 -6 -53 193 223 -24 128 71 13 159 -302 115 38 121 -69 184 144 24 23
5433B3M4k6KJ9j11J09l22L35o2K6r7L10k13l54J57M38k55k43J99J97m54J38N8
$$ 23 67 41 43 62 -49 60 -262 73 11 37 -60 250 37 -317 -160 278 23 -220 -21 176 -278 -140 -82
5456h2m5o7K00K49k49j31J25L4k09L3J01O7%k50K93k07r0J13n5P5j46L56k60N8
$$ -82 -127 -194 6 255 6 -125 0 34 -175 -142 -41 26 26 -224 69 -138 -228 -115 -170 -95 -241 115 -145 -87
5480h7K83j33K8K6j83L88m09N9J00l6N3o8p0J41j19Q7K45k21j12k9K44j84J49
$$ -87 196 63 91 117 -66 322 -87 -28 72 36 89 21 -49 92 -27 60 305 84 -28 -57 187 3 152
5503A52j09J47j30O3J41j2l39J8J15M2n5L17l54P5l67J11K86k32J28p0J54j79
$$ 152 43 190 60 123 264 252 -87 -69 46 88 33 350 -4 71 -296 -185 101 -131 -3 -73 81 -98
5525i8rJ40j8j95q8L85k92J01J72j7j53J04o2k0r2n0K27k67K10n6Q3p2Q7M7k56
$$ -98 -107 33 15 -180 -268 117 -175 -74 98 81 -72 32 -30 -50 -142 -192 35 -232 -22 -78 5 -67 20 67 -189
5550a89L00J6O9k14L4K5l8oKK75k59M8j44M6L30m91K22O2L1j27J81j98J23LJ11
$$ -189 111 127 196 -18 16 41 3 -3 -1 274 15 63 -81 -35 295 -196 26 88 119 -8 173 -25 98 101 212
5575B12k96Q4K73j48k16r2J25L58l42N%J40j00p6K22O5j36M7j11l8k43J51J36
$$ 212 -84 0 273 125 -91 -183 -58 300 -42 -37 -37 103 3 -73 149 214 78 125 14 -24 -267 -116 20
5598B0j96J63rJ23j90N7Q9j83N2p7K03m24L33PR4j36j82J61pO7L6J99k50j37J93
$$ 20 -176 -13 -22 101 -89 -32 57 -126 -74 -151 52 -372 -39 -32 62 -74 -256 -95 -102 -35 1 200 -50 -187 6
5623Fm5k7L1pl7l15M84l5N3o0k46J49ml5R6J82k57L8O7J51p9J72j70j59J07k9
$$ 6 -39 -66 -35 -42 -79 -394 90 55 108 48 -198 -49 -53 -88 8 190 -67 -29 38 189 110 282 112 -47 60 31
5649C1qK0j1j2K87l29n4J42M8J32k41O7j00l36K94R9M2j15J88n7j55P8J42j09
$$ 31 23 43 32 20 307 -22 -76 66 114 246 5 72 -28 -364 -70 29 71 -44 144 87 -68 10 152 43
5673D3k18Q1R9j27O5K49j50n2n8j89L84k84O8J8N1j09J15j28n1r7J40K30m08L01
$$ 43 -175 -94 5 -122 -57 192 42 -10 -68 -257 127 -157 -89 -71 -20 -129 -14 -142 -193 -290 -150 80 -328 -27
5697b7nK17k68J2J39p0R6k54L90j72j85K39l21R6L8J98jj13J38r3lo0O1J36J47
$$ -27 -32 185 -83 -71 68 -2 94 -160 230 58 -127 112 -209 -113 -75 123 122 9 147 54 51 -9 52 188 335
5722C35k91n3K19n46M29q9N4K29k11NO7j44Q6K02R8l91J49k35J35k91L23j21Q2
$$ 335 44 -9 210 -336 93 4 58 287 76 81 148 4 90 292 390 -1 148 -87 48 -243 80 -41 41
5745D1j19K15j0k06P4j56n4Q8K07j14P7J15p5q5L9K10l52K01o5j45L19m26K13
$$ 41 -78 137 127 -79 -5 -161 -215 -127 80 -34 43 158 83 -2 37 247 -105 96 31 -114 205 -221 -8
5768hJ18j29k69J96O8k82P4J83Q8j69Q8NJ55l33k2O09l36l0%Oq3M8nK4j82k5J11
$$ -8 110 -19 -288 -92 -24 -306 -232 -49 39 -130 -42 -37 118 -215 -237 372 36 6 6 12 -71 -23 -28 -4 -186 -211 -100
5795a00k80L77j06J51L1k84K89J22n77L12Q6M2Q2K3o2M5m6r1M1k02K73Q3N5j87
$$ -100 -380 -3 -109 42 73 -211 78 200 -377 -65 21 63 145 168 106 151 105 14 55 -147 126 209 264 77
5819G7j16KJ94l4r2j5j49n1K55L2j30l0N8Q2r8O0Lj27j63K40J7K04m41J54L4K42
$$ 77 -39 -37 157 123 31 16 -133 -184 71 103 -27 -57 1 83 -15 45 48 -79 -242 -2 15 219 -222 -68 -34 208
5845B08k70K36k61N7j04j8m4J05J92j01p8J96p9M8P4k20J87J05l27J04K39m23
$$ 208 -62 174 -87 -30 -134 -152 -196 -91 101 0 -78 118 39 87 161 -59 128 233 -94 10 249 -174
5867a74L96l99L06j71J41P4j77N3k00J88r9M8J40r3m9M5K02p9o4J8j08M1k36j1
$$ -174 222 -177 129 -42 99 173 -4 49 -151 37 -62 -14 126 33 -16 29 231 152 88 106 -2 39 -197 -208
5891b08K74j75km8K43Q8J42k90r4N7J41j81r3L54o4o7l49R0Q2O5j51L97k42K37
$$ -208 66 -109 -111 -159 84 172 314 24 -70 -13 128 -53 -146 208 144 77 -272 -182 -100 -35 -186 211 -31 206
5915B06l00K7L10o15K55N9J56j61l5J89j33j14k60N18l4k53K89r5k42J49L3J64
$$ 206 -94 -67 243 -372 -117 -58 98 -63 -98 91 -42 -156 -416 102 68 -185 104 9 -233 -84 -51 113
5937A13l42K05l2L5k6O6n8J46l40M57k49k62J38R5L09l55j08J80J62k87L98m8
$$ 113 -229 -24 -56 -21 -47 19 -39 107 -233 224 -25 -287 -149 -54 255 -100 -208 -28 134 -153 245 197
5959A97o9j27K28r1n3j74K3L64k53O2l45L09J19J3jk06M0K5l2N6r1%K3m1K01q4
$$ 197 128 1 229 138 85 -89 -66 298 45 107 -238 71 190 203 202 -4 36 61 29 85 -6 -6 17 -24 177 93
5985I3Q1j68p4L54l63Q3QJ02m7o7n4q2j44K45N1J50k08M7J01q6j05j34K90j67
$$ 93 174 6 -68 286 -77 6 14 116 69 2 -52 -134 -278 -33 18 168 -40 7 108 22 -83 -217 73 -94
6009i4L25j65O3j97k08K76j48M0J08J24l8k47L70l1l20L7K63rk92J62k29J54J13
$$ -94 231 66 129 -68 -276 0 -148 -108 0 124 86 -161 209 178 -142 -105 158 149 -143 19 -210 -56 57
6032E7r0J21j8M4M4J30j59j54L59k10O6k20j39K52k75M29ok74R3k2K8K5j73J53
$$ 57 -33 88 70 114 158 288 129 -25 334 124 190 -30 -169 83 -192 237 231 -43 50 28 56 81 -92 61
6056F1j2j59o6K09j02J87q5j90L32l07L50j30k69KK63j07n2J0L4J00p2J50k04
$$ 61 49 -110 -176 33 -69 118 33 -157 175 -132 218 88 -181 -179 84 -23 -75 -65 -31 69 -3 147 -57
6079e7L5j92K26j1l1L4J74k14J90j80J30k21j58K59K5o3J70J51k29k93J29O5N1
$$ -57 -22 -214 12 1 -30 4 178 -36 154 -26 104 -117 -275 -16 9 -54 116 267 38 -255 -126 -61 -10
6102a0o6KL1K45l1p1J77n66L83k63J51m4J61j19K91k60%J51M2J09l46Q1Q0j03
$$ -10 -76 -74 -43 202 171 100 277 -289 94 -169 -18 -62 99 -20 271 11 11 162 204 313 -33 48 128 25
6126B5O1j78K91l46L43j34k01K41j0k42P4L1k7J0r7J72J30j58K25m13J41k66K91
$$ 25 86 -92 199 -147 196 62 -139 102 92 -150 -76 -45 -72 -62 -159 13 143 -15 210 -203 -62 -328 -37
6149c7j33J51J07j65pj23J36j02J72l09K53J84l10J05K75j05r5j37L77k31l8J90
$$ -37 -170 -19 88 -77 -84 -207 -71 -173 -1 -310 -57 127 -183 -78 197 92 -3 -140 237 6 -32 158
6171A58j22K08j66p0Q6n0Q2J19k00P9Qj05m9q7M4K85n47N06k59J50q2L2J22m12
$$ 158 36 244 78 8 94 44 126 245 45 124 132 27 -22 -109 -65 220 -327 179 -80 70 -12 20 142 -270
6195b70K14N5K12j13o0k31K90k59L26j94J56j37R7%J88m9j28m0o3J22k84J61N4
$$ -270 -56 -1 211 98 38 -193 97 -162 164 -30 126 -11 86 86 274 225 97 57 -6 116 -168 -7 47
6218D7j54q2R6P1k21J21J05j27L4p4J65j6J64j30k66K10K05j34k45j4L84K79p90
$$ 47 -107 -189 -93 -22 -243 -122 -17 -144 -110 -184 -19 -35 129 -1 -267 -57 148 14 -231 -245 139 418 -372
6241c72Q53n39K19o6L0m4n3l5l05K22k43Q32K5l45J72n08O8l45N38J88k60j92
$$ -372 481 -58 161 95 125 81 28 -7 -312 -90 -333 499 524 179 351 -157 -89 -434 104 292 32 -160
6263a60K29J83k10k4m6J85j62N6M2k34J29NJ04j79K29l99K95m5r0M25l54M1m3
$$ -160 69 252 42 18 -28 157 -5 51 93 -141 -12 -7 97 -82 147 -252 43 -2 -92 333 -21 20 -23
6286b3n1p1j13K37K4o9L68k1o09K88l7K70q1j71j07M45l68KK37j87M9l11L20m28
$$ -23 -74 -145 -258 -21 3 -66 302 281 -328 -40 -77 193 112 -59 -166 279 -89 -87 150 -37 12 -299 21 -407
6310d07L35J05l9J20j30J67l30K74j67M4N1n0M3K66k81j3L19k12q6o1K5Q9J44
$$ -407 -72 33 -6 114 -16 151 -179 95 -72 -28 23 -27 16 282 1 -12 307 95 9 -52 -27 62 206
6333B06j95K04M0l77J75K6j46K90J05l68q2P9J06q6O7rm5m6M1J78l17J4N0J15
$$ 206 11 215 255 -122 53 79 -67 223 328 -40 -122 -43 63 -23 44 35 -10 -56 -15 163 -154 -140 -90 25
6357B5J08j92O0R0J09l13P4R9l2l2j98L65l57J24R7P0k10J0J48p9o1K8Q6n5p9
$$ 25 133 -59 1 91 200 -113 -39 60 28 -4 -202 163 -194 -70 27 97 -113 -103 45 -34 -95 -67 19 -36 -115
6382a15K50m0j56O0j20J21J2pJ50k42M1j56J47R7l0J16j37J11j78R4R5k05K00
$$ -115 135 95 -61 -1 -121 0 12 5 155 -87 -46 -202 -55 42 12 128 -9 102 -76 18 113 -92 108
6405A08K5p4n6K14Q6j73l22L14J17l05j89K71j71L52j0Q1j0l76J29q4rn8K19O3
$$ 108 133 59 3 217 303 130 -192 122 239 -66 -255 16 -155 197 187 268 258 -118 11 -73 -82 -140 79 142
6429A42j03j5J75j10l41O8K85O7l89M39l91K10Pj56J63j03K46k46N0k36J35J82
$$ 142 39 24 199 89 -252 -184 101 168 -221 218 -173 37 44 -112 51 -52 194 -52 -2 -238 -103 79
6451G9k39J9j37L17j97N2o9O5J22j01J63P2o2j32q6N9J69k95K12K4j04q3J75j37
$$ 79 -160 -141 -278 39 -158 -106 -175 -110 12 -89 74 146 84 -48 -134 -75 94 -201 11 35 -69 -152 23 -114
6475a14K3mn6k2M41k69KRK14k17n1K17K03n58L22j66J46j36J85k02J22k22J70
$$ -114 -91 -95 -151 -173 268 -1 1 10 224 7 -44 173 376 -182 140 -26 120 -16 169 -33 89 -133 37
6498C7J35O9j95j0J01K0j78r5K84m5k70J15J39j39K5J17k2Np2j22J82m8l0j00
$$ 37 172 241 46 36 137 157 -21 -116 168 123 -147 -32 107 -32 -7 110 88 93 21 -101 81 33 3 -97
6522i7j10q3K69p4L68l02J01j71j34L06N5J55m46J19K01k02J4rk3r8J81J00O2
$$ -97 -207 -290 -21 -95 273 -29 72 -99 -233 73 128 283 -163 -44 157 -45 -31 -40 -63 -161 20 120 182
6545A82j16j53J49J67p2j91l6j13j38N75m03M22k54o4K67n7j69J37j56m3K18O3
$$ 182 66 -87 62 229 157 -34 -70 -183 -321 254 -149 273 19 -45 222 165 -4 133 -23 -66 152 215
6567B15j80J01p9J59p3k07J55o2j06K90j71j21M75k50j30m0M7k92K99j18kO7l9
$$ 215 35 136 57 216 143 -64 91 29 -77 213 42 -79 396 146 16 -24 23 -269 30 -88 -90 -23 -62
6590f2l5L96l23J52k15J67j89J20J15O4k31j05K65o9p0k68L18j70o2J93j80J94
$$ -62 -97 299 -24 128 -87 80 -109 11 126 190 -41 -146 119 50 -20 -288 30 -140 -202 -9 -189 5
6612EM3m9J66k08K3K78k89o6j4J22j46Q5J21P2nl17M11j97p2M1K11k95n4K34j70
$$ 5 48 -1 165 -43 -20 258 -31 -97 -111 11 -135 -50 71 143 138 -179 232 35 -37 4 215 -80 -134 100 -70
6637g0K26R5k10l4k9J23j35J1k13k9N53l95J69j25J89k23K08J71O2m81J1K16j30
$$ -70 156 251 41 7 -22 101 -34 -23 -236 -265 288 -107 62 -63 126 -97 111 282 344 -137 -126 90 -40
6660d0J29j35M6J15k64K31J11l41q6K37j25K94j47p9N3j32M19j77r0l9J43O4k63
$$ -40 89 -46 0 115 -149 82 193 -148 -234 3 -122 172 25 -54 -1 -133 286 109 19 -20 123 187 -76
6683g6N4J72k24l06N48j64J13k01j5n0J21r1N1J67m73N88k66o8L1K33k18J47O9
$$ -76 -22 150 -74 -380 168 4 117 -84 -99 -149 -28 -119 -68 99 -374 214 -52 -120 -89 144 -74 73 142
6706A42k31K5j33J98l9oL25j93q8J30k70L51j13j29j1L34k89R1J6n7k9q0L2q9
$$ 142 -89 -64 -197 1 -38 -44 281 88 0 130 -140 211 98 -31 -42 292 3 94 110 53 24 -56 -24 -113
6730a13J90j22M5J43p4K28k09k15j18N8J78Rq2r9K61L8j49k21L37k54R5j29R1
$$ -113 77 -45 0 143 69 297 88 -127 -245 -187 -9 0 -82 -181 80 118 -31 -252 85 -169 -74 -203 -112
6753a12k8m1L41k19o4MM4L3J62q2N6j79L9O0l3k11L87k12j06K4J30J73l75N3L09
$$ -112 -140 -181 160 -59 -123 -119 -75 -42 120 38 94 -85 -46 14 -19 -230 157 -55 -161 -137 -7 166 -209 -156 153
6778A53k62K45j32k42K14M0l4k20M1M72k47k75N6J19L30l06jJ30p3lrJ99lj36
$$ 153 -109 136 4 -238 -24 16 -18 -238 -197 275 28 -247 -191 -72 258 -48 -49 81 8 5 -4 195 192 56
6802E6J53q8j63j13K68K9j15r8K57j45N4l41M01n3Q4k57J60M9j32n0J26j89l53
$$ 56 209 121 -42 -155 113 142 27 -71 186 41 95 -246 155 102 186 -71 89 138 6 -44 82 -107 -460
6825d60M78k3k52J73j19J11j24K36o2j54J87J6K06l02K0N9N2k73j27M32Q9l77
$$ -460 18 -5 -257 -84 -203 -92 -216 20 -42 -196 -9 7 213 -89 -69 -10 42 -231 -358 74 163 -214
6847b14L93j16l1N5q5P9J00j43j5K8p3j59K51n7k08L20O3j22j29m4J75R5q5M7
$$ -214 179 63 32 87 2 81 181 38 23 51 -22 -181 70 13 -195 125 188 66 -63 -107 68 163 78 125
6871A25Q1k14j6N9p6J05j41n9K56k2k55K17k40K30n3J78k76jJ76J67m53L88k87
$$ 125 206 -8 -24 35 -41 64 -77 -136 120 98 -157 60 -180 50 -3 175 -101 -102 74 241 -212 176 -111
6894a11n9L75k64J69j43J81j76k80J73M2O5j11R6K36l93P5l7J68n0j58L1L38j33
$$ -111 -170 205 -59 110 -33 148 -28 -308 -135 -93 -28 -139 -43 193 -200 -125 -162 6 -44 -202 -171 167 34
6917C4pJ18j75o0j3K31j69j0O2j13pK11Q0j8j56j2j01K88k59r7J65P6j75k8L60
$$ 34 27 145 -30 -90 -103 128 -41 -51 11 -102 -109 102 182 164 8 -4 -105 183 -76 -173 -8 68 -107 -135 225
6942B25k54J14q4J00k40N6M23k30j32J83r2n2r7j29L54l51J38K50j94l8Q3Qj65
$$ 225 -29 85 1 101 -139 -83 340 110 -22 161 69 17 -80 -209 145 -206 -68 182 -12 -50 33 41 -124
6965a24o7lj9J38k72L26r4K29k36K86k07J45k90j84K31O5J05j03r5o1O4J7N5J08
$$ -124 -191 -194 -213 -75 -347 -21 -115 114 -122 164 -43 102 -188 -372 -141 -76 29 -74 -169 -230 -166 -149 -94 14
6989A4l3K54p9l22J54M8q2j39J99J66j09j31N0l5M9L3M6q5R1p7K73j61j03J17
$$ 14 -19 235 156 -166 -12 36 -46 -185 14 180 71 -60 -10 -45 4 37 83 -2 89 12 285 124 21 138
7013A38k50k3m8L09j87K79k65R5p1M7J18j22Q5j20L81m45J2J94j25j07j50K58
$$ 138 -112 -135 -183 126 -61 218 -47 48 -23 24 142 20 105 -15 366 -79 -67 127 2 -105 -255 3
7035Cl2J08j58K46j83j38J03L29m12M2K96j33k8l2O9j56j32J10J23R3r6K52j98
$$ 3 -29 79 -79 167 -16 -154 -51 278 -134 -92 204 71 43 11 80 -76 -208 -98 25 118 22 274 76
7058G6l48K95j66K7k7nK52r9N8O0j23J13j88N2J59l96J63L06l54K62j8j24k2j98
$$ 76 -272 23 -143 -116 -143 -148 104 5 63 123 0 113 -75 -23 136 -260 -97 209 -145 117 99 -25 -47 -245
7082b45L88j07k11n3N72n23L78k1J20j19k71M5M1P1l9j01K43k81J43J36p4j26
$$ -245 143 36 -175 -228 344 -179 199 178 298 179 -92 -47 -6 65 26 -75 168 -113 30 166 92 -34
7104c4J62r0r7K00n6J10r2o3mp5l6J70j86n0P3J2J12k65K95k07J42k05Q4k3P0
$$ -34 128 38 -59 141 85 195 103 40 36 -39 -75 95 -91 -141 -68 -56 56 -209 86 -121 21 -184 -100 -123 -53
7129e3k07J63MM0j64J37l3N4j29K08j47n9Q1J23P0j98K6J8O9J51j49K11k86l4
$$ -53 -260 -97 -93 -53 -217 -80 -113 -59 -188 20 -127 -186 -105 18 88 -110 -84 -66 3 154 5 216 -70 -104
7153a04L43l91J09J85q4k9J73o9j92Q3j4O9P7j24l5k8J49j7k8K5l2J34r7M7O2
$$ -104 239 -152 -43 142 58 29 202 133 -59 24 10 79 156 32 -3 -31 118 101 73 98 66 200 103 150 212
7178B12k51J38r0l5K5J06n8M7p1J2K99k61O9j70K34k17j49L03k48j3J4K46k49
$$ 212 -39 99 9 -26 -1 105 47 94 23 35 334 73 142 -28 206 -11 -160 143 -105 -118 -104 142 -107
7201a07j14N7J96l3J06K7k25J59jq5l31L17Q6k19o2L09p6K28l13Q5j01m3J59L13
$$ -107 -221 -164 32 -1 105 132 -93 66 65 -20 -351 -34 52 -167 -229 80 4 232 -81 4 -97 -140 19 332
7225C32m82L2J89n5j89J86K26l67JK2L55j93n9M8k3l9J61k4j34j1N6oL3j56J74
$$ 332 -150 -118 71 16 -173 13 239 -128 -127 -105 250 57 -2 46 23 -16 145 121 -13 -24 32 26 59 -97 77
7250G7j12KM1R8j40K6J54j76PJ11l69J59on5J69j69k13M14p9j50P72q52O64m87
$$ 77 -35 -33 8 106 -34 -8 146 -30 -23 88 -281 -122 -128 -183 -14 -183 -396 18 -61 -211 561 -291 373 -114
7274a14O9J2k03P55l80J64m48j2l1N49k49M6L37l45m67j05O36n83L72K38o40P3
$$ -114 -45 -33 -236 519 139 303 -145 -157 -188 361 112 158 495 150 -317 -422 214 -369 3 241 -399 -326
7296c26L26n5J0oN4p8M95Mq51M84L84j21n78j25j7M03K71m63N70l77L3P8l06M10
$$ -326 0 -55 -45 -51 3 -75 420 424 -427 57 441 320 -258 -383 -400 3 274 -189 381 4 37 115 -191 219
7320B19L9j89k14j08L11J6R5p1k1J17p9J01k68J41J2j55J97j82j19K02m3l5J19
$$ 219 258 69 -145 -253 58 74 169 98 77 194 115 216 -52 89 101 -54 143 -39 -158 44 1 -34 85
7343H5P2o1j23K86l16J4K5k28K75r6%j8N6l7K1J87k01K26k07J30k66J07j01R9
$$ 85 157 96 -27 259 -57 -43 -18 -246 29 -67 -67 -85 -29 -66 -45 142 -59 167 -40 90 -176 -69 -170 -71
7367g1O0j29J08Nk6%P2k3n3J41k59K11n7K24k08K1Q0l75J72J79j28J99N6k81K25
$$ -71 -11 -140 -32 -27 -53 -53 19 -4 -57 84 -175 36 -21 203 -5 16 96 -279 -107 72 -56 143 199 -82 143
7392A43j43j19K58o7k69K32llj31R2J40l6j94J15M1j76L49k93m1K41k10P7J14
$$ 143 0 -119 139 72 -197 35 32 29 -102 -10 130 94 -100 15 56 -120 229 -64 -105 136 -74 3 117
7415A17r9r2J56k02K66l51K18j78K49k14L2O6l15N00j22k15Q8J86j47p7K50j76
$$ 117 18 -74 82 -120 146 -205 13 -165 84 -130 -98 -32 -347 153 31 -184 -96 90 -57 -134 116 -60
7437f0K7r2K01l4k84R0K27k24Q0Q1j03L74m01o8J68M5q9Q9p8J92m05M98j84P3
$$ -60 -33 -125 76 42 -242 -152 75 -149 -69 12 -91 283 -118 -186 -18 27 -62 27 -51 141 -264 234 50 123
7461A23l95M24k02J42j49j17J88o9K30m1j83n0K29J10k31R8k7P8m76L24o5J50
$$ 123 -272 152 -50 92 -57 -174 14 -55 175 134 -49 -99 130 240 9 107 80 158 -318 6 -59 91
7483I1L4o9L2q7J33m46L74j42J96k31L6l6k27K01P6n9N6J02j86L1L15m14J31p3
$$ 91 125 56 88 1 134 -312 62 -80 116 -115 -79 -115 -342 -141 -65 -124 -68 34 -152 -121 194 -220 -89 -162
7507a62K80j96R1j6L5j64k8K80l52K84k0j0q9J0J43p5q4J10l3j08P0M8j68J81
$$ -162 118 -78 13 -3 32 -132 -160 120 -232 52 32 22 -67 -57 86 11 -73 37 4 -104 -34 14 -154 27
7531B7N7j36J66j2j92M14k04j14J67J48j49j06J38k1k07P2J18k46J4L31j88J1
$$ 27 84 -52 114 102 -90 324 120 6 173 321 172 66 204 183 -24 48 166 -80 -66 265 77 88
7553H8j26K62k93Q1M5j4J5m4j38K09k39J01j20L33j93k27M16q3q3j4R8j61K14
$$ 88 -38 224 -69 12 57 43 58 14 -124 85 -154 -53 -173 160 -33 -260 156 73 -10 -24 74 -87 127
7576A27j52Rj55J2j81K57j36m8K08j77L08j14P5P3k39J35j30RN1J78m5p8J30j87
$$ 127 -25 -16 -171 -159 -340 -83 -219 -267 -59 -236 72 -42 33 106 -133 2 -128 -119 -68 110 65 -13 117 -70
7600g0K40k03l8j05M08l02M1J0J27M8L9R6k88Q5J25k47Km3J7j09J35K46j27j28
$$ -70 170 -33 -71 -176 232 -70 -29 -19 108 156 195 291 3 88 213 -34 -32 -75 -58 -167 -32 214 87 -41
7624d1RJ03nk21J34K09j0r7j26K11l16M2J39j05J26j50L2R4r5J59k07J4J08n7
$$ -41 -32 71 66 -155 -21 188 178 81 -45 166 -150 -108 31 -74 52 -98 -66 28 -67 92 -115 -101 7 -50
7648e0R7m1j22MK29l67K01J69k11K19k44l8J89j82J0L66k59j97L50m6n4j36J01
$$ -50 47 6 -116 -112 117 -250 -49 120 -91 128 -116 -154 35 -147 -137 229 -30 -227 123 77 23 -113 -12
7671a2J23j34j08j25K64p9l0K24k38K02J78k22J27N9J94l76j20j8J05J92j68L6
$$ -12 111 -23 -131 -256 8 -71 -101 123 -115 87 265 43 170 229 423 47 -73 -91 14 206 38 74
7693G4M34n05J6M0O3j90L3K95j62k57J38n5PL88l47Q1l8N1Q5k10k41L93J08j97
$$ 74 508 3 19 59 122 -68 -35 260 98 -159 -21 -76 -69 319 -28 53 15 66 151 -59 -300 93 201 4
7717Dk93N53k42k74K60J3N4J8k51K20m5j43J76n7km01N28k35k12K59J02M2j22
$$ 4 -289 264 22 -252 8 21 75 93 -158 62 17 -126 50 -7 -9 -410 118 -117 -329 -70 32 74 -48
7740d8r2P8o3J07q7K72k43J52j02K38j25k21L06K2l62J48K41k84M7m8J37j67L95
$$ -48 -140 -62 -125 -18 -105 167 -76 76 -26 212 87 -134 172 194 -168 -20 221 -63 -16 -64 73 -94 301
7763C01m25P4J3j68L38j71Q3R4k12J04j45J98k67Q2K4P7K14m84M26j65r7l9k7
$$ 301 -124 -50 -37 -205 133 -38 45 139 -73 31 -114 84 -183 -101 -77 0 214 -270 156 -9 -106 -145 -172
7786a72J02j35K54n0j75R5J54o3J21j36j16P6Q5j08L1J17j07Ko5o0J29J0k35L77
$$ -172 -70 -205 49 -1 -176 -81 73 10 131 -5 -121 -45 40 -68 -37 80 -27 -25 -90 -150 -21 -11 -246 131
7810A31k54K32m6J5k79J37P1J14m7r2N9k73K76j36J33j97J55P3l02L84k19O2o2
$$ 131 -123 109 63 78 -201 -64 7 121 74 -18 41 -232 44 -92 41 -156 -1 72 -230 154 -65 -3 -65
7833f5J47k79L76j76J94j33R7K7N5n7j77K3K0j19R1j41K18j65j69M89k25k0m3
$$ -65 82 -197 179 3 197 64 161 188 243 186 9 32 52 -67 24 -117 101 -64 -233 256 31 11 -32
7856c2J37J13k24K44k65K3M2J17l7k47O5O0k00N3L49j64Oj0j44L54m97L61k76
$$ -32 105 218 -6 238 -27 -4 38 155 118 -129 -64 -4 -204 -151 198 34 40 30 -114 240 -257 104 -172
7879a72J02L2P1j3J4j12K0m8q5J48J4J45j13J69m6Ml52J98J64Lk23J36j96J41
$$ -172 -70 -38 33 20 34 -78 -58 -106 -191 -43 -29 116 3 172 126 130 -222 -24 140 143 -80 56 -140 1
7903Aj38K73j58M1R8m8L34l09P2j01j17j5Q6K85j98p6q1K25qj41K32j63l8O9n7
$$ 1 -137 136 -22 19 117 69 403 94 166 65 -52 -67 19 304 106 30 -51 174 166 25 257 94 56 125 68
7928F8j70JK14J51k35N9r1J15j84L6j6J78k93M8K95k27p2K34m0l52K91J28n6l00
$$ 68 -102 -101 113 264 29 88 -3 112 -72 -36 -52 126 -167 -119 176 -51 -123 111 71 -281 10 138 82 -218
7952b18K42k3j00J58j75J42L8k99K94j4k92K81j79P9j14K54kj48Qm5P7l59M62
$$ -218 24 1 -99 59 -116 26 64 -235 59 45 -247 34 -145 -66 -180 74 72 -76 -68 -113 -36 -395 67
7975F7j09R3l29J02L43r7j93R7J40k84J65J96j00l4O4J77k48o2p1N37l98k77K33
$$ 67 -42 51 -278 -176 167 70 -123 -26 114 -170 -5 191 91 57 121 298 50 -12 -83 454 56 -221 12
7998A2K0o6L04j49j98M9NK36k74j72N36k25j08m9J74l3j92o2L68k97l6J97m2r6
$$ 12 32 -34 270 121 -77 -28 -23 213 -61 -233 303 78 -30 -79 95 62 -130 -192 176 -121 -157 40 -2 -98
8022i8J33k18K08q1J67j73p5J22j81J18j05J72m0K4K13j70N8m2j13J31j03r1K37
$$ -98 35 -183 25 -56 111 -62 -137 -15 -196 -78 -183 -11 -51 -27 186 16 74 32 -81 50 -53 -144 93
8045I3r7Q9k06m8L76k32J82l26J03j67M81l20j17L42k77K41M4j0j06Q8l10K50
$$ 93 -4 85 -121 -169 207 -25 157 -169 -66 -233 248 -72 -189 153 -124 117 161 151 45 133 -177 73
8067G3J9M4r6j7N4O8k18K18k41J98k50l6K68r4M5J7p6J74k35j20L08l93L29q4
$$ 73 92 136 40 23 77 145 -73 145 -96 102 -148 -184 84 -10 35 52 -24 150 -85 -205 103 -290 39 -45
8091d5J37j03j00J38m8Q1r1J5j08M0O5l0Q9m25M36j35k00L28m5P0q4o0j25P3J85
$$ -45 92 -11 -111 27 -21 60 -31 -16 -124 -84 -19 -49 40 -385 51 -84 -284 44 -1 69 -15 -75 -200 -127 58
8116E8j62J26q1k13M42k39J64j05n9R2m5K30J6l41J93J27q8j30pJ63p2J52m02
$$ 58 -104 22 -59 -272 170 -69 95 -10 -69 23 -22 208 224 -117 76 203 115 -15 -22 141 69 221 -181
8139a81J95R2l2J33m0K9p4l7R4j77j12R8L2j2PK3j9q1P0OLj79K12jk95L42j69
$$ -181 14 106 74 207 167 196 122 85 179 2 -110 -12 20 8 15 38 19 -62 8 14 17 -162 50 49 -246 96 -73
8166g3J75p1O6Nj67n4N7l7j34K72J3j44J41k65J3J41j48J37M3M7m02M14K21l14
$$ -73 102 31 97 102 -65 -119 -62 -99 -233 39 52 -92 49 -216 -203 -62 -210 -73 -30 17 -385 29 250 -64
8190f4j09
$$ -64 -173
8191a73
$$ Imaginary data points
##PAGE= N=2
##DATA TABLE= (X++(I..I)), XYDATA
0@%%%%%%qJ6j6J6j6K4l2L7m5N6p2Q8j07J31j60J92k25K65l12L68m31M96n70O57
$$ 0 0 0 0 0 0 0 -8 8 -8 8 -8 16 -16 21 -24 32 -40 48 -59 72 -88 104 -121 144 -168 200 -231 265 -305 352
30C52p53Q57r72J102j246J401j574J766j972K198k450K724l021L346l702M090
$$ 352 -401 456 -516 586 -660 741 -833 933 -1039 1159 -1291 1433 -1588 1758 -1944 2146
46B146m512M975n480O036o651P328q075Q904r836J0885j2074J3437j5018J6879
$$ 2146 -2366 2609 -2871 3165 -3486 3842 -4233 4671 -5165 5720 -6354 7083 -7935 8944
60H944j9105K1820k5219K9623l5568M4072n7310Q0869j35086M75231J67481r29858
$$ 8944 -10161 11659 -13560 16063 -19505 24567 -32743 48126 -86960 388271 555752 -374106
72c74106L83919M06858k58769k16914L11143j26817k20640J75310K01424l05211
$$ -374106 9813 416671 157902 -59012 252131 125314 -95326 79984 281408 -23803
82b3803j58953K04446R2861r2397j67380Q7828R5673j34721K9141J61696q9765
$$ -23803 -182756 21690 114551 22154 -145226 -57398 38275 -96446 -67305 94391 4626
93D626k38137K16446J85702j55633k09636J14346K14609n7738j26233n1661R0383
$$ 4626 -233511 -17065 168637 13004 -196632 -82286 132323 74585 -51648 -103309 -12926
104a2926M1669k3080j5681q021j07612M9944K49150k19650j76799K39608J10132
$$ -12926 28743 5663 -10018 -18039 -125651 -75707 173443 -46207 -223006 16602 126734
115A26734k32911j8887K37834j28254j55385K13969J27445k79795j5775K19748
$$ 126734 -106177 -125064 112770 -15484 -170869 43100 170545 -109250 -125025 94723
125I4723l0816r1951o490N8865n4033M7116O6714r4476r8924R7706J57135j27885
$$ 94723 63907 -28044 -34534 24331 -29702 17414 84128 -10348 -109272 -11566 145569 17684
137A7684j13260N6803J12928l8740n4043L7253l0105K2937M3493k3715o9540Q9720
$$ 17684 -95576 -38773 74155 35415 -18628 18625 -11480 11457 54950 31235 -38305 51415
149E1415p337q0180R9327J989r1379j3770J24385l2255q5371M2645l60k2197N5516
$$ 51415 44078 -36102 63225 65214 -26165 -39935 84450 52195 -33176 9469 9109 -13088 42428
162D2428J2484j53849O3755J24746o1050r0390J8771P1693k9048K1313k5242l9784
$$ 42428 54912 -98937 -35182 89564 28514 -61876 -43105 28588 -460 20853 -4389 -44173
174d4173L0578O2712l5943o8846P7056L368m6798r939P9363k2413j00724N7457
$$ -44173 -13595 49117 13174 -55672 21384 24752 -22046 -31985 47378 24965 -75759 -18302
186a8302Q4128o2056j05006J14258J4952q6986M3118L9006q6097l2227J71201
$$ -18302 65826 3770 -101236 13022 27974 -59012 -15894 23112 -62985 -95212 75989
197G5989m8601j70283P7744J66523j06336j19079J26307L3838o4302j8715Q1794
$$ 75989 27388 -142895 -65151 101372 -4964 -124043 2264 36102 -28200 -46915 34879
208C4879k4943n7720N6447K4835k7032l2067N7459j566k9893o132M6244J3635
$$ 34879 9936 -47784 8663 33498 6466 -25601 31858 30292 399 -5733 40511 54146
220E4146q4267L3904O7571j8594j03223M6803J08555o0321j05535N2060J30360
$$ 54146 -30121 3783 71354 52760 -50463 -3660 104895 44574 -60961 -8901 121459
231A21459j06805p3068R0052M0306r5881r074J18351p2896q3736R3931P2279j54978
$$ 121459 14654 -58414 31638 71944 -23937 -33011 85340 12444 -71292 22639 94918 -60060
243f0060j2172J67298n8343j38125O6453J49500j32669r5594J41309M6125j35190
$$ -60060 -72232 95066 36723 -101402 -34949 114551 -18118 -113712 27597 73722 -61468
254f1468j7868J33992m7624p0798M0469N6859o3772k8341Q6848l1117n8487L1758
$$ -61468 -79336 54656 7032 -63766 -23297 33562 -30210 -58551 28297 -2820 -61307 -29549
266b9549P5867o2640n2167N6383M4076l5421o3673O7880L0414l6639m6417L9797
$$ -29549 46318 -16322 -68489 -12106 31970 -3451 -67124 756 31170 -5469 -51886 -12089
278a2089N7577n2976l1582M3795M0825p9762J3694O3452l7174m2881N0091M9520
$$ -12089 45488 -7488 -39070 4725 45550 -34212 -20518 42934 5760 -37121 12970 62490
290F2490j03880J0794R9068l2955j06312P0768J00276j06899m7256P9720M8661
$$ 62490 -41390 -30596 68472 35517 -70795 -27 100249 -6650 -53906 25814 74475
301G4475r4546j320P8996l3820l7499K9458L2296n7143J9172L1233k5724k7021
$$ 74475 -20071 -21391 57605 23785 -13714 15744 48040 -9103 10069 41302 15578 -11443
313a1443K8859L8499o4675j096L1452Q244l3374p445J9614j684K878l7027J4300
$$ -11443 17416 55915 -8760 -9856 21596 29840 -3534 -10979 8635 6951 9829 -27198 -12898
326a2898J4125L253l6626p015M6343k2682j7357N040K1282k8039J3463J3397k8126
$$ -12898 1227 4480 -32146 -39161 7182 -15500 -32857 -27817 -6535 -34574 -21111 -7714 -35840
339c5840J3338J8413L469m8874L6514L5232l4266k1411K9729K4887l7473J3187
$$ -35840 -22502 -4089 -620 -49494 -12980 22252 -12014 -33425 -3696 21191 -16282 -3095
351c095P64N138l184O216o373j9803M5336j2839l2516O361N1307l1148l8762M7531
$$ -3095 -2331 2807 -377 5839 -534 -20337 24999 12160 -20356 -13995 37312 6164 -32598 14933
365A4933J0757k8902j3243N5653l2867k7106N5293k501n5851J9598P9940o9757
$$ 14933 25690 -3212 -16455 39198 6331 -20775 34518 32017 -23834 -4236 75704 5947
377E947m9753O9482M6552q1945l0607R4424k0446n7218J8883N2411m3469k6628
$$ 5947 -43806 25676 72228 -9717 -40324 54100 33654 -23564 -4681 47730 4261 -22367
389b2367M4646k560k8436l155M5460l5678j9298L0215J1486k6373k7966M5505
$$ -22367 22279 19719 -8717 -11872 33588 -2090 -21388 8827 20313 -6060 -34026 11479
401A1479R968l0889l6761M7761K7716n4699k1047M0590L5909p1054J44N2546j7690
$$ 11479 21447 -9442 -46203 1558 29274 -25425 -46472 -5882 30027 -41027 -40883 11663 -6027
414f027m7731M0445M6501p6105l198O5932J127q0128M0260P5484p6088l5801P9886
$$ -6027 -53758 -13313 33188 -42917 -46115 19817 20944 -59184 -18924 56560 -19528 -55329 24557
427B4557L5511j06063O571R3318j8669p7417K3507P1633n8097k0862M4521M129
$$ 24557 60068 -45995 -39424 53894 35225 -42192 -18685 52948 -5149 -26011 18510 22639
439B2639n2169J8309N5702m9148l3510L7805M5774n2456j8714M1758N819j8709
$$ 22639 -29530 -11221 44481 -4667 -38177 -372 45402 -7054 -25768 15990 21809 3100
451C100j3179L9621l342k4017j0727M4594J2665n8736K623M5632J0672o4719J9878
$$ 3100 -10079 29542 26200 2183 -8544 36050 48715 -10021 -7398 38234 48906 -15813 4065
464D065L4655m1330j0068M6336r813p8920N0867N5838n6417o1531O4399M7467
$$ 4065 38720 -2610 -12678 33658 23845 -55075 -4208 51630 -4787 -66318 -1919 45548
476D5548q2436m596N6555o775o2337M2215M7321n7049k7171M8511K7939o2432
$$ 45548 -36888 -41484 15071 8296 -54041 -11826 35495 -21554 -48725 -214 27725 -34707
488c4707J6249K9803k9355o852L7712Q58n9179K4676L7357m811l8468Q91K4145
$$ -34707 -18458 11345 -18010 -24862 12850 13708 -45471 -20795 16562 11751 -26717 -25826 -1681
501a681P217N354l6949J1886K3049j792j8623J5465N331l0900K8145K0337j6395
$$ -1681 5536 10890 -26059 -14173 8876 7084 -11539 3926 9257 -21643 6502 26839 10444
514A0444l8627L3384K4442l0571L766Q202p566j6671M1476K462m2474j1734M7521
$$ 10444 -28183 5201 29643 -928 2838 11040 3474 -13197 28279 30741 -11733 -23467 24054
527B4054K3417n7000J816J6897J0618j142L8j9347j0671M3590n643k8141m530
$$ 24054 47471 -9529 -7713 9184 19802 18660 18698 -649 -11320 32270 26627 -1514 -6044
540f044K8620k2449K387L1619m4118j5905L9095J8668n4192P675K6382k8000m76
$$ -6044 22576 127 2514 34133 -9985 -25890 13205 31873 -22319 -14644 11738 -16262 -16738
553a6738L4382r366o8041M0280N4702l2683n2702J8454N1256k1699k2318O738
$$ -16738 17644 8278 -59763 -19483 35219 2536 -50166 -31712 19544 -2155 -24473 -17735
565a7735J5652k6596K1728L0348m7449j9179M1135L5314n6039p429L7160p358
$$ -17735 -2083 -28679 -6951 23397 -24052 -43231 -2096 33218 -22821 -30250 6910 -448
577d48j3302J7175P178l3103J5406J0547J5379r679l4573J1721M4282N723o8095
$$ -448 -13750 3425 10603 -22500 -7094 3453 18832 9153 -25420 -13699 30583 36306 -31789
590c1789K0089M5878k1845k3584L5848m786n4717N6422L5869o0107l9897P1033
$$ -31789 -11700 34178 12333 -11251 24597 19811 -34906 21516 57385 -2722 -42619 28414
602B8414K7092o8693l512M5940k010n2844L8601L0201n0427k4225N3187K8096
$$ 28414 55506 -13187 -16699 29241 27231 -25613 12988 43189 -7238 -31463 21724 49820
614D9820p3600J42M8041q943l4043K6951Q351m4432J9871K9419r762m4500J4797
$$ 49820 -23780 -23638 24403 15460 -18583 8368 16719 -27713 -7842 21577 11815 -32685 -17888
627a7888L2705k656k2623k5137L7324J3648k7668j8228L9189o387m0490L8280
$$ -17888 14817 12161 -10462 -35599 1725 15373 -12295 -30523 8666 2279 -38211 69
639F9J9448m1333k3496O2564j414n2799J5335L6029j7759l3878M8295L636m4742
$$ 69 19517 -21816 -45312 17252 15838 -36961 -21626 14403 -3356 -37234 11061 14697 -30045
652c0045k70N8938m225p2622K9602N5655k3900n0387M4319J8744m1596J4623K7874
$$ -30045 -30315 28623 24398 -48224 -18622 37033 13133 -37254 7065 25809 -15787 -1164 26710
665B6710k1448l2314M9699O812l5241K897J9159J123j4475J2026j0827P332N21
$$ 26710 5262 -27052 22647 29459 -5782 -2885 16274 17397 2922 14948 4121 11453 11974
678A1974n913O903L634j1847j5029L6549n697l0152q19L2393l084l2767J5939
$$ 11974 6061 12964 16598 4751 -10278 26271 20574 -9578 -10397 21996 18912 -13855 2084
691B084M813k886j0490J6263o819k3038J8244J8870j6604l3751L5597J1808k6953
$$ 2084 6897 4011 -6479 9784 2965 -20073 -1829 17041 437 -33314 2283 14091 -12862
704a2862q092K2393J254k7484K2113K091j1381m231J2976k340m989Q101j7618
$$ -12862 -20954 1439 2693 -24791 -2678 -587 -11968 -16199 -3223 -5563 -10552 -2451 -20069
717b0069J3736J0309q172j8676K0412J2597k6327J1681J0075j1556j3355L8371
$$ -20069 -6333 3976 -4196 -22872 -2460 10137 -16190 -4509 5566 -5990 -19345 19026
729A9026o058m1765K2605L3529j7478m0565L8988J7259l3060o414L4486m805l8106
$$ 19026 12968 -28797 -6192 27337 9859 -30706 8282 25541 -7519 -13933 20553 15748 -22358
742b2358K9553J6710k1401k0671L1907Q510l1622R600J3281l835j9078K0827L961
$$ -22358 7195 23905 2504 -18167 13740 22250 -9372 228 13509 9674 -9404 11423 15384
755A5384j5414n093J0306J7365j9915q334L698K5104j1900k3486J7014J3442j3529
$$ 15384 -30 -5123 5183 22548 2633 -5701 -2003 23101 11201 -12285 4729 18171 4642
768D642j8385L3461p661k7318J2914K6866k0750l3151M0519R098l5028q815M3084
$$ 4642 -13743 19718 12057 -15261 -2347 24519 3769 -29382 11137 20235 -14793 -23608 19476
781A9476j2436m2131L0841K5052l0690l2430M9767J0631m5489O70L4097m675l3561
$$ 19476 7040 -35091 -4250 20802 -9888 -42318 7449 18080 -27409 -26739 7358 2683 -30878
794c0878K6396Q438k0809o443K8200J29l1449J4736J5600o22k2714J0779J5592
$$ -30878 -4482 3956 -16853 -23296 4904 5033 -26416 -11680 3920 3298 -19416 -8637 6955
807F955o337j2134L195K5854j9102j1581J5805K1738k5555j7691L9189L775k8840
$$ 6955 618 -11516 -8321 17533 -1569 -13150 2655 24393 -1162 -18853 20336 24111 -4729
820d729l547L9968j9022k3429K9259J1168l1068j0009N0040j5725l7653J7702
$$ -4729 -8276 31692 12670 -10759 18500 29668 -1400 -11409 38631 22906 -14747 2955
832B955L3872k6598k7801L6864K157k5423n486L1393j4389k4277K0804O485j3249
$$ 2955 36827 10229 -17572 19292 21449 -3974 -9460 21933 7544 -16733 4071 10556 -2693
845b693j3117K0613n736q179J587M158o92j0616J0352l208M742j2014r6J4942
$$ -2693 -15810 4803 -933 -9112 -7525 -3367 -4059 -14675 -4323 -7531 -2789 -14803 -14899 43
859D3j476j3906n811K8612j0904j5232O707J8586j2451j5588K6193l254j3984
$$ 43 -1433 -15339 -21150 7462 -3442 -18674 -11967 6619 -5832 -21420 4773 1519 -12465
872a2465J166K4624j5283j5442K2730N747j4877q744K8919j0684j4911J2320J1951
$$ -12465 -11299 13325 -1958 -17400 5330 11077 -3800 -12544 16375 5691 -9220 3100 15051
885A5051j1148j4730K1041n41n358q450Q957K802n202J843p253J2167o427j212
$$ 15051 3903 -10827 10214 9673 4315 -4135 4822 7624 2422 4265 -2988 9179 2752 1540
899A540L76O646o385o947J8905o825j0545R07K3108j5479j6870K2545M929j8682
$$ 1540 1916 8562 2177 -4770 14135 7310 -3235 -2328 20780 5301 -11569 10976 15905 -2777
913b777p407L2320j4478k2039J4903J8655j7631j9467K8534l539j4237M17J7629
$$ -2777 -10184 22136 7658 -14381 522 19177 1546 -17921 10613 7074 -7163 -6746 10883
926A0883j2696j3309J9961n3j0046r603J9047l416q768j63L082P498j2493K483
$$ 10883 -1813 -15122 4839 4786 -5260 -14863 4184 768 -8000 -8163 -5081 2417 -10076 -7593
940g593J069Q404j3582k276J7548n396j3897k64K7006j6398j3710J5531J0221
$$ -7593 -6524 1880 -11702 -13978 3570 -1826 -15723 -15987 11019 -5379 -19089 -3558 6663
953F663j7771m589L0604j6462j7926J6406K5037k6098j8024L5575L096k4385k440
$$ 6663 -11108 -15697 14907 -1555 -19481 -3075 21962 -4136 -22160 13415 16511 -7874 -10314
966a0314L3727j6332j9475K1502J2772j9980j3271L2268n065j7032K063J5789
$$ -10314 23413 7081 -12394 9108 21880 1900 -11371 20897 15832 -1200 863 16652
978A6652o451j2542J4840j952o255q524J7651P05j5626l314R969J2818k2430j735
$$ 16652 10201 -2341 12499 10547 4292 -4232 13419 14124 -1502 -4816 5153 17971 -4459 -6194
992f194J1544M377j8168L704J8270j8538q073J2595J6494k8794n087K6211l862
$$ -6194 5350 9727 -8441 -4737 13533 -5005 -13078 -483 16011 -12783 -17870 8341 4479
1005D479k0256L722K3890k2567o996J9164O537k7031j857L3652j3518j7825N284
$$ 4479 -15777 -12055 11835 -10732 -17728 1436 7973 -19058 -20915 12737 -781 -18606 -13322
1018a3322J9829j3122o953J4019m261p515K130J8190j4196n265P250O246N09r892
$$ -13322 6507 -6615 -13568 451 -3810 -11325 -9195 8995 -5201 -10466 -3216 3030 3539 -6353
1032f353O292p2O280p651L792M927n240l251N210J5591k2842l505J9141P186k2534
$$ -6353 -61 -133 6147 -1504 2288 7215 1975 -1276 3934 19525 -3317 -6822 12319 19505 -3029
1047c029l833K5179j0744j0028Q602J1781k5372K743K7032j4269j7683P774K2338
$$ -3029 -6862 18317 7573 -2455 6147 17928 -7444 -4701 22331 8062 -9621 -1847 20491
1060B0491j9494o204J2768o5j1033K358J4965j4115k845J192J0847l937j0935
$$ 20491 997 -5207 7561 7496 -3537 -1179 13786 -329 -3174 -1982 8865 4928 -6007
1073f007M324K686N105j2065L696M84n55l342L272M395j6511M835P873M565j9535
$$ -6007 -1683 1003 6108 -5957 -2261 -1777 -2332 -5674 -2402 1993 -14518 -9683 -1810 2755 -16780
1088a6780k51J8773m980j2506K773J8025j9231j685J7963J28j8763L319K6768
$$ -16780 -17031 1742 -3238 -15744 -12971 5054 -14177 -15862 2101 2229 -16534 -13215 13553
1101A3553j6991q761J1728J0487j5496J031J5989r577m887L146J5701j3122p050
$$ 13553 -3438 -12199 -471 10016 -5480 -4449 11540 1963 -2924 222 15923 2801 -4249
1114d249Q797O683j916j3424Q973K989R28r980O871N354j0721P16O136P801k0631
$$ -4249 4548 11231 9315 -4109 4864 7853 8781 -1199 5672 11026 305 1021 7157 14958 -5673
1129e673L483J6343m888j7202P669K0015k3731m942J8908L572k8704R056K7347
$$ -5673 -2190 14153 9265 -7937 -268 19747 -3984 -8926 9982 13554 -15150 -6094 21253
1142B1253k2898j4964J8565J6515k9551k84K1464p543j3337O196J6976j8942k996
$$ 21253 -1645 -16609 1956 18471 -11080 -11364 10100 2557 -10780 -4584 12392 -6550 -9546
1155i546J0699O207j3464n811J6840l732p728m620J5349o433j0107N618N627k092
$$ -9546 1153 7360 -6104 -11915 4925 1193 -6535 -11155 4194 -2239 -12346 -6728 -1101 -3193
1169c193j2055J1454R04l345r481J0063J1001j5190j716J2564P336k0874Q847
$$ -3193 -15248 -3794 -2890 -6235 -15716 -5653 5348 -9842 -11558 1006 8342 -12532 -3685
1182c685J7910j4318r372J8497J1330k8463M537K2817o523k0984J0893J7101j9915
$$ -3685 14225 -93 -9465 9032 20362 -8101 -3564 19253 12730 -8254 2639 19740 -175
1195a75k290Q857M172j5802M167J1538q052o154N92J4075q837l993K302O582j578
$$ -175 -2465 6392 10564 -5238 -1071 10467 2415 -3739 -3147 10928 2091 -1902 400 6982 5404
1210E404o986R165k223j363n851J1439J314j3857l50J0956N035k2315N010J2903
$$ 5404 -1582 7583 5360 3997 -1854 9585 10899 -2958 -3308 7648 12683 -9632 -4622 8281
1224H281n776j4754J0189J0282k1756L301J5629l257k2454J1920J8065j7249q324
$$ 8281 2505 -12249 -2060 8222 -13534 -10233 5396 2139 -20315 -8395 9670 -7579 -15903
1237a5903J2372Q862j9063O770J1057p981r522Q441J3150j5890j611M871O747
$$ -15903 -3531 5331 -13732 -6962 4095 -3886 -13408 -4967 8183 -7707 -9318 -4447 2300
1250B300o469j987M642k367L537m138P253l428k013k20R053L257j6892O542J2192
$$ 2300 -4169 -6156 -1514 -3881 -344 -4482 2771 -657 -2670 -2890 6163 9420 -7472 -930 11262
1265A1262k06j8049J1062J1199j5113j226J2705K009k3075J2082J5407j2657j3297
$$ 11262 11056 -6993 4069 15268 155 -1071 11634 13643 -9432 2650 18057 5400 -7897
1278g897J2097J1122j8540L062P777j722j2051R156J0168j4968k610O736J0070
$$ -7897 4200 15322 -3218 -156 7621 5899 -6152 3004 13172 -1796 -4406 2330 12400
1291A2400j3607l109O779L354m222o511R303m191k689k128R778l890j3853Q119
$$ 12400 -1207 -4316 2463 5817 1595 -4916 4387 196 -2493 -4621 5157 1267 -12586 -4467
1305d467Q934l743j7953J3486P581j1876m496J2832J575k0835J3633J2839j2022
$$ -4467 4467 724 -17229 -3743 3838 -8038 -12534 298 1873 -18962 -5329 7510 -4512
1318d512j5635J9343J0998k2330Q24J4506J083j8244J2572R584j4641k699J3495
$$ -4512 -20147 -804 10194 -12136 -11312 3194 4277 -13967 -1395 8189 -6452 -9151 4344
1331D344N735j9795N470J0583n5j0100K891Q917p255P22P03P166p867k566P075
$$ 4344 10079 -9716 -4246 6337 6282 -3818 -927 7990 735 1457 2160 9326 1459 -1107 5968
1346E968M444m989j0989J3573L718p496p774J2659K179j5206P797P745p013j3593
$$ 5968 10412 5423 -5566 8007 11725 4229 -3545 9114 11293 -3913 3884 11629 4616 -8977
1360h977J8102M713j9274j074J6127R4k0928J1604Q067j0504p473J3066L582j8816
$$ -8977 9125 13838 -5436 -6510 9617 9711 -11217 387 8454 -2050 -9523 3543 7125 -11691
1374a1691N300J0059n05j4914O230Q009o466k395J143O732q753J663L642K281
$$ -11691 -6391 3668 3163 -11751 -5521 2488 -3978 -6373 -5230 1502 -7251 -5588 -1946 335
1388C35o358l592J1633j339n779n510J4271j849j1159N360P635m616j1619J6349
$$ 335 -6023 -9615 2018 679 -5100 -10610 3661 1812 -9347 -3987 3648 -968 -12587 3762
1402C762J490j3447j407J6437j583j7924J1498P892p084q746J4963J805j4777
$$ 3762 5252 -8195 -9602 6835 5252 -12672 -1174 6718 -366 -9112 5851 7656 -7121
1415g121N462J0741j303j4924J0557P162n980m886N768N361r487M395J631J157
$$ -7121 -1659 9082 7779 -7145 3412 10574 4594 -292 5476 10837 1350 5745 7376 8533
1429H533o602J499O015l153k839m472R801l567n451p02O617k546j0892J1617L78
$$ 8533 1931 3430 9445 6292 3453 -1019 8782 5215 -236 -938 5679 3133 -7759 3858 4236
1444D236r087n808J6331j543j6835O130J1080m917j4439J5190L029j2204K56J2114
$$ 4236 -4851 -10659 5672 4129 -12706 -6576 4504 -413 -14852 338 3367 -8837 -8581 3533
1458C533p39j6726J0880P689n870r009R352M439j0179K296M061J665j0925O126
$$ 3533 2794 -13932 -3052 4637 -1233 -10242 -890 3549 -6630 -4334 -273 1392 -9533 -3407
1472c407N550m049m949N13J0072n926l082Q62Q104n344m787J0058J16o091l771
$$ -3407 2143 -1906 -6855 -6342 3730 -2196 -5278 -4416 3688 -1656 -6443 3615 3731 -2360 -6131
1487f131J6406m635j1438O136J1236o580j1384J4778Q52j0049j635J4957m605
$$ -6131 10275 5640 -5798 338 11574 4994 -6390 8388 9240 -809 -2444 12513 7908
1500G908j5621J1681P584p503j0056J2695J522r320K028N906j700j0202J0265
$$ 7908 -7713 3968 11552 4049 -6007 6688 8210 -1110 918 6824 5124 -5078 5187
1513E187J447m181n265M507M882p046q94K25N347p188o10M682o50o218k547J3257
$$ 5187 6634 2453 -2812 1695 6577 -469 -1363 -1138 4209 -2979 -3589 1093 443 -5775 -8322 4935
1529D935o238q360K721J0599n033r457R658K348n664m105J4050n244j1534Q879
$$ 4935 -1303 -9663 -6942 3657 -1376 -10833 -1175 1173 -4491 -8596 5454 210 -11324 -2445
1543b445Q833p270j2118J4116K901j0264j611J0724l304j2022J0994L736n789
$$ -2445 6388 -882 -13000 1116 4017 -6247 -7858 2866 -438 -12460 -1466 2270 -3519
1556c519p863J0681M042q612O48M090L690o671N271J594k90l201L156Q508p403
$$ -3519 -11382 -701 3341 -5271 -4623 -533 3157 -3514 1757 3351 3061 -140 3016 11524 4121
1571D121k271K399R702o885o329P507K918o381m544J2171o884p864N212Q035q797
$$ 4121 1850 4249 13951 7066 737 8244 11162 4781 237 12408 5524 -2340 2872 10907 2110
1586B110r948J3622J72r471j400J0651n842p823R311K396o761o605J2879l53q394
$$ 2110 -7838 5784 5956 -3515 -4915 5736 -106 -7929 1382 3778 -2983 -9588 3291 2938 -5456
1601e456l82N483J622p800L766L64J18m958L876L180n738r02J171P535p548k107
$$ -5456 -5838 -355 1267 -6533 -2767 -2403 -2285 -7243 -3367 -187 -5925 -6827 -5656 1879 -5669 -7776
1617g776M984K927n069j992J0377n005m228L072J0323q716p517J2529K523q375
$$ -7776 -2792 135 -4934 -6926 3451 -1554 -5782 -2710 7613 -1103 -8620 3909 6432 -1943
1631a943m321J4103m531q802O388P249p987p800J5216j109r234n86J1576l142
$$ -1943 -6264 7839 3308 -5494 894 8143 156 -7644 7572 6463 -2771 -3357 8219 5077
1645E077r228P803K793l305n949R281L9o134J55L583L577q427J888K085K296o099
$$ 5077 -4151 3652 6445 3140 -2809 6472 6511 377 532 4115 7692 -735 1153 3238 5534 -565
1661e65m06O893m702l739J960Q378j0283l193Q979J583q963j943J3085p002o632
$$ -565 -971 5922 1220 -2519 -559 7819 -2464 -5657 3322 4905 -4058 -6001 7084 82 -6550
1676f550M409Q707r490o372J2898p93p604l175J2091m978p387O092L317m989n464
$$ -6550 -2141 6566 -2924 -9296 3602 2809 -4795 -7970 4121 -857 -8244 -2152 1165 -3824 -9288
1691i288J0870k266n565j13O663l78o962M219J145J452n604L761L758l015l361
$$ -9288 1582 -684 -6249 -6362 301 -77 -7039 -2820 -1675 -223 -5827 -2066 1692 -1323 -4684
1706d684K240Q792r031j939O156N251r180j500J1966n371n638L813J0058j1227
$$ -4684 -2444 6348 -2683 -4622 1534 6785 -2395 -3895 8071 2700 -2938 875 10933 -294
1720b94l948J2213N59r659j616J3880o538o122M842O125p624m611J1809k698o712
$$ -294 -4242 7971 8530 -1129 -2745 11135 4597 -1525 3317 9442 1818 -2793 9016 6318 -394
1735c94j122R774l765o874M553J623j147n771O282j001l863j694M321L029r087
$$ -394 -1516 8258 4493 -2381 2172 3795 2648 -3123 3159 2158 -1705 -3399 922 3951 -5136
1750e136Q35L522M192r685OP669l140m975J341Q492r663k143P871K715r932j495
$$ -5136 -4301 -779 3413 -6272 -6266 1403 -1737 -6712 -5371 3121 -6542 -8685 -814 1901 -8031 -9526
1766i526J2768n283n238K139Q484q355k965J1320j943p335J24J2466o191n649
$$ -9526 3242 -2041 -7279 -5140 3344 -5011 -7976 3344 1401 -5934 -5810 6656 465 -5184
1780e184M345N079k741n183P278j438j202j883M967N73o134J636L959L204r490
$$ -5184 -839 4240 1499 -3684 3594 2156 954 -929 4038 4611 -1523 113 4072 7276 -2214
1795b214K050N910o18o386J719Q278r162o37O924K865j2306J720J2305o091p607
$$ -2214 -164 5746 5128 -1258 461 8739 -423 -1060 5864 8729 -3577 -1857 10448 4357 -3250
1810c250L334R897j0263j956Q088p76q016P02J1398q650o034M985P023p826n237
$$ -3250 84 9981 -282 -2238 5850 5074 -2942 -2240 9158 508 -5526 -541 6482 -1344 -6581
1825f581Q310j359l467k327P095l891m585K869L539j088p583N385K346l25n855
$$ -6581 1729 370 -3097 -5424 1671 -2220 -6805 -3936 -397 -1485 -9068 -3683 -1337 -1662 -7517
1840g517L204M920n571Q5L356L089r308M072P977m254p336M649J0243j0456j833
$$ -7517 -4313 607 -4964 -4879 -1523 1566 -7742 -3670 4307 53 -7283 -2634 7609 -2847 -4680
1855d680O555L118r157J353J0367o887m844M357Q926r473l181Q124P13m398k346
$$ -4680 1875 4993 -4164 -2811 7556 669 -4175 182 9108 -365 -3546 4578 5291 893 -1453
1870a453Q356m733j841K423L900l579n208O713J246j705o802O297K840n428j488
$$ -1453 6903 2170 329 2752 6652 3073 -2135 4578 5824 4119 -2683 3614 6454 1026 -462
1885d62L374K732r126L889M762k893q096N781P544r818k418N881M464j1156K278
$$ -462 2912 5644 -3482 407 5169 2276 -5820 -39 7505 -2313 -4731 1150 5614 -5542 -3264
1900c264Q075n896n551M758Q178j1878j565P429J826q111m19Q444n689j515J639
$$ -3264 4811 -1085 -6636 -1878 6300 -5578 -7143 286 2112 -5999 -6418 2026 -3663 -5178 -3539
1915c539M608o040j175N724m2k548l700P348n78k450j366M095J877o765M357K750
$$ -3539 1069 -4971 -6146 -422 -464 -3012 -6712 636 58 -2392 -3758 337 2214 -4551 -194 2556
1931B556q98o973O617N227p475k614N510N047j0903L075O125k228o434M299P614
$$ 2556 1658 -5315 1302 6529 -946 -3560 1950 6997 -3906 -831 5294 3066 -3368 931 8545
1946H545r807j082O812L265r679J229Q366m241l776J658O848p592q89N028R80
$$ 8545 -1262 -2344 4468 7733 -1946 -717 7649 3408 -368 1290 8138 546 -343 4685 5665
1961E665n166k326P507k546k650k318N821j674n673M036J377j396o816P177J840
$$ 5665 499 -1827 5680 3134 484 -1834 3987 2313 -3360 676 2053 657 -6159 1018 2858
1976B858n848l069O216K910j0314L258M965j143q288O132N729r098j211O350L336
$$ 2858 -2990 -6059 157 3067 -7247 -3989 976 -167 -8455 -2323 3406 -5692 -6903 -553 2783
1991B783j0740K962O587l244n008L886O311q985P98N126J543o473M60P372l262
$$ 2783 -7957 -4995 1592 -1652 -6660 -2774 3537 -5448 -4650 476 2019 -4454 -3994 3378 116
2006A16k212o7O106m292j433L295J721j397m702O907K80k675l550N987J800o379
$$ 116 -2096 -2163 3943 -349 -1782 1513 3234 1837 -2865 4042 4322 1647 -1903 4084 5884 -495
2022d95J885L339N59q150O620L469o890j976O216L201j0667L053N502j637p039
$$ -495 1390 4729 5288 -2862 3758 7227 337 -1639 4577 7778 -2889 164 5666 4029 -3010
2037c010M640M820q210L31M138K383q832J121O315k917l697L87N991n866k64J327
$$ -3010 1630 6450 -1760 -1429 2709 5092 -3740 -2619 3696 779 -2918 -2531 3460 -2406 -2670 -1343
2053a343K401m135k457O982k132k920k553O871j344m697J433L275k59n981O393
$$ -1343 1058 -3077 -5534 1448 -684 -3604 -6157 714 -630 -5327 -3894 -619 -878 -6859 -466
2068d66P27l901k077O154J716q540L257M661m77o893N931K923o050P6N118K383
$$ -466 261 -3640 -5717 437 2153 -6387 -3130 1531 1054 -5839 92 3015 -3035 -2959 2159 4542
2084D542r451M058N517j835n442K497N974n638K88J687K706n068R53M487k739
$$ 4542 -4909 -851 4666 2831 -2611 -114 5860 222 510 2197 4903 -165 788 5275 2536
2099B536j117j395N796k944j691j34K962q66m313M417L76k211m120P279J55p905
$$ 2536 1419 24 5820 2876 1185 1051 4013 3147 -1166 3251 3627 1416 -2704 4575 4730 -3175
2115c175J941N247o65q189O030K114m587k398N299J449r168M212L953j556p047
$$ -3175 -1234 4013 3348 -4841 1189 3303 -1284 -3682 1617 3066 -6102 -1890 2063 507 -6540
2130f540M486M374n853j074K865L201p470K639L757j904l623J348N841n200o75
$$ -6540 -2054 2320 -3533 -4607 -1742 1459 -6011 -3372 385 -1519 -5142 -3794 2047 -3153 -3828
2145c828J197L398l187j170L672p23j313k101O911k465m062K098M822j543o632
$$ -3828 -2631 767 -2420 -3590 82 -641 -1954 -4055 2856 391 -3671 -1573 3249 1706 -4926
2160d926O739J748l207k911O457K65o807L543L871r44o909O090K516m680j333
$$ -4926 1813 3561 354 -2557 3900 4165 -2642 901 4772 3828 -3081 3009 5525 845 -488
2175d88M012J563o990M025K533j588m636L781L640n756K84J200L031n041M14K252
$$ -488 3524 5087 -1903 2122 4655 3067 -1569 2212 5852 96 380 1580 4611 -430 -16 2236
2191B236j24k260j972N411k892k052n52M737k647m898M935Q18k377m177O948r53
$$ 2236 2112 -148 -2120 3291 399 -1653 -2205 2532 -115 -5013 -78 740 -1637 -5814 1134 181
2207A81n426J918M275j551p115O691K110l909l213N920J025p132L453L642j267
$$ 181 -5245 -3327 948 -603 -7718 -1027 1083 -2826 -6039 -119 906 -6226 -2773 869 -398
2222c98n774N725K511n024k14L535K117o206K947K163k65l200J611M193l534m84
$$ -398 -6172 -447 2064 -2960 -3174 361 2478 -3728 -781 1382 1117 -2083 -472 3721 187 -297
2238b97j11M826l511k378L747J410k023l333O627j804l166L58N004k598n297O004
$$ -297 -408 4418 907 -1471 2276 3686 1663 -1670 4957 3153 -13 345 5349 2751 -2546 3458
2254C458R02k888l439O578r47n478K589L191j339o357O308J127m086j924L878
$$ 3458 4360 1472 -1967 4611 3664 -1814 775 3966 2627 -3730 2578 3705 -381 -2305 1573
2269A573J775o128K310J615J28m394K700K381l770q20Q75L827n466o1K021J464
$$ 1573 3348 -2780 -470 1145 1273 -3121 -421 1960 -1810 -2630 -1755 2072 -3394 -3455 -1434 30
2285C0l048j850N221k269k211L3N512l681l630N113J840l275l631P528r62m472
$$ 30 -3018 -4868 353 -1916 -4127 -4094 1418 -2263 -5893 -780 1060 -2215 -5846 1682 720 -3752
2301c752J475M882k334n578O996P19l902k368P050m05o188L271K940m83n366N330
$$ -3752 -2277 2605 271 -5307 1689 2408 -1494 -3862 3188 2783 -3405 -134 2806 2323 -3043 2287
2317B287J069l015o04L067J867n392K085J453J699l861L59L514j998j140l77M488
$$ 2287 3356 341 -263 2804 4671 -721 1364 2817 4516 655 1014 4528 2530 1390 1013 5501
2333E501m613r88L184J233m402k300O823k441l532J79M667k823m415N040O48l504
$$ 5501 888 -100 3084 4317 -85 -2385 4438 1997 -1535 -1356 3311 488 -3927 1113 1761 -1743
2349a743k831O748j456n208J937L574j299n288N288K7k631j217L898N9m898K582
$$ -1743 -4574 2174 718 -4490 -2553 1021 -278 -5566 -278 -251 -2882 -4099 -201 -142 -5040 -2458
2365b458J633N54m737K579K885k058j540Q59L728m156J08K944J559m788K59N454
$$ -2458 -825 -271 -5008 -2429 456 -1602 -3142 -2283 1445 -2711 -2603 341 1900 -2888 -2629 2825
2381B825k431k180l9P274n039k530M211J700l964j692P111l057l108Q49N005k610
$$ 2825 394 -1786 -1825 5449 410 -2120 2091 3791 -173 -1865 5246 2189 -919 -70 4935 2325
2397B325m766N820j30k124k356N502j628l718K346K593j561m476M566O56j876
$$ 2325 -2441 3379 3249 1125 -1231 4271 2643 -1075 1271 3864 2303 -2173 2393 3049 1173
2412A173j978J754K412m303O38J228J406m535Q50L655j882k707ON315m569j810
$$ 1173 -805 949 3361 -942 -304 924 2330 -2205 -1355 2300 418 -2289 -2283 3032 -1537 -3347
2428c347K436K641m208k011O337k675l015M36N670m069l494M658J206k679l096
$$ -3347 -911 1730 -2478 -4489 1848 -827 -3842 -3406 2264 -1805 -5299 -641 565 -2114 -5210
2443e210O492j989l019J183L487j877m054N023M82j325k854M309Q15l420Q85J744
$$ -5210 1282 -707 -3726 -2543 944 -933 -4987 36 518 -807 -3661 648 1463 -1957 -1072 672
2459F72J707m794K560K242n72l191J505M770m646p23K102L182n050k01N226j789
$$ 672 2379 -2415 145 2387 1815 -1376 129 4899 253 -470 1632 4814 -236 -437 4789 3000
2475C000l361O84O059n237k110L661K005m288j914O399k693l192Q52M494l589
$$ 3000 -361 323 6382 1145 -965 2696 4701 413 -1501 4898 2205 -987 -135 4359 770
2490G70l277M198N69k488k796N462j545k990K84K529J55m442K887J016p17l519
$$ 770 -2507 1691 2260 -228 -3024 2438 893 -2097 -1813 716 871 -3571 -684 332 -385 -3904
2506c904K729K249l412m70J253K861n311J092K933o32l220P84N000m527j346K552
$$ -3904 -1175 1074 -2338 -2808 -1555 1306 -4005 -2913 20 -612 -3832 -3048 1952 -2575 -3921 -1369
2522a369K843m743o57N533j823k547M88N600l839k575L559K077k720k255N670
$$ -1369 1474 -3269 -3926 1607 -216 -2763 -2275 3325 -514 -3089 470 2547 -173 -2428 3242
2537C242j424k173N29L425j519l345L579O20o17l081L210Q96k352n97J445J978
$$ 3242 1818 -355 174 3599 2080 -1265 2314 2934 2317 -764 2446 3342 990 393 1838 3816
2553C816m522J946J754n39l664J802L866m483r87J962K808n361N52L695j432l193
$$ 3816 -706 1240 2994 2455 -1209 593 4459 -24 -1011 951 3759 -1602 -1050 2645 1213 -1980
2569a980Q61N051n119j522K681K203m003j070M371j853j823j31L782l021j928
$$ -1980 -1119 3932 -1187 -2709 -28 2175 -1828 -2898 1473 -380 -2203 -2334 1448 -1573 -3501
2584c501K722K52j054k699L913o45j482p43K520M86l659K160J242J72l519L073
$$ -3501 -779 -527 -1581 -4280 -367 -1012 -2494 -3237 -717 -231 -3890 -1730 -488 -316 -3835 -762
2600g62J942k784q38K255K559m595R35K689L10l135Q94M260l716j159K099L553
$$ -762 1180 -1604 -2442 -187 2372 -2223 -1288 1401 1711 -1424 -530 3730 14 -1145 954 4507
2616D507n082p80M839o42k844j70N033l973j141K445J437k543j931M481j264j586
$$ 4507 -575 -1355 3484 2842 -2 -172 4861 888 -253 2192 3629 1086 -845 3636 2372 786
2632G86q94L387j270k533J406J126l00m117L671Q12k556j648K662J837m896J214
$$ 786 -108 3279 2009 -524 882 2008 1708 -2409 1262 2074 -482 -2130 532 2369 -2527 -1313
2648a313K107K65m235J750K960l170j163J876K845n202M00L498m83l835J210M128
$$ -1313 794 1059 -3176 -1426 1534 -1636 -2799 -923 1922 -3280 -2880 618 135 -3700 -2490 1638
2664A638l943p71J879K087l905n57M370j637j729l78M024k364j405J841J743q78
$$ 1638 -2305 -3076 -1197 890 -3015 -3572 798 -839 -2568 -2946 1078 -1286 -2691 -850 893 15
2680A5k564L513J5j066j391L385J80l050J520J687L13l982L151J635k234j442
$$ 15 -2549 964 979 -87 -1478 1907 2087 -963 557 2244 2557 -1425 1726 3361 1127 -315
2696c15K027K136m630J220K154L82m216J639L787l751j193K272K498m995Q76L037
$$ -315 1712 3848 -782 438 2592 2974 -1242 397 4184 433 -760 1512 4010 -985 -109 2928
2712B928j242k098M67L668l707j014J259K301l181j630L342n87j435j668L722
$$ 2928 1686 -412 55 3723 16 -998 261 2562 -619 -2249 1093 506 -929 -2597 1125
2727A125j542k246J372J244q60k928L241J47q23k077K509J055l677J382J658N48
$$ 1125 -417 -2663 -1291 -47 -907 -3835 -594 -447 -1270 -3347 -838 217 -3460 -2078 -420 128
2743A28l742K298K226k355j315K105K634n047R89K780M3l427J710L371l584J9
$$ 128 -3614 -1316 910 -1445 -2760 -655 1979 -3068 -2079 701 744 -2683 -973 2398 -1186 -1167
2759a167J239K389l463L88K560o23r78p71L514j829r33M56K174j101k284K761
$$ -1167 72 2461 -1002 -614 1946 1323 345 -426 3088 1259 326 782 2956 1855 -429 2332
2775B332J83q94k096L215O1k772O23J694Q5l918K890J181j896k098K839J644m731
$$ 2332 2515 1621 -475 2740 2801 29 652 2346 2431 -1487 1403 2584 688 -1410 1429 3073 -1658
2792a658R97J932K94m429K606K333l154r22J330K497m555Q92J782n5k654N74L185
$$ -1658 -661 1271 1565 -2864 -258 2075 -1079 -2001 -671 1826 -2729 -1837 -55 -110 -2764 -2190 995
2809I95k726r52N72K660k387j075K659l71j167j287L928j720j504Q06K141p18
$$ 995 -1731 -2683 -2111 549 -1838 -2913 -254 -625 -1792 -3079 849 -871 -2375 -1569 572 -146
2825a46k736K903L92o32k192L133P78l142P79K486N30m356K863K001k290j291
$$ -146 -2882 21 413 -219 -2411 722 1500 -1642 -863 1623 2153 -2203 660 2661 371 -920
2841i20K612J791m556J585J747K49l233J743K451k808k32Q20K126l040M4J697
$$ -920 1692 3483 -1073 512 2259 2508 -725 1018 3469 661 429 1249 3375 335 379 2076
2857B076J54j980m39L073k011r37J7K331k057j466K367j61q05k535L764o99k524
$$ 2076 2230 250 -189 2884 873 -64 -47 2284 227 -1239 1128 967 162 -2373 1391 692 -1832
2874a832K66K361n63l534K853N09j307k258L126R56l840J390J711J34l685K717
$$ -1832 -1566 795 232 -3302 -449 60 -1247 -3505 -379 577 -3263 -1873 -162 -28 -3713 -996
2890i96J633k361o08J994J466l798J320J212N59k378N48K595j919l44M50K288
$$ -996 637 -1724 -2332 -338 1128 -2670 -1350 -138 421 -1957 -1409 1186 -733 -1077 -627 1661
2906A661k360m79J702L31r12j389L316j131q86J26K324q71k223K235R70r10k482
$$ 1661 -699 -1178 524 855 -57 -1446 1870 739 -147 -21 2303 1432 -791 1444 2414 1504 -978
2923i78L750j39k823P86J976K17l925L001J039j685j849K852M32l481J109R45
$$ -978 2772 2633 -190 596 2572 2789 -1136 1865 2904 1219 -630 2222 2654 -827 282 1227
2939A227N13l117J323J974j865j077O34K109l388L46R32J033k296n24K793j423
$$ 1227 1740 -1377 -54 1920 55 -1022 -388 1721 -1667 -1321 -389 644 -1652 -2176 617 -806
2955h06p99o51L135j939j558J873P42j348k056L897o93k163j19K680l33l319K909
$$ -806 -1605 -2256 879 -1060 -2618 -745 -3 -1351 -3407 490 -203 -2366 -2485 195 -138 -3457 -548
2972e48J061j214k313L647K08k978J058K101M3l753L155J036j400j387J818K058
$$ -548 513 -701 -3014 633 841 -2137 -1079 1022 1065 -2688 467 1503 103 -1284 534 2592
2988B592l481Q46J194J145k637Q33J904j277o44P7K397k314n80J370Q68j468j536
$$ 2592 -889 -43 1151 2296 -341 492 2396 1119 475 552 2949 635 55 1425 2293 825 -711
3005g11L153r46j320o99L266j458k684K389J210j400k652L644l37k417j1K153
$$ -711 2442 1496 176 -523 2743 1285 -1399 990 2200 800 -1852 1792 1455 -962 -973 1180
3021A180n32k864K358M61j091k041K195J139l213P46R35Q58k995J109J548o13
$$ 1180 648 -2216 142 603 -488 -2529 -334 805 -2408 -1662 -727 131 -2864 -1755 -207 -820
3037h20j528R70K240k920L42N74J953k684k55K731q09j327n18L509k119j225J611
$$ -820 -2348 -1378 862 -2058 -1716 -1142 811 -1873 -2128 603 -206 -1533 -2051 1458 -661 -1886 -275
3054b75J492j706k086M384r28j914k64L286r57k631K537J110j170j907L273l73
$$ -275 1217 -489 -2575 1809 881 -1033 -1297 1989 1032 -1599 938 2048 878 -1029 2244 1871
3070A871j848O77J567K67l120K148N54o19j691J504J209k765P84O71J147l012
$$ 1871 23 700 2267 2534 -586 1562 2116 1497 -194 1310 2519 -246 538 1209 2356 -656
3086f56Q25J370n54j636J41K711k433n10M12J908k303j281L267r20j467o97L114
$$ -656 169 1539 985 -651 -510 2201 -232 -742 -330 1578 -725 -2006 1261 341 -1126 -1823 1291
3103A291j594k092J620J019j325k026L496r89j330j99K103p4k837K238O15l24
$$ 1291 -303 -2395 -775 244 -1081 -3107 389 -600 -1930 -2129 -26 -100 -2937 -699 -84 -408
3119d08k716K794O79j792j37J322J173l074J673J204l94j652O42K712k509n9N92
$$ -408 -3124 -330 349 -1443 -1580 -258 915 -2159 -486 718 324 -1328 -686 2026 -483 -542 50
3136E0K015k304m93K530n31j119o39L161j858r68J034J510j664j408L411j254
$$ 50 2065 -239 -732 1798 1267 148 -491 2670 812 -156 878 2388 724 -684 2727 1473
3152A473j286l86K748j328j925J949O19r98k058K792k15j465l06J510K58k644
$$ 1473 187 -199 2549 1221 -704 1245 1864 866 -1192 1600 1385 -80 -386 1124 1382 -1262
3168a262J664K61L11k516J214J303j906k58M04J745k954Q35J211j67j763J66K611
$$ -1262 402 663 974 -1542 -328 975 -931 -1189 -785 960 -1994 -1159 52 -115 -1878 -1712 899
3185H99k114p33O88K216k591q84K767o73j428k98L391j936j373J231J528j341
$$ 899 -1215 -1948 -1260 956 -1635 -2519 248 -425 -1853 -2151 1240 -696 -2069 -838 690 -651
3201f51j660K966l34j433l12K912p56k117J832P04q5k429K253M01j176j39J264
$$ -651 -2311 655 321 -1112 -1424 1488 732 -1385 447 1151 1066 -1363 890 1291 115 -24 1240
3218A240Q58k777J464N45N80k273J244J256j371o53M64K197k931J98J820m29j664
$$ 1240 2098 -679 785 1330 1910 -363 881 2137 766 113 577 2774 -157 41 1861 1432 -232
3235b32j23K952k242r32J005J606k225r59K304o39q74j031K752j549j319J103
$$ -232 -355 2597 355 -577 428 2034 -191 -1150 1154 515 -359 -1390 1362 -187 -1506 -403
3251d03O14p05j602K399n04p88p11J719l20j857J186N03K59k286J507P12q80p44
$$ -403 211 -494 -2096 303 -201 -989 -1700 19 -301 -2158 -972 -469 -210 -2496 -989 -277 -1157 -1901
3269a901R84J320k337O11J317K79j920O75K370j757q54P29K246k363m95K209p7
$$ -1901 -917 403 -1934 -1323 -6 273 -1647 -972 1398 -359 -1213 -484 1762 -601 -1096 1113 1036
3286A036j468l43L105j912m38M79J681j240j693K684l11q78j005K356j163r33
$$ 1036 -432 -775 2330 418 -20 459 2140 900 -793 1891 1580 702 -303 2053 890 -43
3302d3R64O15k66j806J976k07o58j165J568O95j944L65N59M35k217J336J174j566
$$ -43 921 1536 1270 -536 1440 1233 575 -590 978 1673 -271 94 653 1088 -1129 207 1381 -185
3320a85r81R36J811k911K01J228J26j638r1K237j830m03L45J746k007o21J711
$$ -185 -1166 -230 1581 -1330 -1129 99 225 -1413 -1504 733 -1097 -1500 -1155 591 -1416 -2037 -326
3337c26l2p96q99K536j296q60N43R88m59j396K090l8o39j017K144j44j341O60
$$ -326 -358 -1154 -2053 483 -813 -1673 -1130 -142 -601 -1997 93 55 -584 -1601 543 399 -942 -282
3355b82K97O88k035J766M32m72j222J292J389k345N90O62J082k189P33J814j482
$$ -282 15 703 -1332 434 866 394 -828 464 1853 -492 98 760 1842 -347 386 2200 718
3372G18o10O29J570k525M65J416J31j768R1K156j738n85M26J426j296j313J829
$$ 718 108 737 2307 -218 247 1663 1794 26 117 2273 535 -50 376 1802 506 -807 1022
3389A022k6j162n71K006j285q23K73J041l36j653J579P4n34j195J509N66k013
$$ 1022 996 -166 -737 1269 -16 -839 -566 475 139 -1514 65 139 -395 -1590 -81 485 -1528
3406a528M94O83M99k377J178J256r30j059J073J286k481M03J166M78j868O18J810
$$ -1528 -1034 -351 148 -2229 -1051 205 -725 -1784 -711 575 -1906 -1503 -337 141 -1727 -1109 701
3423G01j408m80N31J582j654l8J222K2r15l77K191j099m48L28J191j007r47J883
$$ 701 -707 -1187 -656 926 -728 -766 456 478 -437 -814 1377 278 -170 158 1349 342 -605 1278
3441A278n61J6j023J881k89j173L17P15K99k279K022L69o52j218J278P96j890
$$ 1278 717 733 -290 1591 1302 129 446 1161 1460 -819 1203 1572 920 -298 980 1776 -114
3458a14M68P73M50k374J343P51p87j028N51J683k290j63J012K33j402n4J936j389
$$ -114 354 1127 1577 -797 546 1297 510 -518 33 1716 -574 -737 275 508 -894 -948 988 -401
3476d01o55J39J635j653n32J176J21p72o98J868q64n74N4J002k53j189J151J24
$$ -401 -1056 -917 718 -935 -1467 -291 -170 -942 -1640 228 -636 -1210 -1156 -154 -407 -1596 -445 -321
3494c21p8j685K155L79j610K90J124J98j780J345P23m93j299J202J128j821O22
$$ -321 -399 -2084 71 450 -1160 -870 254 452 -1328 17 740 247 -1052 150 1278 -543 79
3511G9M74P10j792P46J265q93l89L05J274j588j07Q84N96j156l38J721r75l42
$$ 79 553 1263 -529 217 1482 589 200 505 1779 191 84 968 1564 408 70 1791 816 474
3529D74j00J284p73j168J184N5m65j293J843j82r35m59J227O9j797J249N03o00
$$ 474 374 1658 885 -283 901 956 491 -802 1041 859 -76 -535 692 761 -1036 213 716 116
3547A16j448J279N74j760L31R92L20k169Q78J102j112p97Q94J426j889J23O88
$$ 116 -1332 -53 521 -1239 -908 84 404 -1765 -887 215 -897 -1694 -800 626 -1263 -1140 -452
3564d52P36j854M03J492p29p71M20J577j739n0P02L41o56o89J805l55o12l97J526
$$ -452 284 -1570 -1167 325 -404 -1175 -755 822 -917 -967 -265 76 -580 -1269 536 181 -431 -828 698
3583F98k65j482J378M79J7j540J793K1j060K4R99L59j904J098O66l79j139J214
$$ 698 433 -1049 329 808 825 -715 1078 1099 39 63 1062 1421 -483 615 1281 902 -237 977
3601I77O15j627K10O73L99j728Q47J076n36j123M25J261j968L34O32M41j098o95
$$ 977 1592 -35 175 848 1247 -481 366 1442 906 -217 208 1469 -499 -165 467 908 -190 -885
3619h85J673p42m32l32J505j198o87P53N74o06j420J962j73q01o67J370l72j176
$$ -885 788 46 -386 -718 787 -411 -1098 -345 229 -377 -1797 165 -8 -809 -1476 -106 -478 -1654
3637a654J109O19n34j371J728J11j021J88O01M67j773R97J016o94q38J008P68
$$ -1654 -545 74 -460 -1831 -103 8 -1013 -825 -224 243 -1530 -533 483 -211 -1049 -41 727
3654G27j720N48P76M85j459L49J174k02p54j21J517j192j65P71O25q20r63J794
$$ 727 -993 -445 331 816 -643 -294 880 678 -76 -197 1320 128 -37 734 1359 539 -424 1370
3672A370o6r42m02J649p85j045J091L38m23j344J893k89j087k41J356j08j611
$$ 1370 1304 362 -40 1609 824 -221 870 1208 785 -559 1334 1045 -42 -283 1073 965 -646
3689f46P66M93j39j395J184O40j518k03Q45O07j800P97L41k20p34L55Q85j148
$$ -646 120 613 474 -921 263 903 -615 -818 27 634 -1166 -369 -28 -248 -982 -627 258 -890
3707h90n6L38R11j382j73J301n8j059j80J649j111l18N13N41m20r04J521k87n15
$$ -890 -946 -608 303 -1079 -1252 49 -9 -1068 -1248 401 -710 -1028 -515 26 -394 -1298 223 -64 -579
3726e79l27J436j80j449J148M09L3j628J920Nr10j75J092M23j751J015M57k41
$$ -579 -906 530 350 -1099 49 458 491 -1137 783 788 -122 -297 795 1218 -533 482 939 698
3744F98p45O92M55r40J33L54O59j457M71P28k68o05k84J480r84m81L31R23j112
$$ 698 -47 645 1100 160 293 647 1306 -151 320 1048 780 175 -109 1371 387 -94 237 1160 48
3763D8o01J507n24o88n00J562p72q00N07O01k04j525J637o8r89m25J386j22j472
$$ 48 -553 954 430 -258 -758 804 32 -768 -261 340 136 -1389 248 180 -809 -1234 152 30 -1442
3782a442P97K36nj074J102M38j175l6Q29M04j704J010L72L35j443R12J016j226
$$ -1442 -645 -409 -414 -1488 -386 52 -1123 -1159 -330 74 -1630 -620 -248 87 -1356 -444 572 -654
3800f54j19J37J247j139l9J025J86p48l73J687r48o61M36Q68p90n72J494j10m42
$$ -654 -773 -636 611 -528 -567 458 644 -104 -477 1210 262 -399 37 905 115 -457 1037 927 485
3819D85o70J513p75o91O86M60j11j359J662k66m54n27R45M4j302P76L33J03j540
$$ 485 -185 1328 553 -138 548 1008 897 -462 1200 934 480 -47 898 942 -360 416 749 852 -688
3838f88Q46P85j077n2pQ58j029j96R30j46q50N6J142q66n13Q3J359j035o81J085
$$ -688 158 943 -134 -186 -193 665 -364 -560 370 224 -626 -570 572 -294 -807 -724 635 -400 -1081 4
3858Dk90o16l39J628n85j042L48J121p30r40J507q8n13o82J286R6j338O49P24
$$ 4 -286 -902 -1241 387 -198 -1240 -892 229 -501 -1441 66 -22 -535 -1217 69 165 -1173 -524 200
3877B00j5j253J210J37k84n26R16N75j238L14M08N28j226N48M57n06j17L1J292
$$ 200 185 -1068 142 279 -5 -531 385 960 -278 36 444 972 -254 294 751 245 128 159 1451
3896A451j418j52R77n6n77m19J557j003k15L50Q78j237l84J090j83m01q64J834
$$ 1451 33 -119 858 802 225 -194 1363 360 145 495 1373 136 -248 842 659 258 -606 1228
3914A228p90p06J88P54n12r31J068j50m51m67R80K37j210N36O1L30j578R91K19
$$ 1228 438 -268 -80 674 162 -769 299 149 -302 -769 211 448 -762 -226 -165 165 -1413 -422 -203
3933b03j79n74L99P33j438N18J25P21j146K09Q80o86j60K81J150j181l83P92M20
$$ -203 -382 -956 -557 176 -1262 -744 -619 102 -1044 -835 45 -641 -801 -520 630 -551 -934 -142 278
3952B78l93p45J503o78j49k9J073q35n31J178j08k79q70J398n14m62L08O41Nj190
$$ 278 -115 -860 643 -35 -184 -213 860 25 -506 672 564 285 -585 813 299 -163 145 786 791 -399
3972c99J163K9j90m81N31M30r71K71K00J34r11O19L56l85l68m0R60j361L29N95
$$ -399 764 793 603 122 653 1083 112 383 583 717 -194 425 781 396 28 -12 948 -413 -84 511
3992E11J54j147O5R34m88q27M80R30q88o93Q09N1l02o17J215n44l16O9M90j73
$$ 511 665 -482 -417 517 29 -798 -318 612 -276 -969 -160 -109 -411 -1028 187 -357 -673 -604 -114 -287
4012b87j144J215N8j79p28Q98j30m03J9M36K56j367J252K39j47p86O49R73j122
$$ -287 -1431 -216 -158 -337 -1065 -167 -297 -700 -681 -245 11 -1356 -104 135 -12 -798 -149 824 -298
4031b98K7N06L27p91K52M48k20m96L02Q81p59m9M32K95q28K0R99n32k10l9M65
$$ -298 -271 235 562 -229 23 471 251 -245 57 938 179 130 562 857 29 49 1048 516 306 267 732
4052G32m36l53P19j1l36m16Q53l35m50O4N88p9q91N94J77j70q01P90K16q86l2
$$ 732 296 -57 662 651 315 -101 752 417 -33 31 619 540 -351 243 420 250 -551 239 455 -431 -463
4073d63L16M23j157O24J63k72l96J48J026j221K75K13O57j116j93R97l57n37K2
$$ -463 -147 276 -881 -257 -94 -366 -762 -614 412 -809 -534 -321 336 -780 -973 24 -333 -870 -848
4092h48J055r15j69P04L37l61n13J106o75k36K73R41n82o03R61m43K44n77O92
$$ -848 207 -708 -877 -173 164 -197 -710 396 -279 -515 -242 699 117 -486 475 32 276 -301 391
4111C91j55l28J25M27J91q53O64J67j61p41O97M26n90m7L44L80j096N43L7K48
$$ 391 236 -92 33 460 651 -202 462 629 468 -273 424 850 260 213 557 937 -159 384 421 669
4131F69p07K17P98q23j78L43L97q35p2Q02n02k79j61Q57p10l35L82J76J41j076
$$ 669 -38 179 977 154 -24 319 716 -119 -191 611 109 -170 -331 526 -184 -519 -137 39 180 -896
4151h96J169n09k03j51M57np62O33K17J24j019P81l6k78m5L91J06j070P39L51
$$ -896 273 -236 -439 -590 -133 -138 -900 -267 -50 74 -945 -164 -200 -478 -523 -132 -26 -1096 -357 -6
4171fk07l97K10Q13r35L0M22N35j067K56N17j29k53J60P76q71n3L92N81p17r4
$$ -6 -213 -610 -400 413 -522 -492 -70 465 -602 -346 171 42 -211 -51 725 -146 -199 193 774 57 -37
4192c7Q23n36m9r0N10j62n46K89L44j7p38R00j17l28j73N58N6r27L31M02j60o21
$$ -37 786 250 201 111 621 459 -87 202 546 529 -209 691 574 246 73 631 687 -240 91 493 333 -288
4214b88M81L60n12j05j07O93j254O15J80P5o28k62J305q57m31L70L40p23l6J088
$$ -288 193 553 41 -64 -171 522 -732 -117 63 138 -490 -752 553 -304 -735 -365 -25 -748 -784 304
4234C04n67k16k76R74o41l03M64K13k13n90Q77m44L5l00P03j83m19M57R0o7m62
$$ 304 -263 -479 -755 219 -422 -725 -261 -48 -261 -851 26 -418 -383 -683 20 -163 -582 -125 -35 -102 -564
4255e64O93K93m18l24O82K86j100M95K89O7o92P75Q1m03J59K5N26j139N61M17
$$ -564 129 422 4 -320 362 648 -452 43 332 399 -293 482 563 160 319 344 870 -269 292 709
4275G09r9m52J16Q10p49j61J16J97m25j19O93k87n22M5P18o24j10J35L58j90o80
$$ 709 610 158 274 1084 335 174 290 487 62 -57 636 349 -173 -128 590 -34 -144 -9 349 159 -521
4296e21R98m59k58j98N44L1p34M69K35k30o54Q16jm79k00K96M53r04L32L56R4
$$ -521 477 18 -240 -438 106 137 -597 -128 107 -123 -777 39 38 -441 -641 -345 108 -796 -464 -108 -14
4317a4m82K70K95q04K66M02J44q45J37M43J59l8M2J45J45p78O86M07n50q84J588
$$ -14 -496 -226 69 -735 -469 -67 77 -768 -631 -188 -29 -67 -25 120 265 -513 173 580 30 -854 734
4338G34o44L83q90Q66k17J0k38O07L53j019J083n88K56k39M31K33j319N35r6J53
$$ 734 90 473 -417 449 232 242 4 611 964 -55 1028 440 696 457 888 1121 -198 337 241 394
4358C94o16L26J007r22o12N18j9J6k12J60J45m16J59O05k44m75K34J81l46M14
$$ 394 -222 104 1111 189 -423 95 76 92 -120 40 185 -231 -72 533 289 -186 48 229 -117 297
4378B97k37j14J14m80Q64J30j207l38J013j92p27J393k01r60p91J296M7o6k5R3
$$ 297 60 -54 60 -420 444 574 -633 -971 42 -150 -877 516 315 -645 -1436 -140 -93 -159 -184 -91
4398i1%j192J469O15j063m85O65J302j534M24m16J006q36O64N35j101J54k66J382
$$ -91 -91 -1283 186 801 -262 -747 -82 1220 -314 110 -306 700 -136 528 1063 -38 116 -150 1232
4417A232j135k41J153n93q83P76K53Q06j549Q91k19L06j256J256N47p37n17L85
$$ 1232 97 -144 1009 416 -467 309 562 1368 -181 710 491 797 -459 797 1344 607 90 475
4435D75m24o2M72M54Q1j251J115n69L0m08k68J275m52k99P49r4j765R58p0o03
$$ 475 51 -11 461 915 996 -255 860 291 321 -87 -355 920 468 169 918 824 -941 17 -53 -656
4455f56K03K9N65j58n33k52O37m82n07J343o9n85k22N71n87M32M21m58M63k80
$$ -656 -453 -424 141 -17 -550 -802 -165 -647 -1154 189 120 -465 -687 -116 -703 -271 150 -308 155 -125
4475a25K80j31m49J75N53n05J88K01J33n8k52J89m6k57j55O35J79r40O97n8l69
$$ -125 155 24 -425 -250 303 -202 -14 187 320 262 10 199 153 -104 -259 376 555 -385 312 254 -115
4496a15J43O36k8o47L43J29j0n92J96O31l26n57L06M35k87k05L01N5m59K0K21
$$ -115 28 664 636 -11 332 461 451 -141 55 686 360 -197 109 544 257 52 353 408 -51 -31 190
4517A90j58j61j93Q56o75j69L83l4m02j07P30k43k43j00K44m3n61P06l19J41n17
$$ 190 32 -129 -322 534 -141 -310 73 39 -363 -470 260 17 -226 -326 -82 -125 -686 20 -299 -158 -675
4538f75O64P9o35J84K89L5o40P19R9l50j79K06N00m56j6N6K24m05K4P26m04j80
$$ -675 -11 68 -567 -383 -94 -59 -699 20 119 -231 -410 -204 296 -160 -176 -120 104 -301 -277 449 45 -135
4560a35K4N75o39K22K03m8Jj52N47k22l51J13O23l78l60K52J79k59l70N99k14
$$ -135 -111 464 -175 47 250 202 203 51 598 376 25 138 761 383 23 275 454 195 -175 424 210
$$ [...]
8191D0
##END NTUPLES=NMR FID
##END=
