##TITLE=1H_CG-1049-A22
 CDCl3, 8 sc, 
 20.11.2020
##JCAMPDX= 6.0         $$ Bruker NMR JCAMP-DX V2.0
##DATA TYPE= NMR SPECTRUM
##DATA CLASS= NTUPLES
##ORIGIN= UXNMR, Bruker Analytische Messtechnik GmbH
##OWNER= root
$$ XWIN-NMR		Version 3.5
$$ Fri Nov 20 10:58:24 2020 Russian Standard Time (UT+4h)  she@DPX200
##.OBSERVE FREQUENCY= 200.1315066352
##.OBSERVE NUCLEUS= ^1H
##.ACQUISITION MODE= SIMULTANEOUS
##.ACQUISITION SCHEME= undefined
##.AVERAGES= 8
##.DIGITISER RES= 18
##SPECTROMETER/DATA SYSTEM= spect
##.PULSE SEQUENCE= zg30
##.SOLVENT NAME= CDCl3
##.SHIFT REFERENCE= (INTERNAL, CDCl3, 0, 15.9927)
##AUDIT TRAIL= $$ (NUMBER, WHEN, WHO, WHERE, WHAT)
$$ ##TITLE= Audit trail, XWIN-NMR		Version 3.5
$$ ##JCAMPDX= 5.01
$$ ##ORIGIN= Bruker BioSpin GmbH
$$ ##OWNER= she
$$ F:/spectra/data/she/nmr/H-F/1/pdata/1/auditp.txt
$$ ##AUDIT TRAIL=  $$ (NUMBER, WHEN, WHO, WHERE, WHAT)
(   1,<2020-11-20 10:57:13.82 +0400>,<she>,<DPX200>,
      <created by zg, POWCHK disabled, PULCHK disabled
       configuration hash MD5:
       00 E9 B6 7A A2 85 ED C7 34 08 36 98 17 FE 4E 26
       data hash MD5: 16K
       14 AC D6 D0 79 90 73 39 D8 CC C2 CF 1B D5 F3 C0>)
(   2,<2020-11-20 10:57:16.60 +0400>,<she>,<DPX200>,
      <Start of raw data processing
       efp BC_mod = 2 LB = 0.24 FT_mod = 6 PKNL = 1 PHC0 = -11053.27 PHC1 = 18.60091 SI = 16K 
       data hash MD5: 16K
       36 9E CB 74 90 57 AA B0 39 15 9C DD 4E 86 B7 DD>)
(   3,<2020-11-20 10:57:37.98 +0400>,<she>,<DPX200>,
      <pk PHC0 = 3.30241 PHC1 = -5 
       data hash MD5: 16K
       81 40 B5 E1 37 82 62 79 FB 0E 32 A7 7A F4 9C F7>)
(   4,<2020-11-20 10:57:41.43 +0400>,<she>,<DPX200>,
      <abs ABSG = 5 
       data hash MD5: 16K
       0C 08 49 19 3F 17 B4 99 C4 04 FB 8D AF BE 93 7C>)
$$ ##END=
$$ 
$$ hash MD5
$$ C0 6B 30 2E D6 44 AB 34 19 BA 75 CD 3D FC 28 3F
##$RELAX= 
##$RELAX= 
##$RELAX= 
##$RELAX= 
##$RELAX= 
##$RELAX= 
$$ Bruker specific parameters
$$ --------------------------
##$DU= <F:/spectra>
##$EXPNO= 1
##$NAME= <H-F>
##$PROCNO= 1
##$TYPE= <nmr>
##$USER= <she>
##$AMP= (0..31)
100 100 100 100 100 100 100 100 100 100 100 100 100 100 100 100 100 100 
100 100 100 100 100 100 100 100 100 100 100 100 100 100 
##$AQSEQ= 0
##$AQ_mod= 1
##$AUNM= <au_zg>
##$AUTOPOS= <>
##$BF1= 200.13
##$BF2= 200.13
##$BF3= 200.13
##$BF4= 200.13
##$BF5= 200.13
##$BF6= 200.13
##$BF7= 200.13
##$BF8= 200.13
##$BYTORDA= 1
##$CFDGTYP= 0
##$CFRGTYP= 5
##$CHEMSTR= <none>
##$CNST= (0..31)
1 1 145 1 1 1 1 1 1 1 1 1 1 1 1 1 1 1 1 1 1 1 1 1 1 1 1 1 1 1 1 1 
##$CPDPRG= <>
##$CPDPRG1= <>
##$CPDPRG2= <>
##$CPDPRG3= <>
##$CPDPRG4= <mlev>
##$CPDPRG5= <mlev>
##$CPDPRG6= <mlev>
##$CPDPRG7= <mlev>
##$CPDPRG8= <mlev>
##$CPDPRGB= <>
##$CPDPRGT= <>
##$D= (0..31)
0 1.2 0 0 0 0 0 0 0 0.06 0 0.03 0 0 0 0 0.0002 0 0 0 0 0 0 0 0 0 0 0 0 
0 0 0 
##$DATE= 1605855433
##$DBL= (0..7)
120 120 120 120 120 120 120 120 
##$DBP= (0..7)
150 150 150 150 150 150 150 150 
##$DBP07= 0
##$DBPNAM0= <>
##$DBPNAM1= <>
##$DBPNAM2= <>
##$DBPNAM3= <>
##$DBPNAM4= <>
$$ [...]
##$SUBNAM3= <"">
##$SUBNAM4= <"">
##$SUBNAM5= <"">
##$SUBNAM6= <"">
##$SUBNAM7= <"">
##$SUBNAM8= <"">
##$SUBNAM9= <"">
##$SW= 16.9725356469052
##$SWIBOX= (0..15)
0 0 2 0 0 0 0 0 0 0 0 0 0 0 0 0 
##$SW_h= 3396.73913043478
##$TD= 16384
##$TD0= 1
##$TE= 0
##$TE2= 300
##$TE3= 300
##$TEG= 300
##$TL= (0..7)
0 120 120 120 120 120 120 120 
##$TP= (0..7)
150 150 150 150 150 150 150 150 
##$TP07= 0
##$TPNAME0= <>
##$TPNAME1= <>
##$TPNAME2= <>
##$TPNAME3= <>
##$TPNAME4= <>
##$TPNAME5= <>
##$TPNAME6= <>
##$TPNAME7= <>
##$TPOAL= (0..7)
0.5 0.5 0.5 0.5 0.5 0.5 0.5 0.5 
##$TPOFFS= (0..7)
0 0 0 0 0 0 0 0 
##$TUNHIN= 0
##$TUNHOUT= 0
##$TUNXOUT= 0
##$USERA1= <user>
##$USERA2= <user>
##$USERA3= <user>
##$USERA4= <user>
##$USERA5= <user>
##$V9= 5
##$VALIST= <valist>
##$VCLIST= <CCCCCCCCCCCCCCC>
##$VD= 0
##$VDLIST= <DDDDDDDDDDDDDDD>
##$VPLIST= <PPPPPPPPPPPPPPP>
##$VTLIST= <TTTTTTTTTTTTTTT>
##$WBST= 1024
##$WBSW= 4
##$XGAIN= (0..3)
0 0 0 0 
##$XL= 0
##$YL= 0
##$YMAX_a= 590422
##$YMIN_a= -476570
##$ZGOPTNS= <>
##$ZL1= 120
##$ZL2= 120
##$ZL3= 120
##$ZL4= 120
##$ABSF1= 15.9761
##$ABSF2= -0.996562
##$ABSG= 5
##$ABSL= 3
##$ALPHA= 0
##$AQORDER= 0
##$ASSFAC= 0
##$ASSFACI= 0
##$ASSFACX= 0
##$ASSWID= 0
##$AUNMP= <proc_1d>
##$AZFE= 0.1
##$AZFW= 0.1
##$BCFW= 0
##$BC_mod= 2
##$BYTORDP= 0
##$COROFFS= 0
##$CY= -3
##$DATMOD= 1
##$DC= 0
##$DFILT= <>
##$DTYPP= 0
##$F1P= 0
##$F2P= 0
##$FCOR= 1
##$FTSIZE= 16384
##$FT_mod= 6
##$GAMMA= 0
##$GB= 0
##$INTBC= 1
##$INTSCL= 1.245715e-10
##$ISEN= 128
##$LB= 0.24
##$LEV0= 0
##$LPBIN= 0
##$MAXI= 10000
##$MC2= 0
##$MEAN= 0
##$ME_mod= 0
##$MI= 1.114404
##$NCOEF= 0
##$NC_proc= -7
##$NLEV= 6
##$NOISF1= 3.799351
##$NOISF2= 2.8
##$NSP= 0
##$NTH_PI= 0
##$NZP= 0
##$OFFSET= 15.99267
##$PC= 1
##$PHC0= -11049.97
##$PHC1= 13.60091
##$PH_mod= 1
##$PKNL= yes
##$PPARMOD= 0
##$PSCAL= 0
##$PSIGN= 0
##$REVERSE= no
##$SF= 200.13000439172
##$SI= 16384
##$SIGF1= 3
##$SIGF2= 2
##$SINO= 5.538805
##$SIOLD= 16384
##$SREGLST= <1H.CDCl3>
##$SSB= 0
##$STSI= 16384
##$STSR= 0
##$SW_p= 3396.73913043478
##$SYMM= 0
##$S_DEV= 0
##$TDeff= 16384
##$TDoff= 0
##$TI= <>
##$TILT= no
##$TM1= 0
##$TM2= 0
##$TOPLEV= 0
##$USERP1= <user>
##$USERP2= <user>
##$USERP3= <user>
##$USERP4= <user>
##$USERP5= <user>
##$WDW= 1
##$XDIM= 16384
##$YMAX_p= 494540649
##$YMIN_p= -1049917
$$ End of Bruker specific parameters
$$ ---------------------------------
##NTUPLES= NMR SPECTRUM
##VAR_NAME=  FREQUENCY,     SPECTRUM/REAL,   SPECTRUM/IMAG
##SYMBOL=    X,             R,               I
##VAR_TYPE=  INDEPENDENT,   DEPENDENT,       DEPENDENT
##VAR_FORM=  AFFN,          ASDF,            ASDF
##VAR_DIM=   16384,         16384,           16384
##UNITS=     HZ,            ARBITRARY UNITS, ARBITRARY UNITS
##FACTOR=    0.207333158178281, 1,           1
##FIRST=     3200.61312918385, 0,            0
##LAST=      -196.126001250934, 0,           0
##MIN=       -196.126001250934, -1049917,    0
##MAX=       3200.61312918385, 494540649,    0
$$ Real data points
##PAGE= N=1
##DATA TABLE= (X++(R..R)), XYDATA
$$ [...]
6504G795799K10735j60042M66004j72011J59818m5082k41505k92544m31648m66455
6494F823069k31908l90112k13498r1127m43377k83k76650k7275K55261J68458
6484E572558l40193m05043R0503l21211k51467K90460P8608J30412Q7643l51706
6474D580564l82795j91551M6321M45774j06470J13254N0251j15143J9976K94088
6464D754269K28727n6130R6859l44741k12324O3626l614K26754j54794j09115
6454D489517N26605m15032k02544j40855N5581m2L8569r3106j15311p0676k42682
6443C830024L56345L68692j45065k38602o3099K68615K99099K65830j62938l03671
6433D475230J51289O969j09661j38960r2344Q3802L32584L5753K22171M31420
$$ y = [7795799, 8006534, 7846492, 8312496, 8140485, 8300303, 8255221, 8013716, 7721172, 7289524, 6823069, 6591161, 6201049, 5987551, 5896424, 5453047, 5452764, 5176114, 5148839, 5404100, 5572558, 5232365, 4827322, 4917825, 4596614, 4345147, 4635607, 4714215, 4844627, 4932270, 4580564, 4197769, 4006218, 4052539, 4498313, 4391843, 4505097, 4555348, 4440205, 4460181, 4754269, 4982996, 4926866, 5023725, 4678984, 4466660, 4530286, 4526672, 4753426, 4598632, 4489517, 5016122, 4601090, 4398546, 4257691, 4313272, 4313230, 4351799, 4258693, 4143382, 4072706, 3830024, 4186369, 4555061, 4409996, 4171394, 4108295, 4376910, 4676009, 4941839, 4778901, 4475230, 4626519, 4633488, 4523827, 4384867, 4292523, 4376325, 4708909, 4744662, 4966833, 5398253]
6423E398253j08136l59262M11132K73026L98206J15463m7444L28129L37419J32518
6413F879304l87223j77987R0819j16335l9491R3754k85568k65454j33900k06305
6403E451614j75579K0000j23273j52309m8780n5406l7655J78074j9397m54398
6393D582891r9279O9208O4792k68308J16486J10654j8856L35249j18065L986J49632
6382D928390o70493R6107J29356M91369J56201l68334P5935l3711P5785j67458
6372D713147K44652j28592L14727J07829R5739j28290J58381L34656M17053n844
6362F123458K801m2686O4362m1517j39446l80511K65469P2220l38558L1149P9777
6351E696518J03822L40738M43384J2261J05495j43687m2880k49348K80772J28237
$$ y = [5398253, 5290117, 4930855, 5341987, 5615013, 6013219, 6128682, 6081238, 6409367, 6746786, 6879304, 6492081, 6314094, 6404913, 6288578, 6249087, 6342841, 6057273, 5791819, 5657919, 5451614, 5276035, 5296035, 5172762, 5020453, 4971673, 4916267, 4878612, 5056686, 5037289, 4582891, 4483612, 4552820, 4617612, 4349304, 4465790, 4576444, 4557588, 4892837, 4774772, 4778758, 4928390, 4257897, 4354004, 4483360, 4974729, 5130930, 4762596, 4838531, 4804820, 4880605, 4713147, 4957799, 4829207, 5143934, 5251763, 5347502, 5219212, 5377593, 5712249, 6129302, 6123458, 6126259, 6083573, 6147935, 6106418, 5966972, 5586461, 5851930, 5924150, 5585592, 5616741, 5696518, 5800340, 6141078, 6584462, 6596723, 6702218, 6558531, 6515651, 6266303, 6547075, 6675312]
6341F675312k26189J60834J70888K54893j48034K32595M845N4817L73187J6129
6331G569277N27804P8112J07117k15141k71722K09919K08470N9313O8606l5130
6321H306625R8222K56799M91064p1516J60666J31286M3419K76858L11158L56972
6311A0361553O7030R3125L33709K90202j35515J33806J09500J82670L52926N83605
6301A2372611J58800J08592J81789M69057p7750M8486K24026N27272M74216K82215
6291A4769314M40857M44945M15948L59712M30716J82735O47721O48467M11942
6282A8752357P76646O57822M30741P13124O66514R48383P98002J020442P76456
6273B5540487J056760J275032J239095J068608J024478J256392J907756J523914
$$ y = [6675312, 6449123, 6609957, 6780845, 7035738, 6887704, 7120299, 7125144, 7179961, 7553148, 7569277, 8097081, 8175193, 8282310, 8067169, 7795447, 8005366, 8213836, 8273149, 8341755, 8306625, 8404847, 8661646, 9152710, 9081194, 9241860, 9373146, 9416565, 9693423, 10004581, 10361553, 10428583, 10521708, 10855417, 11145619, 11010104, 11143910, 11253410, 11436080, 11789006, 12372611, 12531411, 12640003, 12821792, 13290849, 13213099, 13261585, 13485611, 14012883, 14487099, 14769314, 15210171, 15655116, 16071064, 16430776, 16861492, 17044227, 17691948, 18340415, 18752357, 19529003, 20186825, 20617566, 21330690, 21997204, 22945587, 23743589, 24764031, 25540487, 26597247, 27872279, 29111374, 30179982, 31204460, 32460852, 34368608, 35892522]
6265C5892522J682202J804720J860576J863054J709065J915308J895111J567301
6257E0189859J693280J512137J388002J461139J243906Q96707O17104J3373k20777
6248E8794730N315n74390r63757r10417j354191j454627j360462j582446j874293
6239D8725462j844776j642132j415145j653163j963947j891821j833378j253052
6231C5228048j806202j411005j401050j780814j156281p01774r12749r97976r19291
6222B4140906j189135q06038m73376r90784r36439o07961k55590k49330p14911
6213A7917342q32598j79891p62596m66061K5469o73379l34126n8888m55686l43031
6203A3836555k74190r8582j59531l93432l80266n68972j4594q2008k24261j69841
$$ y = [35892522, 37574724, 39379444, 41240020, 43103074, 44812139, 46727447, 48622558, 50189859, 51883139, 53395276, 54783278, 56244417, 57488323, 58385030, 59002134, 59015507, 58794730, 58800045, 58225655, 57261898, 56351481, 54997290, 53542663, 52182201, 50599755, 48725462, 46880686, 45238554, 43823409, 42170246, 40206299, 38314478, 36481100, 35228048, 33421846, 32010841, 30609791, 28828977, 27672696, 26970922, 26058173, 25060197, 24140906, 22951771, 22145733, 21672357, 20681573, 19745134, 19137173, 18881583, 18632253, 17917342, 17084744, 16904853, 16142257, 15676196, 15701665, 15028286, 14694160, 14635272, 14179586, 13836555, 13562365, 13463783, 13304252, 12910820, 12530554, 11961582, 11946988, 11864980, 11640719, 11470878]
6193A1470878O154l04985l89491j98595n01361L2092J35287N1473J83422m7572
6183A0437302m57831n2638J06151M8056L57992l49336l86897k35043J24407k41905
6173I350258j62884j26267o982L94852L4404j71395k5199J65371j77275j20083
6163I154800k25005L80052j85810k38418J5316M3208J99227j70059l4098K44269
6153I183482l24463L2306J60149l57215R4657J60859k11816r90L51653J24898
6143I213520j07193K6865k03546R1521k81519K54857j63867l50200K70306K63
6133H751007J08300q4790j05901k04785k77301p3735O01045K02924j47656j29312
6123H639796m25327k11303L31287J29613j37470k2274J00969k56515j17487m83616
$$ y = [11470878, 11477032, 11172047, 10782556, 10583961, 10082600, 10114692, 10249979, 10301452, 10484874, 10437302, 9979471, 9926833, 10032984, 10081040, 10439032, 10089696, 9702799, 9467756, 9592163, 9350258, 9187374, 9061107, 9054125, 9448977, 9483381, 9311986, 9286787, 9452158, 9274883, 9154800, 8929795, 9309847, 9124037, 8885619, 8900935, 8944143, 9143370, 8973311, 8939213, 9183482, 8859019, 8891325, 9051474, 8694259, 8788916, 8949775, 8737959, 8736969, 9088622, 9213520, 9106327, 9133192, 8929646, 9021167, 8739648, 8994505, 8830638, 8480438, 8750744, 8751007, 8859307, 8774517, 8668616, 8463831, 8186530, 8112795, 8713840, 8916764, 8769108, 8639796, 8214469, 8003166, 8334453, 8464066, 8326596, 8304322, 8405291, 8148776, 8031289, 7547673]
6113G547673L7514P0944M8981L17015M6912J49459k88457K9451j21536L37238
6103H175194J24385l10106k35757j93526R2531J31237j5223k60741J23205j24728
6093G506471J72157J56884k36383J86922J05304l2773L04200j47550L1911k98529
6083G748614K45153P5161Q5527J40754R9584j38234J48851M14938L3204J71300
6073I024852J05950o3227K85457P17730M24443J29268K56450K38135J26707J34297
6063A1380062o1534j05350k00407J15038j76306j1101m93769m19277N4743j07854
6053I974245j18694J5997N135L45571O0259j57501j20262K23291j87445j1354
6043A0029242J79605j24711n5108J81783K08495l08577j27733K61583K06532J56193
$$ y = [7547673, 7585187, 7656131, 7705112, 8022127, 8069039, 8218498, 7930041, 7959492, 7837956, 8175194, 8299579, 7989473, 7753716, 7560190, 7652721, 7783958, 7768735, 7507994, 7631199, 7506471, 7678628, 7835512, 7599129, 7786051, 7891355, 7858582, 8162782, 8015232, 8047143, 7748614, 7993767, 8068928, 8154455, 8295209, 8394793, 8256559, 8405410, 8820348, 8853552, 9024852, 9130802, 9067575, 9353032, 10070762, 10495205, 10624473, 10880923, 11119058, 11245765, 11380062, 11318528, 11213178, 11012771, 11127809, 10951503, 10940402, 10446633, 10027356, 10082099, 9974245, 9855551, 9871548, 9876683, 10222254, 10282513, 10125012, 10004750, 10228041, 10040596, 10029242, 10208847, 10084136, 10029028, 10210811, 10419306, 10110729, 9982996, 10244579, 10451111, 10607304]
6033A0607304K98788L70148J43420L65872M37105O5151J51568j16064J09460K84444
6023A2717196K80711L51643N01328K63187r244Q66141P55487N04100N24427O11060
6013A7366036N39639J004551Q21779Q06489N60892P8684N20915J34467M11922
6004B2245374q1477j80046K99834K64963J90320K5693J95753p73144l20381J03149
5994B1970038J32352j5459n02201q33774q61565n84035m43676l30641n35801l68354
5984A7626884n06487k14797m75756l88022k84017j26768J06810K25304l4291J60738
5974A6089598k43637l21475M04274O43426Q784R7909k63103J72175M92078N33128
5964A7613157N96062J41573N75598N36382M74525N71574O55947O74881L57180
$$ y = [10607304, 10906092, 11276240, 11419660, 11785532, 12222637, 12287788, 12439356, 12323292, 12432752, 12717196, 12997907, 13349550, 13850878, 14114065, 14104821, 14970962, 15726449, 16230549, 16754976, 17366036, 17905675, 18910226, 19732005, 20538494, 21099386, 21178070, 21698985, 21833452, 22245374, 22163897, 21983851, 22283685, 22548648, 22738968, 22764661, 22960414, 22187270, 21866889, 21970038, 22102390, 22086931, 21584730, 20750956, 19889391, 19305356, 18861680, 18531039, 17995238, 17626884, 17120397, 16905600, 16429844, 16041822, 15757805, 15631037, 15737847, 15963151, 15928860, 16089598, 15845961, 15524486, 15928760, 16572186, 16580970, 16678879, 16415776, 16587951, 17080029, 17613157, 18209219, 18350792, 18926390, 19462772, 19937297, 20508871, 21164818, 21839699, 22196879]
5955B2196879N8834J12340K00409M5276Q3820P8600m9410M30404L17877k08036
5945B3266993m93775K4998m5602m78286k9374q3343Q726l02139K3928L77734O6603
5934B2336463k27258K78949l5984J18650J86384K85838J84771J07233L42586K83592
5924B3861224K39495L27254J06220L90842M80639N50460L73945N01750P48578
5915B7580407L28414O5126M31279O81804O13828O68083k0940l91207n51450m96113
5905B8909231q76725m05441p76802k30743l64369n70982r55932m57695q20024
5896B3450518p92853m42713k76250n24628m25683p19858n54120k25675m20828
5887A9067910l79328j52736m77491k93013j63219k36615k43076j17479r3330n45913
$$ y = [22196879, 22255713, 22368053, 22568462, 22613738, 22697558, 22776158, 22726748, 23157152, 23475029, 23266993, 22773218, 22798216, 22752614, 22274328, 22244954, 22161611, 22170337, 21868198, 21892126, 22269860, 22336463, 22109205, 22388154, 22352170, 22470820, 22657204, 22943042, 23127813, 23235046, 23577632, 23861224, 24100719, 24427973, 24534193, 24925035, 25405674, 25956134, 26330079, 26831829, 27580407, 27908821, 27973947, 28405226, 29087030, 29700858, 30368941, 30348001, 29956794, 29405344, 28909231, 28032506, 27627065, 26850263, 26619520, 26255151, 25684169, 24728237, 24270542, 23450518, 22657665, 22214952, 21938702, 21414074, 20988391, 20268533, 19714413, 19488738, 19067910, 18688582, 18535846, 18058355, 17765342, 17602123, 17365508, 17122432, 17004953, 16911623, 16365710]
5877A6365710K8685k16305n38476k99998L0309k51723j69875j73117k81048k05247
5867A4288915k43192J54581N70077j09934R9563l11269k00312K16326k29934j98206
5857A4036615j06225P1980j78989J99856o4330k94829j13919O1364j50017L23190
5847A3784696k20634k73768j20222k00036j46774j4072m42737j49916n10436J5203
5837A1721304l48108K5269L24358k11745l26802m04133n1794k71808l48878j22624
5827I985039r1815j72619J4530M8397o6807k43693j30713o51179L29484J27292
5817I147916K65513m65308J95715k21702K97949L35434k9054k9994j2234j17155
5807I367080J89504k30265K67924m61676p24483K53895L74844p4924l74979k11871
$$ y = [16365710, 16394395, 16178090, 15639614, 15339616, 15369925, 15118202, 14948327, 14775210, 14494162, 14288915, 14045723, 14200304, 14770381, 14660447, 14760010, 14448741, 14248429, 14464755, 14234821, 14036615, 13930390, 14002370, 13823381, 14023237, 13958907, 13664078, 13550159, 13611523, 13461506, 13784696, 13564062, 13290294, 13170072, 12970036, 12823262, 12809190, 12366453, 12216537, 11706101, 11721304, 11373196, 11398465, 11722823, 11511078, 11184276, 10780143, 10728349, 10456541, 10107663, 9985039, 9893224, 9720605, 9735135, 9783532, 9716725, 9473032, 9342319, 8691140, 9020624, 9147916, 9413429, 8948121, 9143836, 8922134, 9220083, 9555517, 9526463, 9496469, 9484235, 9367080, 9556584, 9326319, 9594243, 9132567, 8408084, 8661979, 9036823, 8961899, 8586920, 8375049]
5797H375049m2810k34667Q158P8237K4159j18992k85225M0334k05093K1465L16160
5786G976775l39318j80244L13287n0281K801K7890j05872O0467K64760r9911k33891
5775G636463k11926j06626J75225J48151L23m18289n76868r1632J79744L62886
5765G097451L39008L3538m98088p7631K0484m6774j92464k07476L08468K9598
5755F806114m5312J41834J70466P7876J77505j95823r2569j15309l48748k18506
5745F357528r6237O5828m30806j66557R1673l6059j73387J84690l9032J31502
5735E889143J62192r6130j63310l36493o6210Q106J73901J54571k42772k8949
5725E454049k43284J2942K06817l5995R0773j80590L1563k31901j07354L36728
$$ y = [8375049, 8332239, 8097572, 8105730, 8183967, 8208126, 8089134, 7803909, 7844243, 7639150, 7660615, 7976775, 7637457, 7457213, 7770500, 7720219, 7723020, 7750910, 7645038, 7705505, 7970265, 7870354, 7636463, 7424537, 7317911, 7493136, 7641287, 7641610, 7223321, 6646453, 6554821, 6734565, 7097451, 7436459, 7469997, 6971909, 6894278, 6914762, 6867988, 6675524, 6468048, 6776516, 6806114, 6760802, 6902636, 7073102, 7150978, 7328483, 7132660, 7040091, 6924782, 6576034, 6357528, 6261291, 6327119, 5896313, 5729756, 5821429, 5785370, 5611983, 5796673, 5757641, 5889143, 6051335, 5955205, 5791895, 5455402, 5389192, 5397298, 5571199, 5725770, 5482998, 5454049, 5210765, 5223707, 5430524, 5394529, 5485302, 5304712, 5336275, 5104374, 4997020, 5333748]
5715E333748p08399J61969K07645M91468p429k23612l62290J09498l90521L12263
5705D924340L43069N5852J94086k23118n05013Q6759J25480J95714O431k94392
5695D909208j8924m16130K63530K24088L60415k98735m8287j2663k51915q6588
5685D623999K0724k14549L01202M25748j07780J33190p0656k20868o7396L2612
5675D856226L4084J77031n7653J13105l18513n6816J44845M0300l36787n2267
5665D543555N7607M62485o6742L8306o2738m74371K65972J27265J47331l74751
5655D663919k12832K71891N5563K00037j44761j03573L8738k76047K60174j61175
5645D591934o0169j49020J88424k75671J41058O6482l6512P7268p264j89070P2846
$$ y = [5333748, 4625349, 4787318, 4994963, 5486431, 5479002, 5255390, 4893100, 5002598, 4612077, 4924340, 5267409, 5323261, 5517347, 5294229, 4789216, 4875975, 5001455, 5197169, 5203600, 4909208, 4890284, 4474154, 4737684, 4961772, 5322187, 5023452, 4975165, 4962502, 4710587, 4623999, 4644723, 4430174, 4731376, 5157124, 5049344, 5182534, 5111878, 4891010, 4823614, 4856226, 4890310, 5067341, 5009688, 5122793, 4804280, 4747464, 4892309, 4932609, 4595822, 4543555, 4601162, 5063647, 4996905, 5035211, 4972473, 4498102, 4764074, 4891339, 5038670, 4663919, 4451087, 4722978, 4778541, 4978578, 4833817, 4730244, 4768982, 4492935, 4753109, 4591934, 4531765, 4382745, 4571169, 4295498, 4436556, 4503038, 4466526, 4543794, 4536530, 4347460, 4420306]
5634D420306r0494J46282J18490J72911l55908p8756k13664J59094l18047J98820
5624D159034L11784j99881J26287j32437k6515k20281K52287J39929o3600o6233
5614D280374j70930K30987K41564N6192J02488j97489J8121K00416q7070p1809
5604D602844p9748J41629K15717r9114L53073K4584j15971J11001l08117N5463
5594D901361J50656J67610k1734o3730j3021K73322R4666K5656j63949J02375
5584E453212J62440L37094m18876j85067o266J90689M48105P3677l94205o8526
5574E592277L79387k02812J3638K03961q3153n89131J30633J87550K64180o9557
5564E826973j08328J82007m8528J07468L0456j15940L52560o7469r4089m58321
$$ y = [4420306, 4329812, 4476094, 4594584, 4767495, 4411587, 4332831, 4119167, 4278261, 3960214, 4159034, 4470818, 4270937, 4397224, 4264787, 4238272, 4017991, 4270278, 4410207, 4346607, 4280374, 4109444, 4340431, 4581995, 4638187, 4740675, 4543186, 4561307, 4761723, 4674653, 4602844, 4523096, 4664725, 4880442, 4781328, 5134401, 5158985, 5043014, 5154015, 4845898, 4901361, 5052017, 5219627, 5197893, 5134163, 5121142, 5394464, 5489130, 5514786, 5350837, 5453212, 5615652, 5952746, 5533870, 5348803, 5342537, 5533226, 5981331, 6055008, 5660803, 5592277, 5971664, 5768852, 5782490, 5986451, 5903298, 5314167, 5444800, 5632350, 5896530, 5826973, 5718645, 5900652, 5852124, 5959592, 5990048, 5874108, 6226668, 6159199, 6065110, 5606789]
5554E606789L84686O8192r2551l97073K32246O1142m7631O2734k72212L4702J55102
5543E796126j64431J31910k3585J32604l7827J56119j3965O0084K39744j07551
5533F169228k55929l7430L40975k4933l1195l5325R7685k7811j75285K07031l0200
5522F196811J40353K26260l6620P0701K7281J44538k48762j32962J79571J21813
5512F688984J09989k81899L23154J5920j60921J02472K03373N37416J70089q8293
5502G620284m5767J6742J70784P6764j6559k3702j49299J00057J58283J21247
5492H028834O8189L17930q4107K48455L99990J47494K00129K59823k7216n1612
5482I507909J49042Q0745M2669m3994J74933q6727k37275L21991M92397K87429
$$ y = [5606789, 5991475, 6059667, 5967116, 5570043, 5802289, 5863431, 5815800, 5878534, 5606322, 5641024, 5796126, 5631695, 5763605, 5740020, 5872624, 5834797, 5990916, 5976951, 6037035, 6276779, 6169228, 5913299, 5875869, 6216844, 6191911, 6160716, 6125391, 6223076, 6195265, 6019980, 6227011, 6196811, 6337164, 6563424, 6526804, 6597505, 6624786, 6769324, 6520562, 6387600, 6567171, 6688984, 6798973, 6517074, 6840228, 6856148, 6695227, 6797699, 7001072, 7538488, 7708577, 7620284, 7574517, 7591259, 7762043, 7838807, 7822248, 7798546, 7649247, 7749304, 7907587, 8028834, 8097023, 8414953, 8330846, 8579301, 8979291, 9126785, 9326914, 9586737, 9559521, 9507909, 9656951, 9737696, 9780365, 9736371, 9911304, 9824577, 9587302, 9909293, 10401690, 10689119]
5472A0689119L5177J123l90974K03695L86695J17973K2903J86138L36977K46716
5462A1835542l74257J47999L04632M91093K87860L31732L80595M64160K29640
5453A4098996N52730R48747P47973P18912O44172J058614Q44058R52742J355009
5444B1921953Q07539Q10818P29925N43586M97870M54414K87025K64681j47839
5435B6169972o0173L36435N49029O35274M85923P50632J462114J574243J741473
5426C3644922J953167J502435J369916P86005l82247j099281j984014k149129
5418C3641774k089433k223815j916164k414809j651691j482272j353363j244376
5410A9265851j142995o94912j039983r26430l05325m79719q21854n49204p02864
$$ y = [10689119, 10724296, 10725419, 10334445, 10538140, 10924835, 11042808, 11065711, 11251849, 11588826, 11835542, 11461285, 11609284, 11913916, 12405009, 12692869, 13024601, 13405196, 13869356, 14098996, 14651726, 15600473, 16348446, 17067358, 17711530, 18770144, 19614202, 20566944, 21921953, 22729492, 23540310, 24270235, 24813821, 25311691, 25766105, 26053130, 26317811, 26169972, 26109799, 26446234, 26995263, 27630537, 28116460, 28867092, 30329206, 31903449, 33644922, 35598089, 37100524, 38470440, 39256445, 38874198, 37774917, 35790903, 33641774, 31552341, 29328526, 27412362, 24997553, 23345862, 21863590, 20510227, 19265851, 18122856, 17427944, 16387961, 15461531, 15156206, 14676487, 13854633, 13305429, 12602565]
5401A2602565l6431l84723n05790j65977l01879O9827m14951k73494M2823j05718
5391A0526252J9903m26354l13918L3042l31071K62365n49942k21129M2013j80895
5381H860266j15004J60158j84771n74165q5619L67072K05951j93237j30727J79514
5371H489438M4828P0310j11821p9011q3364J72771k72680l67047J81130k68380
5361G776174l29014q0073o5433J52590J31225p1524J70843j03718m5585O9763
5351G605248k82423p8952Q2606R3211K3825j3843k7326j62749J52305q4092l21674
5340F986136M9129O9888L24956j28264L73947L61271m58465m76628J03402L95004
5330G600376J87208j3005n749m6312j20584N9904J83727J90953J15479O5405J21853
$$ y = [12602565, 12566134, 12181411, 11675621, 11509644, 11207765, 11277592, 10862641, 10589147, 10631970, 10526252, 10546155, 10119801, 9805883, 9838925, 9507854, 9770219, 9220277, 8999148, 9041161, 8860266, 8745262, 8905420, 8720649, 8146484, 8060865, 8427937, 8633888, 8440651, 8309924, 8489438, 8534266, 8604576, 8492755, 8413744, 8330380, 8503151, 8230471, 7863424, 8044554, 7776174, 7447160, 7367087, 7301654, 7454244, 7585469, 7513945, 7684788, 7581070, 7535485, 7605248, 7322825, 7243873, 7326479, 7419690, 7443515, 7429672, 7402346, 7239597, 7391902, 7307810, 6986136, 7035265, 7105153, 7430109, 7301845, 7675792, 8037063, 7578598, 7101970, 7205372, 7600376, 7787584, 7774579, 7768830, 7722518, 7601934, 7661838, 7845565, 8036518, 8151997, 8217402, 8339255]
5319H339255K02977M76668R7750L4562K03242j35141K03355K9786K4348R5020
5309I571822J18385L78024J23529l09972m1527M8709K22920J38360K3490j52323
5299A0121417O50543K60096p4443k43603M44967r0369L44M5833P1061j90492j51168
5288A0844186N7831n9079M2791J54542O0496K39239J09138l3787L88135J14422
5278A1917914L75855L2173J24360j57634j14909j13577K39767k1942O1276K17852
5268A2561135K0453R1137J7683N7271K6021L39570L21255K46192L83805L34349
5258A4398871K42113k06891n4331L00118L97002N5650j05148K63795l339J73684
5248A5461524K49485J69945M09673J08478M28642L22320J11557L80723L28715
$$ y = [8339255, 8542232, 9018900, 9116650, 9151212, 9354454, 9219313, 9422668, 9452454, 9476802, 9571822, 9690207, 10068231, 10191760, 9881788, 9840261, 9888970, 10111890, 10250250, 10273740, 10121417, 10771960, 11032056, 10957613, 10714010, 11158977, 11068608, 11068952, 11114785, 11185846, 10995354, 10844186, 10902017, 10842938, 10885729, 11040271, 11100767, 11340006, 11449144, 11415357, 11803492, 11917914, 12293769, 12325942, 12450302, 12292668, 12177759, 12064182, 12303949, 12282007, 12343283, 12561135, 12581588, 12672725, 12690408, 12747679, 12773700, 13113270, 13434525, 13680717, 14064522, 14398871, 14640984, 14434093, 14379762, 14679880, 15076882, 15132532, 15027384, 15291179, 15287840, 15461524, 15711009, 15880954, 16290627, 16399105, 16827747, 17150067, 17261624, 17642347, 17971062]
5239A7971062K69092j05273J3750J43081R3185j16155r7828J11196J24130O531
5229A8412771L5940k39750m99916J62335J65562l6048j06062l08971r1888M8725
5219A7542698K99069n087o45261p1524R8862k8778k85193r9625l89138j18098
5209A6297925j59035j14529K39897K51511K46995K50502M4486O4813l35025o7510
5199A6720030K94990Q8963j97936j28126K73575k1390K09478J43496L13486L54690
5189A8051256M11286j44442L73218K78492P4393J52403L69245J88458k05648M1550
5179A9590211J02354k77827R957L1378K45976k9361J64346L9702l73468K2680
5169A9525948j58990k73774j21199J7495l33658l81501J3972l065m91999q0472
$$ y = [17971062, 18240154, 18134881, 18148631, 18291712, 18384897, 18268742, 18170914, 18282110, 18406240, 18412771, 18448711, 18208961, 17709045, 17871380, 18036942, 18000894, 17894832, 17585861, 17493973, 17542698, 17841767, 17836680, 17191419, 17119895, 17218757, 17189979, 16904786, 16805161, 16416023, 16297925, 16138890, 16024361, 16264258, 16515769, 16762764, 17013266, 17057752, 17122565, 16787540, 16720030, 17015020, 17103983, 16906047, 16777921, 17051496, 17030106, 17239584, 17383080, 17696566, 18051256, 18462542, 18318100, 18691318, 18969810, 19044203, 19196606, 19565851, 19754309, 19548661, 19590211, 19692565, 19414738, 19424695, 19456073, 19702049, 19672688, 19837034, 19876736, 19503268, 19525948, 19366958, 19093184, 18971985, 18989480, 18655822, 18274321, 18288293, 18285228, 17793229, 17712757]
5159A7712757j89797R1667l31345j55369j9426j71124l8202j73321o80897k79887
5149A5765056K19139K11116l97069j03873K50716j06271j28169j00566j07317
5140A5502762j04795K03523r2548L4667K16752q7052J42878k02655J32962K02714
5130A5949208k6152O332M8066L46509K15881K53427L53376L7374J52409L28114
5120A7664544K6839L35091K96856J34719l09524L60979N06866J03111R9485L77631
5110A9596597j22490K18631N09192L26756k19006n59275R8815r6700n7049k37033
5100A9458438n0891m506k47827J40824K13975j57209O3275J86751p3712L83268
5090A9912386L61242K45565K20415R7419P2757J41348Q8898J59179k63355k01317
$$ y = [17712757, 17522960, 17614627, 17283282, 17127913, 17108487, 16937363, 16899161, 16725840, 16044943, 15765056, 15984195, 16195311, 15798242, 15694369, 15945085, 15838814, 15710645, 15610079, 15502762, 15397967, 15601490, 15508942, 15543609, 15760361, 15673309, 15816187, 15613532, 15746494, 15949208, 15923056, 15929388, 15977454, 16323963, 16539844, 16793271, 17146647, 17184021, 17336430, 17664544, 17691383, 18026474, 18323330, 18458049, 18148525, 18509504, 19016370, 19119481, 19218966, 19596597, 19474107, 19692738, 20201930, 20528686, 20309680, 19750405, 19849220, 19752520, 19695471, 19458438, 19407547, 19403041, 19155214, 19296038, 19510013, 19352804, 19416079, 19602830, 19529118, 19912386, 20273628, 20519193, 20739608, 20837027, 20909784, 21051132, 21140030, 21299209, 21035854, 20834537]
5080B0834537J43266K05998k09714j39872M57064Q1886J59167K89056l90244J45578
5070B1576722j8439L5456K93332L36381L91752r207j89303L44075K51506M59128
5060B3471403M45893J23182J91203j90880O27728L41052N62039N1959K97476m2586
5050B5878469K6340L27078J76689j67079P2170K68301J23632J99817J4811J61195
5040B7081423K30761K51673M47231L65683L19915J77893K40251L3463L25110O58658
5030C0132061M34145M00354P9333J3622O3176O04249O00014L29864L23109M96552
5020C3476479R10554M19031K68204O49206P35831Q46470N62085P17912N32673
5011C9118445N88731P94222J147200J125767J419540J217092J105193R83209J693110
$$ y = [20834537, 20977803, 21183801, 20974087, 20834215, 21291279, 21373165, 21532332, 21821388, 21431144, 21576722, 21558283, 21593739, 21887071, 22223452, 22615204, 22605997, 22416694, 22760769, 23012275, 23471403, 23917296, 24040478, 24231681, 24040801, 24668529, 25009581, 25571620, 25623579, 25921055, 25878469, 25904809, 26231887, 26408576, 26241497, 26313667, 26581968, 26705600, 26905417, 26920228, 27081423, 27312184, 27563857, 28011088, 28376771, 28696686, 28874579, 29114830, 29148293, 29473403, 30132061, 30566206, 30966560, 31045893, 31059515, 31122691, 31726940, 32326954, 32656818, 32979927, 33476479, 34387033, 34806064, 35074268, 35723474, 36459305, 37305775, 37867860, 38585772, 39118445, 39707176, 40501398, 41648598, 42774365, 44193905, 45410997, 46516190, 47499399, 49192509]
5002D9192509K253363K378521J908705K495545K705084L161997L763463L918640
4994G1777827M335373M274592L545310K281477J269108l35993j810435k220549
4986H3116710j718787j357735j085063j313370j129887p63938j39720l87037L05099
4977G5526272L67234L34689J279150J241879J663128K472832K677051L008190
4969H8570425L382839L701070M651052N254834N926112P165859P725739Q733988
4961A35111918R503573Q729480P150114M550300J565755j263722k598141l021547
4953A59727730k906339k109594o33444j43691r17959k175434l967559n009449
4945A41864261n941418n579242m643886l630066k383081j867876j549261q95960
$$ y = [49192509, 51445872, 53824393, 55733098, 58228643, 60933727, 64095724, 67859187, 71777827, 76113200, 80387792, 83933102, 86214579, 87483687, 87147694, 85337259, 83116710, 81397923, 80040188, 78955125, 77641755, 76511868, 75747930, 75608210, 75221173, 75526272, 75893506, 76228195, 77507345, 78749224, 80412352, 82885184, 85562235, 88570425, 91953264, 95654334, 100305386, 105560220, 111486332, 118652191, 126377930, 135111918, 144615491, 153344971, 160495085, 165045385, 166611140, 165347418, 162749277, 159727730, 156821391, 154711797, 154078353, 153934662, 153016703, 150841269, 146873710, 141864261, 135922843, 130343601, 125699715, 122069649, 119686568, 117818692, 116269431, 115373471]
4937A15373471o1423M97720J646087K172242L520894M263556M543309N850286
4929A37806142O202742P352596Q361518Q060117P181977O356072N210023K221668
4921A88752855j280802m286652o753181r004032j0388896j0719032j0097187r025879
4913A27197194p518604o575904n509865m391172l502606k897353k890150k029863
4905I1881677j533542q82870K29687Q91618L91302R25077J774660K602371K819660
4896I9099640L390925L062967L178172J176486j469691l857020n288740n423715
4888I3869024m821846m604654m057525l649826k948669k760446k577695j326932
4880F7121431j446710j356520j194884r85996j089146q71489r32260p92753l74518
$$ y = [115373471, 115312048, 115809768, 117455855, 119628097, 123148991, 127412547, 131955856, 137806142, 144008884, 151361480, 159722998, 167783115, 174965092, 181321164, 186531187, 188752855, 187472053, 183185401, 176432220, 167428188, 157039292, 146320260, 136223073, 127197194, 119678590, 113102686, 107592821, 103201649, 99699043, 96801690, 93911540, 91881677, 90348135, 89465265, 89694952, 90586570, 90977872, 91902949, 93677609, 96279980, 99099640, 102490565, 105553532, 108731704, 109908190, 108438499, 104581479, 99292739, 93869024, 89047178, 84442524, 80384999, 76735173, 73786504, 71026058, 68448363, 67121431, 65674721, 64318201, 63123317, 62137321, 61048175, 60176686, 59244426, 58451673, 58077155]
4871E8077155m40307n12583m75776m58755o81670j29059N69863K60605L62986
4862E6572459j32811L21884p798J54947L36989J60054J27386j6447n03264j59868
4852E6853531R789k65836k81900l03377k87496q80959p83528o41967m36107p7481
4842E2904669l48578j25154k35634l64894k15157R4436R5388L82245O07225K66267
4832E3060813L8093K20369J68356J10712J11636K26300l4068m42330k53104m07711
4822E2799066J2513K39924J90076L76877N43822l1632n87744k79569p95946n75489
4812E1891898p16125o41453k97590l53212m13019k70874m64690N5411O12458L72217
4802D9775021M77997M89000M04394K25252P32401J017701J278702J529670J377772
$$ y = [58077155, 57636848, 57124265, 56648489, 56189734, 55508064, 55379005, 55948868, 56209473, 56572459, 56439648, 56761532, 56753734, 56908681, 57245670, 57405724, 57533110, 57516663, 57013399, 56853531, 56863320, 56597484, 56315584, 56012207, 55724711, 54843752, 54060224, 53418257, 52982150, 52904669, 52556091, 52430937, 52195303, 51830409, 51615252, 51709688, 51805076, 52187321, 52794546, 53060813, 53098906, 53319275, 53487631, 53598343, 53709979, 53936279, 53902211, 53459881, 53206777, 52799066, 52811579, 53051503, 53241579, 53618456, 54162278, 54130646, 53542902, 53263333, 52467387, 51891898, 51175773, 50534320, 50236730, 49883518, 49470499, 49199625, 48734935, 48790346, 49402804, 49775021, 50253018, 50742018, 51146412, 51371664, 52104065, 53121766, 54400468, 55930138, 57307910]
4793E7307910J536366J464414J359902J316018L10132j180223j722081k276416
4785E8116022k518894k264816k668398k380970j928647j318079j396164j737214
4777D1902840j372852j524132j376661p80047p97395o02689o51592j317606p40713
4768C2739153l03615j30884p62465n31269l76581m67852l0431n17435M8509k13213
4758B9453917n18390j67104J10927k16123j84049L1962l03705P322J83655N5610
4748B8454022l79750o08159n22130M8034j80067l71178j13883n00415j58481K03289
4738B5871282o13773j18307k36916m48803n8313m17668J2484k75650l09161k65508
4728B3139667K71758l39534M3426j99643L9217k55093N2186p3151l01811L92782
$$ y = [57307910, 58844276, 60308690, 61668592, 62984610, 63294742, 62114519, 60392438, 58116022, 55597128, 53332312, 50663914, 48282944, 46354297, 45036218, 43640054, 41902840, 40529988, 39005856, 37629195, 36849148, 36051753, 35449064, 34797472, 33479866, 32739153, 32435538, 32304654, 31542189, 31010920, 30634339, 30166487, 30136056, 29618621, 29667130, 29453917, 28935527, 28768423, 28879350, 28663227, 28479178, 28511140, 28207435, 28214757, 28398412, 28454022, 28074272, 27466113, 26943983, 26992017, 26811950, 26440772, 26326889, 25826474, 25667993, 25871282, 25257509, 25139202, 24902286, 24453483, 24395170, 23977502, 23989986, 23714336, 23405175, 23139667, 23411425, 23071891, 23115317, 22915674, 22954891, 22699798, 22751984, 22678833, 22377022, 22769804]
4718B2769804K2798m71575J27690K45007K01582k92112J05705j12265k03213l25657
4708B2067764N5967J88225l38403P588l5149R6005K81268k060r6175N9305k02116
4697B2082219k97033M06409j11196j22625K12565K71915R4467K993K65804O9943
4687B2875461M49884j53919j60892r2313K34187K47099M54841k29105K57333O30543
4677B4513119k43681m50747K69321N57596J46479m18621N0233o3312M56182J0734
4667B4827303J1064o2108K95187M57881J05099j26468J89239K95554k38166J7896
4657B5772481L35862J28323L48772m5596q2227L47932j80616r3771N20624p1861
4647B6979923m6220k84507J18750K49389L85345o7024j11823J8257j60481O8650
$$ y = [22769804, 22792602, 22321027, 22448717, 22693724, 22895306, 22603194, 22708899, 22596634, 22393421, 22067764, 22123731, 22311956, 21973553, 21981141, 21945992, 22041997, 22323265, 22321205, 22225030, 22284335, 22082219, 21785186, 22191595, 22080399, 21957774, 22170339, 22442254, 22536721, 22539714, 22805518, 22875461, 23325345, 23171426, 23010534, 22918221, 23152408, 23399507, 23854348, 23625243, 23882576, 24513119, 24269438, 23818691, 24088012, 24645608, 24792087, 24373466, 24423699, 24360387, 24816569, 24827303, 24838367, 24776259, 25071446, 25529327, 25634426, 25507958, 25697197, 25992751, 25754585, 25772481, 26108343, 26236666, 26585438, 26539842, 26457615, 26805547, 26624931, 26531160, 27051784, 26979923, 26933703, 26649196, 26767946, 27017335, 27402680, 27335656, 27223833, 27242090, 27081609, 27150259]
4637B7150259J33422j64489K7023J30588n5288j59681k56156J53883J83204J47038
4627B7289803j23036J20985k86466j83195P115l61643j25782J85541l98433p0266
4617B6054623m93535j36550k10883J40682j08645j74413L8729k74350p3564m24238
4607B4337856K18654K23759k58043l7545J95797m04793n01234J8012n6923q6670
4597B3648870l07538N70970p3244n10614k51609k67795K35101q2814J44975L14816
4587B3421118j96426j21962k59655r8089k5688J96571J19343K2977k63610m28662
4577B2365917J02552K69753r0704l85784R9009J66388j97879j33550j40594L75044
4567B2430152M3503K07877p7354m00558r6647O8321K22223O7369J59783K07205
$$ y = [27150259, 27283681, 27119192, 27146215, 27276803, 27221515, 27061834, 26805678, 26959561, 27142765, 27289803, 27166767, 27287752, 27001286, 26818091, 26825206, 26463563, 26337781, 26523322, 26124889, 26054623, 25561088, 25424538, 25213655, 25354337, 25245692, 25071279, 25110008, 24835658, 24762094, 24337856, 24556510, 24780269, 24522226, 24484681, 24680478, 24275685, 23774451, 23792463, 23735540, 23648870, 23341332, 23912302, 23839058, 23328444, 23076835, 22809040, 23044141, 22961327, 23106302, 23421118, 23224692, 23102730, 22843075, 22744986, 22719298, 22915869, 23035212, 23058189, 22794579, 22365917, 22468469, 22738222, 22647518, 22261734, 22360743, 22527131, 22329252, 22195702, 22055108, 22430152, 22473655, 22681532, 22604178, 22203620, 22106973, 22175294, 22397517, 22464886, 22624669, 22831874]
4557B2831874l6498J30356l56278P4893K58151J78563K04121K79920K81709k50621
4547B3596190m3171L06165L5890k96531J301P2096M4580k11096M7910P2669J39028
4536B3765031p6077K94746o2770L25933p3217L92494K54848j15620J05885J49552
4526B4960805J25053K82088L58835k0013O1225J70663j70797j5615K32838J73490
4516B6158572J1687O0280R9859L36375J52812N5018M14754K0587M66380M91696
4506B8268020j26551P6512K28529l0236N58234M18213J47745O8426J51583O00498
4496C0360973K8177K52673J86284L86430M29316M24353K44947K26763j140M25134
4486C2963910M18388N32976L44981L86671K6395O2538M99558K77328P15223L25329
$$ y = [22831874, 22795376, 22925732, 22569454, 22644347, 22902498, 23081061, 23285182, 23565102, 23846811, 23596190, 23553019, 23859184, 23895074, 23598543, 23599844, 23671940, 23716520, 23505424, 23553334, 23626003, 23765031, 23688954, 23983700, 23920930, 24246863, 24173646, 24566140, 24820988, 24705368, 24811253, 24960805, 25085858, 25367946, 25726781, 25706768, 25767993, 25938656, 25767859, 25752244, 25985082, 26158572, 26170259, 26230539, 26330398, 26666773, 26819585, 26874603, 27289357, 27309944, 27776324, 28268020, 28141469, 28217981, 28446510, 28416274, 28974508, 29392721, 29540466, 29608892, 29760475, 30360973, 30389150, 30641823, 30828107, 31214537, 31643853, 32068206, 32313153, 32539916, 32538776, 32963910, 33382298, 33915274, 34260255, 34646926, 34673321, 34735859, 35235417, 35512745, 36227968, 36553297]
4476C6553297K25170J82091R71258M38209N17344N72622M32253N58494M41424
4467D0892162L68431R86079P07887P23749M26647Q46657N35716J314798P49218
4458D7551344Q89604J395978J663215J435129J585650J591215J331860J954576
4450E9398571K335065K278156J987027K513285K578372K659614K926892L284302
4442G9961284L683171L939040M204861M650628N200200N453301N446661O379861
4434A18919007O589140O567316O883313O750364O233932N795473N074094M672028
4426A67484667L954736K043164O64928q07460k757950l503135m322225n359104
4418A57397621n727701n877659n986619o060337o573300n907247n628577n318378
$$ y = [36553297, 36778467, 36960558, 37931816, 38370025, 38887369, 39459991, 39892244, 40450738, 40892162, 41260593, 42246672, 42954559, 43678308, 44104955, 44951612, 45487328, 46802126, 47551344, 48440948, 49836926, 51500141, 52935270, 54520920, 56112135, 57443995, 59398571, 61733636, 64011792, 65998819, 68512104, 71090476, 73750090, 76676982, 79961284, 83644455, 87583495, 91788356, 96438984, 101639184, 107092485, 112539146, 118919007, 125508147, 132075463, 138958776, 145709140, 151943072, 157738545, 162812639, 167484667, 171439403, 173482567, 174147495, 173340035, 170582085, 167078950, 162756725, 157397621, 151669920, 145792261, 139805642, 133745305, 127172005, 121264758, 115636181, 110317803]
4410A10317803m803860m275925m190321l577349l345293k780413k182512j926783
4402H3235347j851413j796547j693932j116705j097957j563707j351641k081199
4394G0682246k420040k014026k158440j859822j762202j610167j694676j538139
4386E5624734j364221j168870j694717j405903q12551q51582o84193j077624j208442
4377D5356631r75986p46505m25240n29451n78218n57089m51968p41279l92326
4368C9958569q1177m02423l42373l78217n22069l00865l34802k41236j19968M17998
4358C7653437L48218j17445l21675r3484j01969j24196N262n8537r7961n14663
4348C6576987Q4717j27831p33216K02622J38171J5847k43698j32848K92932J47534
$$ y = [110317803, 105513943, 101238018, 97047697, 93470348, 90125055, 87344642, 85162130, 83235347, 81383934, 79587387, 77893455, 76776750, 75678793, 74115086, 72763445, 70682246, 68262206, 66248180, 64089740, 62229918, 60467716, 58857549, 57162873, 55624734, 54260513, 53091643, 51396926, 49991023, 49178472, 48326890, 47642697, 46565073, 45356631, 44380645, 43634140, 43208900, 42679449, 42101231, 41544142, 41092174, 40350895, 39958569, 39877392, 39474969, 39132596, 38754379, 38232310, 37931445, 37596643, 37355407, 37235439, 37653437, 38001655, 37884210, 37562535, 37469051, 37367082, 37242886, 37248148, 37189611, 37091650, 36576987, 36661704, 36533873, 35800657, 36003279, 36141450, 36157297, 35913599, 35780751, 36073683, 36221217]
4338C6221217q7174o4478J28882q7286J67997j99605p6011M12132O08747K17871
4328C7242292N3853p8498O852l83037N3987m438L45382n4003k56258l75218J40743
4317C6691657j67178l24545k43295j0979k66644k84856k46221j62359k34066j58440
4307C4593074k13477j50978k03181q60608j50645k50372j19306L3110j16813l15643
4297C2245161m63155m75314K35320k2234p7562k45831j98171j74649j78804l16553
4287C0328208j26824k02674K25Q57901R3326k43309q4746l67953o1302M12377
4277C0605229N4736l37302q85576m42893k91192N3314j95272J21049K0220r0064
4267B8612249n8067J02898l0595J67112j61720P7236J03599O2927k12193J22077
$$ y = [36221217, 36134043, 36069565, 36198447, 36111161, 36279158, 36079553, 36003542, 36415674, 37024421, 37242292, 37296145, 37217647, 37224499, 36841462, 36895449, 36891011, 37236393, 37182390, 36926132, 36550914, 36691657, 36524479, 36199934, 35956639, 35945660, 35679016, 35394160, 35147939, 34985580, 34751514, 34593074, 34379597, 34228619, 34025438, 33164830, 33014185, 32763813, 32644507, 32677617, 32560804, 32245161, 31782006, 31306692, 31542012, 31519778, 31442216, 31196385, 30998214, 30823565, 30644761, 30328208, 30201384, 29998710, 29998935, 30856836, 30950162, 30706853, 30622107, 30254154, 30192852, 30605229, 30659965, 30322663, 29437087, 28994194, 28703002, 28756316, 28561044, 28682093, 28702313, 28612249, 28554182, 28657080, 28626485, 28793597, 28631877, 28709113, 28812712, 28875639, 28663446, 28785523]
4257B8785523j08436r7109P0981O4336J17697k21951n27990l47901M4588l8496
4247B7741242j4501m62828m80855n20092o2282k62175l59470m72695l30339j26143
4237B4649862L8161q36218l13989l31668r9132m13526j19999m00410r5377m48801
4227B1628903k49567J4343j07770l18584N4818l54014k01345j07636k34547j28249
4217A9996352l4241l39588l08857L04819L5422l4775j93166j47662j1541J53885
4207A9420648J25527L00174K53856M2779L51125N06398J51685j73891k09612K64681
4197B1033370J42024K63224M80216K90561M8212j71292M2092K24897k9806q648
4187B2314850O54884K32925k1404L91198l45606m78697k75277J08162K53500j83598
$$ y = [28785523, 28677087, 28579978, 28650959, 28715295, 28832992, 28611041, 28083051, 27735150, 27779738, 27741242, 27726741, 27263913, 26783058, 26262966, 26200684, 25938509, 25579039, 25106344, 24776005, 24649862, 24688023, 23851805, 23537816, 23206148, 23107016, 22693490, 22573491, 22173081, 22077704, 21628903, 21379336, 21393679, 21285909, 20967325, 21022143, 20668129, 20466784, 20359148, 20124601, 19996352, 19962111, 19622523, 19313666, 19618485, 19653907, 19619132, 19425966, 19278304, 19266763, 19420648, 19546175, 19846349, 20100205, 20142984, 20494109, 21000507, 21152192, 20978301, 20768689, 21033370, 21175394, 21438618, 21918834, 22209395, 22257607, 22086315, 22128407, 22353304, 22323498, 22314850, 22969734, 23202659, 23181255, 23572453, 23226847, 22748150, 22472873, 22581035, 22834535, 22650937]
4177B2650937Q2964m0994j70042K37415J84660J72138N56200J49118R4347L48545
4167B4265288M35172L35906K6451J44718k38287Q2229l5664k72078m87261k60774
4157B3995700j57196p22590n72923l66351p38361n75622m79844o3958l35371m09927
4147A9573557k01325k43680L6293n4604m51127l39769l14619k76812l83619K23302
4137A7567597k36719L69443J89436l59066l46149l65111k94131k35420m7007k12397
4127A6030476K15308r6861L80178J38174k26944k69127J88119Q1567K52910M98849
4117A7192649K94694M3160m03818P6190j41485N3889p5235k52238k68164J49975
4107A6669617K50463j60092j68704p50j22286r2144Q2024K73711K58025M03681
$$ y = [22650937, 22733901, 22692907, 22522865, 22760280, 22944940, 23117078, 23673278, 23822396, 23916743, 24265288, 24700460, 25036366, 25062817, 25207535, 24969248, 25051477, 25015813, 24743735, 24256474, 23995700, 23838504, 23115914, 22542991, 22176640, 21438279, 20862657, 20382813, 20318855, 19983484, 19573557, 19372232, 19128552, 19164845, 19110241, 18659114, 18319345, 18004726, 17727914, 17344295, 17567597, 17330878, 17700321, 17889757, 17530691, 17184542, 16819431, 16525300, 16289880, 16242873, 16030476, 16245784, 16148923, 16529101, 16667275, 16440331, 16171204, 16359323, 16440890, 16693800, 17192649, 17487343, 17530503, 17126685, 17202875, 17061390, 17115279, 17040044, 16787806, 16519642, 16669617, 16920080, 16759988, 16591284, 16590534, 16468248, 16376104, 16458128, 16731839, 16989864, 17393545]
4097A7393545k83652J62726r3277j93893L08441m8625j20293L52968L09657K81213
4087A8068810k0774j0396L85134j91871K70730P3273K40868o0728J73445J12973
4077A9041464N57418J59760N51051K7140P7467M36348L78133M34131L58254R869
4067B2031035J72886O01335K73274j0051M42167K58272K44109O87540K28437L28520
4057B5257524K79779M95397L31155L47108K07363M29678K02425L03956L80303
4048B8234688O18778K86754J07749K55988P94087O25173O17171N72821O00519
4039C2713728N68328P91123P28517Q52447J034620O57372O45468R58221J199893
4030D0149717P13849M45920K13343N65203O61433O42391L72675L60370L29918
$$ y = [17393545, 17109893, 17272619, 17179342, 16985449, 17293890, 17245265, 17124972, 17477940, 17787597, 18068810, 18048036, 18037640, 18422774, 18230903, 18501633, 18574906, 18815774, 18755046, 18928491, 19041464, 19598882, 19758642, 20309693, 20336833, 20414300, 20850648, 21228781, 21662912, 22021166, 22031035, 22203921, 22805256, 23078530, 23068479, 23510646, 23768918, 24013027, 24700567, 24929004, 25257524, 25537303, 26032700, 26363855, 26710963, 26918326, 27348004, 27550429, 27854385, 28234688, 28853466, 29140220, 29247969, 29503957, 30298044, 30923217, 31540388, 32113209, 32713728, 33282056, 34073179, 34801696, 35654143, 36688763, 37346135, 37991603, 38949824, 40149717, 40863566, 41309486, 41522829, 42088032, 42749465, 43391856, 43764531, 44124901, 44454819]
4021D4454819M80474O23984J086910M87660L81075L83830J231708J117781R18515
4012E1166756J83746L96864N66746P42437P27049N19322O60402M98463L79253
4003E5841038Q85607J402853J282994J198575J294570J858503J967305K175969
3995F7907414K362822K339880J885864K758819K463370K743915J715661J259091
3987H5436836J478229J083643Q45465O87856l0555j21959j28532n28496p57936
3978H7964551k21144l89718o98438l20992k14219n96815o22637r00810q64156
3969H3135622n67566j222483r06365j544894j477748j514558j371108j013599
3961G3517301p03466o51970r06300r61849m45812k87470m82009L4696j71937k56370
$$ y = [44454819, 44935293, 45559277, 46646187, 47133847, 47514922, 47898752, 49130460, 50248241, 51166756, 51350502, 51747366, 52314112, 53056549, 53783598, 54302920, 54963322, 55461785, 55841038, 56726645, 58129498, 59412492, 60611067, 61905637, 63764140, 65731445, 67907414, 70270236, 72610116, 74495980, 77254799, 79718169, 82462084, 84177745, 85436836, 86915065, 87998708, 88844173, 89532029, 89501474, 89379515, 89250983, 88722487, 87964551, 87743407, 87353689, 86655251, 86334259, 86120040, 85523225, 84900588, 83999778, 83135622, 82568056, 81345573, 80439208, 78894314, 77416566, 75902008, 74530900, 73517301, 72813835, 72161865, 71255565, 70293716, 69847904, 69560434, 69078425, 69113121, 68941184, 68684814]
3951F8684814K07970L91321q4416j22216M37098L38159k0205M78353M9828R276
3941G0369982j51481K37304R90035M46443R89004O15734P92906J301973J263841
3932G6855741M75864l65995n36120n15952O6386k49615J69184j9955l43689l35400
3922G5200449j195015j481444j601520j246673j677826j708515j521096j604861
3914F3163499j759060j243672j000956j197254m84176k56599l12318n91384K5638
3905E6343718J45010l365K61860N24514P33776P52728P57817Q41825L84297N01037
3895F1243217P77687Q62942O19388P3897l59748q25719p02294o28142k41610q44225
3885E9975393j249009q81773j273356r70174q47630q42789n70352l35712k11025
$$ y = [68684814, 68892784, 69284105, 69199689, 69077473, 69514571, 69852730, 69832525, 70310878, 70360706, 70369982, 70218501, 70455805, 71445840, 71892283, 72881287, 73497021, 74289927, 75591900, 76855741, 77331605, 76965610, 76429490, 75913538, 75979924, 75730309, 75899493, 75879538, 75535849, 75200449, 74005434, 72523990, 70922470, 69675797, 67997971, 66289456, 64768360, 63163499, 61404439, 60160767, 59159811, 57962557, 57478381, 57221782, 56909464, 56318080, 56343718, 56488728, 56485363, 56747223, 57271737, 58005513, 58758241, 59516058, 60357883, 60742180, 61243217, 62020904, 62883846, 63503234, 63577131, 63217383, 62391664, 61689370, 61061228, 60819618, 59975393, 58726384, 57844611, 56571255, 55601081, 54753451, 53910662, 53340310, 53004598, 52793573]
3876E2793573n42907j78915k52718p4236j35983J20813k32233L15055l8485o43046
3866E1130918j16960N0612L66161j11033j07793k12165l74081p0837K35235m0922
3856E0749135K19436l35449J10123M2112k61286N3990J54799N9214P3307K21053
3846E1086434n3525J72589J67940J48004k33300R9268K96755K51821O04632J61271
3836E2701889l3878N35259J081385M26124P89880N68939R00948R62040L70936
3827E8303522R87593J150001J247036J104438J132607Q12898J289284J859921
3819F7887300J809851K343928J931497J603801K031896K021857K237365K811457
3811H4678952L324601L656355L782238L986502M504476M520590N345632O057088
$$ y = [52793573, 52250666, 52071751, 51819033, 51744797, 51608814, 51729627, 51497394, 51812449, 51773964, 51130918, 51013958, 51064570, 51430731, 51319698, 51211905, 50999740, 50625659, 50554822, 50790057, 50749135, 50968571, 50633122, 50743245, 50785357, 50524071, 50578061, 50732860, 50792074, 50865381, 51086434, 51032909, 51205498, 51373438, 51521442, 51288142, 51387410, 51684165, 51935986, 52540618, 52701889, 52668011, 53203270, 54284655, 54710779, 55500659, 56069598, 56970546, 57932586, 58303522, 59291115, 60441116, 61688152, 62792590, 63925197, 64738095, 66027379, 67887300, 69697151, 72041079, 73972576, 75576377, 77608273, 79630130, 81867495, 84678952, 88003553, 91659908, 95442146, 99428648, 103933124, 108453714, 113799346, 119856434]
3803A19856434P233703Q338649R328129J0302229J0823797J0085502P829878M679705
3795A88478026K883447L562517M881052P856284J1626636J6129660K0131075K4080544
3787B79629241K9326609L6546088M7428012N6071613M5539086m058223m8574383
3780D41908043n7050740n2890223m3146203l1394859k2978242j7916119j4842354
3773B01689303j3579661j2575379j1395515r565147q311889o326637n064638l756264
3765A31114173l524175l464513l168408k796470k339494k034635j779086j371552
3757A10635840j227486p65849m70789j02465k4510m21374J4985O3949N46732N97263
3747A08846296M22654P54707J040506J143211Q47348J172186R24867J069194J534486
$$ y = [119856434, 127090137, 135428786, 144756915, 155059144, 165882941, 175968443, 183798321, 188478026, 191361473, 194923990, 199805042, 207661326, 219287962, 235417622, 255548697, 279629241, 308955850, 345501938, 392929950, 449001563, 494540649, 490482426, 441908043, 384857303, 331967080, 288820877, 257426018, 234447776, 216531657, 201689303, 188109642, 175534263, 164138748, 154573601, 146261712, 139935075, 134870437, 131114173, 127589998, 124125485, 120957077, 118160607, 115821113, 113786478, 112007392, 110635840, 109408354, 108642505, 108171716, 108069251, 108044741, 107623367, 107638352, 107702301, 108249033, 108846296, 109268950, 110023657, 111064163, 112207374, 113054722, 114226908, 115151775, 116220969, 117755455]
3738A17755455J835333K004384K725951K181068K158843K483181K265229K434189
3730A35843633K136424K274261J711289K230720K295689K442174K945789L051364
3722A54931343L248152L836738L667335M218066M643366M827177N252440N619362
3714A90243979O623963O786041P137162P313582P829404Q447368R572961J0656113
3706B54610573J0752795J1546278J2422925J3720236J4377109J4583057J4771596
3699C46784569J5091574J5135803J4413467J2965266J0994666Q069130M554250
3692D28008725N50740l491294p689397j1150875j4225463j6515536j7864107j8286744
3684C39336049j7817441j6632093j5755924j4574138j2970848j1710961j0351664
$$ y = [117755455, 119590788, 121595172, 124321123, 126502191, 128661034, 131144215, 133409444, 135843633, 137980057, 140254318, 141965607, 144196327, 146492016, 148934190, 151879979, 154931343, 158179495, 162016233, 165683568, 169901634, 174545000, 179372177, 184624617, 190243979, 196867942, 203653983, 210791145, 218104727, 225934131, 234381499, 243954460, 254610573, 265363368, 276909646, 289332571, 303052807, 317429916, 332012973, 346784569, 361876143, 377011946, 391425413, 404390679, 415385345, 423454475, 428008725, 428559465, 425068171, 417378774, 406227899, 392002436, 375486900, 357622793, 339336049, 321518608, 304886515, 289130591, 274556453, 261585605, 249874644, 239522980]
3677B39522980r685784q252925p462869o498896n812672m967132l895461l390732
3669A89556509k957677k525020k093304q71761q17233j054328p47260p19710o04344
3660A77165872j291521j226117j637971j786205k044293k685749l061992l538391
3652A59893633m038240m347801m147196m383394m333070m185633l639280m293623
3644A26525396l693382l300017k958267k560184k930004k763427k708632k343867
3636A03267616k344118j993987j978743j926477k311796k056543j714387j941049
3628H7000516j578768j400246j548655j058864p01814r78053j332900j241524
3620G7159692r56159q39845p93093j207105j202403j080502j146913r24049p72470
$$ y = [239522980, 229837196, 221584271, 214121402, 207622506, 201809834, 196842702, 192947241, 189556509, 186598832, 184073812, 181980508, 181108747, 180291514, 179237186, 178489926, 177770216, 177165872, 175874351, 174648234, 173010263, 171224058, 169179765, 166494016, 163432024, 159893633, 155855393, 151507592, 147360396, 142977002, 138643932, 134458299, 130819019, 126525396, 122832014, 119531997, 116573730, 114013546, 111083542, 108320115, 105611483, 103267616, 100923498, 98929511, 96950768, 95024291, 92712495, 90655952, 88941565, 87000516, 85421748, 84021502, 82472847, 81413983, 80712169, 79734116, 78401216, 77159692, 76203533, 75363688, 74570595, 73363490, 72161087, 71080585, 69933672, 69009623, 68237153]
3611F8237153m19093j207022j001356j057086o70790j13109q05967n43484l06092
3602F2113154k38163m20778M0981m02151n35459m10591l0889P7880l03339k39485
3592E9651160o99341J7046J90175L6580J77625j46945O5124o7078J38269K93754
3582E9656369L34250M09517M91165L75041N20586Q15719P54934O92885N40660
3573F4591126R78725J196038J508464J592262J438727J355268J597592K690720
3565G6948922K623524K960329K951413K922826M141718M718813N159785N870166
3557A08297496O328565P646054Q202239R193448J0531338J1379569J1833984J2753881
3549A86166574J1915534J0056856O206797L32939n369407r681171j1747113j2542245
$$ y = [68237153, 67818060, 66611038, 65609682, 64552596, 63881806, 63768697, 62962730, 62419246, 62113154, 61874991, 61454213, 61495194, 61093043, 60557584, 60146993, 60116104, 60193984, 59890645, 59651160, 58951819, 58968865, 59159040, 59195620, 59373245, 59226300, 59291424, 59224346, 59362615, 59656369, 59990619, 60400136, 60891301, 61266342, 61786928, 62602647, 63357581, 64050466, 64591126, 65569851, 66765889, 68274353, 69866615, 71305342, 72660610, 74258202, 76948922, 79572446, 82532775, 85484188, 88407014, 92548732, 97267545, 102427330, 108297496, 114626061, 122272115, 130474354, 139667802, 150199140, 161578709, 173412693, 186166574, 198082108, 208138964, 214345761, 214678700, 209309293, 199628122, 187881009, 175338764]
3541A75338764j2182254j1458185j0264280q994466p327982o814292o287134n637775
3533A06372396m718142m362634l452922l496591k686101l088168k856752k515468
3525G9195618k280156k679718k201452k239501j930685j354158j362176j252121
3517F3895651j443354j035399j083332p32315m5635m75040m73396j36746j53943
3508E8316491L77277J75648P3298K37716M01005J29672L60301K53711n8903n92132
3498E9674084n46213q72493k08540o81102r54224p69452k25508o52400J89919
3489E4954071Q918k66167j197J95068N61202M55623K78122O69841O77115P03153
3479E8235749J276765R55682O64973P19802J271132J200984J535008J222439J268438
$$ y = [175338764, 163156510, 151698325, 141434045, 132439579, 125111597, 118297305, 112010171, 106372396, 101654254, 97291620, 93838698, 90342107, 87656006, 84567838, 81711086, 79195618, 76915462, 74235744, 72034292, 69794791, 67864106, 66509948, 65147772, 63895651, 62452297, 61416898, 60333566, 59601251, 59555616, 59080576, 58607180, 58470434, 58316491, 58693768, 58869416, 58942714, 59180430, 59581435, 59711107, 60071408, 60325119, 60266216, 59674084, 59127871, 58255378, 58046838, 57365736, 56411512, 55642060, 55416552, 54764152, 54954071, 54962989, 54696822, 54695625, 54890693, 55451895, 55907518, 56185640, 56855481, 57532596, 58235749, 59512514, 60468196, 61133169, 61852971, 63124103, 64325087, 65860095, 67082534, 68350972]
3470F8350972J343047J578690J873665J553277J477113J646102J826084K036583
3462H1685533K422176K564716K917938K943296L546349M042315M701738L428940
3454A08253001J98501j099265p18937k63622M7838M24851K27469N33550M13700
3445A08017086L59722L33856L77304K55975P39026N10695J154215J997626J735431
3436A15480936J760831K228399L070191L665279L909950M588668M750200O035410
3428A45489864O766685P682081Q341492Q800104J0327227J2104363J3856217J5839932
3420B29207965J7485512J9342035K1223099K2725268K2924145K1891896J8055013
3413C72854933J0614505R83987q934701j5863022j9693324k0527038j9423865
$$ y = [68350972, 69694019, 71272709, 73146374, 74699651, 76176764, 77822866, 79648950, 81685533, 84107709, 86672425, 89590363, 92533659, 96080008, 100122323, 104824061, 108253001, 108451502, 107352237, 106633300, 106369678, 106417516, 106842367, 107069836, 107603386, 108017086, 108376808, 108710664, 109087968, 109343943, 110082969, 110593664, 111747879, 113745505, 115480936, 117241767, 119470166, 122540357, 126205636, 130115586, 134704254, 139454454, 145489864, 152256549, 159938630, 168280122, 177080226, 187407453, 199511816, 213368033, 229207965, 246693477, 266035512, 287258611, 309983879, 332908024, 354799920, 372854933, 383469438, 384453425, 375518724, 359655702, 339962378, 319435340, 300011475]
3406C00011475j7490203j5694787j3398089j1823214j0623997r730089q115014
3399B13136082o885583n461464m482278m100632l775075k635889j595565q32361
3391A83367235k6005P48047J492793K368830L055670L288058K868297J180724
3383A98343649j088248l575384n226887o052019o309308n766414m940510l812673
3375A61572206l155814l044157k584728k743350k906435k981237k617568k127633
3367A39411284k534920k927057k782252k585224k294249k502379k422379k105457
3359A19257367j775282j689312k100503k174317k006813j773308j463963j493593
3351A04780276j676228j744143j805621j437026j342333j144621j272044j192644
$$ y = [300011475, 282521272, 266826485, 253428396, 241605182, 230981185, 221251096, 213136082, 206250499, 200789035, 196306757, 192206125, 188431050, 185795161, 184199596, 183367235, 183341230, 184089277, 185582070, 187950900, 191006570, 194294628, 197162925, 198343649, 197255401, 193680017, 188453130, 182401111, 176091803, 170325389, 165384879, 161572206, 158416392, 155372235, 152787507, 150044157, 147137722, 144156485, 141538917, 139411284, 136876364, 133949307, 131167055, 128581831, 126287582, 123785203, 121362824, 119257367, 117482085, 115792773, 113692270, 111517953, 109511140, 107737832, 106273869, 104780276, 103104048, 101359905, 99554284, 98117258, 96774925, 95630304, 94358260, 93165616]
3343I3165616j411534j324342j204893r97139m81593n27667r26081m02906n76846
3334H5312615o08119m75248k46640m13330l6459j24867K63007K31959j93726k22381
3324H3486811K95720M42962K17215P45243M91001L06348N31902P47222K66479
3315H7530903Q90302P56147N47617M65917Q33761n3P33089N36870L98962M80138
3305I3173653O16327N06141O18417N23602P56112J211293J655908K112016J691461
3296A02864930K009344K244662K590972K455723L324410L849412L613928L791322
3288A26744703M140331M697251N461081O054800O736228P330011Q425105R023559
3280A78613069R801102J1117021J2536333J3267882J4482437J5292922J6126296
$$ y = [93165616, 91754082, 90429740, 89224847, 88227708, 87746115, 87218448, 86292367, 85889461, 85312615, 84704496, 84229248, 83982608, 83569278, 83532819, 83407952, 83670959, 83902918, 83709192, 83486811, 83782531, 84225493, 84442708, 85187951, 85678952, 85985300, 86517202, 87264424, 87530903, 88421205, 89177352, 89724969, 90190886, 91024647, 91024594, 91757683, 92294553, 92693515, 93173653, 93789980, 94296121, 94914538, 95438140, 96194252, 97405545, 99061453, 101173469, 102864930, 104874274, 107118936, 109709908, 112165631, 115490041, 119339453, 122953381, 126744703, 130885034, 135582285, 141043366, 147098166, 153834394, 161164405, 169589510, 178613069, 188414171, 199531192, 212067525, 225335407, 239817844, 255110766, 271237062]
3273B71237062J6279177J5933662J4993216J2550970Q768825M126200j557733
3266C42331379o965795j1241641j3332663j4777640j5900876j5317310j4333674
3259B50461780j3797664j3286940j2537536j2198194j1152795j0485033r867184
3252A67136434r207755q062156p965440o886390o196612n532062m961444m487256
3244A13837319m471737l482957l529547l094354k487552k453194k241861j664821
3236I0411296j394148j858988j387848q32408r70884q98572k69142m98844n02180
3227H1798282m85128n53045l92728N88865L28428M83469O10287P29385J248318
3218H4356133J277710J649025J941457J907201J384140R67852M73922r9665j037484
$$ y = [271237062, 287516239, 303449901, 318443117, 330994087, 339762912, 343889112, 342331379, 335365584, 324123943, 310791280, 296013640, 280112764, 264795454, 250461780, 236664116, 223377176, 210839640, 198641446, 187488651, 177003618, 167136434, 157928679, 149866523, 141901083, 135014693, 128818081, 123286019, 118324575, 113837319, 109365582, 105882625, 102353078, 99258724, 96771172, 94317978, 92076117, 90411296, 89017148, 87158160, 85770312, 84937904, 83967020, 83068448, 82799306, 82300462, 81798282, 81313154, 80760109, 80367381, 80956246, 81284674, 81768143, 82378430, 83107815, 84356133, 85633843, 87282868, 89224325, 91131526, 92515666, 93483518, 93957440, 93857775, 92820291]
3209I2820291k261793j943163k086394j916702j463533r25465l45035L7997P67144
3200H2683347O12002J188219J663977J961127K369816J529300O50452k51932j843825
3191I0562483l056184l453928k845990k335813k301464j833485j191526q33099
3183G2710994m04456j79932l87974K59971N28204M90909K99874R41994P74663
3174G5034247Q65963J128747J766609K133397K093901K412809J620690K079028
3166H9135391K201435K505536L091635L160901L757263L536843K785466J187106
3158A11361576q12739k732154l657836m312996l524045l765767k886798k763006
3150H6906235l005247k694319k457862k532454k255578k262416j755329j168967
$$ y = [92820291, 90558498, 88615335, 86528941, 84612239, 83148706, 82223241, 81878206, 81916203, 82683347, 83295349, 84483568, 86147545, 88108672, 90478488, 92007788, 92658240, 92406308, 90562483, 87506299, 84052371, 81206381, 78870568, 76569104, 74735619, 73544093, 72710994, 72306538, 72126606, 71738632, 71998603, 72526807, 73017716, 73317590, 74259584, 75034247, 75900210, 77028957, 78795566, 80928963, 83022864, 85435673, 87056363, 89135391, 91336826, 93842362, 96933997, 100094898, 103852161, 107389004, 110174470, 111361576, 110548837, 107816683, 104158847, 99845851, 96321806, 92556039, 89669241, 86906235, 83900988, 81206669, 78748807, 76216353, 73960775, 71698359, 69943030, 68774063]
3142F8774063j290586j189058j153847j238619j612626r11910q20034o91532j052965
3133E8812886q58238p20080m19578l39479n32329k69137o25522n47652J06181
3124E4607052p35079n09965k51331k30842j32985o355j63320J7080j81050k49251
3114E2163954j30922p0784j93815m4834K6972m546L62728L20255L98742N10689
3104E3338439M76988N85966M04174M95026N04936N68731N34481R98043P18338
3095E8625122P99206J254423R32731O99248P41228J82593m08363q19546j65384
3086F1841258o51236o94028m02502l35156J64884M4230l41205l85320L38360J102445
3076F0681730R19164O20713R60246J294143J347188J619344J955349K045683K588171
$$ y = [68774063, 67483477, 66294419, 65140572, 63901953, 62289327, 61377417, 60557383, 59865851, 58812886, 57954648, 57234568, 56814990, 56475511, 55943182, 55674045, 55048523, 54500871, 54607052, 53871973, 53362008, 53110677, 52879835, 52746850, 52740495, 52577175, 52594255, 52413205, 52163954, 52033032, 51962248, 51768433, 51723599, 51750571, 51746025, 52108753, 52429008, 52827750, 53338439, 53815427, 54401393, 54805567, 55300593, 55805529, 56374260, 56908741, 57906784, 58625122, 59424328, 60678751, 61611482, 62310730, 63051958, 63234551, 62826188, 62006642, 61841258, 61190022, 60495994, 60093492, 59758336, 59923220, 59967450, 59626245, 59240925, 59579285, 60681730, 61600894, 62221607, 63181853, 64475996, 65823184, 67442528, 69397877, 71443560, 74031731]
3067G4031731K807599L083093L190887K963228K246958J764743J485708J026569
3059I2600516R2346n98208j541893k232808k438854j957950j668030j352387j201982
3050G9700750o58020m95850j03567P11784P41959P84791J065759J843414K284312
3041H5875332K605634K770088K762346L563310M047786L978065M334353L912524
3033A13849438L112083K290191J376620P40417l58412j072651k079508k746353
3025A15111825k586422k572422l194209l465457l755323m069795l898367k835016
3017H8734814k764108k119090j513402j397203j129085p47854l77307j1580j22491
3008G8552694O14426R99660J761196J776691J064280Q68662O87654K39589o32518
$$ y = [74031731, 76839330, 79922423, 83113310, 86076538, 88323496, 90088239, 91573947, 92600516, 92692862, 92094654, 90552761, 88319953, 85881099, 83923149, 82255119, 80902732, 79700750, 79042730, 78546880, 78443313, 79155097, 79897056, 80681847, 81747606, 83591020, 85875332, 88480966, 91251054, 94013400, 97576710, 101624496, 105602561, 109936914, 113849438, 116961521, 119251712, 120628332, 121368749, 121010337, 119937686, 117858178, 115111825, 112525403, 109952981, 106758772, 103293315, 99537992, 95468197, 91569830, 88734814, 85970706, 83851616, 82338214, 80941011, 79811926, 79064072, 78686765, 78675185, 78552694, 79167120, 80166780, 81927976, 83704667, 84768947, 85637609, 86325263, 86564852, 85932334]
2999H5932334j536651j890481k076936k743455k587325k620549k644722k572613
2991F7259602k664642k084482j625903j557150j266702j265499j073104p65053
2983E4957067l74494q53972o94479o71876m02687l80780J35723K3917P9051m2259
2973E1775211L31543K43553K42371J83381o00235j099990j187672o67139k98661
2964D8922362r06526p28549k32670j77110l82128k99687j28287M888K43279P4278
2954D6389850K70234o6473L29900J85452l0572N14986Q64172O43764N80952Q28927
2944E0511192Q07533M55448K77103J02786l13806J2904l08476m83839o60180o04038
2934D9796627j003882o58691q56273m10777k0221l01152n83966n16336j30392
$$ y = [85932334, 84395683, 82505202, 80428266, 77684811, 75097486, 72476937, 69832215, 67259602, 64594960, 62510478, 60884575, 59327425, 58060723, 56795224, 55722120, 54957067, 54582573, 53728601, 53034122, 52362246, 51959559, 51578779, 51714502, 51738419, 51817470, 51775211, 52106754, 52350307, 52592678, 52776059, 52175824, 51075834, 49888162, 49221023, 48922362, 48015836, 47287287, 47054617, 46877507, 46495379, 46195692, 46067405, 46072293, 46315572, 46389850, 46660084, 46593611, 46923511, 47108963, 47078391, 47593377, 48457549, 49101313, 49682265, 50511192, 51318725, 51774173, 52051276, 52154062, 51840256, 51853160, 51544684, 51060845, 50400665, 49796627, 48792745, 48134054, 47277781, 46867004, 46846783, 46545631, 45961665, 45445329, 45314937]
2925D5314937P8678K92295j07125j27023N69226L61347Q41113R07488J081059
2916D9211995J681701J250446J305666J722372K192808J822930J774837J143691
2908F2106446J244040O89358k7583j102157p01395j867688j935447k016793j718786
2899E4669995j757781j687115j852335j342636j473736l65737o39195m35841q3167
2890D5032452P0764k0903J41949K96796N16997O02043L2845N95940j39032J64610
2880D7294461N7114j71987m31624o4065n03832K7003l68850j3401K38864k75085
2870D5788598l02508j20446n04173n83644j125126q47523r44999p70685j489233
2861C9100261j152361o09528m24887m60046n28691m14663J28487M11360K52491
$$ y = [45314937, 45393615, 45685910, 45578785, 45451762, 46020988, 46382335, 47223448, 48130936, 49211995, 50893696, 52144142, 53449808, 55172180, 57364988, 59187918, 60962755, 62106446, 63350486, 64039844, 64012261, 62910104, 62208709, 60341021, 58405574, 56388781, 54669995, 52912214, 51225099, 49372764, 48030128, 46556392, 46190655, 45551460, 45115619, 45032452, 45103216, 45082313, 45224262, 45521058, 46038055, 46640098, 46672943, 47268883, 47129851, 47294461, 47351575, 47179588, 46747964, 46683899, 46180067, 46207070, 45838220, 45824819, 46063683, 45788598, 45486090, 45365644, 44861471, 44277827, 43152701, 42305178, 41360179, 40589494, 39100261, 37947900, 37338372, 36913485, 36453439, 35924748, 35510085, 35638572, 36049932, 36302423]
2852C6302423J79954O80945N46801j05656K29337P9390L2382j73713m45551l61305
2842C6965007m53744j135482j037414j264665j563187j238598q88534j329987
2834B8053396j162695p97852p67366r51966o07308n26663m51152m27922o11597
2825B1748875m89543l70788k8448k49542l98512j61107j90538m7084K3579J70623
2815B0007515J13781M296R21791j88238M90656O60837J32793J28223J92245o8059
2805B2395840j05347k58370o79326o35530r09365n97284o54359o55835o39297
2796A7261127n99055n72186o89061j71344j58060m66856n59902m94987m32021
2787A3117655m68141k52132j31577m72304m67038J17553k0734n04167m64601J10962
$$ y = [36302423, 36482377, 37163322, 37710123, 37604467, 37833804, 37913194, 37945576, 37771863, 37326312, 36965007, 36511263, 35375781, 34338367, 33073702, 31510515, 30271917, 29383383, 28053396, 26890701, 26092849, 25325483, 24373517, 23766209, 23239546, 22788394, 22360472, 21748875, 21259332, 20888544, 20860096, 20610554, 20212042, 20050935, 19860397, 19813313, 19836892, 20007515, 20121296, 20125592, 21047383, 20859145, 21349801, 22010638, 22143431, 22271654, 22463899, 22395840, 22290493, 22032123, 21352797, 20717267, 19807902, 19210618, 18556259, 17900424, 17261127, 16662072, 16089886, 15400825, 15229481, 15071421, 14604565, 14044663, 13549676, 13117655, 12649514, 12397382, 12265805, 11793501, 11326463, 11444016, 11423282, 10919115, 10454514, 10565476]
2777A0565476j58790j455r161k51409n75274N833k8881o6455M0900N5782j66123
2766I410443j64670p1975J36045m44542l12074J23493k93462j37665L28579l28854
2756H245318r0378P6126L0624l2401k40305k30561j76435J02316P6582q4967p5380
2745G600539P198n33864k02860J10558K5886j28675j30089L15857K71474j3885
2735G322139k11067J96650j21785k89665K73840K46954l38637m80031r0191J01605
2725F609812k73525L16725L58516o600k30695m373k78264j0901J19036j45633
2715F454098l73132j1462J53157m993P4693J39641l2141L1749M0740l6908q610
2704F426832q8297K54414l43790l00996l55472J36398J95073M37239l05754l17980
$$ y = [10565476, 10406686, 10405231, 10396070, 10144661, 9569387, 9575220, 9546339, 9479884, 9520784, 9576566, 9410443, 9245773, 9173798, 9309843, 8865301, 8553227, 8676720, 8383258, 8245593, 8574172, 8245318, 8154940, 8231066, 8261690, 8229289, 7988984, 7758423, 7581988, 7684304, 7760886, 7675919, 7600539, 7607737, 7073873, 6871013, 6981571, 7007457, 6878782, 6748693, 7064550, 7336024, 7322139, 7111072, 7307722, 7185937, 6896272, 7170112, 7417066, 7078429, 6598398, 6508207, 6609812, 6336287, 6653012, 7011528, 7004928, 6774233, 6769860, 6491596, 6480695, 6599731, 6454098, 6080966, 6069504, 6222661, 6217668, 6292361, 6432002, 6399861, 6431610, 6472350, 6435442, 6426832, 6338535, 6592949, 6249159, 5948163, 5592691, 5729089, 5924162, 6361401, 6055647, 5737667]
2694E737667P5496L17667j57724P9929m2724M3311r9060L20264q9084m9167q694
2683F127881j45400m77969J24131L58496j74891l433J69472J75718l53300k17728
2673E582977j78599K38290L90476j67572p8822J34823K72609j14462l238R1046
2663F167528J22029j87337k96340M21487L76457N2533l19105o346J94961J84466
2653F710333l7608J08260j52123Q9963j45612K4254R6226J12172K23803j27594
2643F902074j60087k3334M96349J87505J46294O2267P921L57348Q2781k82978
2633G776140k01374J31767J27315J95924j3500K4911O88j17061k34556k5478j33745
2622G531031N9913J97650J92766L325L54755k20952K5822J22770K28419J32398
$$ y = [5737667, 5813163, 6130830, 5973106, 6053035, 6010311, 6053622, 5954562, 6274826, 6185742, 6136575, 6127881, 5982481, 5504512, 5628643, 5987139, 5812248, 5808815, 5978287, 6154005, 5800705, 5582977, 5404378, 5642668, 6033144, 5865572, 5786750, 5921573, 6194182, 6079720, 6076482, 6167528, 6289557, 6102220, 5805880, 6227367, 6603824, 6656357, 6337252, 6330906, 6525867, 6710333, 6672725, 6780985, 6628862, 6718825, 6573213, 6597467, 6693693, 6805865, 7029668, 6902074, 6741987, 6718653, 7215002, 7402507, 7548801, 7611068, 7618989, 7976337, 8059118, 7776140, 7574766, 7706533, 7833848, 8029772, 8016272, 8041183, 8041871, 7924810, 7690254, 7664776, 7531031, 7590944, 7788594, 7981360, 7984685, 8339440, 8118488, 8144310, 8267080, 8495499, 8627897]
2612H627897M13953M0827k09139L43318K72443k13309m6685J59841l88416j81631
2602H819099l97990K6674K35546K14876l06967j23210O6333L37490l30018k27989
2592H313844P44983J16769L8757m5582N1957j61238j81400J98179P6374M14860
2582I567503K73534q355m30040j95063J84314M5902q7725L62698L26549k84279
2572I755038k34116K452n1906J00985p7145m10407q882L5373K27427J20407J04992
2561I564218M79421K712k89227L87963j52166m5201K40718K11397K03053j29224
2551A0473664K28148k20017k35860J9051L97012J47701l8217n7113l7547n1577
2541A0625245m11899M40722L62052k65296J85159l4306m83982J72904O38285k87535
$$ y = [8627897, 9041850, 9082677, 8873538, 9216856, 9489299, 9275990, 9229305, 9389146, 9000730, 8819099, 8421109, 8447783, 8683329, 8898205, 8591238, 8468028, 8534361, 8871851, 8541833, 8313844, 9058827, 9175596, 9214353, 9168771, 9220728, 9059490, 8878090, 9076269, 9152643, 9567503, 9841037, 9832682, 9402642, 9207579, 9391893, 9437795, 9350070, 9712768, 10039317, 9755038, 9520922, 9523374, 9471468, 9572453, 9495308, 9084901, 9076019, 9111392, 9338819, 9459226, 9564218, 10043639, 10046351, 9757124, 10145087, 9992921, 9947720, 10188438, 10399835, 10602888, 10473664, 10701812, 10481795, 10245935, 10264986, 10661998, 10809699, 10771482, 10714369, 10676822, 10625245, 10213346, 10654068, 11016120, 10750824, 10935983, 10901677, 10417695, 10590599, 11228884, 10941349]
2531A0941349j55786k0017J31628j80424K28320k61709M92625L82583j0716R1321
2521A1639174j76978J81218k57222O5088J98590L35315L00026Q2919k79615k93882
2511A1794633J3658J24812K56864j39208p2516P1752l98482q4884j91343r8867
2501A1276419o4738M01981j48009j76310j90162j34538r2191j38909l9956J98714
2491A0892301m23682k25622Q0412R0990K47157L905k42378j02178k13917J29322
2481A0236310j6629J59520j35789k79617K99494K17696j21851n39750k98814k73219
2471I247351j83877J99843n4284k75654j66263l27155k55278J4080J65510M8063
2461H412336k93374l34002J10529j53576Q8338N1507j01834J84104q3328L8579
$$ y = [10941349, 10785563, 10765546, 10897174, 10716750, 10945070, 10683361, 11175986, 11558569, 11547853, 11639174, 11462196, 11643414, 11386192, 11451280, 11649870, 11985185, 12285211, 12368130, 12088515, 11794633, 11808291, 11933103, 12189967, 12050759, 11978243, 12049995, 11651513, 11566629, 11375286, 11276419, 11211681, 11613662, 11465653, 11289343, 11099181, 10964643, 10872452, 10733543, 10693587, 10892301, 10468619, 10242997, 10323409, 10414399, 10661556, 10665461, 10423083, 10320905, 10106988, 10236310, 10219681, 10379201, 10243412, 9963795, 10263289, 10480985, 10359134, 9819384, 9520570, 9247351, 9063474, 9263317, 9209033, 8933379, 8767116, 8439961, 8184683, 8198763, 8364273, 8412336, 8118962, 7784960, 7895489, 7741913, 7830251, 7881758, 7779924, 7964028, 7880700, 7919279]
2451G919279m76187l25955J08062M1482r0922k42965K36401l0570k3287M6757
2441G162095P7602Q8615j18610m49763r1961K38917J70072j24762k35415q7223
2431F629567L20324l55020j18532M11851j3574k42342K68309j55696l70959l05096
2421F068832l7846O1688L22849Q1937j40311l80449j09457j20138R4208J58566
2411E999879L43725J39745k32729K13365l88020k81341K29120J02217L1784N7600
2401F215345k60876o7276r1217k58835K02870j1514k14033J06209j60138l61778
2391E098757J6142Q7133p3216L74474O746j53559q86l06709k262q4310l13128
2380D649182L37412J24523O3800o6631J26607K69168j30450n1623L9578k20912
$$ y = [7919279, 7443092, 7117137, 7225199, 7266681, 7175759, 6932794, 7169195, 7138625, 7115338, 7162095, 7239697, 7328312, 7209702, 6759939, 6667978, 6906895, 7076967, 6952205, 6716790, 6629567, 6949891, 6594871, 6476339, 6888190, 6874616, 6632274, 6900583, 6744887, 6373928, 6068832, 6030986, 6092674, 6415523, 6497460, 6357149, 5976700, 5867243, 5747105, 5841313, 5999879, 6343604, 6483349, 6250620, 6463985, 6075965, 5794624, 6023744, 6125961, 6157745, 6215345, 5954469, 5887193, 5795976, 5537141, 5740011, 5728497, 5514464, 5620673, 5460535, 5098757, 5114899, 5202032, 5128816, 5503290, 5510036, 5356477, 5355591, 5048882, 5046620, 4962310, 4649182, 4986594, 5111117, 5174917, 5108286, 5234893, 5504061, 5373611, 5321988, 5361566, 5140654]
2370E140654L67119k1882m23106K41615K16323L27318J54846k8082m54974k45510
2360E274321M17653J96508o5380R1295K78339k62250j73322J81384L9529K26117
2350F204194K05640K61050j94452l09214K76824q1210K25084M3824M5000k58265
2340F418475k22577L28578J07319K29030L37386j1956k30345k71573K73822l290
2330F954869J05186j42222N01208L70849L3955j58594l26616N1340K47576K7120
2320G664671r4038K75796k54181j72207K87500M30548J10399j70059K21830K93532
2310H593791R2756k14924n6391R201J55478J48377k7817J03220k23952M2213J98679
2299H820631J70980J48488M37805Q2801J97155J73673P6307K57538J70025m1198
$$ y = [5140654, 5507773, 5485891, 5062785, 5304400, 5520723, 5848041, 6002887, 5974805, 5519831, 5274321, 5691974, 5888482, 5823102, 5914397, 6192736, 5930486, 5757164, 5938548, 5978077, 6204194, 6409834, 6670884, 6476432, 6167218, 6444042, 6362832, 6587916, 6631740, 6676740, 6418475, 6195898, 6524476, 6631795, 6860825, 7198211, 7186255, 6955910, 6684337, 6958159, 6954869, 7060055, 6917833, 7419041, 7789890, 7823845, 7665251, 7338635, 7389975, 7637551, 7664671, 7570633, 7846429, 7592248, 7420041, 7707541, 8138089, 8248488, 8078429, 8300259, 8593791, 8686547, 8471623, 8415232, 8424433, 8579911, 8728288, 8700471, 8803691, 8579739, 8621952, 8820631, 8991611, 9140099, 9577904, 9660705, 9857860, 10031533, 10107840, 10365378, 10535403, 10494205]
2289A0494205K6390J77625J03401J45780o8187Q8131q3137K70568Q00244M28942
2279A2383962j76649M49291O67107J43224O44219k39790j75765K81035M01262
2270A4377896L16604M61342K73520N19179K60074P00091o8463K17632P22181N08699
2260A8288755J83836L20379P39507J45842J31395L32885L09865J004718N84539
2251B2041721J00439K51545O33606N65591J71871M62117P99348M25913M46979
2242B5899130N10586N81576L93431O37863O64111K03715R17843N53222P49414
2233C1110891O75218Q29600R68752J084063R53264N33208J097860Q84563J014438
2224C9151857J425089Q98154J222803J084584J140233J085530J033604J443655
$$ y = [10494205, 10520595, 10698220, 10801621, 10947401, 10879214, 10967345, 10884208, 11154776, 11955020, 12383962, 12207313, 12656604, 13323711, 13466935, 14111154, 13871364, 13695599, 13976634, 14377896, 14694500, 15155842, 15429362, 15948541, 16208615, 16908706, 16840243, 17057875, 17780056, 18288755, 18472591, 18792970, 19532477, 19678319, 19809714, 20142599, 20452464, 21457182, 22041721, 22142160, 22393705, 23027311, 23592902, 23764773, 24226890, 25026238, 25452151, 25899130, 26409716, 26991292, 27384723, 28022586, 28686697, 28890412, 29808255, 30361477, 31110891, 31786109, 32615709, 33584461, 34668524, 35621788, 36154996, 37252856, 38137419, 39151857, 40576946, 41475100, 42697903, 43782487, 44922720, 46008250, 47041854, 48485509]
2216D8485509J545418J187478J235610P34661J357089R41793J160309R78663Q22026
2207E8448556J008103J055308R63838O60775R64224J501180J140558J262167J110323
2198F8115032J275424J543073J270488J503660J875715J477120J888356J682977
2190H0631845J840685J880626J817711K140982J734521J866050K265983K427347
2182I6605750K472339K626190K597626K943011L436491L649295M350198M654936
2174A23335836N074467N792101O049874P226121P905376Q107930R052763J0191061
2166A82735529J0747692J1393282J2435991J2995476J2769160J2928483J1043450
2159B67049063R376046O233842J925334k566982p000435j0607923j3767473j5827814
$$ y = [48485509, 50030927, 51218405, 52454015, 53188676, 54545765, 55487558, 56647867, 57626530, 58448556, 59456659, 60511967, 61475805, 62136580, 63100804, 64601984, 65742542, 67004709, 68115032, 69390456, 70933529, 72204017, 73707677, 75583392, 77060512, 78948868, 80631845, 82472530, 84353156, 86170867, 88311849, 90046370, 91912420, 94178403, 96605750, 99078089, 101704279, 104301905, 107244916, 110681407, 114330702, 118680900, 123335836, 128410303, 134202404, 140252278, 147478399, 155383775, 163491705, 172544468, 182735529, 193483221, 204876503, 217312494, 230307970, 243077130, 256005613, 267049063, 276425109, 282658951, 284584285, 282017303, 275016868, 264408945, 250641472, 234813658]
2151B34813658j7253147j7290054j5798233j4018395j2913314j1930630j0428652
2144A35181233r283605q336799o973692o517335o322100n345990n077935m068350
2136H3255427l658031l732590l754644k790691k510546k636261k425578j860052
2128E9887034k172081j824792j727678j196395j684087j462269j501383j543946
2120D6774403j288467j573158j440738q64778r99792r52959j153193j143758j330439
2111C6027121r79033p43996n87887j025653j192924n67485o15528j078251p14213
2102B8522151n62763p95001n00895p72564o78752r09814l08735n07137j88348
2093B3298142m69503l87761o55222l32976l29164n12483l45609p4719m74891m4335
$$ y = [234813658, 217560511, 200270457, 184472224, 170453829, 157540515, 145609885, 135181233, 125897628, 117560829, 110587137, 104069802, 97747702, 92401712, 87323777, 83255427, 79597396, 75864806, 72110162, 69319471, 66808925, 64172664, 61747086, 59887034, 57714953, 55890161, 54162483, 52966088, 51282001, 49819732, 48318349, 46774403, 45485936, 43912778, 42472040, 41607262, 40607470, 39654511, 38501318, 37357560, 36027121, 35048088, 34304092, 33716205, 32690552, 31497628, 30930143, 30314615, 29236364, 28522151, 27959388, 27164387, 26663492, 25890928, 25212176, 24302362, 23993627, 23486490, 23298142, 22828639, 22440878, 21785656, 21452680, 21123516, 20611033, 20265424, 20190705, 19715814, 19671479]
2083A9671479k47155l26814l77071n16576j09548j41613m26628k6947m39572m04377
2073A6655178j75790o3933l41961l7608l60804m33660j39467J15224r7305l84309
2063A4735565m31488l57232j63010k24626j46066l72959k13592L1076J12907j89459
2053A2781116p09657l50239l8467l8462j61345M49966k44510j89233J07008k53762
2043A1352415m57450K67532n1680n9660k70704j32989j67843j47449R6511q44
2033A0427839l14529K18279J87096k08457j41286j22618j39353O8979o1161J51553
2023A0066342j52688o80798k30319j9940K48116J05133J83835k39222J75945L9497
2013I495901l27270m6003P0759m66484M17018R1184J032n57618k1846k40020l62743
$$ y = [19671479, 19424324, 19097510, 18720439, 18203863, 18094315, 17952702, 17526074, 17499127, 17059555, 16655178, 16479388, 16415455, 16073494, 16035886, 15675082, 15241422, 15101955, 15217179, 15119874, 14735565, 14304077, 13946845, 13783835, 13559209, 13413143, 13040184, 12826592, 12857668, 12970575, 12781116, 12071459, 11721220, 11682753, 11644291, 11482946, 11932912, 11688402, 11499169, 11606177, 11352415, 10894965, 11162497, 11110817, 11051157, 10780453, 10647464, 10479621, 10332172, 10428683, 10427839, 10113310, 10331589, 10518685, 10310228, 10168942, 10046324, 9906971, 9975950, 9914789, 10066342, 9913654, 9232856, 9002537, 8982597, 9230713, 9335846, 9519681, 9280459, 9456404, 9495901, 9168631, 9122628, 9193387, 8726903, 9143921, 9235105, 9236137, 8678519, 8656673, 8416653, 8053910]
2002H053910m4395K30661l14754M6008k93845P2842j26587J40127j42358l8334
1992G583275l62821P1265j27569N7287K88578K46820k94290k44978J01129m45535
1982F873161L15075O5397J07370j84129r5149j43434j85648n01214N0885J93420
1972F495734j06917p0863Q9389j31785j63663k11120J30932k6918k31328K51186
1962F024647k15660O2396R9887J35977n26302O7824K46325j7697j51180j21303
1952E604914k60462k00416M85561J01991m04823k10898j99348J3876K36628L65424
1942E532447m48286j77779J60632k68816R994j04921K05882K50616j41008K7358
1932E046119l6885l03536N389p6331J85668K13374J43848l08132n5515l8483R0228
$$ y = [8053910, 8009515, 8240176, 7925422, 7971430, 7677585, 7750427, 7623840, 7763967, 7621609, 7583275, 7220454, 7291719, 7164150, 7221437, 7510015, 7756835, 7462545, 7217567, 7318696, 6873161, 7188236, 7253633, 7361003, 7176874, 7081725, 6938291, 6752643, 6251429, 6302314, 6495734, 6388817, 6317954, 6407343, 6275558, 6111895, 5900775, 6031707, 6004789, 5773461, 6024647, 5808987, 5871383, 5971270, 6107247, 5580945, 5648769, 5895094, 5877397, 5726217, 5604914, 5344452, 5144036, 5629597, 5731588, 5326765, 5115867, 4916519, 4930395, 5167023, 5532447, 5084161, 4906382, 5067014, 4798198, 4808192, 4703271, 4909153, 5159769, 5018761, 5046119, 5009234, 4705698, 4711087, 4634756, 4820424, 5033798, 5177646, 4869514, 4813999, 4775516, 4865744]
1921D865744J9767M45786K10825o9882l31272J97064m34044k31552L15861J79830
1911E168127J79255Q8279k56232P5193m58267K02454K96668N26831Q8225L3339
1901E943872j77553k65077J59464n9320K39396k2055K79945L45645l84227p6398
1891E983692J15569o3547J44179J87311k12021J56222j95687M3q0756N50974K78828
1880F864807l24936j42492J97864O9687j07046N24889L52681q7488L0530K72011
1870G650507k02904K5488l6439N63K27655J36595M2436k85604o2600M39919l1309
1859G904307J16786M42172q5457m72474L09009K57180N67514M19543J08670k1705
1849I545545K12077k35875M97475K25609M24592M25783p6549Q6860N66073N51566
$$ y = [4865744, 4885511, 5331297, 5542122, 5472240, 5140968, 5338032, 4903988, 4672436, 4988297, 5168127, 5347382, 5435661, 5179429, 5254622, 4796355, 4998809, 5295477, 5822308, 5910533, 5943872, 5766319, 5501242, 5660706, 5601386, 5840782, 5818727, 6098672, 6444317, 6060090, 5983692, 6099261, 6035714, 6179893, 6367204, 6155183, 6311405, 6115718, 6115761, 6035005, 6585979, 6864807, 6539871, 6397379, 6595243, 6664930, 6557884, 7082773, 7435454, 7347966, 7378496, 7650507, 7447603, 7473091, 7436652, 7437215, 7664870, 7801465, 7843901, 7558297, 7495697, 7935616, 7904307, 8021093, 8463265, 8377808, 7905334, 8214343, 8471523, 9039037, 9458580, 9567250, 9545545, 9757622, 9521747, 10019222, 10244831, 10669423, 11095206, 11018657, 11105517, 11671590, 12223156]
1839A2223156N07082L07406Q36871P14419N06688N10274L85545M82352P11000
1830A7184793P90611R57012N75805Q01552N04565N10966N21008k00507L92468
1821B2038273L23336O7072K21712K91827K63061J58626r3858K36437L06901M02120
1811B4215507O6855J30728M34418J039038J032439O97877O58162M29103J004536
1802B9708663R64592J621989J401808J335919J527860J687348J267045J179333
1794D0694557M32794q42800j508690j725593j590418j713170j387739j228383
1786C1130558r64389r59180k05458l00699k09655m30904m29176o3025P1046L96186
1776B8035304N26502r1757p6400R1205K96790K16311O09042L76316K10880J00101
$$ y = [12223156, 12730238, 13037644, 13874515, 14588934, 15095622, 15605896, 15991441, 16473793, 17184793, 17975404, 18932416, 19508221, 20309773, 20814338, 21325304, 21846312, 21645805, 22038273, 22361609, 22428681, 22650393, 22942220, 23205281, 23363907, 23270049, 23506486, 23813387, 24215507, 24282362, 24413090, 24847508, 25886546, 26918985, 27616862, 28275024, 28704127, 29708663, 30673255, 32295244, 33697052, 35032971, 36560831, 38248179, 39515224, 40694557, 41127351, 40284551, 38775861, 37050268, 35459850, 33746680, 32358941, 31130558, 30166169, 29206989, 29001531, 28700832, 28491177, 28060273, 27631097, 27568072, 27639118, 28035304, 28561806, 28470049, 28393649, 28484854, 28781644, 28997955, 29606997, 29983313, 30194193, 30294294]
1766C0294294N5873k39640m41353l13854o32639n08139k63324r64101j495929
1757B5491188r76814j001893p59456o10824n80003j95813n42975m51485l09670
1748B0062255J27922j39179k52951m92216p81021j05175o77856n74152n90282
1739A6577345m68205l92927m50246n42440n60262o77591p63276o21077l58120
1730A1743201m92510k66408m97302p62363q6939k6660l81924J7168K86274p37458
1720H795079l24527k66358p3488J13205j11832k59708l48310j51374q0211J89369
1710G481845m00642m64005J1193l2129l65507j78816j50158k17794k350m0575
1700E641062J00459l37807k99814j25978k99189J3980R9678L5780j88660j72226
$$ y = [30294294, 30350167, 30110527, 29669174, 29355320, 28722681, 28214542, 27951218, 26987117, 25491188, 24514374, 23512481, 22753025, 22142201, 21562198, 21366385, 20823410, 20371925, 20062255, 20190177, 20050998, 19798047, 19305831, 18524810, 18419635, 17741779, 17167627, 16577345, 16109140, 15716213, 15265967, 14723527, 14163265, 13485674, 12722398, 12101321, 11743201, 11250691, 10984283, 10486981, 9724618, 9637679, 9611019, 9229095, 9246263, 9532537, 8795079, 8470552, 8204194, 8130706, 8243911, 8132079, 7872371, 7524061, 7372687, 7292476, 7481845, 7081203, 6617198, 6628391, 6596262, 6230755, 6051939, 5901781, 5683987, 5681637, 5641062, 5741521, 5403714, 5103900, 4977922, 4678733, 4692713, 4792391, 4828171, 4639511, 4467285]
1690D467285n3930L09162J8459k56962k25058J8809O1498J08423O3735j40957
1680D370464n91982l18502J49986n6857M2915k93663j8444j51954J73433K910
1670C308306m219j41801k34496J26260n4273J16157k14993l57423p7051L93430
1660B859897l22751o4883J05340Q267j56681P5216J18385k77203k00967k87677
1650A856943L3314j47629N25841l3760q4610j07136q8893N3446n7157J9260P419
1639A977038j88951N2975K85292l04086J35241j68644o1803k8447k57457K75006
1629A716164J3154Q9996k17679P5983m11813J31154K93183j96261P0603N561q7791
1618A482254K31644j03160l26560l6093k70024J96352J34170j18186Q1196j24601
$$ y = [4467285, 4413355, 4722517, 4740976, 4484014, 4258956, 4277765, 4339263, 4447686, 4511421, 4370464, 3778482, 3459980, 3609966, 3553109, 3596024, 3302361, 3283917, 3131963, 3305396, 3308306, 3304087, 3162286, 2927790, 3054050, 2999777, 3115934, 2900941, 2543518, 2466467, 2859897, 2537146, 2472263, 2577603, 2585870, 2429189, 2504405, 2622790, 2345587, 2144620, 1856943, 1890257, 1742628, 2268469, 2234709, 2150099, 2042963, 1954070, 2007516, 1950359, 1969619, 1977038, 1788087, 1841062, 2126354, 1822268, 1957509, 1788865, 1727062, 1698615, 1441158, 1716164, 1729318, 1819314, 1601635, 1677618, 1265805, 1396959, 1690142, 1493881, 1564484, 1570045, 1482254, 1713898, 1610738, 1284178, 1248085, 978061, 1174413, 1308583, 1190397, 1271593, 1146992]
1608A146992L8300K01396p2509l4436j21013Q9565r4752Q9858j07798o3530n1553
1597A020520J44263j27881J85872j31200p4055n0913p4622k9232O3441k57008
1587F69185L7547j8405K25188O8243K33652P0041l24843J35837l97341l4222J24313
1576G89195M7901m9099R1312J20799J21164k84761j76611j81741L3445M262J41836
1565F57702l1417K1380l769M0638M03J40962r5983r5135j26212M4823L39995J39878
1553A033265Q0635l43737r3446J55869j18206Q551N40k66266j29260p1646J18873
1542C75172Q1457M0568J63377K24674K7829m3792j66208K64595j88553M3014j28832
1531F93301Q0079J04791k73633J68688k8655K5687K6228L5391k70912n91608R0664
$$ y = [1146992, 1185292, 1386688, 1314179, 1279743, 1158730, 1248295, 1153543, 1243401, 1135603, 1072073, 1020520, 1164783, 1036902, 1222774, 1091574, 1017519, 966606, 891984, 862752, 926193, 669185, 706732, 688327, 913515, 981758, 1215410, 1285451, 960608, 1096445, 699104, 664882, 789195, 837096, 787997, 879309, 1000108, 1121272, 836511, 659900, 478159, 511604, 515866, 657702, 626285, 647665, 643896, 684534, 684937, 825899, 729916, 634781, 508569, 553392, 893387, 1033265, 1113900, 770163, 676717, 832586, 714380, 722931, 723471, 457205, 327945, 256299, 375172, 456629, 497197, 660574, 885248, 913077, 869285, 703077, 967672, 779119, 822133, 693301, 773380, 878171, 604538, 773226, 744571, 770258, 796486, 831877, 560965, -30643, 60021]
1520F0021J58210J86996L02130M1021n4077m6253J20881q3077j7047j68616J52385
1509F52574p3563L57041j48954o3879j10152j20647k85105m6674J50495L24527
1499F35663J28001k95915l66194N5265L16143J66082J83329l78364K69162K64503
1489I77675L6097k23756j45714l93221n4929R1204L17949j18651Q446J31446L0899
1478F57445j11478J31067p6498J62858k92148j57027J86632J02648j66775o9457
1468C67267k7437K21946L00285j89461O7509r341m04702K87966K30427j16903
1458G27556j13953K4374J43316j17935J16762m05552k15963J46505K34240j6951
1448E22399j54644R446r498q4377m0798j25436J81871J04979Q5754k0806L0828
$$ y = [60021, 218231, 405227, 707357, 748378, 694301, 648048, 768929, 685852, 668805, 500189, 652574, 579011, 936052, 787098, 723219, 613067, 492420, 207315, 160641, 311136, 635663, 763664, 467749, 101555, 156820, 472963, 639045, 822374, 444010, 713172, 977675, 1013772, 790016, 644302, 251081, 196152, 287356, 605305, 486654, 495100, 626546, 657445, 545967, 677034, 600536, 763394, 471246, 314219, 500851, 603499, 436724, 367267, 339830, 561776, 862061, 672600, 740109, 730768, 326066, 614032, 844459, 727556, 613603, 637977, 781293, 663358, 780120, 374568, 158605, 305110, 539350, 522399, 367755, 377201, 367703, 283326, 242528, 117092, 298963, 403942, 489696, 468890, 499718]
1437D99718j71491P2155j04197L43158k8837j54924P2746J50345l58867m18594
1427i8788j93314J24032M17841k3668r5337l0212J69348J36703j65572m1459j40555
1416E9019k6414q2707Q6495J02319r697P6241l3450j15352K8507l9481k3032j06248
1404h3800K03172J63922j11634M1788J16967p8737r4249k9741J71961J80397j08870
1393C71176l36693K55309k03031j1041M52639k22072J27401O1948k25428L40410
1383F10618k72328m28284J97814p0439j61246O069J20981J64214j8697K33676
1373C82378P6948J7690j77664l9009m93060k12207L30499L22440p2714j82018
1363d6717J20585K06144Q2657k66534n0766k16311k9645M7682L30024l34658O0280
$$ y = [499718, 328227, 400382, 296185, 639343, 610506, 455582, 528328, 678673, 319806, -98788, -292102, -168070, 249771, 226103, 130766, 100554, 269902, 406605, 241033, 199574, 59019, 32605, -50102, 36393, 138712, 129015, 205256, 171806, 56454, 84961, 45480, 22448, -83800, 119372, 283294, 171660, 213448, 330415, 251678, 157429, 127688, 299649, 480046, 371176, 34483, 289792, 86761, 75720, 528359, 306287, 433688, 495636, 270208, 610618, 338290, -89994, 107820, 37381, -123865, -117796, 3185, 167399, 148702, 382378, 459326, 477016, 299352, 260343, -232717, -444924, -114425, 208015, 135301, -46717, 73868, 280012, 362669, 96135, 45369, -170942, -200587, -152905, 177119, -157539, -97259]
1352i7259k25739L08370K92530O3334P2059p9367j70273p0027O1267J22427k3950
1341B53372r120q2984J48592k10760M88991Q4317m63134l39129J20951j86261
1331a95165K49533j73746J17657K80544j45786J85860l9954K1002m4878l04985
1321d9918K86603k00987K40199j73118l6507j17637K20596q4015k56787L63153
1311A91582k6513N9980j18378j72716j61378K31641M3427n2347p0993Q1255l21544
1300c15984j20641J74758K95901k43996L10731J03854k49605j54205J83262J10541
1290I4616k38116o5542j98455K59537o1198K9666R9949j81203j55169K97776J0822
1279a07317j21885L63346l82527j71992J48114J33485J04500m2028k47449k9710
$$ y = [-97259, -322998, -14628, 277902, 341236, 413295, 333928, 163655, 93628, 154895, 277322, 253372, 244252, 161268, 309860, 99100, 588091, 672408, 209274, -129855, -8904, -195165, 54368, -119378, -1721, 278823, 133037, 318897, 278943, 299945, 255067, -49918, 236685, 35698, 275897, 102779, 66272, -51365, 169231, 85216, -171571, 191582, 165069, 225049, 106671, -66045, -227423, 4218, 47645, -4702, -75695, 5560, -315984, -436625, -261867, 34034, -209962, 100769, 204623, -44982, -199187, -15925, 94616, -143500, -209042, -407497, -147960, -209158, -179492, -79543, -260746, -415915, -118139, -107317, -229202, 134144, -248383, -420375, -272261, -138776, -34276, -76304, -323753, -353463]
1269c53463J5773K03883q5316j9971J4504J46197m17784K12617K35826J14331
1259F6597m24400M20577K78434J966k52524j0632p6852j42216k43440K35982J07165
1248c9343J96493J63365J88889J18998k57253M4797m9570N4107K87121l2899L0999
1237G05704J41759J36012K8918O5219m97522K13799N49085J59128k1437l97948
1227A082717N9492k90229n7357K38188L6558j70630J79127k14399r2233J086k01886
1216E70434j97851j55540j53407K62820J54342m3333j15784J50382j08483O5229
1206D28809j20018j84925p5670Q4966K16905J33234l32600P8447j83763L1918
1196G7303o4666l22497K51571L41994j5699k0350J87554l09469k32617k9771L62814
$$ y = [-353463, -337690, -133807, -219123, -239094, -224590, -78393, -496177, -283560, -47734, 66597, -357803, 62774, 341208, 343174, 90650, 80018, 3166, -139050, -382490, -146508, -39343, 157150, 320515, 509404, 628402, 371149, 415946, 366376, 420483, 707604, 674705, 705704, 847463, 983475, 1012393, 1077612, 580090, 793889, 1342974, 1502102, 1480665, 1082717, 1142209, 851980, 794623, 1032811, 1069369, 898739, 1077866, 863467, 771234, 772320, 570434, 372583, 217043, 63636, 326456, 480798, 437465, 321681, 472063, 363580, 428809, 308791, 123866, 48196, 133162, 350067, 483301, 150701, 229148, 45385, 77303, 12637, -309860, -58289, 283705, 268006, 247656, 435210, 125741, -106876, -136647, 226167]
1185B26167m23772j51471M87086j19327j29710L1847P6170k73161l35381k35464
1175h47016K80785P6347j93653J85032m5903J81324L51309Q9893L83679m25989
1165C5808j3179J46052J08434J29437k28749k33394k27713Q3544n9832K11940
1155d7652K9189n7482L58688K87588k39055j01924L15958n1822j68309k7611J79545
1144D77113n3125j62347K46726l1216n061o6011J48611j03633l01284L76941N5624
1133E82338J61194k20739J59477k56649N1753K21448j17608q0048N7102j1900
1123E46368j56270P0800J79546j71211j01185R3332K21439P9411j31198L75176
1113A006208k78784P9464J75705j84761r9738J9234j32005M38196R0277k01648
$$ y = [226167, -197605, -349076, 138010, 18683, -111027, -79180, -3010, -276171, -611552, -847016, -566231, -489884, -683537, -498505, -544408, -363084, -11775, 78118, 461797, 35808, 22629, 168681, 277115, 406552, 177803, -55591, -283304, -199760, -259592, -47652, -18463, -75945, 282743, 570331, 331276, 229352, 545310, 493488, 325179, 297568, 477113, 423988, 261641, 508367, 477151, 472090, 406079, 554690, 451057, 149773, 526714, 582338, 743532, 522793, 682270, 425621, 477374, 698822, 581214, 501166, 558268, 546368, 390098, 460898, 640444, 469233, 368048, 461380, 682819, 762230, 631032, 1006208, 727424, 806888, 982593, 797832, 698094, 717328, 585323, 1023519, 1113796, 912148]
$$ [...]
##END NTUPLES=NMR SPECTRUM
##END=
