##TITLE=1H_CG-1049-A2
 CDCl3, 8 sc, 
 19.11.2020
##JCAMPDX= 6.0         $$ Bruker NMR JCAMP-DX V2.0
##DATA TYPE= NMR SPECTRUM
##DATA CLASS= NTUPLES
##ORIGIN= UXNMR, Bruker Analytische Messtechnik GmbH
##OWNER= root
$$ XWIN-NMR		Version 3.5
$$ Thu Nov 19 10:54:47 2020 Russian Standard Time (UT+4h)  she@DPX200
##.OBSERVE FREQUENCY= 200.1315066352
##.OBSERVE NUCLEUS= ^1H
##.ACQUISITION MODE= SIMULTANEOUS
##.ACQUISITION SCHEME= undefined
##.AVERAGES= 8
##.DIGITISER RES= 18
##SPECTROMETER/DATA SYSTEM= spect
##.PULSE SEQUENCE= zg30
##.SOLVENT NAME= CDCl3
##.SHIFT REFERENCE= (INTERNAL, CDCl3, 0, 15.9854)
##AUDIT TRAIL= $$ (NUMBER, WHEN, WHO, WHERE, WHAT)
$$ ##TITLE= Audit trail, XWIN-NMR		Version 3.5
$$ ##JCAMPDX= 5.01
$$ ##ORIGIN= Bruker BioSpin GmbH
$$ ##OWNER= she
$$ F:/spectra/data/she/nmr/H-F/1/pdata/1/auditp.txt
$$ ##AUDIT TRAIL=  $$ (NUMBER, WHEN, WHO, WHERE, WHAT)
(   1,<2020-11-19 10:53:23.06 +0400>,<she>,<DPX200>,
      <created by zg, POWCHK disabled, PULCHK disabled
       configuration hash MD5:
       00 E9 B6 7A A2 85 ED C7 34 08 36 98 17 FE 4E 26
       data hash MD5: 16K
       46 24 0A 9B 7E 5E CF 11 82 19 0C EB 2C E5 12 CB>)
(   2,<2020-11-19 10:53:25.60 +0400>,<she>,<DPX200>,
      <Start of raw data processing
       efp BC_mod = 2 LB = 0.24 FT_mod = 6 PKNL = 1 PHC0 = -11049.05 PHC1 = 11.6009 SI = 16K 
       data hash MD5: 16K
       08 89 8B A1 3C 6B 47 76 1C 17 94 CE 73 04 5F 63>)
(   3,<2020-11-19 10:53:48.50 +0400>,<she>,<DPX200>,
      <pk PHC0 = -1.011425 PHC1 = 0.6 
       data hash MD5: 16K
       34 48 1D 5E C6 E5 73 B5 9E E8 7F 02 4D 20 D5 A1>)
(   4,<2020-11-19 10:53:52.06 +0400>,<she>,<DPX200>,
      <abs ABSG = 5 
       data hash MD5: 16K
       FF 2A E4 78 35 12 B3 62 3F 96 39 E0 6E 25 AD 78>)
$$ ##END=
$$ 
$$ hash MD5
$$ 3B D6 79 45 36 79 8E 60 15 E0 09 87 08 F2 6C 5A
##$RELAX= 
##$RELAX= 
##$RELAX= 
##$RELAX= 
##$RELAX= 
##$RELAX= 
$$ Bruker specific parameters
$$ --------------------------
##$DU= <F:/spectra>
##$EXPNO= 1
##$NAME= <H-F>
##$PROCNO= 1
##$TYPE= <nmr>
##$USER= <she>
##$AMP= (0..31)
100 100 100 100 100 100 100 100 100 100 100 100 100 100 100 100 100 100 
100 100 100 100 100 100 100 100 100 100 100 100 100 100 
##$AQSEQ= 0
##$AQ_mod= 1
##$AUNM= <au_zg>
##$AUTOPOS= <>
##$BF1= 200.13
##$BF2= 200.13
##$BF3= 200.13
##$BF4= 200.13
##$BF5= 200.13
##$BF6= 200.13
##$BF7= 200.13
##$BF8= 200.13
##$BYTORDA= 1
##$CFDGTYP= 0
##$CFRGTYP= 5
##$CHEMSTR= <none>
##$CNST= (0..31)
1 1 145 1 1 1 1 1 1 1 1 1 1 1 1 1 1 1 1 1 1 1 1 1 1 1 1 1 1 1 1 1 
##$CPDPRG= <>
##$CPDPRG1= <>
##$CPDPRG2= <>
##$CPDPRG3= <>
##$CPDPRG4= <mlev>
##$CPDPRG5= <mlev>
##$CPDPRG6= <mlev>
##$CPDPRG7= <mlev>
##$CPDPRG8= <mlev>
##$CPDPRGB= <>
##$CPDPRGT= <>
##$D= (0..31)
0 1.2 0 0 0 0 0 0 0 0.06 0 0.03 0 0 0 0 0.0002 0 0 0 0 0 0 0 0 0 0 0 0 
0 0 0 
##$DATE= 1605768802
##$DBL= (0..7)
120 120 120 120 120 120 120 120 
##$DBP= (0..7)
150 150 150 150 150 150 150 150 
##$DBP07= 0
##$DBPNAM0= <>
##$DBPNAM1= <>
##$DBPNAM2= <>
##$DBPNAM3= <>
##$DBPNAM4= <>
$$ [...]
##$SUBNAM3= <"">
##$SUBNAM4= <"">
##$SUBNAM5= <"">
##$SUBNAM6= <"">
##$SUBNAM7= <"">
##$SUBNAM8= <"">
##$SUBNAM9= <"">
##$SW= 16.9725356469052
##$SWIBOX= (0..15)
0 0 2 0 0 0 0 0 0 0 0 0 0 0 0 0 
##$SW_h= 3396.73913043478
##$TD= 16384
##$TD0= 1
##$TE= 0
##$TE2= 300
##$TE3= 300
##$TEG= 300
##$TL= (0..7)
0 120 120 120 120 120 120 120 
##$TP= (0..7)
150 150 150 150 150 150 150 150 
##$TP07= 0
##$TPNAME0= <>
##$TPNAME1= <>
##$TPNAME2= <>
##$TPNAME3= <>
##$TPNAME4= <>
##$TPNAME5= <>
##$TPNAME6= <>
##$TPNAME7= <>
##$TPOAL= (0..7)
0.5 0.5 0.5 0.5 0.5 0.5 0.5 0.5 
##$TPOFFS= (0..7)
0 0 0 0 0 0 0 0 
##$TUNHIN= 0
##$TUNHOUT= 0
##$TUNXOUT= 0
##$USERA1= <user>
##$USERA2= <user>
##$USERA3= <user>
##$USERA4= <user>
##$USERA5= <user>
##$V9= 5
##$VALIST= <valist>
##$VCLIST= <CCCCCCCCCCCCCCC>
##$VD= 0
##$VDLIST= <DDDDDDDDDDDDDDD>
##$VPLIST= <PPPPPPPPPPPPPPP>
##$VTLIST= <TTTTTTTTTTTTTTT>
##$WBST= 1024
##$WBSW= 4
##$XGAIN= (0..3)
0 0 0 0 
##$XL= 0
##$YL= 0
##$YMAX_a= 458672
##$YMIN_a= -380459
##$ZGOPTNS= <>
##$ZL1= 120
##$ZL2= 120
##$ZL3= 120
##$ZL4= 120
##$ABSF1= 15.98232
##$ABSF2= -0.9903421
##$ABSG= 5
##$ABSL= 3
##$ALPHA= 0
##$AQORDER= 0
##$ASSFAC= 0
##$ASSFACI= 0
##$ASSFACX= 0
##$ASSWID= 0
##$AUNMP= <proc_1d>
##$AZFE= 0.1
##$AZFW= 0.1
##$BCFW= 0
##$BC_mod= 2
##$BYTORDP= 0
##$COROFFS= 0
##$CY= -3
##$DATMOD= 1
##$DC= 0
##$DFILT= <>
##$DTYPP= 0
##$F1P= 0
##$F2P= 0
##$FCOR= 1
##$FTSIZE= 16384
##$FT_mod= 6
##$GAMMA= 0
##$GB= 0
##$INTBC= 1
##$INTSCL= 1.245715e-10
##$ISEN= 128
##$LB= 0.24
##$LEV0= 0
##$LPBIN= 0
##$MAXI= 10000
##$MC2= 0
##$MEAN= 0
##$ME_mod= 0
##$MI= 1.114404
##$NCOEF= 0
##$NC_proc= -6
##$NLEV= 6
##$NOISF1= 3.799351
##$NOISF2= 2.8
##$NSP= 0
##$NTH_PI= 0
##$NZP= 0
##$OFFSET= 15.98542
##$PC= 1
##$PHC0= -11050.06
##$PHC1= 12.2009
##$PH_mod= 1
##$PKNL= yes
##$PPARMOD= 0
##$PSCAL= 0
##$PSIGN= 0
##$REVERSE= no
##$SF= 200.13000584271
##$SI= 16384
##$SIGF1= 3
##$SIGF2= 2
##$SINO= 5.538805
##$SIOLD= 16384
##$SREGLST= <1H.CDCl3>
##$SSB= 0
##$STSI= 16384
##$STSR= 0
##$SW_p= 3396.73913043478
##$SYMM= 0
##$S_DEV= 0
##$TDeff= 16384
##$TDoff= 0
##$TI= <>
##$TILT= no
##$TM1= 0
##$TM2= 0
##$TOPLEV= 0
##$USERP1= <user>
##$USERP2= <user>
##$USERP3= <user>
##$USERP4= <user>
##$USERP5= <user>
##$WDW= 1
##$XDIM= 16384
##$YMAX_p= 370840931
##$YMIN_p= -470962
$$ End of Bruker specific parameters
$$ ---------------------------------
##NTUPLES= NMR SPECTRUM
##VAR_NAME=  FREQUENCY,     SPECTRUM/REAL,   SPECTRUM/IMAG
##SYMBOL=    X,             R,               I
##VAR_TYPE=  INDEPENDENT,   DEPENDENT,       DEPENDENT
##VAR_FORM=  AFFN,          ASDF,            ASDF
##VAR_DIM=   16384,         16384,           16384
##UNITS=     HZ,            ARBITRARY UNITS, ARBITRARY UNITS
##FACTOR=    0.207333158178281, 1,           1
##FIRST=     3199.16224343785, 0,            0
##LAST=      -197.576886996932, 0,           0
##MIN=       -197.576886996932, -470962,     0
##MAX=       3199.16224343785, 370840931,    0
$$ Real data points
##PAGE= N=1
##DATA TABLE= (X++(R..R)), XYDATA
$$ [...]
6701I58683j1381K2369J56770m111k8243N6101J91979P3540n1126n9737J0484
$$ 958683 947302 969671 1126441 1122330 1094087 1150188 1342167 1415707 1364581 1304844 1315328
6690A315328j9020O1412j3992l6064J95480O3181o662L8410j79502M6326J23273
$$ 1315328 1296308 1357720 1343728 1307664 1503144 1566325 1559663 1598073 1418571 1464897 1588170
6679A588170j48256n9068J70415k3948j71826R3638N7016J7779r614j16467J6109
$$ 1588170 1439914 1380846 1551261 1527313 1355487 1449125 1506141 1523920 1514306 1397839 1413948
6668A413948O9844J11328J35259l0436J36804L2677O2987J28102J3660l9018n5005
$$ 1413948 1483792 1595120 1730379 1699943 1836747 1869424 1932411 2060513 2074173 2035155 1980150
6657A980150M9986L3128n4936o7523J4974J09836k00443m5265j4692M9271P8221
$$ 1980150 2030136 2063264 2008328 1940805 1955779 2065615 1865172 1819907 1805215 1854486 1932707
6646A932707L0344N5096P3550l0751L0953j56617Q01n4430L1282r5097j48820
$$ 1932707 1963051 2018147 2091697 2060946 2091899 1935282 1936083 1881653 1912935 1817838 1669018
6635A669018M5853j4678M8430M4983K69827L93076j20551k3815j64746j03743
$$ 1669018 1714871 1700193 1748623 1793606 2063433 2456509 2335958 2312143 2147397 2043654
6625B043654j8007l9138n1970l60733L6859o2511j1785k6338O1112M1896p8229
$$ 2043654 2025647 1986509 1934539 1573806 1610665 1548154 1536369 1510031 1571143 1613039 1534810
6614A534810J11261J1471P8919J40309k4029j36144j06000J9609j22288j03855
$$ 1534810 1646071 1657542 1736461 1876770 1852741 1716597 1610597 1630206 1507918 1404063
6604A404063J32803K795J14790R2464Q3695m3551P9442R2557j32071o096P9201
$$ 1404063 1536866 1539661 1654451 1746915 1830610 1787059 1866501 1959058 1826987 1820891 1900092
6593A900092n3099k01360j33433j60698q4292j0509J05193K957K8279R1950J24982
$$ 1900092 1846993 1645633 1512200 1351502 1267210 1256701 1361894 1364851 1393130 1485080 1610062
6582A610062n7602J34072Q1570m939K5536j44719l0512J00622j08099j60474O365
$$ 1610062 1552460 1686532 1768102 1763163 1788699 1643980 1613468 1714090 1605991 1445517 1451882
6571A451882m8849L0969J70993J73763k04634k26151J14773K53534J6988J2384
$$ 1451882 1403033 1434002 1604995 1778758 1574124 1347973 1462746 1716280 1733268 1745652
6561A745652J668j69909j38365K4882l1171k2619O2423L6885j0264J54186J55249
$$ 1745652 1747320 1577411 1439046 1463928 1432757 1410138 1472561 1509446 1499182 1653368 1808617
6550A808617j40888q9659J47590J23322l0628L0679k24529n5183N687P1316j39086
$$ 1808617 1667729 1578070 1725660 1848982 1818354 1849033 1624504 1569321 1575008 1646324 1507238
6539A507238j41900n2485j00398O4490J2509J70742m8069r1353Q9943j43177M6042
$$ 1507238 1365338 1312853 1212455 1276945 1289454 1460196 1412127 1320774 1410717 1267540 1313582
6528A313582K0477l5933Q42J19203m3810n1720l5973n0805O8558J17890k6264
$$ 1313582 1334059 1298126 1298968 1418171 1374361 1322641 1286668 1235863 1304421 1422311 1396047
6517A396047J34006m0888J49193J90669k9878k5189p1048j76657k54300N0424
$$ 1396047 1530053 1489165 1638358 1829027 1799149 1773960 1702912 1526255 1271955 1322379
6507A322379O9200O453J33036k49868j63892J79861J34954n8559q6584R9363M2313
$$ 1322379 1391579 1398032 1531068 1281200 1117308 1297169 1432123 1373564 1286980 1386343 1428656
6496A428656l1348N4414j70365j45525K80851P6735l31j55582J499Q9363J86429
$$ 1428656 1397308 1451722 1281357 1135832 1416683 1493418 1493087 1337505 1339004 1428367 1614796
6485A614796J3863q2793R0259J42818l6939J616J4242j39619k91351N2490N9943
$$ 1614796 1628659 1545866 1636125 1778943 1742004 1743620 1757862 1618243 1326892 1379382 1439325
6474A439325N6089j37014j60706Q802J30412K15425l3949J04685J8868j53595
$$ 1439325 1495414 1358400 1197694 1206496 1336908 1552333 1518384 1623069 1641937 1488342
6464A488342l1045J61105J50573k85551j92241R5632J7089J5394K2860q8351R0492
$$ 1488342 1457297 1618402 1768975 1483424 1291183 1386815 1403904 1419298 1442158 1353807 1444299
6453A444299J03351J43026O8539j8662k0275j45906k81830J38263L4117k61793
$$ 1444299 1547650 1690676 1759215 1740553 1720278 1574372 1292542 1430805 1464922 1203129
6443A203129l2770N6433O7960n007l6326l1921J84404o1898m6840o7138O8045
$$ 1203129 1170359 1226792 1294752 1289745 1253419 1221498 1405902 1344004 1297164 1230026 1298071
6432A298071k7935L6083K9536Q0605l1906k38244j3057j05302L2059p99P1019
$$ 1298071 1270136 1306219 1335755 1416360 1384454 1146210 1133153 1027851 1059910 1059111 1130130
6421A130130J3414Q5520k4809Q4906r839p3653q235j58934R3896L4450j93193
$$ 1130130 1143544 1229064 1204255 1289161 1279322 1205669 1197434 1038500 1132396 1166846 973653
6410I73653j61255J19560J17057Q3171n0223k6949l5203J57523P9655j20091O2406
$$ 973653 812398 931958 1049015 1132186 1081963 1055014 1019811 1177334 1256989 1136898 1199304
6399A199304o1497r1257L1378R2609P1627j94887j42872j8250J56503M313r1387
$$ 1199304 1137807 1046550 1077928 1170537 1242164 1047277 904405 886155 1042658 1046971 955584
6388I55584j43746K8595J62953O5841M8548J9417M5201j84526p0467J68518L6840
$$ 955584 811838 840433 1003386 1069227 1117775 1137192 1182393 997867 927400 1095918 1132758
6377A132758k3796j16781k8723J1188P0401K8861N7023J54462k6960l0523O6136
$$ 1132758 1108962 992181 963458 974646 1045047 1073908 1130931 1285393 1258433 1227910 1294046
6366A294046j02690j05319R6430R5646r2412k80924j94157J52568K63208L6674
$$ 1294046 1191356 1086037 1182467 1278113 1185701 904777 710620 863188 1126396 1163070
6356A163070R808n0855M1758J58447j91150J11211J74440k8119k78473M3200J22517
$$ 1163070 1172878 1122023 1163781 1322228 1131078 1242289 1416729 1388610 1110137 1153337 1275854
6345A275854k45937j27067j78616J74032m9704J97799J2520j16656J03360P2345
$$ 1275854 1029917 902850 724234 898266 848562 1046361 1058881 942225 1045585 1117930
6335A117930R3141J23339j85162j80189q682J83149j35110k05481L6832K19902
$$ 1117930 1211071 1334410 1149248 969059 960377 1143526 1008416 802935 839767 1059669
6325A059669l2874o9590J16688J21190j2092l381M7191p6442K834k07547K0826
$$ 1059669 1026795 957205 1073893 1195083 1182991 1179610 1226801 1150359 1153193 945646 966472
6314I66472K34308O0942j48508J7063N6069O756n1140n5683n0235j10279P3066
$$ 966472 1200780 1261722 1113214 1130277 1186346 1193102 1141962 1086279 1036044 925765 998831
6303I98831J09230j03314n166M8603l1031J8032N8344L1372l4090l7555j55771
$$ 998831 1108061 1004747 999581 1048184 1017153 1035185 1093529 1124901 1090811 1053256 897485
6292H97485m3296J80013K50648O1654j74950m2874J4101J4358J56549n4525j74823
$$ 897485 854189 1034202 1284850 1346504 1171554 1128680 1142781 1157139 1313688 1259163 1084340
6281A084340K44285J33105n2338n406L4100k62443J01172J06900m2608L1147n6262
$$ 1084340 1328625 1461730 1409392 1403986 1438086 1175643 1276815 1383715 1341107 1372254 1315992
6270A315992k0029O6541N6249j6038p7908Q6711J38144o4101n5373j31363J10596
$$ 1315992 1295963 1362504 1418753 1402715 1324807 1411518 1549662 1485561 1430188 1298825 1409421
6259A409421J45004J9773M7439j103j49970J23873M987Q2295l8576L1571R8022
$$ 1409421 1554425 1574198 1621637 1620534 1470564 1594437 1599424 1681719 1643143 1674714 1772736
6248A772736M6988m5045j156R8524j39631K7004o1513J60026M5302J01497K3110
$$ 1772736 1819724 1774679 1773523 1872047 1732416 1759420 1697907 1857933 1903235 2004732 2027842
6237B027842O1431K3165j05612R689j92530l0144K57515J67680R3069K3104P4938
$$ 2027842 2089273 2112438 2006826 2016515 1823985 1793841 2051356 2219036 2312105 2335209 2410147
6226B410147M7252r8021m8282R3991K4467J49201Q0245J33890p8350j18982k1242
$$ 2410147 2457399 2359378 2311096 2405087 2429554 2578755 2659000 2792890 2714540 2595558 2574316
6215B574316J31755J29709k5446Q9104J86393P6622L5132Q1657P7426Q1296J56924
$$ 2574316 2706071 2835780 2810334 2899438 3085831 3162453 3197585 3279242 3356668 3437964 3594888
6204C594888K04889M9287R0538Q3279k9189K32732K67388J88303P5425J38894
$$ 3594888 3799777 3849064 3939602 4022881 3993692 4226424 4493812 4682115 4757540 4896434
6194D896434J05238L0560Q6757J93078K52529K57623K00535O2287K02440L31779
$$ 4896434 5001672 5032232 5118989 5312067 5564596 5822219 6022754 6085041 6287481 6619260
6184F619260K74016J65091L55452L81757M31163K35524J81215K40639L62309K15634
$$ 6619260 6893276 7058367 7413819 7795576 8226739 8462263 8643478 8884117 9246426 9462060
6174I462060L52159J63295J84435K12811L52778J14884J18135L7806j83304M1754
$$ 9462060 9814219 9977514 10161949 10374760 10727538 10842422 10960557 10998363 10815059 10856813
6164A0856813j60010j91292l04869l72387l60153j41988l27559l35502l52976
$$ 10856813 10696803 10505511 10200642 9828255 9468102 9326114 8998555 8663053 8310077
6155H310077m23510k85027k70880j71633m52749l77177j64950j14587l11684l30575
$$ 8310077 7886567 7601540 7330660 7159027 6706278 6329101 6164151 6049564 5737880 5407305
6145E407305j89796j04492k7323j56372l01341o4977j9173J2795q508j35946l7333
$$ 5407305 5217509 5113017 5085694 4929322 4627981 4563004 4543831 4556626 4548118 4412172 4374839
6134D374839N2916k97108j31989o0360l7942k28631l00533m8486r8854L5278j42954
$$ 4374839 4427755 4130647 3998658 3938298 3900356 3671725 3371192 3322706 3223852 3259130 3116176
6123C116176j65498m9307j78356P2986n7466j05585j86441r4890P7371j20511
$$ 3116176 2950678 2901371 2723015 2796001 2738535 2632950 2446509 2351619 2428990 2308479
6113B308479Q7312M3111j1799o1279q5482j4364o6864L3786j83511j41508o918
$$ 2308479 2395791 2438902 2427103 2365824 2280342 2265978 2199114 2232900 2049389 1907881 1900963
6102A900963P9625P741q5470k15100Q4856J82497j0277r6335M897m1297r1593
$$ 1900963 1980588 1988329 1902859 1687759 1772615 1955112 1944835 1848500 1853397 1812100 1720507
6091A720507K5831O31J21676j25244J2525Q4758j090j9004o1621o5329R1744L8192
$$ 1720507 1746338 1746969 1868645 1743401 1755926 1840684 1839594 1820590 1758969 1693640 1785384 1823576
6079A823576K03833J2600k1162m7925J23188j1701O7388k4331Q0199p427J05967
$$ 1823576 2027409 2040009 2018847 1970922 2094110 2082409 2149797 2125466 2205665 2198238 2304205
6068B304205J43157J3822l6763J30538J80377m2768K8453J10081k96593j18482
$$ 2304205 2447362 2461184 2424421 2554959 2735336 2692568 2721021 2831102 2534509 2416027
6058B416027j56431j46663J26671O1619o0423k678j4825j25132p1819m453K3054
$$ 2416027 2259596 2112933 2239604 2301223 2240800 2238122 2223297 2098165 2026346 2021893 2044947
6047B044947J45150j54822j92753p8774K432L1453n0661K36942j25946M3921M3892
$$ 2044947 2190097 2035275 1842522 1763748 1766180 1797633 1746972 1983914 1857968 1901889 1945781
6036A945781j0421N0134R565P7929Q2431j22220J6096l332K1629K6268L1520J54349
$$ 1945781 1935360 1985494 1995059 2072988 2155419 2033199 2049295 2045963 2067592 2093860 2125380 2279729
6024B279729K4924L5204O6925j11089J40181J55730j07397K1438r2025p6388J73016
$$ 2279729 2304653 2339857 2406782 2295693 2435874 2591604 2484207 2505645 2413620 2337232 2510248
6013B510248N6196P1789O3976r7055j8868K22314J21483j29627k9191m4663o1247
$$ 2510248 2566444 2638233 2702209 2605154 2586286 2808600 2930083 2800456 2771265 2726602 2665355
6002B665355J63483j16447j34785l2215j0283K4696J25235K4623k59429k2885
$$ 2665355 2828838 2712391 2577606 2545391 2535108 2559804 2685039 2709662 2450233 2427348
5992B427348Q3642M824o7676o9280M1153M2288J96K5905j66588J33264J3283O0347
$$ 2427348 2510990 2515814 2448138 2378858 2420011 2462299 2462495 2488400 2321812 2455076 2468359 2528706
5980B528706m7170j04694m720M1415J6965J8639L9818L0814J13983Q5036J32911
$$ 2528706 2481536 2376842 2372122 2413537 2430502 2449141 2488959 2519773 2633756 2718792 2851703
5969B851703K92060n684m8799L1047l7202J20931j37589n983P9152K26084j04854
$$ 2851703 3143763 3138079 3089280 3120327 3083125 3204056 3066467 3060484 3139636 3365720 3260866
5958C260866j7290k9717j35015Q8701M059J176J21402k00484j06381M6761J38549
$$ 3260866 3243576 3213859 3078844 3167545 3171604 3172780 3294182 3093698 2987317 3034078 3172627
5947C172627k6527p6039Q3681j41454L3073J78109J43172J30614j81291J11952
$$ 3172627 3146100 3070061 3153742 3012288 3045361 3223470 3366642 3497256 3315965 3427917
5937C427917J40462J37933M6403q956p2112M7888K23056M3631J38743J48966j10870
$$ 3427917 3568379 3706312 3752715 3743759 3671647 3719535 3942591 3986222 4124965 4273931 4163061
5926D163061O5443l7074J49733J10632k8892K30602L7028O8517j1750k26236j66074
$$ 4163061 4228504 4191430 4341163 4451795 4422903 4653505 4690533 4759050 4747300 4521064 4354990
5915D354990m2822P0547k1175j52600p8855j65220r7071L814N231p0158j05808
$$ 4354990 4312168 4382715 4361540 4208940 4130085 3964865 3867794 3871608 3876839 3806681 3700873
5904C700873M2870M4544k42360l05575p2858p5247j08625p3910j38562J43967
$$ 3700873 3743743 3788287 3545927 3240352 3167494 3092247 2983622 2909712 2771150 2915117
5894B915117k40526j83599K10134J00592q0831P14L022J2568o525r364j94303
$$ 2915117 2674591 2490992 2701126 2801718 2720887 2721601 2724623 2737191 2730666 2721302 2526999
5883B526999j12848j8486J91123K3891k81103Q3866J14206p7388R5219P6717p3367
$$ 2526999 2414151 2395665 2586788 2610679 2329576 2413442 2527648 2450260 2545479 2622196 2548829
5872B548829K48411J07244p5636K8058p8553R1034O5561l0249J29908j0576r7038
$$ 2548829 2797240 2904484 2828848 2856906 2778353 2869387 2934948 2904699 3034607 3024031 2926993
5861B926993l1543J1898J46357L7517j07502k0936k7133J06606L8097l30346l20530
$$ 2926993 2895450 2907348 3053705 3091222 2983720 2962784 2935651 3042257 3080354 2750008 2429478
5850B429478J39461R5673q4708j04408m7981J3357n2914q1757j13722q0295j6542
$$ 2429478 2568939 2664612 2579904 2475496 2427515 2440872 2387958 2306201 2192479 2112184 2095642
5839B095642o8874q6948j20193M3396j00748P567R9735j22972O0018q5000n0965
$$ 2095642 2026768 1939820 1819627 1863023 1762275 1769842 1869577 1746605 1806623 1721623 1670658
5828A670658p9537N7510L1196L792P7374l0594n7141L1296n5707l0097j7779K16876
$$ 1670658 1591121 1648631 1679827 1683619 1760993 1730399 1673258 1704554 1648847 1618750 1600971 1817847
5816A817847o4537m7725J2608p2140r7147K46816K5691k5240n7165K5322J03637
$$ 1817847 1753310 1705585 1718193 1646053 1548906 1795722 1821413 1796173 1739008 1764330 1867967
5805A867967l3316J08224r3913k2338k10359Q2849k7975J41843j15397k62600
$$ 1867967 1834651 1942875 1848962 1826624 1616265 1699114 1671139 1812982 1697585 1434985
5795A434985P4590K5439L1786m8101l2861J12336K1993J09347j43653j98479J55849
$$ 1434985 1509575 1535014 1566800 1518699 1485838 1598174 1620167 1729514 1585861 1387382 1543231
5784A543231j78696m7041l26O4627P6647o7869J0828O643Q5948J59585j78475
$$ 1543231 1364535 1317494 1317168 1381795 1458442 1390573 1401401 1408044 1493992 1653577 1475102
5773A475102r5449Q4453J98956k7676j84042L8893r3993O9106K5287m7191J13573
$$ 1475102 1379653 1464106 1663062 1635386 1451344 1490237 1396244 1465350 1490637 1443446 1557019
5762A557019J7883J3107J4090j23530m3845K59841n7313j34323J74920r3606J2427
$$ 1557019 1574902 1588009 1602099 1478569 1434724 1694565 1637252 1502929 1677849 1584243 1596670
5751A596670k52584m8814O3367R5033P3377o1220j7872m8830j3954j91653j19335
$$ 1596670 1344086 1295272 1358639 1453672 1527049 1465829 1447957 1399127 1385173 1193520 1074185
5740A074185N7454J2807o1761P7264k5188j02529J1802p0015J18175jm1139j17570
$$ 1074185 1131639 1144446 1082685 1159949 1134761 1032232 1044034 974019 1092194 1092193 1051054 933484
5728I33484P7757O3476m2164P7638M2519r8126j08522R8940R144Q9841J525j55868
$$ 933484 1011241 1074717 1032553 1110191 1152710 1054584 946062 1045002 1054146 1143987 1145512 989644
5716I89644J36337P5549j21608j21833m3506p7025o1936J58560L7055J00842O5256
$$ 989644 1125981 1201530 1079922 958089 914583 837558 775622 934182 971237 1072079 1137335
5705A137335j29661k0596j06764O0608l3667J7641R68n6325P7049l0982j27421
$$ 1137335 1007674 987078 880314 940922 907255 924896 925864 869539 946588 915606 788185
5694G88185P2963J10932J6641k16168J885L1119J4891J19574j01506l1764K62193
$$ 788185 861148 972080 988721 772553 774438 805557 820448 940022 838516 806752 1068945
5683A068945P4445n3509P030j63361O6813J43522q5507R0288K2579m8804K2343
$$ 1068945 1143390 1089881 1096911 933550 1000363 1143885 1058378 1148666 1171245 1122441 1144784
5672A144784j13199j24135J09098J26517j92554j34491Q7446J14268N2075j11157
$$ 1144784 1031585 907450 1016548 1143065 950511 816020 903466 1017734 1069809 958652
5662I58652q4055Q5768J02530j5572J83J86033l087j82913j08774R2023L3085
$$ 958652 874597 960365 1062895 1047323 1047506 1233539 1230452 1047539 938765 1030788 1063873
5651A063873L4057M6666Q6820j34581q1772j09879M0015O4865j18770k0634P7007
$$ 1063873 1097930 1144596 1231416 1096835 1015063 905184 945199 1010064 891294 870660 947667
5640I47667o9902N4964Q5432R9553J44315M9702J2595N3934j81149j92150n1040
$$ 947667 877765 932729 1018161 1117714 1262029 1311731 1324326 1378260 1197111 1004961 953921
5629I53921J95498J45825Q5373l23900J4922K2013m5758J64423J12435j34865
$$ 953921 1149419 1295244 1380617 1056717 1071639 1093652 1047894 1212317 1324752 1189887
5619A189887N3788O4839r8805J00061o447J4026j27017R2072k9591L0792J67064
$$ 1189887 1243675 1308514 1209709 1309770 1303323 1317349 1190332 1282404 1252813 1283605 1450669
5608A450669j67969j11115l9213M8307R0259M0637m2708q0286K45982k5950j28422
$$ 1450669 1282700 1171585 1132372 1180679 1270938 1311575 1268867 1188581 1434563 1408613 1280191
5597A280191Q4394K3626j07706L1175p1390m4901N2944Q9818Q5341J69299M6252
$$ 1280191 1364585 1388211 1280505 1311680 1240290 1195389 1248333 1338151 1423492 1592791 1639043
5586A639043J04640j74937k06196K01626K0983K1372j95161Q3596L7554p212Q2075
$$ 1639043 1743683 1568746 1362550 1564176 1585159 1606531 1411370 1494966 1532520 1525308 1607383
5575A607383n7396o861J03214k107k5594n198J89797j39364J18860N772m2359
$$ 1607383 1549987 1543126 1646340 1644233 1618639 1613441 1803238 1663874 1782734 1788506 1746147
5564A746147o3730O0385P052j3047J76832j59485l1655J36328J93209m3785o5715
$$ 1746147 1682417 1742802 1749854 1736807 1913639 1754154 1722499 1858827 2052036 2008251 1942536
5553A942536j20689N7348m2600J51517j11869n0459j24095J30602j7375o4632
$$ 1942536 1821847 1879195 1836595 1988112 1876243 1825784 1701689 1832291 1814916 1750284
5543A750284P170j11357K6946Q1012j5482J65930q3958O1166o707J32499N5080
$$ 1750284 1757454 1646097 1673043 1754055 1738573 1904503 1820545 1881711 1875004 2007503 2062583
5532B062583j55750K7679k7649j23731l7923J54362R5366j72141k9032o834J22835
$$ 2062583 1906833 1934512 1906863 1783132 1745209 1899571 1994937 1822796 1793764 1786930 1909765
5521A909765J54998j29314n697J20217K83138j57899J06294k5974r0423J46906
$$ 1909765 2064763 1935449 1929752 2049969 2333107 2175208 2281502 2255528 2165105 2312011
5511B312011k1548k617j43173Q675L1960O2137K1102j02041o7507O332K19854
$$ 2312011 2290463 2287846 2144673 2153348 2185308 2247445 2268547 2166506 2098999 2105331 2325185
5500B325185K04741o1456P3879o4805j24878J14867J13235m6385n2976J45327
$$ 2325185 2529926 2468470 2542349 2477544 2352666 2467533 2580768 2534383 2481407 2626734
5490B626734j70527M2437J12151K11248R4958P1153J11120O1804r360r798n3036
$$ 2626734 2456207 2498644 2610795 2822043 2917001 2988154 3099274 3161078 3151718 3141920 3088884
5479C088884K1305J12414J26038j4160k3117p829J19197J81862J97978N3865p570
$$ 3088884 3110189 3222603 3348641 3334481 3311364 3303535 3422732 3604594 3802572 3856437 3848867
5468C848867K61989l5743P5083K03710K01142J36038K86142K30233K01545J59910
$$ 3848867 4110856 4075113 4150196 4353906 4555048 4691086 4977228 5207461 5409006 5568916
5458E568916j1929m6437j19115K7305R1243O2554O2930J67303R8774j0933J69875
$$ 5568916 5556987 5510550 5391435 5418740 5509983 5572537 5635467 5802770 5901544 5890611 6060486
5447F060486o309o4057j31696K9126o4084n9885P8399l0171J08135K40200P5592
$$ 6060486 6054177 5990120 5858424 5887550 5823466 5763581 5841980 5811809 5919944 6160144 6235736
5436F235736o8519J02469O9052l1904k61460j67771l76997m66525k74874j39651
$$ 6235736 6167217 6269686 6338738 6306834 6045374 5877603 5500606 5034081 4759207 4619556
5426D619556m05349l01643l38270l7415r1120j03152R5123k55923j9741N7829
$$ 4619556 4214207 3912564 3574294 3536879 3445759 3342607 3437730 3181807 3162066 3219895
5416C219895K2233j86588k14781q4069n8242N9488j23407j47555L00570O9183
$$ 3219895 3242128 3055540 2840759 2756690 2698448 2757936 2634529 2486974 2787544 2856727
5406B856727j04565q6504j07323K8180L5858N0302r5221n5744p5374k4525l2644
$$ 2856727 2752162 2665658 2558335 2586515 2622373 2672675 2577454 2521710 2446336 2421811 2389167
5395B389167J22046n2632r4826R081J4255M7920J60493j56126k1975r7621o6296
$$ 2389167 2511213 2458581 2363755 2372836 2387091 2435011 2595504 2439378 2417403 2319782 2253486
5384B253486o85n4388J23742m7081l4726O2261j77470j8754K05116O126p1306
$$ 2253486 2252801 2198413 2322155 2275074 2240348 2302609 2125139 2106385 2311501 2317627 2246321
5373B246321l4741J11368J7148J5123J5812K6835M0906J01020j43846O3894j39057
$$ 2246321 2211580 2322948 2340096 2355219 2371031 2397866 2438772 2539792 2395946 2459840 2320783
5362B320783o2931Q1626L0970q868l1659N8640J35443N0637j65347k5359L22733
$$ 2320783 2257852 2339478 2370448 2361580 2329921 2388561 2524004 2574641 2409294 2383935 2706668
5351B706668m9415k8812N3666r907P3701n2099l4069n8990M1171J76539P4917
$$ 2706668 2657253 2628441 2682107 2672200 2745901 2693802 2659733 2600743 2641914 2818453 2893370
5340B893370N038m8410J76078R9538M450J82480J9378q041J29294R1505r4473
$$ 2893370 2898408 2849998 3026076 3125614 3130064 3312544 3331922 3323881 3453175 3544680 3450207
5329C450207K09848J5120n2332J29685q2444J73518K08268m6682k420o2448P1518
$$ 3450207 3660055 3675175 3622843 3752528 3670084 3843602 4051870 4005188 4002768 3940320 4011838
5318D011838M3301q4507P6055j68165n8971j15328m696q6638l1814J0878j22587
$$ 4011838 4055139 3970632 4046687 3878522 3819551 3704223 3699527 3612889 3581075 3591953 3469366
5307C469366R1879O233J24597L2166p602K5877l1408Q666j21648l9452J18443
$$ 3469366 3561245 3567478 3692075 3724241 3716639 3742516 3711108 3719774 3598126 3558674 3677117
5296C677117k7696P2706J1421K0055q5753N9242J09940k5048R9227K4141K06916
$$ 3677117 3649421 3722127 3733548 3753603 3667850 3727092 3837032 3811984 3911211 3935352 4142268
5285D142268N2211j27564J33382n021j63373q4649J94988L9835K9792J14110m1926
$$ 4142268 4194479 4066915 4200297 4195276 4031903 3947254 4142242 4182077 4211869 4325979 4284053
5274D284053K25279K36888n950J00506J72818p8756P2754K22215J30392O5453
$$ 4284053 4509332 4746220 4740270 4840776 5013594 4934838 5007592 5229807 5360199 5425652
5264E425652J30705J78522J01318N5170k7661O8711n1793L12008n5554K3056K32309
$$ 5425652 5556357 5734879 5836197 5891367 5863706 5932417 5880624 6192632 6137078 6160134 6392443
5253F392443N673j5611m5912L6193j09503j04614k21470J1428j25635k64605p9216
$$ 6392443 6398116 6382505 6336593 6372786 6263283 6158669 5937199 5948627 5822992 5558387 5479171
5242E479171r6482j9669J1969n6456k9857k3516q3709k16141o8178p1122J21226
$$ 5479171 5382689 5363020 5374989 5318533 5288676 5265160 5181451 4965310 4897132 4826010 4947236
5231D947236r8652j10988j27029k3412J00757j3058P9682P5965J76542J92679
$$ 4947236 4848584 4737596 4610567 4587155 4687912 4674854 4754536 4830501 5007043 5199722
5221E199722K2376k84716k677L9053K6514o6842p2488q4247N6065J55027n6204
$$ 5199722 5222098 4937382 4934705 4973758 5000272 4933430 4860942 4776695 4832760 4987787 4931583
5210D931583n1589J01172K3756Q5582L2740k9335K18942m7176n4651R1483K32509
$$ 4931583 4879994 4981166 5004922 5090504 5123244 5093909 5312851 5265675 5211024 5302507 5535016
5199E535016J22093j53803R0569J22454N1291K08924P8362O49m5013K45108J77373
$$ 5535016 5657109 5503306 5593875 5716329 5767620 5976544 6054906 6055555 6010542 6255650 6433023
5188F433023k0030K01014J20143L03118K35637N6194J90896J43409J92176p0439
$$ 6433023 6412993 6614007 6734150 7037268 7272905 7329099 7519995 7663404 7855580 7785141
5178G785141Q3115O7099p6467K0526m8023J27131L581j71206q0507l13466k4989
$$ 7785141 7868256 7935355 7858888 7879414 7831391 7958522 7962103 7790897 7710390 7396924 7371935
5167G371935j4167o9430J168j90438p3731J14294L3322j66519j09937K09006J7915
$$ 7371935 7357768 7288338 7289506 7099068 7025337 7139631 7172953 7006434 6896497 7105503 7123418
5156G123418J59926J63194N8592J34396l0630J58711j90484k06365k17562k33048
$$ 7123418 7283344 7446538 7505130 7639526 7608896 7767607 7577123 7370758 7153196 6920148
5146F920148l82424m6151K1728k72730L933q8729K5691J27490K24257j4955j23438
$$ 6920148 6537724 6491573 6513301 6240571 6244504 6155775 6181466 6308956 6533213 6518258 6394820
5135F394820J44554P5090N6612J67346Q0270L3527o6826J6284J19854K1584L50643
$$ 6394820 6539374 6614464 6671076 6838422 6918692 6952219 6885393 6901677 7021531 7043115 7393758
5124G393758P2597P9904R8580o2999k11221m7575O9967N3782N462O3983M3844
$$ 7393758 7466355 7546259 7644839 7581840 7370619 7323044 7393011 7446793 7452255 7516238 7560082
5113G560082J69327j8589J13829K04143j44654K0018J30210J19013R3148K73689
$$ 7560082 7729409 7710820 7824649 8028792 7884138 7904156 8034366 8153379 8246527 8520216
5103H520216J08949j9368J08044j67016Q0627M7669m5197j28665k9266R1630k164
$$ 8520216 8629165 8609797 8717841 8550825 8631452 8679121 8633924 8505259 8475993 8567623 8565459
5092H565459k8809O4297Q3804Q2942K6922k26893p7648O0298J80693R6438O7207
$$ 8565459 8536650 8600947 8684751 8767693 8794615 8567722 8490074 8550372 8731065 8827503 8894710
5081H894710M49Q1440J48528M1364L6092J52475p453J61723J91914J8917R1392
$$ 8894710 8895159 8976599 9125127 9166491 9202583 9355058 9347605 9509328 9701242 9720159 9811551
5070I811551K85040K15478O3891J4875O0055J11547j38832K78231J06459J56393
$$ 9811551 10096591 10312069 10375960 10390835 10450890 10562437 10423605 10701836 10808295 10964688
5060A0964688J27327J25050j20441J34088K87954J15445K51188p3033L81008K29924
$$ 10964688 11092015 11217065 11096624 11230712 11518666 11634111 11885299 11812266 12193274 12423198
5050A2423198J08188L29323K39999J35654M53983K54551k1316L17349M25484O3587
$$ 12423198 12531386 12860709 13100708 13236362 13690345 13944896 13923580 14240929 14666413 14730000
5040A4730000M41602K68543L19503M29192L59442K49024L19037N77876O40381
$$ 14730000 15171602 15440145 15759648 16188840 16548282 16797306 17116343 17694219 18334600
5031A8334600L76015L31018N22503N94420M20698O64281M81849N98259Q59193
$$ 18334600 18710615 19041633 19564136 20158556 20579254 21243535 21725384 22323643 23182836
5022B3182836M59032P56967Q48587P56870J005788J030088J240413J442072J690415
$$ 23182836 23641868 24398835 25247422 26004292 27010080 28040168 29280581 30722653 32413068
5013C2413068J627542J740088K211715K312666K774734K867834L554511L723147
$$ 32413068 34040610 35780698 37992413 40305079 43079813 45947647 49502158 53225305
5005E3225305L315353K680886J232350j00410j711313k271695k494538k363903
$$ 53225305 56540658 59221544 60453894 60353484 58642171 56370476 53875938 51512035
4997E1512035j692500j463336j076164p30692m82646l64417Q077L12899L42018
$$ 51512035 49819535 48356199 47280035 46549343 46066697 45702280 45710357 46023256 46365274
4988D6365274N51942Q24141R60302J216665J673061K104753K303903K643756L284139
$$ 46365274 46917216 47741357 48701659 49918324 51591385 53696138 56000041 58643797 61927936
4979F1927936L679676M273640M887334N801188O803414P395853P808735O938882
$$ 61927936 65607612 69881252 74768586 80569774 87373188 94769041 102577776 109516658
4971A09516658M998355J856332j821629m514342n170853m620617l552619j864239
$$ 109516658 114515013 116371345 114549716 110035374 104864521 100243904 96691285 94827046
4963I4827046m87394M97173R89483J03025j556434l561990m858388m673034m128356
$$ 94827046 94339652 94836825 95826308 95929333 94372899 90810909 85952521 81279487 77151131
4954G7151131l492634k896723j972466j381506o56390O4282L51048J007368J708966
$$ 77151131 73658497 70761774 68789308 67407802 66751412 66815694 67166742 68174110 69883076
4945F9883076K565438L167313L801942M728578N372496N824957N611451N139808
$$ 69883076 72448514 75615827 79417769 84146347 89518843 95343800 100955251 106095059
4937A06095059M741806M127302L818325L475861K226846o24267l419881o181259
$$ 106095059 110836865 114964167 118782492 122258353 124485199 123860932 120441051 114259792
4929A14259792q098801r245044r534097q632279p350715o008115m575409l868588
$$ 114259792 106160991 96915947 87381850 78749571 71398856 65390741 60815332 56946744
4921E6946744k996059k555027j716549j379779r62114o44008l03108L50716N47770
$$ 56946744 53950685 51395658 49679109 48299330 47337216 46693208 46390100 46740816 47288586
4912D7288586Q92784J229940K106376K472081K815928L363142L200178K774548
$$ 47288586 48181370 49411310 51517686 53989767 56805695 60168837 63369015 66143563
4904F6143563J633483q40622l189410n073555n175273m863308m289722l403739
$$ 66143563 67777046 66936424 63747014 58673459 53498186 48634878 44345156 40941417
4896D0941417l022704k276990k359996j915840j660530j165738p79019j030286
$$ 40941417 37918713 35641723 33281727 31365887 29705357 28539619 27760600 26730314
4888B6730314p15089p37206n31197m81799l82099k83976k24515l9949r6189j58363
$$ 26730314 26015225 25278019 24746822 24265023 23882924 23598948 23374433 23334484 23238295 23079932
4878B3079932Q198j15305P7237l16003j48366p5926l83288l43703o20533n55484
$$ 23079932 23088130 22972825 23050062 22734059 22585693 22509767 22126479 21782776 21162243 20606759
4868B0606759k53621l24070l84182m50425m10561k78871j94662o06932m50522
$$ 20606759 20353138 20029068 19644886 19194461 18783900 18505029 18310367 17703435 17252913
4859A7252913k25237j78613j73555m31160J1496m027j35266q7830k78225J68611
$$ 17252913 17027676 16849063 16675508 16244348 16255844 16251817 16116551 16028721 15750496 15919107
4849A5919107l6619l70002k83986j67296J4028j09595j62054k06521m3948j82833
$$ 15919107 15882488 15512486 15228500 15061204 15075232 14965637 14803583 14597062 14553114 14370281
4839A4370281k15547j13345k05285l3852j77733k81895j10023j09180j54723j26161
$$ 14370281 14154734 14041389 13836104 13802252 13624519 13342624 13232601 13123421 12968698 12842537
4829A2842537j00843j41120j38378p0902j38333l01852j74252l41773j71672k81497
$$ 12842537 12741694 12600574 12462196 12391294 12252961 11951109 11776857 11435084 11263412 10981915
4819A0981915M8772k6194k7611k5997j95992k25911q1067R2384k16766m5212J95109
$$ 10981915 11030687 11004493 10976882 10950885 10754893 10528982 10447915 10540299 10323533 10278321 10473430
4808A0473430K79418M321J40037N7779K29594K54213p487O6371K82223k071j69538
$$ 10473430 10752848 10757169 10897206 10954985 11184579 11438792 11431305 11497676 11779899 11777828 11608290
4797A1608290k36894l88650l70618l50372m25940k53716m42098k32831p9933j02352
$$ 11608290 11371396 10982746 10612128 10261756 9835816 9582100 9140002 8907171 8827238 8724886
4787H724886k22275k43446J6125j04862k23500j09094j60040J77147k1722j73090
$$ 8724886 8502611 8259165 8275290 8170428 7946928 7837834 7677794 7854941 7833219 7660129
4777G660129j65564j00831k2257J5157N3458O9884o0162Q2166j36229P9085L7150
$$ 7660129 7494565 7393734 7371477 7386634 7440092 7509976 7449814 7531980 7395751 7474836 7511986
4766G511986J98993J76020k79714J85028J10805j20967N6519J38370p1904k5874
$$ 7511986 7710979 7886999 7607285 7792313 7903118 7782151 7838670 7977040 7905136 7879262
4756G879262J51515O0426l9966p5162k27843J34933k5828k3692q5370O6957j41619
$$ 7879262 8030777 8091203 8051237 7976075 7748232 7883165 7857337 7833645 7748275 7815232 7673613
4745G673613r3157n1182K84216j23951j26393N6730K40153l1345Q5022O2570O2273
$$ 7673613 7580456 7529274 7813490 7689539 7563146 7619876 7860029 7828684 7913706 7976276 8038549
4734H038549K66882n0953P9290J72523J15705J04985k8296q6022p4030K14289
$$ 8038549 8305431 8254478 8333768 8506291 8621996 8726981 8698685 8612663 8538633 8752922
4724H752922n9219L1318J37793J7653O5994R9814J14057O4514J8327o6906J7803
$$ 8752922 8693703 8725021 8862814 8880467 8946461 9046275 9160332 9224846 9243173 9176267 9194070
4713I194070n6135J08867K20749q2718O165r4487K24189J85581n6676J23001L94308
$$ 9194070 9137935 9246802 9467551 9384833 9390998 9296511 9520700 9706281 9649605 9772606 10166914
4702A0166914K7507j6280K32659j01554Q3956N1009L4027j73793K82713K4144
$$ 10166914 10194421 10178141 10410800 10309246 10393202 10444211 10478238 10304445 10587158 10611302
4692A0611302j54987Q5279j0298J40593M620l6460J00963k9270M5081k2969j13711
$$ 10611302 10456315 10541594 10531296 10671889 10676509 10640049 10741012 10711742 10756823 10733854 10620143
4681A0620143m363J10287r1964J61787j6634j5324R9289Q1199r3529N1804l3965
$$ 10620143 10615780 10726067 10634103 10795890 10779256 10763932 10863221 10944420 10850891 10902695 10868730
4670A0868730M2527J09691j91211O2004J2023J00715q6151o8140o0419j16368
$$ 10868730 10911257 11020948 10829737 10891741 10903764 11004479 10918328 10850188 10789769 10673401
4660A0673401J31561k88115q3336P7678J4908J01042j70408j68325J49887P0161
$$ 10673401 10804962 10516847 10433511 10511189 10526097 10627139 10456731 10288406 10438293 10508454
4650A0508454M171j00226l5306l7417j06742l5121J01434K10594J7930k75210
$$ 10508454 10512625 10412399 10377093 10339676 10232934 10197813 10299247 10509841 10527771 10252561
4640A0252561j08343J30314J23503m3915j69859R3729j0538l2336j59115Q843
$$ 10252561 10144218 10274532 10398035 10354120 10184261 10277990 10267452 10235116 10076001 10084844
4630A0084844J2876p3630R6801J20624j51593j15839J00360L7494K53119k5842
$$ 10084844 10097720 10024090 10120891 10241515 10089922 9974083 10074443 10111937 10365056 10339214
4620A0339214P4550M8442k4063L9515n6257l7450k8087m9643r858k2140J04242
$$ 10339214 10413764 10462206 10438143 10477658 10421401 10383951 10355864 10306221 10296363 10274223 10378465
4609A0378465j3487j09316k0568J61569M5596J73703j00657o3897L9481K0763
$$ 10378465 10364978 10255662 10235094 10396663 10442259 10615962 10515305 10451408 10490889 10511652
4599A0511652j77732l7853R1323j30056m2860r1006R1705Q3140J66618N5827O7754
$$ 10511652 10333920 10296067 10387390 10257334 10214474 10123468 10215173 10298313 10464931 10520758 10588512
4588A0588512K05974p7908j01035N1805P1508j6389p6699J87718n2940o1354P1211
$$ 10588512 10794486 10716578 10615543 10667348 10738856 10722467 10645768 10833486 10780546 10719192 10790403
4577A0790403K8911m9048J24479J38344K41939j68735J12660m2530J26902J62256
$$ 10790403 10819314 10770266 10894745 11033089 11275028 11106293 11218953 11176423 11303325 11465581
4567A1465581r7542k5618Q5535K2943l6805l3188J97567m8379R1585J06760J83699
$$ 11465581 11368039 11342421 11427956 11450899 11414094 11380906 11578473 11530094 11621679 11728439 11912138
4556A1912138J87750J24099J83999J33170J00367K89584m9189m5595m272J68719
$$ 11912138 12099888 12223987 12407986 12541156 12641523 12931107 12881918 12836323 12832051 13000770
4546A3000770J78785N7135K82365K8020M72182L37323K18538l93828l09551l37905
$$ 13000770 13179555 13236690 13519055 13547075 14019257 14356580 14575118 14181290 13871739 13533834
4536A3533834k95464j92528j58176O5912j42915j05867M5090j4436J40971m3351
$$ 13533834 13238370 13045842 12887666 12953578 12810663 12704796 12749886 12735450 12876421 12833070
4526A2833070J39729j94880P9628L54072J44336j108R3790K77869K49975K33833
$$ 12833070 12972799 12777919 12857547 13211619 13355955 13354847 13448637 13726506 13976481 14210314
4516A4210314L01792L63033M03092M60478N68415O91723N87626Q69350R31572
$$ 14210314 14512106 14875139 15278231 15738709 16307124 16998847 17586473 18455823 19387395
4507A9387395O32121L4914p83745p80057n84060n52479l65036j99084K39375j52349
$$ 19387395 20019516 20054430 19270685 18490628 17906568 17354089 16989053 16789969 17029344 16876995
4497A6876995o2947M4243L45086Q9139K7151J71620O5813K85323J89954K53883
$$ 16876995 16814048 16858291 17203377 17292516 17319667 17491287 17557100 17842423 18032377 18286260
4487A8286260J80046L55481L81090L11327M11346L88862M44359N82010O15966
$$ 18286260 18466306 18821787 19202877 19514204 19925550 20314412 20758771 21340781 21956747
4478B1956747O53414J080945R41545J230263J149911R16786J80017n18224k97610
$$ 21956747 22610161 23691106 24632651 25862914 27012825 27929611 28109628 27591404 27293794
4469B7293794k79910o5415P8944M74711K37906M33993P76042Q71530P53642R13139
$$ 27293794 27013884 26948469 27027413 27502124 27740030 28174023 28950065 29821595 30575237 31488376
4459C1488376J091050J167018J186097J489804J574627J911571J949280K423363
$$ 31488376 32579426 33746444 34932541 36422345 37996972 39908543 41857823 44281186
4451D4281186K390970K888264L035909L454702L949483M504722N056716N494125
$$ 44281186 46672156 49560420 52596329 56051031 60000514 64505236 69561952 75056077
4443G5056077O020393O252993O806480P084465O994607O348235N801105N384697
$$ 75056077 81076470 87329463 94135943 101220408 108215015 114563250 120364355 125749052
4435A25749052M422491K727004O58926k010458m089823n766519o701805o922239
$$ 125749052 130171543 132898547 133557473 131547015 127457192 121690673 114988868 108066629
4427A08066629o957494o788881p035500o765383o178086o103629n530025n107110
$$ 108066629 101109135 94320254 87284754 80519371 74341285 68237656 62707631 57600521
4419E7600521m142286l799821l250473k783292k488302k328687k101044j862200
$$ 57600521 53458235 49658414 46407941 43624649 41136347 38807660 36706616 34844416
4411C4844416j645646j772564j659963j337778j087078j166980j119992r74090
$$ 34844416 33198770 31426206 29766243 28428465 27341387 26174407 25054415 24080325
4403B4080325p56942r76036q25784n78491n88391n14100m53534n75615m41961
$$ 24080325 23323383 22347347 21521563 20943072 20354681 19840581 19387047 18811432 18369471
4394A8369471m31731l25507n02615n21342r9488m38837l88695m28796q7503n0587
$$ 18369471 17937740 17612233 17109618 16588276 16488788 16049951 15661256 15232460 15144957 15094370
4384A5094370o2976j84965l07292j60716j16353j36549j13760j59542l0338r7831
$$ 15094370 15031394 14846429 14539137 14378421 14262068 14125519 14011759 13852217 13821879 13724048
4374A3724048j55945q3645k24080j98950Q0075m6157m9793J24679K24691o6575
$$ 13724048 13568103 13484458 13260378 13061428 13141503 13095346 13045553 13170232 13394923 13328348
4364A3328348L9589j0051J56841K45343k61398J09997J3368K9443O3399P2652
$$ 13328348 13367937 13357886 13514727 13760070 13498672 13608669 13622037 13651480 13714879 13787531
4354A3787531M7236M1603j3m2003O4719k39020j38370r3246k28075K6055l55142
$$ 13787531 13834767 13876370 13876357 13834354 13899073 13660053 13521683 13428437 13200362 13226417 12871275
4343A2871275o2182k97898l36657o2828l05632k78336j07975k07764l21807J03827
$$ 12871275 12809093 12511195 12174538 12111710 11806078 11527742 11419767 11212003 10890196 10994023
4333A0994023j27724l41126l11197n5661K0874o5313j99215j55754p8724n9667
$$ 10994023 10866299 10525173 10213976 10158315 10179189 10113876 9914661 9758907 9680183 9620516
4323I620516J1491l40115J2450j08035Q0764J30971p2425k20038k89861R4273
$$ 9620516 9632007 9291892 9304342 9196307 9277071 9408042 9335617 9115579 8825718 8919991
4313H919991J04902P8024K27116R981l32424J5954P3584J58655R6474J53547J08702
$$ 8919991 9024893 9102917 9330033 9340014 9007590 9023544 9097128 9255783 9352257 9505804 9614506
4302I614506j55111M9270J43477P6140K61149J48339R6373j27063R6122l70183
$$ 9614506 9459395 9508665 9652142 9728282 9989431 10137770 10234143 10107080 10203202 9833019
4292I833019k12795p1743p5245l02087K0584k92912k69032j02715m6354m9341
$$ 9833019 9620224 9548481 9473236 9171149 9191733 8898821 8629789 8527074 8480720 8431379
4282H431379k84391j26538j11912k52112k14210k03301k06985j43046J36950k33849
$$ 8431379 8146988 8020450 7908538 7656426 7442216 7238915 7031930 6888884 7025834 6791985
4272F791985J19663J01962m6884J34815j22348J14419l4339K0311j70705j333
$$ 6791985 6911648 7013610 6966726 7101541 6979193 7093612 7059273 7079584 6908879 6907546
4262F907546l7844j53527k8130j43198R547j12580m7861o34R2596J93376J14368
$$ 6907546 6869702 6716175 6688045 6544847 6554394 6441814 6393953 6393319 6485915 6679291 6793659
4251F793659J99749J30455M70225J74954L39136M74955P05586N20544O33921R0027
$$ 6793659 6993408 7123863 7594088 7769042 8108178 8583133 9288719 9809263 10443184 10533211
4241A0533211n15669o02450m78196l14394m21477j55291n6347k05713j62693j4604
$$ 10533211 10017542 9415092 8936896 8622502 8201025 8045734 7989387 7783674 7620981 7606377
4231G606377j32226l55098j42585j23851j43208j36477J9019j21240k21530k98989
$$ 7606377 7474151 7119053 6976468 6852617 6709409 6572932 6591951 6470711 6249181 5950192
4221E950192j78726k3021N6299O5610r6535o6940j13033j75763P9943m1925q1657
$$ 5950192 5771466 5748445 5804744 5870354 5773819 5706879 5593846 5418083 5498026 5456101 5374444
4210E374444n1454N4133p8700j84678j0890N536j7121p3822j70556R4278K7242
$$ 5374444 5322990 5377123 5298423 5113745 5102855 5108391 5091270 5017448 4846892 4941170 4968412
4199D968412j88731O6689j35343Q1157K3404j3168k2950J34245j2600k01993j96034
$$ 4968412 4779681 4846370 4711027 4792184 4815588 4802420 4779470 4913715 4901115 4699122 4503088
4188D503088m2404m6710M6577J46821J56255J13585J65084p8321j29449K00217
$$ 4503088 4460684 4413974 4460551 4607372 4763627 4877212 5042296 4963975 4834526 5034743
4178E034743P2161p6962J6370J08502j2001K62036r255q8913q9423R8700n4062
$$ 5034743 5106904 5029942 5046312 5154814 5142813 5404849 5395594 5306681 5217258 5315958 5261896
4167E261896R2575l15148j52252M618J12091j0287j58234m2907J17499p6066K0196
$$ 5261896 5354471 5039323 4887071 4891689 5003780 4993493 4835259 4792352 4909851 4833785 4853981
4156D853981j3154j05460j00444J42312k3484J09323M7286q3496m6257r294K8546
$$ 4853981 4840827 4735367 4634923 4777235 4753751 4863074 4910360 4826864 4780607 4771313 4799859
4145D799859L058K3078j18273j0843o8112R1902J2309o7468q0454K38998j7423
$$ 4799859 4802917 4825995 4707722 4696879 4628767 4720669 4732978 4665510 4585056 4824054 4806631
4134D806631J71268M1973m523K29164M9915q4709L63553K72512K55151K48548
$$ 4806631 4977899 5019872 5015349 5244513 5294428 5209719 5573272 5845784 6100935 6349483
4124F349483J88681j59909o3878m30532q3837l568j82924j24517j34940j16192
$$ 6349483 6538164 6378255 6314377 5883845 5800008 5796440 5613516 5488999 5354059 5237867
4114E237867M4148M5203R3178J55048J65601J3122L0275j7116N1270r4110J74477
$$ 5237867 5282015 5327218 5420396 5575444 5741045 5754167 5784442 5767326 5818596 5724486 5898963
4103E898963K8359j98292k7943K47821j02389p3909O3151O974J09901N1049k3548
$$ 5898963 5927322 5729030 5701087 5948908 5846519 5772610 5835761 5842735 5952636 6003685 5980137
4092E980137J5847R8138k45116m0487J09872j4074O0877K65790n6249m4536J52705
$$ 5980137 5995984 6094122 5849006 5808519 5918391 5904317 5965194 6230984 6174735 6130199 6282904
4081F282904l11N0581k3153P2589J86334j02465J98130Q9090L5586J4338J36892
$$ 6282904 6282593 6333174 6310021 6382610 6568944 6466479 6664609 6753699 6789285 6803623 6940515
4070F940515L1168m2020K18763J33077J02518J83894J05778J38608J28327P6474
$$ 6940515 6971683 6929663 7148426 7281503 7384021 7567915 7673693 7812301 7940628 8017102
4060H017102J02154j14327j11100J23488K10564K67367J71666K32853J39861K52659
$$ 8017102 8119256 8004929 7893829 8017317 8227881 8495248 8666914 8899767 9039628 9292287
4050I292287L00475O2977K36214K78071N77194L46209K85867K19800L46481O39347
$$ 9292287 9592762 9655739 9891953 10170024 10747218 11093427 11379294 11599094 11945575 12584922
4040A2584922M29136K33440O0751L07535L08520K47411K45751K10610L22036K63390
$$ 12584922 13014058 13247498 13308249 13615784 13924304 14171715 14417466 14628076 14950112 15213502
4030A5213502O06410N18601N08240O19502N68377M57025P80506P96979P32794
$$ 15213502 15819912 16338513 16846753 17466255 18034632 18491657 19272163 20069142 20801936
4021B0801936O41821M75462M07924N65783M76450K52493J69183k06123j68366
$$ 20801936 21443757 21919219 22327143 22892926 23369376 23621869 23791052 23584929 23416563
4012B3416563l67867k99092m82119m37310n01744l20378n37552k94803k28813
$$ 23416563 23048696 22749604 22267485 21830175 21328431 21008053 20470501 20175698 19946885
4003A9946885k09961k52400n5079m1131J47941r1002K923m9972J23283J40559
$$ 19946885 19736924 19484524 19429445 19388314 19536255 19445253 19448176 19398204 19521487 19662046
3993A9662046j34635j06203m0960p6789k00082o8100j41571k09800R9502k3482
$$ 19662046 19527411 19421208 19380248 19303459 19103377 19035277 18893706 18683906 18783408 18759926
3983A8759926L6155J07365o6224j10781j11128l57198j78815j89922l32181m56985
$$ 18759926 18796081 18903446 18837222 18726441 18615313 18258115 18079300 17889378 17557197 17100212
3973A7100212m34314m91023j93781k43690m09947j56982j88066j30881J78670
$$ 17100212 16665898 16174875 15981094 15737404 15327457 15170475 14982409 14851528 15030198
3964A5030198n0583q7156J43659Q0320P9975K88317J16329n9046J75390k7388
$$ 15030198 14979615 14892459 15036118 15116438 15196413 15484730 15601059 15542013 15717403 15690015
3954A5690015J57230K14007K03555P0659j27029L6558J44714L1127q0286R0080
$$ 15690015 15847245 16061252 16264807 16335466 16208437 16244995 16389709 16420836 16340550 16430630
3944A6430630P3532j22518J30555o1825j95477k11170k53222r5282j79193j2406
$$ 16430630 16504162 16381644 16512199 16450374 16254897 16043727 15790505 15695223 15516030 15503624
3934A5503624R3333k24997J4045n3478L8315m1217Q4697k38477n1556Q0919m7609
$$ 15503624 15596957 15371960 15386005 15332527 15370842 15329625 15414322 15175845 15124289 15205208 15157599
3923A5157599K15046L6947j03499K43119J02295Q2632j88874l2279J48418R4157
$$ 15157599 15372645 15409592 15306093 15549212 15651507 15734139 15545265 15512986 15661404 15755561
3913A5755561K8448J05722J10478J15871P2854J36543K42299K60542J14341M7176
$$ 15755561 15784009 15889731 16000209 16116080 16188934 16325477 16567776 16828318 16942659 16989835
3903A6989835J70752n7069n8233K99663K17413O9729K10404J1020R1268Q5223
$$ 16989835 17160587 17103518 17045285 17344948 17562361 17632090 17842494 17853514 17944782 18030005
3893A8030005J66307M29071L85413N23616N61247O03163O80237R52436J232100
$$ 18030005 18196312 18625383 19010796 19534412 20095659 20698822 21379059 22331495 23563595
3884B3563595J004351O2590q22655j019273n94813n96654l17899j92689j33744
$$ 23563595 24567946 24630536 23807881 22788608 22193795 21597141 21279242 21086553 20952809
3875B0952809q217M4322J48249J65657J725K08069k5822J23235K14449L00259
$$ 20952809 20944592 20988914 21137163 21302820 21304545 21512614 21486792 21610027 21824476 22124735
3865B2124735J6198K47185J7341J93242M04127K14164L34198K02116L26723M47726
$$ 22124735 22140933 22388118 22405459 22598701 23002828 23216992 23551190 23753306 24080029 24527755
3855B4527755L86218K75816L12411N68432M64659L43930N27037L19978L89827
$$ 24527755 24913973 25189789 25502200 26070632 26535291 26879221 27406258 27726236 28116063
3846B8116063M15613K96196M42653M99479L23459M92241N78714O74564O22731
$$ 28116063 28531676 28827872 29270525 29770004 30093463 30585704 31164418 31838982 32461713
3837C2461713Q51997O34300Q15347Q64479R49689Q15195Q05342J141227J276086
$$ 32461713 33313710 33948010 34763357 35627836 36577525 37392720 38198062 39339289 40615375
3828D0615375J391932J427473J452244J814498K200521K686143K995889L298939
$$ 40615375 42007307 43434780 44887024 46701522 48902043 51588186 54584075 57883014
3820E7883014L858725M514468M499432L845836K282352l72693j459578j305869
$$ 57883014 61741739 66256207 70755639 74601475 76883827 76511134 75051556 73745687
3812G3745687m99548L46911O36605J036999J322315J756161K317025L152777M231766
$$ 73745687 73246139 73593050 74229655 75266654 76588969 78345130 80662155 83814932 88046698
3803H8046698N124470O396016P728394R416232J1146589J3676727J6730177K1142157
$$ 88046698 93171168 99567184 107295578 116711810 127858399 141535126 158265303 179407460
3795A79407460K7377790L5509787M3352053M9139454L6054387j9258342n5737790
$$ 179407460 206785250 242295037 285647090 334786544 370840931 351582589 295844799
3788B95844799n5565891m3578527k9695581k1943716j7185392j4696279j1981235
$$ 295844799 240278908 196700381 167004800 145061084 127875692 113179413 101198178
3781A01198178r462891p316118n956847m726468m379664l316211k981843k192316
$$ 101198178 91735287 84419169 78462322 73735854 69356190 66039979 63058136 60865820
3773F0865820k133756j911480j487481j228368j196194p48156r29011q35475n98462
$$ 60865820 58732064 56820584 55333103 54104735 52908541 52160385 51231374 50395899 49797437
3764D9797437o69509o99768m95993k37863q9290k6152M2567M9767K39998N572
$$ 49797437 49127928 48428160 47932167 47694304 47605014 47578862 47621429 47671196 47911194 47916766
3754D7916766L17500K33355L33933O21542O04459R13199J121010J304934J459826
$$ 47916766 48234266 48467621 48801554 49423096 50027555 50940754 52061764 53366698 54826524
3745E4826524J359366Q81095R0718J10407r3530J54499L45973N65824R58825R77139
$$ 54826524 56185890 57066985 57157703 57268110 57174580 57329079 57675052 58240876 59199701 60176840
3735F0176840P48865J006553J516974J627234J643305J820162J837585K061302
$$ 60176840 60925705 61932258 63449232 65076466 66719771 68539933 70377518 72438820
3727G2438820K401452K543922K958129L080154L329561L537140L802223M576579
$$ 72438820 74840272 77384194 80342323 83422477 86752038 90289178 94091401 98667980
3719I8667980N036002N504517N837650O572310P528507Q335768R173139J0202460
$$ 98667980 103703982 109208499 115046149 121618459 129146966 137482734 146655873 156858333
3711A56858333J1183446J2416813J3631400J4348997J4446362J4666992J3870397
$$ 156858333 168041779 180458592 194089992 208438989 222885351 237552343 251422740
3704B51422740J1976657R403927O264040K104752k394411o857303j0473789j3897314
$$ 251422740 263399397 272803324 279067364 281172116 278777705 271920402 261446613 247549299
3696B47549299j6692277j8478383j9346563j8676951j6775736j4585840j2542261
$$ 247549299 230857022 212378639 193032076 174355125 157579389 142993549 130451288
3689A30451288j0723336r396823q014166o871953o080920n148905m514664m043978
$$ 130451288 119727952 110331129 102316963 95445010 89364090 84215185 79700521 75656543
3681G5656543l634136l212254k807382k379974j944627j872882j532799j349736
$$ 75656543 72022407 68810153 66002771 63622797 61678170 59805288 58272489 56922753
3673E6922753j489144j188269j039124q51294q76383q17764p71877p18875k64157
$$ 56922753 55433609 54245340 53206216 52354922 51478539 50660775 49888898 49170023 48905866
3664D8905866j81992m11064m79056n70445o70334o89593o27099j028746j127600
$$ 48905866 48723874 48312810 47833754 47263309 46592975 45903382 45276283 44247537 43119937
3655D3119937j048058j212705j092929j296600j189899j130286j048414j031470
$$ 43119937 42071879 40859174 39766245 38469645 37279746 36149460 35101046 34069576
3647C4069576j075962j021972q89886p62611m97635o97056n52720o55235o48483
$$ 34069576 32993614 31971642 31081756 30319145 29821510 29124454 28571734 27916499 27268016
3638B7268016n74438l57950j58533l26368n16774m94115l00050j44899n17364
$$ 27268016 26693578 26335628 26177095 25850727 25333953 24839838 24539788 24394889 23877525
3629B3877525k60062j97342k08816k56546l94411n8010j18862l6186j11455k10558
$$ 23877525 23617463 23420121 23211305 22954759 22560348 22502338 22383476 22347290 22235835 22025277
3619B2025277j58455M3610Q8363K5598K48042M6280K11093M51382L3538J43404
$$ 22025277 21866822 21910432 21998795 22024393 22272435 22318715 22529808 22981190 23014728 23158132
3609B3158132N18737L07213O00316M34283N20347Q88501J096644J266071J265478
$$ 23158132 23676869 23984082 24584398 25018681 25539028 26427529 27524173 28790244 30055722
3600C0055722R80106R5823k74646j26740L66548R13506J106063J368834J635027
$$ 30055722 31035828 31131651 30857005 30730265 31096813 32010319 33116382 34485216 36120243
3591C6120243K125735K655572L405887L944164M311634M714629M102024J832635
$$ 36120243 38245978 40901550 44307437 48251601 52563235 57277864 61379888 63212523
3583F3212523j993146m951610n767859n761300m644290l792960l107021k763859
$$ 63212523 61219377 56267767 50499908 44738608 40094318 36301358 33194337 30430478
3575C0430478k399704k031993j674297j319828j285796j088141r61505q58000
$$ 30430478 28030774 25998781 24324484 23004656 21718860 20630719 19669214 18811214
3567A8811214o22333p24909n63104n16710m23906k98757n16269l85167j16970
$$ 18811214 18188881 17463972 16900868 16384158 15960252 15661495 15145226 14760059 14643089
3558A4643089l03846l19755j93363k74499k74827l8957L6486j27339n0842n3274
$$ 14643089 14339243 14019488 13826125 13551626 13276799 13237842 13274328 13146989 13096147 13042873
3548A3042873j609l5056j06435j73109R9464o0146l4119j2070o2868j7759j19520
$$ 13042873 13041264 13006208 12899773 12726664 12826128 12765982 12731863 12719793 12656925 12639166 12519646
3537A2519646m6881q892O1884k9992k1545J2290q0687N2210j02681k6390K1605
$$ 12519646 12472765 12463873 12525757 12495765 12474220 12486510 12405823 12458033 12355352 12328962 12350567
3526A2350567J7248n2156o211r1926N0351J58667Q6955K4404N5013J95083K15095
$$ 12350567 12367815 12315659 12309448 12217522 12267873 12426540 12513495 12537899 12592912 12787995 13003090
3515A3003090K86062J08665J65773K73594J29040L80061J3817Q4197J67421N3248
$$ 13003090 13289152 13397817 13563590 13837184 13966224 14346285 14360102 14444299 14611720 14664968
3505A4664968l1946J99011J23752M3376L01545J18476J60130K21483J88782K29280
$$ 14664968 14633022 14832033 14955785 14999161 15300706 15419182 15579312 15800795 15989577 16218857
3495A6218857J5968K86220N3043J57146K85544P2816L15879K80509J85007K18425
$$ 16218857 16234825 16521045 16574088 16731234 17016778 17089594 17405473 17685982 17870989 18089414
3485A8089414K35460M32668M13705M34097K57089M82998L98908L55542M17109
$$ 18089414 18324874 18757542 19171247 19605344 19862433 20345431 20744339 21099881 21516990
3476B1516990K70824N12132N59451L85755N92305P08954P40562P39676P62834
$$ 21516990 21787814 22299946 22859397 23245152 23837457 24546411 25286973 26026649 26789483
3467B6789483R47589J185357J243330Q47682J122312J094182J409251J746186
$$ 26789483 27737072 28922429 30165759 31013441 32135753 33229935 34639186 36385372
3459C6385372J863141J887042J818130K178707K140642J656768J196200R76974
$$ 36385372 38248513 40135555 41953685 44132392 46273034 47929802 49126002 50102976
3451E0102976P24462N52400Q59065Q48470J142168J237794J247530J515987J582324
$$ 50102976 50827438 51379838 52238903 53087373 54229541 55467335 56714865 58230852 59813176
3442E9813176J850321J908042K274863K806637L251509L585542M253026N057001
$$ 59813176 61663497 63571539 65846402 68653039 71904548 75490090 79743116 84800117
3434H4800117N481924O581398P473674Q654556J0394049J2103188J3957940J6420892
$$ 84800117 90282041 96863439 104337113 112991669 123385718 135488906 149446846 165867738
3426A65867738J8712899K1450453K3346023K2637755J6635961L825868j1931646
$$ 165867738 184580637 206031090 229377113 252014868 268650829 272476697 260545051
3419B60545051k3011736k6510682k4556390k0543476j7098001j4022395j1528386
$$ 260545051 237533315 211022633 186466243 165922767 148824766 134802371 123273985
3412A23273985r522127p493441o161364n143795m500118m158566l672238l327743
$$ 123273985 113751858 106258417 100097053 94953258 90453140 86294574 82622336 79294593
3404G9294593k871237k589081j928809j541221j356626j280000j192087j206205
$$ 79294593 76423356 73834275 71905466 70364245 69007619 67727619 66535532 65329327
3396F5329327j348393j547053j499685j829128k054765k126875k381363k213445
$$ 65329327 63980934 62433881 60934196 59105068 57050303 54923428 52542065 50328620
3388E0328620j945530j989761k007436j753471j593127j575233j127729j148500
$$ 50328620 48383090 46393329 44385893 42632422 41039295 39464062 38336333 37187833
3380C7187833j056766r04934r67696q85026j011048o77023n23499l62046n29130
$$ 37187833 36131067 35226133 34258437 33373411 32362363 31685340 31161841 30799795 30270665
3371C0270665l70916j51315k03951j05905j37431l95347L0365j3647p9976j26459
$$ 30270665 29899749 29748434 29544483 29438578 29301147 28905800 28936165 28922518 28842542 28716083
3361B8716083P2546J72149J82677J72259J09232J10789j69555k77181o55642p63992
$$ 28716083 28788629 28960778 29143455 29315714 29424946 29535735 29366180 29088999 28433357 27669365
3351B7669365o36764p49889n60503o02930m74112o00397o21083n23882l92533
$$ 27669365 27032601 26282712 25722209 25119279 24645167 24044770 23423687 22899805 22507272
3342B2507272m35185m07046l14751n13042l08895k73134j37882q6077j36431q2778
$$ 22507272 22072087 21665041 21350290 20837248 20528353 20255219 20117337 20031260 19894829 19812051
3332A9812051l2334j91020M0322Q6348J67654K06806K28935K58995L13787L59154
$$ 19812051 19779717 19588697 19629019 19715367 19883021 20089827 20318762 20577757 20891544 21250698
3322B1250698M27483L54830M21332M94696L01846o4902L17369K57512R067r0157
$$ 21250698 21678181 22033011 22454343 22949039 23250885 23185983 23503352 23760864 23769931 23679774
3312B3679774L3278l8917j03029l8614N804R4242K32046J98099J76825M80995
$$ 23679774 23713052 23674135 23571106 23532492 23538296 23632538 23864584 24062683 24239508 24720503
3302B4720503N78121N91973O36667R57491Q43513R19275J143470J309987J433123
$$ 24720503 25298624 25890597 26527264 27484755 28328268 29247543 30391013 31701000 33134123
3293C3134123J487744J387610J544635J711129J971728K348015K855291L446880
$$ 33134123 34621867 36009477 37554112 39265241 41236969 43584984 46440275 49887155
3285D9887155L978991M477343N331025O100253O199688O103441N133829K845331
$$ 49887155 53866146 58343489 63674514 69774767 75974455 82077896 87211725 90057056
3277I0057056p90244m452689o773611p488301p014598o130649n029985m313447
$$ 90057056 89266812 84814123 78040512 70552211 63537613 57406964 52376979 48063532
3269D8063532m081717l389957k961704k522929k259271k220535k017807j766348
$$ 48063532 43981815 40591858 37630154 35107225 32847954 30627419 28609612 26843264
3261B6843264j580046j380585j020424r79022r68707q40356p95231m54282n66246
$$ 26843264 25263218 23882633 22862209 21883187 20914480 20074124 19278893 18824611 18258365
3252A8258365n92430l54524l64086k44120l46846k85180l54605k72010j18270
$$ 18258365 17665935 17311411 16947325 16703205 16356359 16071179 15716574 15444564 15326294
3243A5326294j05870m5264j03189j36995O1895r0013J24036M9436R143k4721m6652
$$ 15326294 15220424 15175160 15071971 14934976 14996871 14906858 15030894 15080330 15089473 15064752 15018100
3232A5018100L94770L43386K53850K25264N57041L36336K71072M48622K75861
$$ 15018100 15412870 15756256 16010106 16235370 16792411 17128747 17399819 17848441 18124302
3223A8124302J37863O0368k07575l21378k26872n24191l16973j66423k15118k31061
$$ 18124302 18262165 18322533 18114958 17793580 17566708 17042517 16725544 16559121 16344003 16112942
3213A6112942p3204N6035r0890J17534K78614L78931L37487J95913l2840l98621
$$ 16112942 16039738 16095773 16004883 16122417 16401031 16779962 17117449 17313362 17280522 16881901
3203A6881901j37933k34706m02874l00357l22146m31830n36926k31513j23020
$$ 16881901 16743968 16509262 16106388 15806031 15483885 15052055 14515129 14283616 14160596
3194A4160596k25581r4925q2170J19958J15061j36133N5964R7758L63639L37409
$$ 14160596 13935015 13840090 13757920 13877878 13992939 13856806 13912770 14010528 14374167 14711576
3184A4711576j213L42843L95837L81576L71181J64156O5639J6107L13747K67819
$$ 14711576 14710363 15053206 15449043 15830619 16201800 16365956 16431595 16447702 16761449 17029268
3174A7029268L04692L66182O48599N58448M33797j0425m31107m66816l96302l05586
$$ 17029268 17333960 17700142 18348741 18907189 19340986 19330561 18899454 18432638 18036336 17730750
3164A7730750n35403k37908j11219n11028m40162l84249n34159k81537k55239
$$ 17730750 17195347 16957439 16846220 16335192 15895030 15510781 14976622 14695085 14439846
3155A4439846k07069O738j55777q4619p1812r8112k2595R6034l6679n9087p1886
$$ 14439846 14232777 14239515 14083738 13999119 13927307 13829195 13806600 13902634 13865955 13806868 13734982
3144A3734982j21130n6526m2511k9773P199J76138Q3083Q7329J88474N7690j8745
$$ 13734982 13613852 13557326 13514815 13485042 13492241 13668379 13751462 13838791 14027265 14084955 14066210
3133A4066210K32321O1675K19680J94375m85K00917J87842J36500J93278L54080
$$ 14066210 14298531 14360206 14579886 14774261 14773776 14974693 15162535 15299035 15492313 15846393
3123A5846393K71565K28641K52314L29448M78429K23491M85640N10010N76853
$$ 15846393 16117958 16346599 16598913 16928361 17406790 17630281 18115921 18625931 19202784
3114A9202784P52691O37926O40451O17569P42053Q61868J077857J357333R26411
$$ 19202784 19955475 20593401 21233852 21851421 22593474 23455342 24533199 25890532 26816943
3105B6816943R00049R72384M02704O6728m22508n74442m48358n22166n33339n34356
$$ 26816943 27716992 28689376 29092080 29158808 28736300 28161858 27713500 27191334 26657995 26123639
3095B6123639k49791k01422q8896M5312J33364K66048P19262O29225Q93586Q63460
$$ 26123639 25873848 25672426 25583530 25628842 25762206 26028254 26747516 27376741 28270327 29133787
3085B9133787J022237J585204J607166J856187K079230K294937K641201K634089
$$ 29133787 30156024 31741228 33348394 35204581 37283811 39578748 42219949 44854038
3077D4854038K483715K310808K031113J525555O56590J44902o92068j477568k053177
$$ 44854038 47337753 49648561 51679674 53205229 53861819 54006721 53314653 51837085 49783908
3068D9783908k329303k374023j989472j719084j601532j104546o05622m61135
$$ 49783908 47454605 45080582 43091110 41372026 39770494 38665948 38060326 37599191
3060C7599191o9098l4030N49101P39401J012663J283317J503065J954790K137770
$$ 37599191 37530093 37496063 38045164 38784565 39797228 41080545 42583610 44538400 46676170
3051D6676170K668657K687697L054935L225751L489856L050195K585232J850415
$$ 46676170 49344827 52032524 55087459 58313210 61803066 64853261 67438493 69288908
3043F9288908P19319l39202j705828k933763l396289l577918l541344l482885
$$ 69288908 70008227 69669025 67963197 65029434 61633145 58055227 54513883 51030998
3035E1030998l151441k593427k375606j961244j790988j369346r30922m76057
$$ 51030998 47879557 45286130 42910524 40949280 39158292 37788946 36858024 36381967
3027C6381967l90214l52437L28621L56920M75024Q39424J239070J566423J786038
$$ 36381967 35991753 35639316 35967937 36324857 36799881 37639305 38878375 40444798 42230836
3018D2230836J991020J767367J703201J173176M80301l17582j290933j429176
$$ 42230836 44221856 45989223 47692424 48865600 49345901 49028319 47737386 46308210
3010D6308210j945404k160531k169994k585399k407485k402625k044203j774591
$$ 46308210 44362806 42202275 40032281 37446882 35039397 32636772 30592569 28817978
3002B8817978j543739j233988j112432p96514q37080m90318l71564n14446j67632
$$ 28817978 27274239 26040251 24927819 24131305 23294225 22803907 22432343 21917897 21750265
2993B1750265m36576J73442r0839j04590J27431K00766K56482Q5995K07560L46052
$$ 21750265 21313689 21487131 21396292 21291702 21419133 21619899 21876381 21962376 22169936 22515988
2983B2515988Q4926L6427n82752r64853j009408j028911j020303j028022n45196
$$ 22515988 22600914 22637341 22054589 21089736 20080328 19051417 18031114 17003092 16457896
2974A6457896m99320m60734n04624m82725j78256j32849r9966k29938p2437J34250
$$ 16457896 15958576 15497842 14993218 14510493 14332237 14199388 14099422 13869484 13797047 13931297
2964A3931297Q4599p2669l05286j87038m29486l46424l25095k83603p4118k60710
$$ 13931297 14015896 13943227 13637941 13450903 13021417 12674993 12349898 12066295 11992177 11731467
2954A1731467j81447p2475n1074Q7997j02798N7442p3741L7249N4671j35690m0121
$$ 11731467 11550020 11477545 11426471 11514468 11411670 11469112 11395371 11432620 11487291 11351601 11311480
2943A1311480k86221k03775l15525l02824k73641k39008j24864k97332k32160
$$ 11311480 11025259 10821484 10505959 10203135 9929494 9690486 9565622 9268290 9036130
2934I036130j40450q2122N458k02637r6189P6745J38107M0842P7419J39427K2381
$$ 9036130 8895680 8813558 8819016 8616379 8520190 8596935 8735042 8775884 8853303 8992730 9015111
2923I015111K14590K55214J90153K17899M24319L88851K70514N2667Q4684L84318
$$ 9015111 9229701 9484915 9675068 9892967 10317286 10706137 10976651 11029318 11114002 11498320
2913A1498320J13938k0686j31526k17516l32437n03764n42395l73828j79350k83085
$$ 11498320 11612258 11591572 11460046 11242530 10910093 10406329 9863934 9490106 9310756 9027671
2903I027671l62465j19339r0852k69560Q2884R7305K32451K29873K46119J07081
$$ 9027671 8665206 8545867 8455015 8185455 8268339 8365644 8598095 8827968 9074087 9181168
2893I181168Q3187N4459l4710k3033Q8015j96775k87393j78137j02360j70777
$$ 9181168 9264355 9318814 9284104 9261071 9349086 9152311 8864918 8686781 8584421 8413644
2883H413644j12805l5507o7572j1744M7510k2850l0586k8076j58703j00823J4029
$$ 8413644 8300839 8265332 8197760 8186016 8233526 8210676 8180090 8152014 7993311 7892488 7906517
2872G906517l14297k63328l29910j6171j06990r3699j96374k19958o8010J73939
$$ 7906517 7592220 7328892 6998982 6982811 6875821 6782122 6585748 6365790 6297780 6471719
2862F471719J03452J16442p655M3373J8520J61457L7682o8535K6651l0071j46448
$$ 6471719 6575171 6691613 6683958 6727331 6745851 6907308 6944990 6876455 6903106 6873035 6726587
2851F726587r4930r4808j23533j19265j79596k10450k35735k47762l10755k46561
$$ 6726587 6631657 6536849 6413316 6294051 6114455 5904005 5668270 5420508 5109753 4863192
2841D863192k00224j70858k9720j23536k17158n5631k60972N7022m209J05271
$$ 4863192 4662968 4492110 4462390 4338854 4121696 4066065 3805093 3862115 3857906 3963177
2831C963177J3752P9098k22601j56136O8424J51569j28030j31802J37610J03380
$$ 3963177 3976929 4056027 3833426 3677290 3745714 3897283 3769253 3637451 3775061 3878441
2821C878441P4366L4l8523J54954J69347K19810l5707j2756p0131l9404q2625
$$ 3878441 3952807 3952841 3914318 4069272 4238619 4458429 4422722 4409966 4339835 4300431 4217806
2810D217806n2489j23571j56724m3430l27685j84563k1911p8194j47234j94638
$$ 4217806 4165317 4041746 3885022 3841592 3513907 3329344 3307433 3229239 3082005 2887367
2800B887367n585K3530k2113j96942M4218p1222J40997p1617k62481q6370j54515
$$ 2887367 2881782 2905312 2883199 2686257 2730475 2659253 2800250 2728633 2466152 2379782 2225267
2789B225267j01683j47561K569J52848M3592J76886o7796l7419J7111J1060k22679
$$ 2225267 2123584 1976023 1978592 2131440 2175032 2351918 2284122 2246703 2263814 2274874 2052195
2778B052195j4418J5738N8595j14706l9025p4200N5024K04889j56574O5696k8827
$$ 2052195 2037777 2053515 2112110 1997404 1958379 1884179 1939203 2144092 1987518 2053214 2024387
2767B024387N7871Q2992P5843L6946l20491j24524m1555J43196p8524J9941j25065
$$ 2024387 2082258 2165250 2241093 2278039 1957548 1833024 1791469 1934665 1856141 1876082 1751017
2756A751017j62886P9388O228J56244l5817j2581O4815m7116j53396n4691N3686
$$ 1751017 1588131 1667519 1673747 1829991 1794174 1781593 1846408 1799292 1645896 1591205 1644891
2745A644891J56916J45178k27385k54071m7419j70131K11817K3789P6834O4117
$$ 1644891 1801807 1946985 1719600 1465529 1418110 1247979 1459796 1483585 1560419 1624536
2735A624536N2722J61513P8431k44748L5542L7526q685r2676r9766J4212J87196
$$ 1624536 1677258 1838771 1917202 1672454 1707996 1745522 1736837 1644161 1544395 1558607 1745803
2724A745803o5126r6328k5627q1849N7001j35673P6228J67907k4211p3990j75207
$$ 1745803 1680677 1584349 1558722 1476873 1533874 1398201 1474429 1642336 1618125 1544135 1368928
2713A368928J48991j27931P1019j9538l5181m2380o8250j415o8534K65767q3987
$$ 1368928 1517919 1389988 1461007 1441469 1406288 1363908 1295658 1294243 1225709 1491476 1407489
2702A407489j73551L2846j0386P1480j25190R4297n0469L9227n3473n994P3013
$$ 1407489 1233938 1266784 1256398 1327878 1202688 1296985 1246516 1285743 1232270 1226276 1299289
2691A299289n114o7600J47549n8194n0656J6954L3744j4045j27032J69912j48074
$$ 1299289 1294175 1226575 1374124 1315930 1265274 1282228 1315972 1301927 1174895 1344807 1196733
2680A196733l7181O9257p0156m9997j65413L2568M4644J6868j29549K2845J73586
$$ 1196733 1159552 1228809 1158653 1108656 943243 975811 1020455 1037323 907774 930619 1104205
2669A104205j15035L9932J32455K61867Q0636o0648m989j82885m9664O4049j21618
$$ 1104205 989170 1029102 1161557 1423424 1504060 1443412 1438423 1255538 1205874 1269923 1148305
2658A148305K6128R8251r3870j00564q2750m062K5160J68853L2574o1265K8298
$$ 1148305 1174433 1272684 1178814 1078250 995500 991438 1016598 1185451 1218025 1156760 1185058
2647A185058j07340R7300K2378k4134L1772o2520o1269K2661m243O6162K7886
$$ 1185058 1077718 1175018 1197396 1173262 1205034 1142514 1081245 1103906 1099663 1165825 1193711
2636A193711j20999P7375K33370l8196L5755j71295n3189j7508J05601q8377r4663
$$ 1193711 1072712 1150087 1383457 1345261 1381016 1209721 1156532 1139024 1244625 1156248 1061585
2625A061585J73982P3384q1559q9092n7153J76199l3889m8652j5114n9886j166
$$ 1061585 1235567 1308951 1227392 1138300 1081147 1257346 1223457 1174805 1159691 1099805 1098639
2614A098639M2077P6965M9358N2807j73842N0803O9809k3696J8309j89952J19550
$$ 1098639 1140716 1217681 1267039 1319846 1146004 1196807 1266616 1242920 1261229 1071277 1190827
2603A190827o4818m3862J35901k9642r1304m6697J83316Q7137j04940N5405o9691
$$ 1190827 1126009 1082147 1218048 1188406 1097102 1050405 1233721 1320858 1215918 1271323 1201632
2592A201632J57116j90479j37302M8949N2291J67554Q3742j45373O8484R5373
$$ 1201632 1358748 1168269 1030967 1079916 1132207 1299761 1383503 1238130 1306614 1401987
2582A401987j59268j03292n8755R5657l8101N0546O2864O6023j8930j9902k4093
$$ 1401987 1242719 1139427 1080672 1176329 1138228 1188774 1251638 1317661 1298731 1278829 1254736
2571A254736J36738M1462m5765k14615Q0728j1582j47133K53343l428j50600k4139
$$ 1254736 1391474 1432936 1387171 1172556 1253284 1241702 1094569 1347912 1344484 1193884 1169745
2560A169745O0821k4431J1442N4026n1622m0940J3678Q6135k0348j8037M7469
$$ 1169745 1230566 1206135 1217577 1271603 1219981 1179041 1192719 1278854 1258506 1240469 1287938
2549A287938J11203q0895o2494K57975j15470k16730R2100J69792N287k00389
$$ 1287938 1399141 1318246 1255752 1513727 1398257 1181527 1273627 1443419 1448706 1248317
2539A248317m4576J96225Q386O5159j01648k8219J44251j11307k24354P0132J17889
$$ 1248317 1203741 1399966 1408352 1473511 1371863 1343644 1487895 1376588 1152234 1222366 1340255
2528A340255j03324J42665R2709j2088J1134q8419K3788Q9878R046j12498J3373
$$ 1340255 1236931 1379596 1472305 1460217 1471351 1382932 1406720 1496598 1505644 1393146 1406519
2517A406519J14441K7859k3832J06653R8433j11493l6512P2386j85732j17131
$$ 1406519 1520960 1548819 1524987 1631640 1730073 1618580 1582068 1654454 1468722 1351591
2507A351591P3310J13487Q9004j47117J81560j59554p4603n1651J55417P0722
$$ 1351591 1424901 1538388 1627392 1480275 1661835 1502281 1427678 1376027 1531444 1602166
2497A602166j7800J44896M034q9108j1026n050J28072o954m6975j51946L8888
$$ 1602166 1584366 1729262 1733296 1644188 1633162 1628112 1756184 1749230 1702255 1550309 1589197
2486A589197j494P5393l487k41578J22411K58535j33939L4596j377n495j0545
$$ 1589197 1587703 1663096 1659609 1418031 1540442 1798977 1665038 1699634 1698257 1692762 1682217
2475A682217j89173J904P4262J30018L9291j14402q9181O6603P6115k05469J53503
$$ 1682217 1493044 1494948 1569210 1699228 1738519 1624117 1534936 1601539 1677654 1472185 1625688
2464A625688l3968J6256M3612j85684J00816j4225J4946l6107J9088k8147O9929
$$ 1625688 1591720 1607976 1651588 1465904 1566720 1552495 1567441 1531334 1550422 1522275 1592204
2453A592204q4811k50296N0686R9499r6576J37578N571n2172o4911m1231q2472
$$ 1592204 1507393 1257097 1307783 1407282 1310706 1448284 1453855 1401683 1336772 1295541 1213069
2442A213069J18084M9839m5531q9731j53166k3165J88462j43397J07712J00116
$$ 1213069 1331153 1380992 1335461 1245730 1092564 1069399 1257861 1114464 1222176 1322292
2432A322292l2995Q5887j54812o1059j67308J4348J17032N0097l23161o2202J52427
$$ 1322292 1289297 1375184 1220372 1159313 992005 1006353 1123385 1173482 850321 788119 940546
2421I40546K252K94652k09635n6450L3153q9987K8905J35784K06447j60439j93416
$$ 940546 942798 1237450 1027815 971365 1004518 914531 943436 1079220 1285667 1125228 931812
2410I31812j29089J35742J16833r316k6621j90663Q5506J04131q1925P164M9150
$$ 931812 802723 938465 1055298 1045982 1019361 828698 914204 1018335 936410 943574 992724
2399I92724k52026N3006J86196j01484j2817J18304j43574o0126o2549j46525
$$ 992724 740698 793704 979900 878416 865599 983903 840329 780203 717654 571129
2389E71129n6035k5619N7058O1619P4131J5837o1551k24081k7981L22508M9835
$$ 571129 515094 489475 546533 608152 682283 698120 636569 412488 384507 707015 756850
2378G56850N3527m8625M1464j6526o4863p9667j6362N6040l4755Q9217J373n2579
$$ 756850 810377 761752 803216 786690 721827 642160 625798 681838 647083 736300 737673 685094
2366F85094l0545k4798m1373P0234q8007R1808O8296j37684N9034k05086n5630
$$ 685094 654549 629751 588378 658612 570605 662413 730709 593025 652059 446973 391343
2355C91343R2620r1925K5625K08289J35212N572n7955o8311Q5249J5003R6067
$$ 391343 483963 392038 417663 625952 761164 766736 708781 640470 725719 740722 836789
2344H36789J6637j17151J3030r8968j9751J85424m0870j35656r6071M1819j16505
$$ 836789 853426 736275 749305 650337 630586 816010 775140 639484 543413 585232 468727
2333D68727J55875M3601p0638K24715j77022O6139r9802P2340O2128p5952J87991
$$ 468727 624602 668203 597565 822280 645258 711397 611595 683935 746063 670111 858102
2322H58102n9167j1671j47432J51498L5804j25402M432L2695Q4559K9005j37194
$$ 858102 798935 787264 639832 791330 827134 701732 706164 738859 823418 852423 715229
2311G15229Q8089r5921j78571j34546L20950J73440r2260K8395j01381J51981
$$ 715229 803318 707397 528826 394280 715230 888670 796410 824805 723424 875405
2301H75405K34581j58933J38643K1357q724R287J4038q3408M4092L6209j22274
$$ 875405 1109986 951053 1089696 1111053 1102329 1111616 1125654 1042246 1086338 1122547 1000273
2290A000273J83588j51061Q0418k3838k0859O3636O6688R3328r0222k6163J12413
$$ 1000273 1183861 1032800 1113218 1089380 1068521 1132157 1198845 1292173 1201951 1175788 1288201
2279A288201K8240k9309P4596J56489n7658j16549J37404k6906J18232n4852L7070
$$ 1288201 1316441 1287132 1361728 1518217 1460559 1344010 1481414 1454508 1572740 1517888 1554958
2268A554958J06461j30248K51964N7963m6364R0739R8920j05399k0838J15935
$$ 1554958 1661419 1531171 1783135 1841098 1794734 1885473 1984393 1878994 1858156 1974091
2258A974091j58146J33458M8517j18502L22640K04609P0135o9979m27p0335J76877
$$ 1974091 1815945 1949403 1997920 1879418 2202058 2406667 2476802 2406823 2406396 2336061 2512938
2247B512938K26319k9466m3463J45288N8899O5407J14932Q0312L0904L2560O1958
$$ 2512938 2739257 2709791 2666328 2811616 2870515 2935922 3050854 3131166 3162070 3194630 3256588
2236C256588j18127J51457J77384K1454J09634R4830M5602J14590J6535q6756
$$ 3256588 3138461 3289918 3467302 3488756 3598390 3693220 3738822 3853412 3869947 3783191
2226C783191j1265J63042J15105J47825l404J04792K23997J60249J02760J54465
$$ 3783191 3771926 3934968 4050073 4197898 4194494 4299286 4523283 4683532 4786292 4940757
2216D940757J70500J4669J35027J45413k7259J28249J60686N631K47496J66105
$$ 4940757 5111257 5125926 5260953 5406366 5379107 5507356 5668042 5673673 5921169 6087274
2206F087274K73097J3745J76030L55512K33732L6214K22899L91199K33111J92109
$$ 6087274 6360371 6374116 6550146 6905658 7139390 7175604 7398503 7789702 8022813 8214922
2196H214922J32839j22021K02817K42481K29373K89631L03830K72630O362L09893
$$ 8214922 8347761 8225740 8428557 8671038 8900411 9190042 9493872 9766502 9772864 10082757
2186A0082757L01908M10553O02457M92944L98433L23172M12438N49627O50091
$$ 10082757 10384665 10795218 11397675 11890619 12289052 12612224 13024662 13574289 14224380
2177A4224380Q22975M62647Q99842O14606Q28006J003564P92625J107884J059991
$$ 14224380 15047355 15510002 16409844 17024450 17852456 18856020 19648645 20756529 21816520
2168B1816520J064685J042771J013841Q64890O10872N35791L15529J61325N5372
$$ 21816520 22881205 23923976 24937817 25802707 26413579 26949370 27264899 27426224 27481596
2159B7481596k51233m07394o59064o85815j144665j224187j056251j129037q10537
$$ 27481596 27230363 26822969 26163905 25478090 24333425 23109238 22052987 20923950 20113413
2150B0113413o01815l35553j20017q17365j594539j856726j438525j236944j037350
$$ 20113413 19511598 19176045 19056028 18238663 16644124 14787398 13348873 12111929 11074579
2141A1074579o83317p30713m66161n42507k72836k04771l71501j36130j65408
$$ 11074579 10391262 9660549 9194388 8651881 8379045 8174274 7802773 7666643 7501235
2132G501235j96402j10585k46599o4493J5374K0887j68778J07098K46099J19956
$$ 7501235 7304833 7194248 6947649 6883156 6898530 6919417 6750639 6857737 7103836 7223792
2122G223792M62955K55485O70660O77813Q16917J101107J343443J777738J435757
$$ 7223792 7686747 7942232 8612892 9290705 10107622 11208729 12552172 14329910 15765667
2113A5765667l63468j869768j917423j706351j633425p92119o34195o19048l96399
$$ 15765667 15402199 13532431 11615008 9908657 8275232 7483113 6848918 6229870 5833471
2104E833471o30907j39476l69095n7836k11965j01089j04127k87355j3520l953
$$ 5833471 5202564 5063088 4693993 4636157 4424192 4323103 4218976 3931621 3918101 3914148
2094C914148o0545k15559j05143K87293M1861l8706K60861K14388J14782K86115
$$ 3914148 3853603 3638044 3532901 3820194 3862055 3823349 4084210 4298598 4413380 4699495
2084D699495N49884O06981O15929N64197O69972j00029r68971p96319j072223
$$ 4699495 5249379 5856360 6472289 7036486 7706458 7606429 6637458 5841139 4768916
2075D768916p88982k84951l36844m56328k15716q2616j93906k1774j53882k52951
$$ 4768916 3979934 3694983 3358139 2901811 2686095 2603479 2409573 2387799 2233917 1980966
2065A980966n0008l2169N4237j38824k89006J5459r9355o1168k3858j38600O7164
$$ 1980966 1930958 1898789 1953026 1814202 1525196 1540655 1441300 1380132 1356274 1217674 1284838
2054A284838K13251k30977j26842r2456n5831j1257J43612j07647P1620J24732
$$ 1284838 1498089 1267112 1140270 1047814 991983 980726 1124338 1016691 1088311 1213043
2044A213043k03233k32831L8536K48855L14136j72154j40883j55484r1407r645
$$ 1213043 1009810 776979 815515 1064370 1378506 1206352 1065469 909985 818578 808933
2034H08933K4080L3871J3697O8707Q449M1178k05882j99422q3044J31533J80890
$$ 808933 833013 866884 880581 949288 957737 998915 793033 593611 510567 642100 822990
2023H22990r285j16840j76562N5707n0901J15605O8858m5082p3103l8937O8200
$$ 822990 813705 696865 520303 576010 525109 640714 709572 664490 591387 552450 620650
2012F20650r2261J05992j45444O9451O8446K5007j08200n3892J44289j9293j11910
$$ 620650 528389 634381 488937 558388 626834 651841 543641 489749 634038 614745 502835
2001E02835J29524P3674j10999j63804q8007N3805M4539q5034l8342J28626j75888
$$ 502835 632359 706033 595034 431230 343223 397028 441567 356533 318191 446817 270929
1990B70929p1302M7818J4628J23758L3389j06416J17429O2137l0537R7015k31668
$$ 270929 199627 247445 262073 385831 419220 312804 430233 492370 461833 558848 327180
1979C27180m8579J99131l1743J2623J7881k12526j22187j53368K7644K61315J85956
$$ 327180 278601 477732 445989 458612 476493 263967 141780 -11588 16056 277371 463327
1968D63327n718j2711l2043j62790J9654O719K5659K5273j47320J52403j2454
$$ 463327 457609 444898 412855 250065 269719 276438 302097 327370 180050 332453 319999
1957C19999M9720j15794m9287j8250m1912p6298R8613K14842L2117m4820l3754
$$ 319999 369719 253925 204638 186388 144476 68178 166791 381633 413750 368930 335176
1946C35176p9630p8179J0482P430J3256j8008j47647J8434J21813p9235q2601
$$ 335176 255546 177367 187849 195279 208535 190527 42880 61314 183127 103892 21291
1935B1291J03207L5390N0755j24855R5369N5993r7315K8999l1164J76217P684
$$ 21291 124498 159888 210643 85788 181157 237150 139835 168834 137670 313887 321571
1924C21571r2568k1116r0045K4793L2125L1198o7050J87421K0964m5312J2725
$$ 321571 229003 207887 117842 142635 174760 205958 138908 326329 347293 301981 314706
1913C14706p9773N7499p9284m4112r5878p4019N4581j037L3090r3018O9561J99728
$$ 314706 234933 292432 213148 169036 73158 -861 53720 52683 85773 -7245 62316 262044
1901B62044k3099J50299j47960o8728l2246J65231Q4545j54426q6170Q5044O976
$$ 262044 238945 389244 241284 172556 140310 305541 390086 235660 149490 234534 241510
1890B41510K7891r0994K47255k473n616l452L2282N3521k21283l1834J74305p5920
$$ 241510 269401 178407 425662 423189 417573 414121 446403 499924 278641 246807 421112 345192
1878C45192R3868K2690j22397L693l4822j45524J02221P8355l4369J23030N7346
$$ 345192 439060 461750 339353 343046 308224 162700 264921 343276 308907 431937 489283
1867D89283J76260j443j01198J03431O5624n3435Q708Q0441o6767j83666J24218
$$ 489283 665543 664100 562902 666333 731957 678522 687230 767671 700904 517238 641456
1856F41456J73986P1539m2094j24514R6106n7171K2947o2869j8778K06090J44878
$$ 641456 815442 886981 844887 720373 816479 759308 782255 719386 700608 906698 1051576
1845A051576P821n247J6703l1529j11243K05514M0305J25291K01973r650J66852
$$ 1051576 1059397 1054150 1070853 1039324 928081 1133595 1173900 1299191 1501164 1491514 1658366
1834A658366k7325K13803j02455j53921Q8765R2592o3303o9083K23982J495J2759
$$ 1658366 1631041 1844844 1742389 1588468 1677233 1769825 1706522 1637439 1861421 1862916 1875675
1823A875675r0475K1052J24762j25156J21018J27348K2919N593o3943K07751J62715
$$ 1875675 1785200 1806252 1931014 1805858 1926876 2054224 2077143 2082736 2018793 2226544 2389259
1812B389259o7383o3987J66541K73952j24785R6808K65731L10336J93511K9486
$$ 2389259 2321876 2257889 2424430 2698382 2573597 2670405 2936136 3246472 3439983 3469469
1802C469469M9567K80575q5080k78906k08383j15703l57009j02724k56539q1041
$$ 3469469 3519036 3799611 3714531 3435625 3227242 3111539 2754530 2651806 2395267 2314226
1792B314226P6600j43465j60057q1853n9368N6832j04073K04936J72184j44843
$$ 2314226 2390826 2247361 2087304 2005451 1946083 2002915 1898842 2103778 2275962 2131119
1782B131119j18128J45595J0730M6509K09085j18050J22524j08484l0032N2857
$$ 2131119 2012991 2158586 2169316 2215825 2424910 2306860 2429384 2320900 2290868 2343725
1772B343725j14275n2566J39770m1614r68p0758k63771j35213n0580j02740o2400
$$ 2343725 2229450 2176884 2316654 2275040 2274072 2203314 1939543 1804330 1753750 1651010 1588610
1761A588610M0347j48342j07299L4803j26430M9152J4857K0622j33646j50568
$$ 1588610 1628957 1480615 1373316 1408119 1281689 1330841 1345698 1366320 1232674 1082106
1751A082106Q9445n3053n0677j04012O7382n86k3896Q9099j04894m1962j28390
$$ 1082106 1171551 1118498 1067821 963809 1031191 1030605 1006709 1095808 990914 948952 820562
1740H20562J0925j33254j16215Q5267R7952M9189k20457j42972K8049K7418j305
$$ 820562 831487 698233 582018 667285 765237 814426 593969 450997 479046 506464 505159
1729E05159n1642k6047p9201m2398l8945K0330J8456M6482O3625n8693L1239Q5264
$$ 505159 453517 427470 348269 305871 266926 287256 305712 352194 415819 357126 388365 473629
1717D73629o5259j03889j58419J9905O1167l6561J82080o3443j0694j55789R1048
$$ 473629 408370 304481 146062 165967 227134 190573 372653 309210 298516 142727 233775
1706B33775K3920K0919P5209q3402j90930o0401n8798J36217j11000N6278L3603
$$ 233775 257695 278614 353823 270421 79491 19090 -39708 96509 -14491 41787 75390
1695G5390j6922R1496l4708J07947p2266K7696K8290j69619j3685J15247j28852
$$ 75390 58468 149964 115256 223203 150937 178633 206923 37304 23619 138866 10014
1684A0014R3162j66552R3783M9138J29804j09649j74268j2535l842n6251Q8998
$$ 10014 103176 -63376 30407 79545 209349 99700 -74568 -87103 -90945 -147196 -58198
1673e8198j50876J11725K9479J4980P6103N8437k0113m1701j2935j42568J49357
$$ -58198 -209074 -97349 -67870 -52890 23213 81650 61537 19836 6901 -135667 13690
1662A3690l3070p2390J9388j44919J13157J85125K9941j88310o7906J33284L3953
$$ 13690 -19380 -91770 -72382 -217301 -104144 80981 110922 -77388 -145294 -12010 21943
1651B1943r0257J00312R940J30549P704j51701k16322J9466J9243j2284J60881
$$ 21943 -68314 31998 41938 172487 180191 28490 -187832 -168366 -149123 -161407 -526
1640e26j55852q2987M9480J58097L1324n8265o3427l7061K6307K05106j02272
$$ -526 -156378 -239365 -189885 -31788 -464 -58729 -122156 -159217 -132910 72196 -30076
1629c0076n0761m5121P9344J2995k801j2994p747o7549q2839k6652J18915O9262
$$ -30076 -80837 -125958 -46614 -33619 -36420 -49414 -57161 -124710 -207549 -234201 -115286 -46024
1617d6024K6027m6464r1076Q1335M7383p4729J22317j0291k65261N5033L3979
$$ -46024 -19997 -66461 -157537 -76202 -28819 -103548 18769 8478 -256783 -201750 -167771
1606a67771q0523J151p403J71917k2111L1535p0617K2152K38639j96163R750j0038
$$ -167771 -248294 -247143 -254546 -82629 -104740 -73205 -143822 -121670 116969 -79194 -69444 -79482
1594g9482N8893k4950q7853O8545k99o3541r810N7192K9168J58940l2485j67317
$$ -79482 -20589 -45539 -133392 -64847 -65146 -128687 -138497 -81305 -52137 106803 74318 -92999
1582i2999l783j42679J5558K1602J15243K8018p7327k4057l4586P2080J0560L0589
$$ -92999 -96782 -239461 -223903 -202301 -87058 -59040 -136367 -160424 -195010 -122930 -112370 -81781
1570h1781O9523J49672J72222k60271q5694O9411k16991P468o3032Q8552j07703
$$ -81781 -12258 137414 309636 49365 -36329 33082 -183909 -176441 -239473 -150921 -258624
1559b58624p9234l176L08873J249p5439J65064j1462M4272J59458j42093l0044
$$ -258624 -337858 -341034 -32161 -30912 -106351 58713 47251 91523 250981 108888 78844
1548G8844p2676J5637j56083l347l3809l8665K0988O0383P9097N321j10013m8061
$$ 78844 6168 21805 -134278 -137625 -171434 -210099 -189111 -128728 -49631 -44310 -154323 -202384
1536b02384J00780J75975r4329r1369r8114j3678L2020q0012R9132l8187M9633
$$ -202384 -101604 74371 -19958 -111327 -209441 -223119 -191099 -271111 -171979 -210166 -160533
1525a60533J38370n8529O4021j1354j28849K6970m3824K44415O8823r8881j05567
$$ -160533 -22163 -80692 -16671 -28025 -156874 -129904 -173728 70687 139510 40629 -64938
1514f4938q0405j77291p4307L1006J62029o743j7319J24755n453k69303J68814
$$ -64938 -145343 -322634 -396941 -365935 -203906 -210649 -227968 -103213 -108666 -377969 -209155
1503b09155n6247K20243N2404O104Q0357p3801q8464j45730P0516m5345j16665
$$ -209155 -265402 -45159 7245 13349 93706 19905 -68559 -214289 -143773 -189118 -305783
1492c05783K27269q031K0721q9763m0315J139K27361M7905j94176j9319N452o7313
$$ -305783 -78514 -86545 -65824 -155587 -195902 -194763 32598 80503 -113673 -132992 -127540 -194853
1480a94853p2068K4587K06973j72668O9882N5721q510L30287m511j70384K746
$$ -194853 -266921 -242334 -35361 -208029 -138147 -82426 -90936 239351 234840 64456 67202
1469F7202J87980j51777K2143n0840j51010q1807o0364j06171O3836M8122J33176
$$ 67202 255182 103405 125548 74708 -76302 -158109 -218473 -324644 -260808 -212686 -79510
1458g9510l8656K1369P7052K4082L5758M5696P6588j37624j7452j00753l9864
$$ -79510 -118166 -96797 -19745 4337 40095 85791 162379 24755 7303 -93450 -133314
1447a33314Q6731j64757K4459q4317j916j09042J90463P8065j18251R7734L0307
$$ -133314 -46583 -211340 -186881 -271198 -273114 -382156 -191693 -113628 -231879 -134145 -103838
1436a03838J69088K3164j29752J38570j81873j74548R9050N9186Q2950r775r8408
$$ -103838 65250 88414 -41338 97232 -84641 -259189 -160139 -100953 -18003 -27778 -126186
1425a26186j45748L19662L8800o3243l8043j48758K24756r7038k8154P7170q0067
$$ -126186 -271934 47728 86528 23285 -14758 -163516 61240 -35798 -63952 13218 -66849
1414f6849R2131j20953L2293o5679J05671k9055m6128J3151n1636J74783J7265
$$ -66849 25282 -95671 -63378 -129057 -23386 -52441 -98569 -85418 -137054 37729 54994
1403E4994L4624L8580j48149K6546k1008L0099q588J4877J82876k41588P5956
$$ 54994 89618 128198 -19951 6595 -14413 15686 7098 21975 204851 -36737 39219
1392C9219j19151J22731M200l7712J03829j67611J12062P0381q3117O0635p0515
$$ 39219 -79932 42799 46999 9287 113116 -54495 57567 127948 44831 105466 34951
1381C4951J7248j54572N3920J00841k6288n5101K744j0943q9017O5392O9258j12949
$$ 34951 52199 -102373 -48453 52388 26100 -29001 -26257 -37200 -126217 -60825 8433 -104516
1369a04516P4434Q003O0943J6692j91551J18056N747O8089j03687q0622j1408
$$ -104516 -30082 -22079 38864 55556 -135995 -17939 -12192 55897 -47790 -128412 -139820
1358a39820o7253R6796m1303M4626N4210j31179J96436j19314O0554q1553j3071
$$ -139820 -207073 -110277 -151580 -106954 -52744 -183923 12513 -106801 -46247 -127800 -140871
1347a40871O570M7637J11004n0950q0448L9106q6447M2263p401J48109J25274
$$ -140871 -134301 -86664 24340 -26610 -107058 -67952 -154399 -112136 -119537 28572 153846
1336A53846L9850K779o1078j34444j47924o5083K10691J92468j78734p3766P0651
$$ 153846 193696 196475 135397 953 -146971 -212054 -1363 191105 12371 -61395 9256
1325I256j13670O0125j0714R2995P7715k5986j67585P8519J68082j07146k532
$$ 9256 -104414 -44289 -55003 37992 115707 89721 -77864 655 168737 61591 59059
1314E9059j41211n256l4262K01195k66012P2519J7063l2612q6367O3554K06652
$$ 59059 -82152 -87408 -121670 79525 -186487 -113968 -96905 -129517 -215884 -152330 54322
1303E4322m8826j91568M9145J01569K9864R790N9896O5936o9722l29456J17330
$$ 54322 5496 -186072 -136927 -35358 -5494 4296 64192 130128 60406 -269050 -151720
1292a51720J60254m513j16404K06516q4361o9529j7007j50390J38129J59900j82674
$$ -151720 8534 4021 -112383 94133 9772 -59757 -76764 -227154 -89025 70875 -111799
1281a11799J4429O555p1709J41001P732r7608R5141j33431j02369J76246j12129
$$ -111799 -97370 -90815 -162524 -21523 -13791 -111399 -16258 -149689 -252058 -75812 -187941
1270a87941k4716n6213P9916J71671R5569j13372r879J54512J0953n2453j09245
$$ -187941 -212657 -268870 -188954 -17283 78286 -35086 -44965 109547 120500 68047 -41198
1259d1198j3799K66772j49678J34633o3541o9518J832k74N0994J5445j06532N1367
$$ -41198 -54997 211775 62097 196730 133189 63671 65503 65229 116223 131668 25136 76503
1247G6503K3480J02067m5682K98679K3818j33769M6493n2453K34185n1790o7093
$$ 76503 99983 202050 156368 455047 478865 345096 391589 339136 573321 521531 454438
1236D54438J58114l2778L2594j81411m4897l527Q8000k13687j02411J51657r3553
$$ 454438 612552 579774 612368 430957 386060 382533 470533 256846 154435 306092 212539
1225B12539N9282j35147j58277j00411L9847J50908P2830q2810j04285k5295K2279
$$ 212539 271821 136674 -21603 -122014 -82167 68741 141571 58761 -45524 -70819 -48540
1214d8540j41545Q8880L1147J37244J31235j83482Q6262n7695J01133J81045k72103
$$ -48540 -190085 -101205 -70058 67186 198421 14939 101201 43506 144639 325684 53581
1203E3581o5538k0291J02383l8917q586M3692J6629K2747p5K4285P9761k7578
$$ 53581 -11957 -32248 70135 31218 22632 66324 82953 105700 105625 129910 209671 182093
1191A82093N0298j72742m5232J53922j57879q8376O5310J5995K5622J67885J5450
$$ 182093 232391 59649 14417 168339 10460 -77916 -12606 3389 29011 196896 212346
1180B12346J0182k0363q2232o2473j1705p091J20489Q4415l7629j50868q8378
$$ 212346 222528 202165 119933 57460 45755 38664 159153 243568 205939 55071 -33307
1169c3307P4476J40149j07006J76400P2885Q7203j03189k58129N9180P4550r0004
$$ -33307 41169 181318 74312 250712 323597 410800 307611 49482 108662 183212 93208
1158I3208q7750N167N3087J88228L6439m8861J68191j69907j33704Q0747n9362
$$ 93208 5458 10625 63712 251940 288379 239518 407709 237802 104098 184845 125483
1147A25483P1602J7550K4433L5462R7776R661k08782M7454L8776j73186J9008
$$ 125483 197085 214635 239068 274530 372306 381967 173185 220639 259415 86229 105237
1136A05237Q4379J15384j41524J89073M1098j66994N6597O4455n6455k73173k7284
$$ 105237 189616 305000 163476 352549 393647 226653 283250 347705 291250 18077 -9207
1125i207R9891m8707J44996R3523J11819k20517K85100m6297r7474N7750j72263
$$ -9207 90684 41977 186973 280496 392315 171798 456898 410601 313127 370877 198614
1114A98614o2506Q2440k9608j2384J10057R6934p9957k5259R2228N4902Q7400
$$ 198614 136108 218548 188940 176556 286613 383547 303590 278331 370559 425461 512861
1103E12861k35891O8069N2161J13726j06328j4096J28983j34756j00632J41818
$$ 512861 276970 345039 397200 510926 404598 390502 519485 384729 284097 425915
1093D25915J88308P634j21895J22412K6281o11J64841q9458q4024n7902k2176
$$ 425915 614223 621857 499962 622374 648655 648044 812885 723427 639403 581501 559325
1082E59325k1006K13836O2802n5201N5934J5738m2012J19685M2466n7579J7959
$$ 559325 538319 752155 814957 759756 815690 831428 789416 909101 951567 893988 911947
1071I11947r0481o4010j2217k9103J12962L8556n5173r0146k575P8163J61007
$$ 911947 821466 757456 745239 716136 829098 867654 812481 722335 719760 797923 958930
1060I58930J61598k5277q0156O0288K6200q608P2746l8965n3419R250J7685L3289
$$ 958930 1120528 1095251 1015095 1075383 1101583 1092975 1165721 1126756 1073337 1082587 1100272 1133561
1048A133561J96553J59931l5720L5312P4352P5801n856J68005K8905J15433M9370
$$ 1133561 1330114 1490045 1454325 1489637 1563989 1639790 1633934 1801939 1830844 1946277 1995647
1037A995647L1001P087O5915J19689O0446q992k360L6475j67542K5627J2339O5679
$$ 1995647 2026648 2033735 2099650 2219339 2279785 2270793 2268433 2304908 2137366 2162993 2175332 2241011
1025B241011M2357l5041Q5752J45096k7275M103L566j6132j32618J27600j11973
$$ 2241011 2283368 2248327 2334079 2479175 2451900 2456003 2459569 2443437 2310819 2438419 2326446
1014B326446K61397K03295o4500J48159Q4315J8290k0693N3629M3640L18341K08007
$$ 2326446 2587843 2791138 2726638 2874797 2959112 2977402 2956709 3010338 3053978 3372319 3580326
1003C580326Q5188K8013j21351J68322J20733K32150P5683M28033R8338j8711
$$ 3580326 3665514 3693527 3572176 3740498 3861231 4093381 4169064 4597097 4695435 4676724
993D676724R4734J72392K95848K06893N6000M50587J29673L39170K75033K73932
$$ 4676724 4771458 4943850 5239698 5446591 5502591 5953178 6082851 6422021 6697054 6970986
983F970986L89340M24486L68079O97543M18143O47817M21816O89965N65186P99296
$$ 6970986 7360326 7784812 8152891 8850434 9268577 9916394 10338210 11028175 11593361 12392657
973A2392657P42162J071397J144337J411720J390281P27379P08806J140512J564535
$$ 12392657 13134819 14206216 15350553 16762273 18152554 18879933 19588739 20729251 22293786
964B2293786J985913K556460L321178L767762M651476N535254P368831R336403
$$ 22293786 24279699 26836159 30157337 33925099 38576575 44111829 51480660 60817063
956F0817063J2279089J5757522K0991662J4551996j3987944k4763305k0187996
$$ 60817063 73096152 88853674 109845336 124397332 110409388 85646083 65458087
949F5458087j2777910q348404o368860n564183m887811l617027k703041k124506
$$ 65458087 52680177 44331773 37962913 32398730 27510919 23893892 21190851 19066345
941A9066345j439465j253970j263097o34715o62793j180746j324971r78515q95347
$$ 19066345 17626880 16372910 15109813 14475098 13812305 12631559 11306588 10328073 9432726
932I432726o59598p22158n90377m50520l82173m17052k97825l59662k71563k65139
$$ 9432726 8773128 8050970 7460593 7010073 6627900 6210848 5913023 5553361 5281798 5016659
922E016659j07570k75540k08703j66735k01009r5193q4147r2463j38171j25304
$$ 5016659 4909089 4633549 4424846 4258111 4057102 3961909 3877762 3785299 3647128 3521824
912C521824q3688j88926j7316n9219j82451k52185j32083k72892o4258K5450N9609
$$ 3521824 3438136 3249210 3231894 3172675 2990224 2738039 2605956 2333064 2268806 2294256 2353865
$$ [...]
##END NTUPLES=NMR SPECTRUM
##END=
