##TITLE=1H_CG-1049-A1
 CDCl3, 8 sc, 
 19.11.2020
##JCAMPDX= 6.0         $$ Bruker NMR JCAMP-DX V2.0
##DATA TYPE= NMR SPECTRUM
##DATA CLASS= NTUPLES
##ORIGIN= UXNMR, Bruker Analytische Messtechnik GmbH
##OWNER= root
$$ XWIN-NMR		Version 3.5
$$ Thu Nov 19 10:48:02 2020 Russian Standard Time (UT+4h)  she@DPX200
##.OBSERVE FREQUENCY= 200.1315066352
##.OBSERVE NUCLEUS= ^1H
##.ACQUISITION MODE= SIMULTANEOUS
##.ACQUISITION SCHEME= undefined
##.AVERAGES= 8
##.DIGITISER RES= 18
##SPECTROMETER/DATA SYSTEM= spect
##.PULSE SEQUENCE= zg30
##.SOLVENT NAME= CDCl3
##.SHIFT REFERENCE= (INTERNAL, CDCl3, 0, 15.9823)
##AUDIT TRAIL= $$ (NUMBER, WHEN, WHO, WHERE, WHAT)
$$ ##TITLE= Audit trail, XWIN-NMR		Version 3.5
$$ ##JCAMPDX= 5.01
$$ ##ORIGIN= Bruker BioSpin GmbH
$$ ##OWNER= she
$$ F:/spectra/data/she/nmr/H-F/1/pdata/1/auditp.txt
$$ ##AUDIT TRAIL=  $$ (NUMBER, WHEN, WHO, WHERE, WHAT)
(   1,<2020-11-19 10:46:47.43 +0400>,<she>,<DPX200>,
      <created by zg, POWCHK disabled, PULCHK disabled
       configuration hash MD5:
       00 E9 B6 7A A2 85 ED C7 34 08 36 98 17 FE 4E 26
       data hash MD5: 16K
       CB 30 A5 0D 7A F2 43 BD C4 BA 13 FF 50 30 38 17>)
(   2,<2020-11-19 10:46:51.56 +0400>,<she>,<DPX200>,
      <Start of raw data processing
       efp BC_mod = 2 LB = 0.24 FT_mod = 6 PKNL = 1 PHC0 = -11049.88 PHC1 = 15.2009 SI = 16K 
       data hash MD5: 16K
       9C AC B8 28 E2 77 50 C3 14 0D 09 30 7F 5A 22 F1>)
(   3,<2020-11-19 10:47:13.25 +0400>,<she>,<DPX200>,
      <pk PHC0 = 0.8296123 PHC1 = -3.600001 
       data hash MD5: 16K
       70 F0 07 3F DE 81 55 DB 71 A6 C0 42 15 4C A3 62>)
(   4,<2020-11-19 10:47:16.46 +0400>,<she>,<DPX200>,
      <abs ABSG = 5 
       data hash MD5: 16K
       38 65 E9 D1 54 69 38 94 BB 44 24 1C CD 97 F0 D5>)
$$ ##END=
$$ 
$$ hash MD5
$$ B3 C0 36 3C 98 1A 2C DC 26 EB 6D A1 9C 83 07 18
##$RELAX= 
##$RELAX= 
##$RELAX= 
##$RELAX= 
##$RELAX= 
##$RELAX= 
$$ Bruker specific parameters
$$ --------------------------
##$DU= <F:/spectra>
##$EXPNO= 1
##$NAME= <H-F>
##$PROCNO= 1
##$TYPE= <nmr>
##$USER= <she>
##$AMP= (0..31)
100 100 100 100 100 100 100 100 100 100 100 100 100 100 100 100 100 100 
100 100 100 100 100 100 100 100 100 100 100 100 100 100 
##$AQSEQ= 0
##$AQ_mod= 1
##$AUNM= <au_zg>
##$AUTOPOS= <>
##$BF1= 200.13
##$BF2= 200.13
##$BF3= 200.13
##$BF4= 200.13
##$BF5= 200.13
##$BF6= 200.13
##$BF7= 200.13
##$BF8= 200.13
##$BYTORDA= 1
##$CFDGTYP= 0
##$CFRGTYP= 5
##$CHEMSTR= <none>
##$CNST= (0..31)
1 1 145 1 1 1 1 1 1 1 1 1 1 1 1 1 1 1 1 1 1 1 1 1 1 1 1 1 1 1 1 1 
##$CPDPRG= <>
##$CPDPRG1= <>
##$CPDPRG2= <>
##$CPDPRG3= <>
##$CPDPRG4= <mlev>
##$CPDPRG5= <mlev>
##$CPDPRG6= <mlev>
##$CPDPRG7= <mlev>
##$CPDPRG8= <mlev>
##$CPDPRGB= <>
##$CPDPRGT= <>
##$D= (0..31)
0 1.2 0 0 0 0 0 0 0 0.06 0 0.03 0 0 0 0 0.0002 0 0 0 0 0 0 0 0 0 0 0 0 
0 0 0 
##$DATE= 1605768406
##$DBL= (0..7)
120 120 120 120 120 120 120 120 
##$DBP= (0..7)
150 150 150 150 150 150 150 150 
##$DBP07= 0
##$DBPNAM0= <>
##$DBPNAM1= <>
##$DBPNAM2= <>
##$DBPNAM3= <>
##$DBPNAM4= <>
$$ [...]
##$SUBNAM3= <"">
##$SUBNAM4= <"">
##$SUBNAM5= <"">
##$SUBNAM6= <"">
##$SUBNAM7= <"">
##$SUBNAM8= <"">
##$SUBNAM9= <"">
##$SW= 16.9725356469052
##$SWIBOX= (0..15)
0 0 2 0 0 0 0 0 0 0 0 0 0 0 0 0 
##$SW_h= 3396.73913043478
##$TD= 16384
##$TD0= 1
##$TE= 0
##$TE2= 300
##$TE3= 300
##$TEG= 300
##$TL= (0..7)
0 120 120 120 120 120 120 120 
##$TP= (0..7)
150 150 150 150 150 150 150 150 
##$TP07= 0
##$TPNAME0= <>
##$TPNAME1= <>
##$TPNAME2= <>
##$TPNAME3= <>
##$TPNAME4= <>
##$TPNAME5= <>
##$TPNAME6= <>
##$TPNAME7= <>
##$TPOAL= (0..7)
0.5 0.5 0.5 0.5 0.5 0.5 0.5 0.5 
##$TPOFFS= (0..7)
0 0 0 0 0 0 0 0 
##$TUNHIN= 0
##$TUNHOUT= 0
##$TUNXOUT= 0
##$USERA1= <user>
##$USERA2= <user>
##$USERA3= <user>
##$USERA4= <user>
##$USERA5= <user>
##$V9= 5
##$VALIST= <valist>
##$VCLIST= <CCCCCCCCCCCCCCC>
##$VD= 0
##$VDLIST= <DDDDDDDDDDDDDDD>
##$VPLIST= <PPPPPPPPPPPPPPP>
##$VTLIST= <TTTTTTTTTTTTTTT>
##$WBST= 1024
##$WBSW= 4
##$XGAIN= (0..3)
0 0 0 0 
##$XL= 0
##$YL= 0
##$YMAX_a= 577967
##$YMIN_a= -460013
##$ZGOPTNS= <>
##$ZL1= 120
##$ZL2= 120
##$ZL3= 120
##$ZL4= 120
##$ABSF1= 15.97506
##$ABSF2= -0.9976015
##$ABSG= 5
##$ABSL= 3
##$ALPHA= 0
##$AQORDER= 0
##$ASSFAC= 0
##$ASSFACI= 0
##$ASSFACX= 0
##$ASSWID= 0
##$AUNMP= <proc_1d>
##$AZFE= 0.1
##$AZFW= 0.1
##$BCFW= 0
##$BC_mod= 2
##$BYTORDP= 0
##$COROFFS= 0
##$CY= -3
##$DATMOD= 1
##$DC= 0
##$DFILT= <>
##$DTYPP= 0
##$F1P= 0
##$F2P= 0
##$FCOR= 1
##$FTSIZE= 16384
##$FT_mod= 6
##$GAMMA= 0
##$GB= 0
##$INTBC= 1
##$INTSCL= 1.245715e-10
##$ISEN= 128
##$LB= 0.24
##$LEV0= 0
##$LPBIN= 0
##$MAXI= 10000
##$MC2= 0
##$MEAN= 0
##$ME_mod= 0
##$MI= 1.114404
##$NCOEF= 0
##$NC_proc= -6
##$NLEV= 6
##$NOISF1= 3.799351
##$NOISF2= 2.8
##$NSP= 0
##$NTH_PI= 0
##$NZP= 0
##$OFFSET= 15.98232
##$PC= 1
##$PHC0= -11049.05
##$PHC1= 11.6009
##$PH_mod= 1
##$PKNL= yes
##$PPARMOD= 0
##$PSCAL= 0
##$PSIGN= 0
##$REVERSE= no
##$SF= 200.130006463629
##$SI= 16384
##$SIGF1= 3
##$SIGF2= 2
##$SINO= 5.538805
##$SIOLD= 16384
##$SREGLST= <1H.CDCl3>
##$SSB= 0
##$STSI= 16384
##$STSR= 0
##$SW_p= 3396.73913043478
##$SYMM= 0
##$S_DEV= 0
##$TDeff= 16384
##$TDoff= 0
##$TI= <>
##$TILT= no
##$TM1= 0
##$TM2= 0
##$TOPLEV= 0
##$USERP1= <user>
##$USERP2= <user>
##$USERP3= <user>
##$USERP4= <user>
##$USERP5= <user>
##$WDW= 1
##$XDIM= 16384
##$YMAX_p= 460769347
##$YMIN_p= -411780
$$ End of Bruker specific parameters
$$ ---------------------------------
##NTUPLES= NMR SPECTRUM
##VAR_NAME=  FREQUENCY,     SPECTRUM/REAL,   SPECTRUM/IMAG
##SYMBOL=    X,             R,               I
##VAR_TYPE=  INDEPENDENT,   DEPENDENT,       DEPENDENT
##VAR_FORM=  AFFN,          ASDF,            ASDF
##VAR_DIM=   16384,         16384,           16384
##UNITS=     HZ,            ARBITRARY UNITS, ARBITRARY UNITS
##FACTOR=    0.207333158178281, 1,           1
##FIRST=     3198.54177125156, 0,            0
##LAST=      -198.197359183225, 0,           0
##MIN=       -198.197359183225, -411780,     0
##MAX=       3198.54177125156, 460769347,    0
$$ Real data points
##PAGE= N=1
##DATA TABLE= (X++(R..R)), XYDATA
$$ [...]
$$ plain form
6230 1815551 2047437 1909285 1599871 1648949 1674620 1628969 1607807 1651723 1794331 1909417
6220 1909417 1834562 1792533 1682957 1688017 1823242 1913060 1877645 1815183 1859789 1803168 1930674
6209 1930674 2013557 2023890 2056050 2015790 1963230 2044340 2003919 1972463 1759023 1796372 1835674
6198 1835674 2022429 2015601 1885599 2043828 2121284 2078009 2169157 2342127 2270696 2140941 2198160
6187 2198160 2289216 2195097 2310403 2312730 2335571 2432957 2407610 2513080 2618641 2629527 2730126
6176 2730126 2638104 2735877 2763898 2781386 2868850 2824593 3036257 3085715 3001569 3065133 3078985
6165 3078985 3002250 3172343 3260605 3199921 3071307 3017400 3109937 3255218 3368693 3489343
6155 3489343 3441847 3504562 3528531 3714493 3763339 3673986 3594162 3488992 3475468 3493181 3410092
$$ packed form
6230A815551K31886j38152l09414M9078K5671m5651k1162M3916J42608J15086
6220A909417p4855m2029j09576N060J35225Q9818l5415o2462M4606n6621J27506
6209A930674Q2883J0333L2160m0260n2560Q1110m0421l1456k13440L7349L9302
6198A835674J86755o828j30002J58229P7456m3275R1148J72970p1431j29755N7219
6187B198160R1056r4119J15306K327K2841R7386k5347J05470J05561J0886J00599
6176B730126r2022R7773K8021J7488Q7464m4257K11664M9458q4146O3564J3852
6165C078985p6735J70093Q8262o0684j28614n3907R2537J45281J13475J20650
6155C489343m7496O2715K3969J85962M8846q9353p9824j05170j3524J7713q3089
$$ plain form
6144 3410092 3469262 3532281 3659663 3700139 3447120 3382691 3555120 3605603 3585103 3707148 3538369
6133 3538369 3607081 3632207 3722273 3936038 3842643 3743547 3842557 3958043 3911720 4014614 4112640
6122 4112640 4125757 3957309 3939834 3831097 3845261 3714141 3656316 3647185 3506573 3373218 3234715
6111 3234715 3180927 3151194 3164583 3051187 2826894 2751934 2844294 2668672 2730229 2745829 2561801
6100 2561801 2504760 2557871 2479188 2626856 2684092 2445304 2254854 2293735 2236305 2382183 2351509
6089 2351509 2404192 2304884 2297161 2195657 2301018 2445164 2463853 2508766 2501933 2472013 2410424
6078 2410424 2387810 2525142 2617658 2567230 2691650 2864205 2909948 2965279 3039769 2994320 2706866
6067 2706866 2801271 2772016 2758325 2816004 2833210 2729481 2625206 2632729 2851886 3188955 3255185
$$ packed form
6144C410092N9170O3019J27382M0476k53019o4429J72429N0483k0500J22045j68779
6133C538369O8712K5126R0066K13765r3395r9096R9010J15486m6323J02894R8026
6122D112640J3117j68448j7475j08737J4164j31120n7825r131j40612j33355j38503
6111C234715n3788k9733J3389j13396k24293p4960R2360j75622O1557J5600j84028
6100B561801n7041N3111p8683J47668N7236k38788j90450L8881n7430J45878l0674
6089B351509N2683r9308p723j01504J05361J44146J8689M4913o833k9920o1589
6078B410424k2614J37332R2516n0428J24420J72555M5743N5331P4490m5449k87454
6067B706866R4405k9255j3691N7679J7206j03729j04275P523K19157L37069O6230
$$ plain form
6056 3255185 3130553 3074624 3147635 3236265 3412100 3360731 3370018 3384405 3261035 3356507 3525415
6045 3525415 3526319 3623493 3753544 3683877 3631311 3675502 3582603 3720142 3830676 3961195 3864856
6034 3864856 3991779 4052284 4117528 4209005 4419595 4541864 4732359 4590613 4755450 5092277
6024 5092277 5187471 5429937 5631774 5804920 6098911 6470365 6699266 6818874 6851154 7020207
6014 7020207 7126765 7246792 7336229 7454116 7544175 7333948 7254474 7180610 7095128 7154216 7166953
6003 7166953 7004067 6633447 6489750 6575019 6385386 6317798 5954812 5726969 5540293 5343836
5993 5343836 5329483 5330626 5062245 4947162 4812611 4691886 4701486 4808636 4945725 5055880
5983 5055880 5088220 4912808 4875882 5104449 5206879 5418098 5546220 5673944 5925803 5905401
$$ packed form
6056C255185j24632n5929P3011Q8630J75835n1369R287J4387j23370R5472J68908
6045C525415R04R7174J30051o9667n2566M4191r2899J37539J10534J30519r6339
6034C864856J26923O0505O5244R1477K10590J22269J90495j41746J64837L36827
6024E092277R5194K42466K01837J73146K93991L71454K28901J19608L2280J69053
6014G020207J06558J20027Q9437J17887R0059k10227p9474p3864q5482N9088J2737
6003G166953j62886l70620j43697Q5269j89633o7588l62986k27843j86676j96457
5993E343836j4353J143k68381j15083j34551j20725R600J07150J37089J10155
5983E055880L2340j75412l6926K28567J02430K11219J28122J27724K51859k0402
$$ plain form
5973 5905401 6017018 6251571 6381565 6481712 6676099 6761343 6831528 7035723 6940984 6871469
5963 6871469 7067831 7151722 7072520 7090720 7140514 7225250 7277125 7163072 7290426 7235023 7183407
5952 7183407 7175289 7299139 7266337 7250610 7413569 7499641 7511276 7672386 7741612 7738447 7839914
5941 7839914 8167664 8335034 8778304 8893280 9001795 9337752 9427411 9677919 10180786 10285232
5931 10285232 10521944 10656040 10707452 10961156 11163427 11144572 11247142 11139548 11290738 11353754
5921 11353754 11336797 11418061 11296010 10961775 10584596 10311843 10007426 9703667 9428294 9220889
5911 9220889 8941536 8653403 8324360 8147205 7926235 7841686 7603444 7326306 7234441 7177577
5901 7177577 7140127 7060204 6821635 6785695 6743390 6706815 6664677 6660193 6583419 6477492 6511254
$$ packed form
5973E905401J11617K34553J29994J00147J94387Q5244P0185K04195r4739o9515
5963F871469J96362Q3891p9202J8200M9794Q4736N1875j14053J27354n5403n1616
5952G183407q118J23850l2802j5727J62959Q6072J1635J61110O9226l165J01467
5941G839914L27750J67370M43270J14976J08515L35957Q9659K50508N02867J04446
5931A0285232K36712J34096N1412K53704K02271j8855J02570j07594J51190O3016
5921A1353754j6957Q1264j22051l34235l77179k72753l04417l03759k75373k07405
5911I220889k79353k88133l29043j77155k20970q4549k38242k77138r1865n6864
5901G177577l7450p9923k38569l5940m2305l6575m2138m484p6774j05927L3762
$$ plain form
5890 6511254 6317608 6347953 6378501 6640536 6698318 6525731 6621481 6566142 6652217 6659508 6669084
5879 6669084 6630831 6505684 6486652 6369034 6476474 6560554 6487447 6438315 6224583 6305804 6086751
5868 6086751 6068921 6172237 5954510 5868101 5742120 5628238 5625176 5584185 5444866 5404359 5277631
5857 5277631 5082282 4970101 4885390 4897762 4812379 4710665 4649779 4507079 4446073 4387891 4178663
5846 4178663 4105964 3987281 3958679 3852495 3811526 3776603 3784147 3717774 3639089 3500264 3592959
5835 3592959 3629765 3590291 3478423 3370913 3362323 3240362 3226431 3214651 3249407 3161170 3027684
5824 3027684 3033249 3065939 3066896 3164566 3240106 3199382 3175227 3105859 2998755 2992822 2904818 2812931
5812 2812931 2703338 2658453 2598114 2612351 2658848 2646343 2723691 2652824 2560788 2540064 2644945
$$ packed form
5890F511254j93646L0345L0548K62035N7782j72587R5750n5339Q6075P291R576
5879F669084l8253j25147j9032j17618J07440Q4080p3107m9132k13732Q1221k19053
5868F086751j7830J03316k17727q6409j25981j13882l062m0991j39319m0507j26728
5857E277631j95349j12181q4711J2372q5383j01714o0886j42700o1006n8182k09228
5846D178663p2699j18683k8602j06184m0969l4923P544o6373p8685j38825R2695
5835C592959L6806l9474j11868j07510q590j21961j3931j1780L4756q8237j33486
5824C027684N565L2690R57R7670P5540m0724k4155o9368j07104n933q8004r1887
5812B812931j09593m4885o0339J4237M6497j2505P7348p0867r2036k0724J04881
$$ plain form
5801 2644945 2724703 2659630 2746234 2820145 2673600 2612498 2596149 2519490 2501468 2492705 2409148
5790 2409148 2422537 2460474 2710136 2675188 2601964 2630541 2725493 2778235 2697623 2515623 2643748
5779 2643748 2792465 2714985 2701403 2729632 2770132 2653739 2698129 2654387 2555761 2437012 2443933
5768 2443933 2339589 2410901 2286585 2198864 2165112 2149004 2183879 2152777 2124874 2144081 2099088
5757 2099088 2207717 2159393 2100416 2188374 2165568 2038892 2113916 2058557 2076403 2089096 2009639
5746 2009639 2008171 1982766 1986960 1816404 1829103 1917379 1930020 1985046 2123904 2101165 1900582
5735 1900582 1819407 1923324 1844809 1833512 1857502 1784794 1944758 2000162 1989070 2065070 1913174
5724 1913174 1866467 1835417 1765005 1914767 1832609 1811117 1817183 1835039 1920508 1826138 1867937
$$ packed form
5801B644945P9758o5073Q6604P3911j46545o1102j6349p6659j8022q763q3557
5790B409148J3389L7937K49662l4948p3224K8577R4952N2742q0612j82000J28125
5779B643748J48717p7480j3582K8229M0500j16393M4390m3742r8626j18749O921
5768B443933j04344P1312j24316q7721l3752j6108L4875l1102k7903J9207m4993
5757B099088J08629m8324n8977Q7958k2806j26676P5024n5359J7846J2693p9457
5746B009639j468k5405M194j70556J2699Q8276J2641N5026J38858k2739k00583
5735A900582q1175J03917p8515j1297K3990p2708J59964N5404j1092P6000j51896
5724A913174m6707l1050p0412J49762q2158k1492O066J7856Q5469r4370M1799
$$ plain form
5713 1867937 1900944 1755056 1775893 1734493 1661627 1732904 1755316 1657449 1680973 1690419 1705618
5702 1705618 1824365 1823985 1883188 1723505 1654614 1634998 1501632 1512912 1577636 1690742 1762497
5691 1762497 1790691 1941660 1801921 1798514 1760749 1753447 1839844 1935331 1893670 1827059 1763062
5680 1763062 1861309 1962497 1974841 2083212 2084476 1980981 1963067 1963303 1884212 1854207 1783042
5669 1783042 1968132 1941230 2096697 1977051 1918293 1908694 1844837 2050021 2125058 2267400 2302167
5658 2302167 2080985 2064070 2153512 2077873 2174234 2379792 2346334 2167925 2277083 2297592 2350404
5647 2350404 2459026 2461865 2214280 2171376 2439901 2456553 2366463 2400838 2466627 2258813 2179295
5636 2179295 2189056 2140716 2189081 2109969 2006151 2143193 2102991 2000560 1894994 1993557 2005440
$$ packed form
5713A867937L3007j45888K0837m1400p2866P1277K2412r7867K3524R446J5199
5702A705618J18747l80N9203j59683o8891j9616j33366J1280O4724J13106P1755
5691A762497K8194J50969j39739l407l7765p302Q6397R5487m1661o6611o3997
5680A763062R8247J01188J2344J08371J264j03495j7914K36p9091l0005p1165
5669A783042J85090k6902J55467j19646n8758r599o3857K05184P5037J42342L4767
5658B302167k21182j6915Q9442p5639R6361K05558l3458j78409J09158K0509N2812
5647B350404J08622K839k47585m2904K68525J6652r0090L4375O5789k07814p9518
5636B179295R761m8340M8365p9112j03818J37042m0202j02431j05566R8563J1883
$$ plain form
5625 2005440 2044717 1965260 1996716 2172864 2126404 2085843 2142479 2199048 2150049 2230426 2343555
5614 2343555 2302860 2105056 2281876 2275077 2454785 2608298 2437570 2414790 2360673 2487877
5604 2487877 2773785 2814332 2814108 2696305 2592954 2584445 2568436 2395111 2348793 2450888 2464126
5593 2464126 2598574 2721708 2703561 2502538 2412148 2573651 2603717 2622368 2609977 2682802 2739283
5582 2739283 2820230 2857268 2753818 2938383 3084986 3046917 2962712 3076116 3189570 3153693
5572 3153693 3142751 3174235 3191195 3134935 3220436 3246077 3283122 3264905 3179627 3126357 3206081
5561 3206081 3243057 3323144 3234897 2959935 3043443 3037616 3010296 2991400 2926033 2861710 2850358
5550 2850358 2894602 2936591 3123190 3104103 3109210 3219515 3196691 3141783 3117338 3154461 3204578
$$ packed form
5625B005440L9277p9457L1456J76148m6460m0561N6636N6569m8999Q0377J13129
5614B343555m0695j97804J76820o799J79708J53513j70728k2780n4117J27204
5604B487877K85908M0547k24j17803j03351q509j6009j73325m6318J02095J3238
5593B464126J34448J23134j8147k01023r0390J61503L0066J8651j2391P2825N6481
5582B739283Q0947L7038j03450J84565J46603l8069q4205J13404J13454l5877
5572C153693j0942L1484J6960n6260Q5501K5641L7045j8217q5278n3270P9724
5561C206081L6976Q0087q8247k74962Q3508n827k7320j8896o5367o4323j1352
5550B850358M4244M1989J86599j9087N107J10305k2824n4908k4445L7123N0117
$$ plain form
5539 3204578 3271227 3275335 3148171 3153998 3136010 3142582 3236228 3284468 3246572 3205530 3089391 3141780
5527 3141780 3287984 3244212 3311456 3404390 3384857 3187017 3298437 3320457 3295072 3378795 3564181
5516 3564181 3577128 3360510 3436491 3485868 3577179 3606762 3644398 3817716 3732796 3753322 3756211
5505 3756211 3816667 3993627 4112264 4098883 3991814 4038428 4084245 4162029 4278265 4217761 4209361
5494 4209361 4065405 4299518 4500762 4601039 4554126 4508794 4645651 4771813 4841068 4961903
5484 4961903 4894371 4791065 4945616 4951209 5083361 5172346 5154378 5169870 5359167 5382986 5383444
5473 5383444 5539971 5652772 5720775 5932614 6012134 6193726 6404477 6535956 6834099 7192591
5463 7192591 7358213 7654351 7997923 8381824 9014079 9449394 9961985 10525335 11054324 11561094
$$ packed form
5539C204578O6649M108j27164N827j7988O572R3646M8240l7896m1042j16139N2389
5527C141780J46204m3772O7244R2934j9533j97840J11420K2020k5385Q3723J85386
5516C564181J2947k16618P5981M9377R1311K9583L7636J73318q4920K0526K889
5505C756211O0456J76960J18637j3381j07069M6614M5817P7784J16236o0504q400
5494D209361j43956K34113K01244J00277m6913m5332J36857J26162O9255J20835
5484D961903o7532j03306J54551N593J32152Q8985j7968J5492J89297K3819M58
5473E383444J56527J12801O8003K11839P9520J81592K10751J31479K98143L58492
5463G192591J65622K96138L43572L83901O32255M35315N12591N63350N28989N06770
$$ plain form
5453 11561094 12359332 13012987 13814029 14574798 15334259 16092560 16502409 16355316 15942749
5444 15942749 15485309 14984006 14751132 14395126 14083462 13843306 13919914 13915658 13890242 14204695
5434 14204695 14620737 14918348 15393538 15453386 15133986 14621562 13674865 12959987 12224178 11300283
5424 11300283 10431437 9716460 9082289 8737987 8348006 7912917 7632392 7167011 6901518
5415 6901518 6707601 6577449 6503200 6378826 6297909 6204495 6001207 5983481 5849665 5894076
5405 5894076 5797446 5660829 5717874 5652799 5686187 5759718 5679898 5489784 5388830 5267701 5153874
5394 5153874 5030162 5161554 5205427 5077965 4852973 4793929 4762038 4695900 4857552 4813700
5384 4813700 4808180 4718106 4803614 4746708 4712905 4740535 4536827 4523721 4543887 4443909 4416798
$$ packed form
5453A1561094P98238O53655Q01042P60769P59461P58301M09849j47093m12567
5444A5942749m57440n01303k32874l56006l11664k40156P6608m256k5416L14453
5434A4204695M16042K97611M75190N9848l19400n12424r46697p14878p35809r23895
5424A1300283q68846p14977o34171l44302l89981m35089k80525m65381k65493
5415F901518j93917j30152p4249j24374q0917r3414k03288j7726j33816M4411
5405E894076r6630j36617N7045o5075L3388P3531p9820j90114j00954j21129j13827
5394E153874j23712J31392M3873j27462k24992n9044l1891o6138J61652m3852
5384D813700n520r0074Q5508n6906l3803K7630k03708j3106K0166r9978k7111
$$ plain form
5373 4416798 4273469 4072147 3965316 3945869 4016032 4084921 4051316 4079159 4027451 3859347 3778112
5362 3778112 3821882 3877628 3760071 3782514 3953766 3886357 3874910 3966256 3788186 3753327 3724797
5351 3724797 3724237 3735972 3701308 3782608 3842780 3863100 3643445 3665668 3542939 3552065 3801818
5340 3801818 3720232 3617241 3602978 3672835 3794444 3844719 3753352 3764499 3785009 3814264 3730904
5329 3730904 3821230 3783834 3867475 4044255 4052826 4214010 4138792 3973235 4192986 4277657 4397289
5318 4397289 4289746 4267143 4386984 4356465 4447983 4447068 4523126 4750429 4596435 4652088 4519775
5307 4519775 4455960 4713089 4709997 4848304 5093724 5153647 5179080 5390825 5547747 5475522 5567891
5296 5567891 5520612 5649132 5848861 5798019 5836193 5825005 5764070 5752622 5596527 5477426 5458029
$$ packed form
5373D416798j43329k01322j06831j9447P0163O8889l3605K7843n1708j68104q1235
5362C778112M3770N5746j17557K2443J71252o7409j1447R1346j78070l4859k8530
5351C724797n60J1735l4664Q1300O0172K0320k19655K2223j22729R126K49753
5340C801818q1586j02991j4263O9857J21609N0275r1367J1147K0510K9255q3360
5329C730904R0326l7396Q3641J76780Q571J61184p5218j65557K19751Q4671J19632
5318D397289j07543k2603J19841l0519R1518r15P6058K27303j53994N5653j32313
5307D519775o3815K57129l092J38307K45420N9923K5433K11745J56922p2225R2369
5296E567891m7279J28520J99729n0842L8174j1188o0935j1448j56095j19101j9397
$$ plain form
5285 5458029 5404793 5403063 5260183 5078349 5135004 5171851 5173331 5188031 5045694 5109055 5103687
5274 5103687 5081531 5157810 5200375 5137482 5211055 5090491 5144375 5381264 5543700 5499972 5821312
5263 5821312 5929442 6149895 6099530 5953027 5949968 5914952 5746774 5541632 5642572 5697456
5253 5697456 5754063 5849975 5847659 5833879 5904009 5988149 6159789 6188639 6110377 6306047 6389710
5242 6389710 6367330 6524291 6659308 6823121 6689625 6831332 6842113 6924179 7162479 7361198
5232 7361198 7495528 7658624 7675371 7691473 7683870 7558253 7632769 7739764 7852194 7864110 7716150
5221 7716150 7646509 7632834 7567602 7334620 7237941 7162500 7157279 7194467 7124928 6989910 6810307
5210 6810307 6742497 6641932 6542472 6672374 6696575 6804217 6704381 6529142 6462295 6464810 6458264
$$ packed form
5285E458029n3236j730j42880j81834N6655L6847J480J4700j42337O3361n368
5274E103687k2156P6279M2565o2893P3573j20564N3884K36889J62436m3728L21340
5263E821312J08130K20453n0365j46503l059l5016j68178k05142J00940N4884
5253E697456N6607R5912k316j3780P0130Q4140J71640K8850p8262J95670Q3663
5242F389710k2380J56961J35017J63813j33496J41707J0781Q2066K38300J98719
5232G361198J34330J63096J6747J6102p603j25617P4516J06995J12430J1916j47960
5221G716150o9641j3675o5232k32982r6679p5441n221L7188o9539j35018j79603
5210F810307o7810j00565r9460J29902K4201J07642r9836j75239o6847K515o546
$$ plain form
5199 6458264 6514431 6540941 6633753 6779094 6701469 6593335 6681766 6784206 6696521 6893844 6800140
5188 6800140 6744779 6757591 6830928 6944266 7120019 7100591 7111523 7266123 7449284 7414013 7575221
5177 7575221 7590009 7581879 7779700 7818265 7895464 7940310 7838653 8054748 8368456 8269264 8323657
5166 8323657 8366163 8546149 8553989 8804657 9034296 9008045 9120087 9221615 9393383 9596423
5156 9596423 9698603 9947030 9887564 9859270 10170476 10249722 10142243 10164905 10314815 10428445
5146 10428445 10449258 10615164 10613178 10418692 10417583 10329510 10159191 9983797 9851551 9942914 10016816
5135 10016816 9822707 9863975 9948827 9895357 9774278 9943071 9994270 10142211 10288852 10553220
5125 10553220 10707712 10732414 10909929 11114444 11345522 11661348 11814127 11809422 11961811 12104197
$$ packed form
5199F458264N6167K6510R2812J45341p7625j08134Q8431J02440q7685J97323r3704
5188F800140n5361J2812P3337J13338J75753j9428J0932J54600J83161l5271J61208
5177G575221J4788q130J97821L8565P7199M4846j01657K16095L13708r9192N4393
5166H323657M2506J79986P840K50668K29639k6251J12042J01528J71768K03040
5156I596423J02180K48427n9466k8294L11206P9246j07479K2662J49910J13630
5146A0428445K0813J65906j986j94486j109q8073j70319j75394j32246R1363P3902
5135A0016816j94109M1268Q4852n3470j21079J68793N1199J47941J46641K64368
5125A0553220J54492K4702J77515K04515K31078L15826J52779m705J52389J42386
$$ plain form
5115 12104197 12324023 12320988 12325218 12237717 12081745 12085693 12022548 11927072 12041002 11998675 12081100
5104 12081100 12111573 12401293 12551798 12716687 13003401 13259907 13646657 13745204 14034867 14309086
5094 14309086 14366323 14630617 14800731 14957768 15124795 15272155 15384618 15351155 15640681 15656616
5084 15656616 15700428 15822747 15853999 15607607 15431137 15311296 15221554 15251219 15276483 15378935
5074 15378935 15447969 15448148 15442553 15649692 15863313 15980138 16196446 16281473 16525773 16740301 16828284
5063 16828284 16839322 16849536 16773799 16774514 16729591 16616298 16740941 16987287 16972530 16824685 16868264
5052 16868264 17003875 17287223 17359653 17395148 17558039 17710751 17942880 18212053 18355307 18474800
5042 18474800 18731775 19160310 19360047 19679354 19945491 20088117 20382402 20644116 20848176
$$ packed form
5115A2104197K19826l035M230q7501j55972L948o3145r5476J13930m2327Q2425
5104A2081100L0473K89720J50505J64889K86714K56506L86750R8547K89663K74219
5094A4309086N7237K64294J70114J57037J67027J47360J12463l3463K89526J5935
5084A5656616M3812J22319L1252k46392j76470j19841q9742K9665K5264J02452
5074A5378935O9034J79n595K07139K13621J16825K16308Q5027K44300K14528Q7983
5063A6828284J1038J0214p5737P15m4923j13293J24643K46346j4757j47845M3579
5052A6868264J35611K83348P2430L5495J62891J52712K32129K69173J43254J19493
5042A8474800K56975M28535J99737L19307K66137J42626K94285K61714K04060
$$ plain form
5033 20848176 21169351 21506143 22010638 22407883 22900107 23372571 23835553 24428545 24899592
5024 24899592 25379462 25933050 26310633 26965089 27622019 28236820 28904138 29521907 30338484
5015 30338484 31229141 32255000 33304500 34532373 35978899 37424432 38941877 40949769
5007 40949769 43211375 45760714 48935817 52109764 55723259 59777515 64240014 68538277
4999 68538277 72197015 74199775 74260444 72848220 70279126 67475799 64785799 62167073
4991 62167073 60272408 58827777 57709064 56862727 56460129 56367073 56292465 56888937 57421042
4982 57421042 57884936 59097335 60863014 62845154 65062454 67798482 71214374 75000908
4974 75000908 79528636 84843632 90757477 97811423 106157917 115485879 125533267 135248888
$$ packed form
5033B0848176L21175L36792N04495L97245M92224M72464M62982N92992M71047
5024B4899592M79870N53588L77583O54456O56930O14801O67318O17769Q16577
5015C0338484Q90657J025859J049500J227873J446526J445533J517445K007892
5007D0949769K261606K549339L175103L173947L613495M054256M462499M298263
4999F8538277L658738K002760O0669j412224k569094k803327k690000k618726
4991F2167073j894665j444631j118713q46337m02598r3056p4608N96472N32105
4982E7421042M63894J212399J765679J982140K217300K736028L415892L786534
4974G5000908M527728N314996N913845P053946Q346494R327962J0047388R715621
$$ plain form
4966 135248888 143204373 147369386 147225744 143827465 139116572 134455868 131411240 129897281
4958 129897281 129284665 128153006 125211904 119882125 113289288 106482436 100502261 95425603
4950 95425603 91007600 87480501 84958127 83180116 82325984 82307996 82734461 83880619 85662506
4941 85662506 88352192 92181506 96831104 102504896 109632494 117862982 126833383 136757455
4933 136757455 146389557 154997962 161864386 165424048 164785563 160059831 152038273 141719756
4925 141719756 129700312 117522299 106684099 97256829 89418873 82698816 77377327 72968470
4917 72968470 69376320 66517020 64336936 62706771 61590401 60960182 60791939 60900533 61692973
4908 61692973 63100152 65391538 68283625 71650325 75446759 79153791 82689696 84802873
$$ packed form
4966A35248888P955485M165013j43642l398279m710893m660704l044628j513959
4958A29897281o12616j131659k941102n329779o592837o806852n980175n076658
4950I5425603m418003l527099k522374j778011q54132j7988M26465J146158J781887
4941H5662506K689686L829314M649598N673792P127598Q230488Q970401R924072
4933A36757455R632102Q608405O866424L559662o38485m725732q021558j0318517
4925A41719756j2019444j2178013j0838200r427270p837956o720057n321489m408857
4917G2968470l592150k859300k180084j630165j116370o30219j68243J08594P92440
4908F1692973J407179K291386K892087L366700L796434L707032L535905K113177
$$ plain form
4900 84802873 84131487 80483747 74885718 68691862 62960220 57983087 53811097 50214233
4892 50214233 47165451 44695452 42354937 40468087 38606395 37080370 35744570 34646374
4884 34646374 33818023 32972161 32102886 31482143 30913836 30450535 30181258 29884519 29692506
4875 29692506 29440909 29216974 28976149 28482266 28126968 27682124 27172961 26594623 26139056
4866 26139056 25757189 25322211 24679555 24328739 24314858 23971236 23673691 23330719 22952218 22737472
4856 22737472 22642227 22532450 22382827 22117757 21934145 21702296 21628945 21504586 21442663 21418642
4846 21418642 21427446 21253413 21134335 20956372 20861002 20830186 20734938 20648868 20633841 20736872 20874825
4835 20874825 21186435 21344718 21655441 22019796 22155632 22635623 23254247 23812594 24409029
$$ packed form
4900H4802873o71386l647740n598029o193856n731642m977133m171990l596864
4892E0214233l048782k469999k340515j886850j861692j526025j335800j098196
4884C4646374q28351q45862q69275o20743n68307m63301k69277k96739j92013
4875B9692506k51597k23935k40825m93883l55298m44844n09163n78338m55567
4866B6139056l81867m34978o42656l50816j3881l43622k97545l42972l78501k14746
4856B2737472r5245j09777j49623k65070j83612k31849p3351j24359o1923k4021
4846B1418642Q804j74033j19078j77963r5370l0816r5248q6070j5027J03031J37953
4835B0874825L11610J58283L10723L64355J35836M79991O18624N58347N96435
$$ plain form
4826 24409029 24706502 24645875 24374899 23858341 23248580 22412685 21683949 20880198 20139692 19581080
4816 19581080 19072030 18818593 18457191 18033389 17976909 17936267 17890881 17833103 17732898 17869111
4806 17869111 18059885 18171513 18547505 19120027 19489184 19749132 20088082 20122172 19846075 19399573
4796 19399573 18666547 17963329 17248205 16434576 15671356 15034772 14364873 13791207 13419998
4787 13419998 13094627 12737268 12495985 12187135 11964966 11695647 11427180 11303632 11098826
4778 11098826 10813532 10662404 10465055 10253119 10120331 9995619 9947331 9761907 9671416 9739955
4768 9739955 9742888 9693442 9520069 9483172 9414414 9267637 9313743 9388964 9531438 9567344 9468621
4757 9468621 9489947 9482649 9626512 9685449 9513214 9492063 9475498 9560837 9735598 9843754 9715930
$$ packed form
4826B4409029K97473o0627k70976n16558o09761q35895p28736q03751p40506n58612
4816A9581080n09050k53437l61402m23802n6480m0642m5386n7778j00205J36213
4806A7869111J90774J11628L75992N72522L69157K59948L38950L4090k76097m46502
4796A9399573p33026p03218p15124q13629p63220o36584o69899n73666l71209
4787A3419998l25371l57359k41283l08850k22169k69319k68467j23548k04806
4778A1098826k85294j51128j97349k11936j32788j24712m8288j85424r0491O8539
4768I739955K933m9446j73373l6897o8758j46777M6106P5221J42474L5906r8723
4757I468621K1326p298J43863N8937j72235k1151j6565Q5339J74761J08156j27824
$$ plain form
4746 9715930 9647065 9629383 9516403 9474122 9165986 9123344 9263189 8999850 8869305 8797009
4736 8797009 8640520 8639639 8629055 8694194 8647508 8520956 8448005 8353145 8507389 8511453 8528005
4725 8528005 8450107 8438936 8491202 8559074 8639758 8621024 8879060 8976309 9130141 9189312 9137747
4714 9137747 9178268 9490386 9620107 9589423 9468799 9453299 9656622 9485687 9401932 9511909
4704 9511909 9449845 9447290 9456771 9470767 9528185 9602401 9644559 9522046 9463490 9526899 9443494 9589785
4692 9589785 9415795 9450383 9614101 9540122 9755809 9846703 9738544 9841936 9948385 9927223
4682 9927223 9894653 9993012 10184868 10324249 10416909 10532329 10743037 10784918 10809831 10876581 11013099
4671 11013099 11128952 10975268 10901368 11080869 10963200 10914236 10765748 10730825 10697251 10778836
$$ packed form
4746I715930o8865j7682j12980m2281l08136m2642J39845k63339j30545p2296
4736H797009j56489q81j0584O5139m6686j26552p2951r4860J54244M064J6552
4725H528005p7898j1171N2266O7872Q0684j8734K58036R7249J53832N9171n1565
4714I137747M0521L12118J29721l0684j20624j5500K03323j70935q3755J09977
4704I511909o2064k555R481J3996N7418P4216M2158j22513n8556O3409q3405J46291
4692I589785j73990L4588J63718p3979K15687R0894j08159J03392J06449k1162
4682I927223l2570R8359J91856J39381R2660J15420K10708M1881K4913O6750J36518
4671A1013099J15853j53684p3900J79501j17669m8964j48488l4923l3574Q1585
$$ plain form
4661 10778836 10798656 10780500 10700404 10537380 10513244 10573825 10459203 10264429 10314559 10236689 10225307
4650 10225307 10218561 10065412 10111817 10126024 9994226 9863452 9889207 9810332 9679045 9583352 9555250
4639 9555250 9578363 9632435 9780173 9835511 9824208 9787911 9599300 9503426 9602572 9655158 9522434
4628 9522434 9507619 9474332 9354412 9273312 9372103 9380710 9200453 9151077 8995968 8812009 8869884
4617 8869884 8818303 8651764 8607934 8661138 8581370 8610137 8578389 8548142 8468691 8511126 8519683
4606 8519683 8630498 8665757 8626898 8540266 8623565 8717399 8756244 8795949 8743819 8950558 8929089
4595 8929089 8718016 8732195 8661008 8501421 8676131 8532931 8567473 8586717 8536152 8573568 8543629
4584 8543629 8407905 8688304 8789577 8734304 8607009 8666095 8659407 8668454 8901411 9008405 8954949
$$ packed form
4661A0778836J9820j8156q0096j63024k4136O0581j14622j94774N0130p7870j1382
4650A0225307o746j53149M6405J4207j31798j30774K5755p8875j31287r5693k8102
4639I555250K3113N4072J47738N5338j1303l6297j88611r5874R9146N2586j32724
4628I522434j4815l3287j19920q1100R8791Q607j80257m9376j55109j83959N7875
4617H869884n1581j66539m3830N3204p9768K8767l1748l0247p9451M2435Q557
4606H519683J10815L5259l8859q6632Q3299R3834L8845L9705n2130K06739k1469
4595H929089k11073J4179p1187j59587J74710j43200L4542J9244n0565L7416k9939
4584H543629j35724K80399J01273n5273j27295N9086o688R047K32957J06994n3456
$$ plain form
4573 8954949 8994864 9002605 9023368 8886349 8961691 9032367 9295445 9523821 9652700 9478723 9466164
4562 9466164 9759925 9883978 9846078 9844150 9762755 9732167 9686933 9753960 9925943 9732364 9710727
4551 9710727 9690512 9828188 10028526 10094588 9954821 9962560 10150189 10463936 10512912 10490147 10666580
4540 10666580 10977446 11057445 11033889 11192241 11374443 11463760 11653642 11804162 11996378 12234772
4530 12234772 12446279 12652573 12888521 13066038 13017820 12867332 12756265 12720553 13005503 13162563
4520 13162563 13172100 13199127 13383088 13487589 13629661 13915887 14047982 14113388 14062135 14184103
4510 14184103 14332631 14295583 14021476 14220533 14516328 14699165 14822992 14871323 15250689 15610932
4500 15610932 15861789 16180962 16497552 17024225 17645369 18333941 19045707 19246701 19351055
$$ packed form
4573H954949L9915P741K0763j37019P5342P0676K63078K28376J28879j73977j2559
4562I466164K93761J24053l7900j928q1395l0588m5234O7027J71983j93579k1637
4551I710727k0215J37676K00338O6062j39767P739J87629L13747M8976k2765J76433
4540A0666580L10866P9999k3556J58352J82202Q9317J89882J50520J92216K38394
4530A2234772K11507K06294K35948J77517m8218j50488j11067l5712K84950J57060
4520A3162563R537K7027J83961J04501J42072K86226J32095O5406n1253J21968
4510A4184103J48528l7048k74107J99057K95795J82837J23827M8331L79366L60243
4500A5610932K50857L19173L16590N26673O21144O88572P11766K00994J04354
$$ plain form
4491 19351055 19032796 18826993 18797676 18860884 19217917 19445740 19668150 19701617 19584164 19692590
4481 19692590 19862179 19912320 19887778 20274106 20871964 21125619 21511252 21933307 22299296 22970587
4471 22970587 23508208 24298267 25166290 26018997 27101382 28200107 29416171 30694872 31916051
4462 31916051 33254760 34565288 35982316 37200135 37738521 38182734 38777991 39743207 40893217
4453 40893217 42260297 43964433 45699131 47572705 49875728 52560597 55624356 58959502
4445 58959502 62804474 67274285 72541253 78452160 84603825 91626368 99271926 107390199
4437 107390199 115939341 124470663 132907489 140990320 148589183 155078678 159262258 160972327
4429 160972327 159616368 155655755 149954031 143036090 135348566 127128930 118741620 110679830
$$ packed form
4491A9351055l18259k05803k9317O3208L57033K27823K22410L3467j17453J08426
4481A9692590J69589N0141k4542L86328N97858K53655L85633M22055L65989O71291
4471B2970587N37621P90059Q68023Q52707J082385J098725J216064J278701J221179
4462C1916051J338709J310528J417028J217819N38386M44213N95257R65216J150010
4453D0893217J367080J704136J734698J873574K303023K684869L063759L335146
4445E8959502L844972M469811N266968N910907O151665P022543P645558Q118273
4437A07390199Q549142Q531322Q436826Q082831P598863O489495M183580J710069
4429A60972327j355959l960613n701724o917941p687524q219636q387310q061790
$$ plain form
4421 110679830 102867023 95284845 87963848 81505328 75815019 70756532 66501188 62763617
4413 62763617 59516817 56787036 54437478 52231778 50114762 47962913 46251322 44460132
4405 44460132 42555109 40420934 38523467 36601091 34803772 33354241 31948268 30770574
4397 30770574 29654402 28526038 27600933 26562057 25794180 25220684 24442341 23764773 23133477
4388 23133477 22613536 22039754 21316480 20927001 20421215 20062501 19831946 19333201 18889494
4379 18889494 18573996 18290261 17943088 17610165 17280617 16828240 16602572 16284662 15956827
4370 15956827 15828135 15687533 15374058 15245656 15001008 14840363 14741624 14619398 14577890 14557402
4360 14557402 14428571 14292536 14329222 14290389 14439039 14319917 14098014 13967566 13800784 13657855
$$ packed form
4421A10679830p812807p582178p320997o458520n690309n058487m255344l737571
4413F2763617l246800k729781k349558k205700k117016k151849j711591j791190
4405D4460132j905023k134175j897467j922376j797319j449531j405973j177694
4397C0770574j116172j128364r25105j038876p67877n73496p78343o77568o31296
4388B3133477n19941n73782p23274l89479n05786l58714k30555m98745m43707
4379A8889494l15498k83735l47173l32923l29548m52377k25668l17910l27835
4370A5956827j28692j40602l13475j28402k44648j60645r8739j22226m1508k0488
4360A4557402j28831j36035L6686l8833J48650j19122k21903j30448j66782j42929
$$ plain form
4350 13657855 13622637 13601938 13453506 13508843 13501579 13431532 13319473 13325019 13448028 13578167 13625832
4339 13625832 13556367 13709340 13702892 13721180 13903314 13956192 14015485 14183214 14348730 14434733 14366462
4328 14366462 14365513 14282477 14158335 14006765 13925395 13732196 13460893 13257221 13103875 12837193
4318 12837193 12770681 12421898 12069343 11909108 11783900 11598796 11358763 11177912 11072918 10900600
4308 10900600 10947034 10835964 10764612 10672838 10482699 10571179 10559188 10436383 10350841 10466692
4298 10466692 10429632 10291689 10483303 10297380 10122739 10063778 9989721 9945609 9996186 9891897
4288 9891897 9874411 9861910 9850488 9855939 9648569 9714923 9798094 9911684 9947400 9905446 9956085
4277 9956085 9918013 9904037 10068350 10099267 10209414 10233898 10205304 10286588 10331539 10262667 10174399
$$ packed form
4350A3657855l5218k0699j48432N5337p264p0047j12059N546J23009J30139M7665
4339A3625832o9465J52973o448J8288J82134N2878N9293J67729J65516Q6003o8271
4328A4366462r49q3036j24142j51570q1370j93199k71303k03672j53346k66682
4318A2837193o6512l48783l52555j60235j25208j85104k40033j80851j04994j72318
4308A0900600M6434j11070p1352r1774j90139Q8480j1991j22805q5542J15851
4298A0466692l7060j37943J91614j85923j74641n8961p4057m4112N0577j04289
4288I891897j7486j2501j1422N451k07370O6354Q3171J13590L5716m1954N0639
4277I956085l8072j3976J64313L0917J10147K4484k8594Q1284M4951o8872q8268
$$ plain form
4266 10174399 9954428 9758189 9649807 9560115 9243722 9317480 9185237 8958351 8838571 8701100
4256 8701100 8580481 8434944 8373338 8327164 8293454 8216363 7966430 8015168 8030872 7973785 7959013
4245 7959013 7926318 7876616 7973704 8042369 8111050 8155586 8126824 8151279 8119802 8436117 8396100
4234 8396100 8494600 8817991 9096622 9685490 10230011 10748416 11538480 12494160 13861648 15207156
4224 15207156 15251611 13774080 12196705 11369607 10573421 9856174 9378461 9005347 8730336
4215 8730336 8516948 8338349 8204308 7923165 7780220 7723998 7705051 7780359 7752998 7678465
4205 7678465 7499810 7545562 7339504 7323567 7474466 7062297 6848728 6876148 6762033 6865921
4195 6865921 6595586 6418608 6385926 6222966 6129456 6052151 6124805 6190391 6002112 6179440
$$ packed form
4266A0174399k19971j96239j08382q9692l16393P3758j32243k26886j19780j37471
4256H701100j20619j45537o1606m6174l3710p7091k49933M8738J5704n7087j4772
4245G959013l2695m9702R7088O8665O8681M4536k8762K4455l1477L16315m0017
4234H396100R8500L23391K78631N88868N44521N18405P90064R55680J367488J345508
4224A5207156M4455j477531j577375q27098p96186p17247m77713l73114k75011
4215H730336k13388j78599j34041k81143j42945n6222j8947P5308k7361p4533
4205G678465j78655M5752k06058j5937J50899m12169k13569K7420j14115J03888
4195F865921k70335j76978l2682j62960r3510p7305P2654O5586j88279J77328
$$ plain form
4185 6179440 6094538 5879540 5903527 5916582 6012675 5905660 6039467 6050367 6068095 5944794 5803968
4174 5803968 5808038 5904317 5888485 5739215 5758278 5778538 5864050 5942898 5921286 5930824 6069871
4163 6069871 6157808 6179651 6031971 5867257 6046706 6019024 5962698 6094704 6219101 6237911
4153 6237911 6177555 6276744 6288999 6272755 6451401 6450519 6350400 6423836 6395963 6537879 6585010
4142 6585010 6487530 6479910 6338711 6490700 6454829 6401415 6469905 6484456 6644950 6665283 6608972
4131 6608972 6682572 6772140 6839404 6886643 7106859 7292584 7378094 7639558 7876269 8168228
4121 8168228 8363949 8322232 8181517 7899372 7647944 7739860 7599481 7569516 7470179 7509087
4111 7509087 7584946 7576740 7563142 7508330 7612172 7545856 7432576 7547615 7627772 7758978 7721329
$$ packed form
4185F179440q4902k14998K3987J3055R6093j07015J33807J0900J7728j23301j40826
4174E803968M070R6279j5832j49270J9063K0260Q5512P8848k1612R538J39047
4163F069871Q7937K1843j47680j64714J79449k7682n6326J32006J24397J8810
4153F237911o0356R9189J2255j6244J78646q82j00119P3436k7873J41916M7131
4142F585010r7480p620j41199J51989l5871n3414O8490J4551J60494K0333n6311
4131F608972P3600Q9568O7264M7239K20216J85725Q5510K61464K36711K91959
4121H168228J95721m1717j40715k82145k51428R1916j40379k9965r9337L8908
4111G509087P5859q206j3598n4812J03842o6316j13280J15039Q0157J31206l7649
$$ plain form
4100 7721329 7713320 7599214 7717210 7754504 7649690 7633273 7505461 7560807 7537819 7664410 7694273
4089 7694273 7674415 7724567 7759076 7654947 7842922 7881401 7816163 7814157 7857340 7885397 8004194
4078 8004194 8076295 8195382 8016511 8170603 8210582 8057059 8120905 8196527 8463447 8583366
4068 8583366 8476551 8582547 8672382 8617050 8764825 8865509 9010030 8927622 8889669 9013703
4058 9013703 9012945 9162802 9262538 9412508 9538147 9509172 9600905 9633411 9754250 9828150 9840898
4047 9840898 10019394 10027578 10071071 10310655 10449806 10506122 10575511 10695199 10990473 10975523 11039207
4036 11039207 11225655 11231962 11508311 11650094 11819991 12035548 12186005 12489420 12664358 12841767
4026 12841767 13162302 13374422 13550889 13784055 14056184 14425095 14871780 15253241 15472929
$$ packed form
4100G721329q009j14106J17996L7294j04814j6417j27812N5346k2988J26591K9863
4089G694273j9858N0152L4509j04129J87975L8479o5238k006M3183K8057J18797
4078H004194P2101J19087j78871J54092L9979j53523O3846P5622K66920J19919
4068H583366j06815J05996Q9835n5332J47775J00684J44521q2408l7953J24034
4058I013703p58J49857R9736J49970J25639k8975R1733L2506J20839P3900J2748
4047I840898J78496Q184M3493K39584J39151N6316O9389J19688K95274j4950O3684
4036A1039207J86448O307K76349J41783J69897K15557J50457L03415J74938J77409
4026A2841767L20535K12120J76467K33166K72129L68911M46685L81461K19688
$$ plain form
4017 15472929 15709168 16013961 16243371 16474178 16773687 17207522 17486852 17840911 18067647
4008 18067647 18559374 19236696 19783397 20423390 20962303 21707493 22384328 22813693 23482115
3999 23482115 23982603 24587697 25028908 25509984 25805625 25826440 25837696 25772380 25606265 25327286
3989 25327286 24900458 24436618 24111481 23739544 23385074 22946505 22682766 22522497 22234635
3980 22234635 22216328 22085767 22192008 22023289 21652432 21613830 21631723 21431635 21512109 21356194
3970 21356194 21106901 20976302 20937613 20950858 20733167 20691801 20618185 20631404 20373167 20348193
3960 20348193 20360838 20386569 20430691 20552108 20493134 20537195 20409383 20560850 20651518 20791408
3950 20791408 20965068 20863960 20983208 21199074 21270071 21420314 21750393 22159662 22421357 22767079
$$ packed form
4017A5472929K36239L04793K29410K30807K99509M33835K79330L54059K26736
4008A8067647M91727O77322N46701O39993N38913P45190O76835M29365O68422
3999B3482115N00488O05094M41211M81076K95641K0815J1256o5316j66115k78979
3989B5327286m26828m63840l25137l71937l54470m38569k63739j60269k87862
3980B2234635j8307j30561J06241j68719l70857l8602J7893k00088Q0474j55915
3970B1356194k49293j30599l8689J3245k17691m1366p3616J3219k58237k4974
3960B0348193J2645K5731M4122J21417n8974M4061j27812J51467R0668J39890
3950B0791408J73660j01108J19248K15866P0997J50243L30079M09269K61695L45722
$$ plain form
3940 22767079 23051275 23319875 23672332 23972418 24319821 24474653 24765435 24991712 24927041 25046547
3930 25046547 25054884 25153970 25381640 25342658 25328212 25324912 25354360 25279204 25365890 25502024 25540827
3919 25540827 25765067 25920023 25925232 26008194 26187053 26461151 26735942 27019548 27313421 27688100
3909 27688100 27701263 27998614 28347588 28721019 28992878 29271697 29782145 29967025 30141631 30176581
3899 30176581 30199851 30228174 30064548 30154840 30417565 30502066 30609386 30873247 31321973 31840225
3889 31840225 32041047 31990759 31807758 31756856 31397030 31018622 30861217 30567017 30565469 30598666
3879 30598666 30509894 30531127 30465999 30396779 30536711 30767332 30953866 31134521 31292297 31251415
3869 31251415 31372018 31554150 31636450 31631862 31759156 31830471 31973541 32093113 32329654 32593117
$$ packed form
3940B2767079K84196K68600L52457L00086L47403J54832K90782K26277o4671J19506
3930B5046547Q337R9086K27670l8982j4446l300K9448p5156Q6686J36134L8803
3919B5540827K24240J54956N209Q2962J78859K74098K74791K83606K93873L74679
3909B7688100J3163K97351L48974L73431K71859K78819N10448J84880J74606L4950
3899C0176581K3270K8323j63626R0292K62725Q4501J07320K63861M48726N18252
3889C1840225K00822n0288j83001n0902l59826l78408j57405k94200j548L3197
3879C0598666q8772K1233o5128o9220J39932K30621J86534J80655J57776m0882
3869C1251415J20603J82132Q2300m588J27294P1315J43070J19572K36541K63463
$$ plain form
3859 32593117 32750931 33035363 33338065 33664383 34069501 34423423 34638526 34933537 35760499
3850 35760499 36475171 37120529 37502762 37552322 37592766 37717383 37983787 38199036 38473966 39045516
3840 39045516 39542717 40209886 40883087 41723933 42552326 43261783 43881875 44661944 45350918
3831 45350918 46119164 47089286 48057105 49116983 50416553 51833097 53252744 54934257 56902924
3822 56902924 59167799 61857412 64794883 67984799 71687962 75900074 80874827 85788265
3814 85788265 90107678 93738654 95684543 95215044 93422806 91972015 91394542 91539954 92348051
3805 92348051 93681670 95756848 98426816 101861877 106360355 112292747 118940565 127159688
3797 127159688 137444240 150677150 166805921 186341507 209916753 240139245 279484103
$$ packed form
3859C2593117J57814K84432L02702L26318M05118L53922K15103K95011Q26962
3850C5760499P14672O45358L82233M9560M0444J24617K66404K15249K74930N71550
3840C9045516M97201O67169O73201Q40846Q28393P09457O20092P80069O88974
3831D5350918P68246R70122R67819J059878J299570J416544J419647J681513J968667
3822E6902924K264875K689613K937471L189916L703163M212112M974753M913438
3814H5788265M319413L630976J945889m69499j792238j450791n77473J45412Q08097
3805I2348051J333619K075178K669968L435061M498478N932392O647818Q219123
3797A27159688J0284552J3232910J6128771J9535586K3575246L0222492L9344858
$$ plain form
3790 279484103 330376386 391634433 451319844 460769347 406757119 336412327 279186140
3783 279186140 237945737 206650305 181608923 161359225 145754790 133196826 122708836
3776 122708836 113284671 105416967 98912517 93630056 89131525 85468069 82252288 79586445
3768 79586445 77365148 75531286 73552762 72111773 70824000 69549671 68722439 67785189
3760 67785189 66919260 66282128 65740286 65353573 65070119 65137981 65283860 65390098 65509349 65876291
3750 65876291 66166420 66614683 67308421 68013711 68909313 69970175 71042611 71756110 72570820
3741 72570820 73479478 74258559 74961336 75657255 76417856 77003510 77799835 78670895 79551123
3732 79551123 80751360 81895973 83365108 85009930 86790768 88813623 90874661 93154589
$$ packed form
3790B79484103N0892283O1258047N9685411R449503n4012228p0344792n7226187
3783B79186140m1240403l1295432k5041382k0249698j5604435j2557964j0487990
3776A22708836r424165p867704o504450n282461m498531l663456l215781k665843
3768G9586445k221297j833862j978524j440989j287773j274329q27232r37250
3760F7785189q65929o37132n41842l86713k83454O7862J45879J06238J19251L66942
3750F5876291K90129M48263O93738P05290Q95602J060862J072436P13499Q14710
3741G2570820R08658P79081P02777O95919P60601N85654P96325Q71060Q80228
3732G9551123J200237J144613J469135J644822J780838K022855K061038K279928
$$ plain form
3724 93154589 95945996 98784902 101831299 105142807 108831131 112881538 117098487 122063772
3716 122063772 127534700 133819608 140933121 148567919 157241668 167129512 177973901 190362722
3708 190362722 203975678 218974755 235438460 252905947 270825249 288351904 304983042
3701 304983042 319959640 331704279 339288097 341842023 338972295 331140600 319151344 303132017
3693 303132017 283856661 262490240 240542536 219808326 201091569 184331954 169638460
3686 169638460 156936937 145817928 136107440 127673230 120233148 113655322 107934687 102702947
3678 102702947 98050252 93768591 90149060 86752162 83676772 80977924 78505739 76159336
3670 76159336 74041830 72137415 70263649 68405444 66521659 64964521 63109526 61332763
$$ packed form
3724I3154589K791407K838906L046397L311508L688324M050407M216949M965285
3716A22063772N470928O284908P113513P634798Q673749R887844J0844389J2388821
3708A90362722J3612956J4999077J6463705J7467487J7919302J7526655J6631138
3701C04983042J4976598J1744639P583818K553926k869728p831695j1989256j6019327
3693C03132017j9275356k1366421k1947704k0734210j8716757j6759615j4693494
3686A69638460j2701523j1119009r710488q434210p440082o577826n720635n231740
3678A02702947m652695m281661l619531l396898l075390k698848k472185k346403
3670G6159336k117506j904415j873766j858205j883785j557138j854995j776763
$$ plain form
3662 61332763 59857528 58313981 56833152 55520976 54300307 52980164 51765047 50874932
3654 50874932 49934909 49071116 48232027 47401047 46837526 46078241 45595154 45086226 44278877
3645 44278877 43787510 43392251 43169261 42770867 42158020 41645216 41075198 40679816 40223950
3636 40223950 39797994 39170860 38613488 37825367 37384193 36789185 36209355 35604964 35079847
3627 35079847 34451563 33921652 33480430 33010412 32617912 32042876 31395850 31109667 30661028
3618 30661028 30292820 30017328 29513805 29168117 28937572 28748836 28466677 28318676 27995521
3609 27995521 27799085 27890277 27798386 27541579 27429319 27298943 27156156 27089951 27083058 27052823
3599 27052823 27034114 26989010 27000969 26899960 26758961 26654675 26749044 26922217 26917871 26973020 26995844
$$ packed form
3662F1332763j475235j543547j480829j312176j220669j320143j215117q90115
3654E0874932r40023q63793q39089q30980n63521p59285m83087n08928q07349
3645D4278877m91367l95259k22990l98394o12847n12804n70018l95382m55866
3636D0223950m25956o27134n57372p88121m41174n95008n79830o04391n25117
3627C5079847o28284n29911m41222m70018l92500n75036o47026k86183m48639
3618C0661028l68208k75492n03523l45688k30545j88736k82159j48001l23155
3609B7995521j96436R1192r1891k56807j12260j30376j42787o6205o893l0235
3599B7052823j8709m5104J1959j01009j40999j04286R4369J73173m346N5149K2824
$$ plain form
3588 26995844 27085637 27310936 27542028 27627546 27804459 28178116 28410995 28956505 29578183 30226755
3578 30226755 31242483 32459790 33726048 35179042 36778022 39108238 41753813 44814771
3570 44814771 48399035 52747101 57668241 62772830 67706543 71383954 71690068 68466568
3562 68466568 63114091 57291191 51966370 47427552 43691363 40203465 37340399 35263363
3554 35263363 33034828 31328375 30041216 28876588 27748897 26841545 26297476 25508308 24843653
3545 24843653 24318569 23786479 23578095 23457778 23287619 23279803 23155339 23201243 23176292 22975836
3535 22975836 22873158 22578232 22224630 22152511 21926773 21582028 21215203 20996362 20905726 20738565
3525 20738565 20737399 20691890 20607788 20677067 20723711 20769190 20775920 21000750 21068385 21132665 21272478
$$ packed form
3588B6995844Q9793K25299K31092Q5518J76913L73657K32879N45510O21678O48572
3578C0226755J015728J217307J266258J452994J598980K330216K645575L060958
3570D4814771L584264M348066M921140N104589M933713L677411L06114l223500
3562F8466568n352477n822900n324821m538818l736189l487898k863066k077036
3554C5263363k228535j706453j287159j164628j127691r07352n44069p89168o64655
3545B4843653n25084n32090k08384j20317j70159p816j24464M5904k4951k00456
3535B2975836j02678k94926l53602p2119k25738l44745l66825k18841r0636j67161
3525B0738565j166m5509q4102O9279M6644M5479O730K24830O7635O4280J39813
$$ plain form
3514 21272478 21568517 21944671 22249461 22549506 22691150 22851075 22943861 22890914 23126298 23254036
3504 23254036 23126559 22984743 22662523 22365587 22234756 22110296 22122014 22044748 22100256 22081448
3494 22081448 22159071 22372920 22276956 22398402 22698735 22687296 22783845 22941476 23253497 23476910
3484 23476910 23745665 23932282 24124219 24514827 24715112 24910112 25257185 25395401 25719617
3475 25719617 26077555 26260849 26690202 26814119 27169090 27692039 27993292 28295043 28749544
3466 28749544 29270526 29728989 30351035 31164920 31899291 32689780 33687421 34582038 35401830
3457 35401830 36412711 37680289 39048135 40508817 42174395 43891339 45490795 46959275
3449 46959275 48500179 50000254 51529196 53270514 55169182 56974744 59039915 61172348
$$ packed form
3514B1272478K96039L76154L04790L00045J41644J59925R2786n2947K35384J27738
3504B3254036j27477j41816l22220k96936j30831j24460J1718p7266N5508j8808
3494B2081448P7623K13849r5964J21446L00333j1439R6549J57631L12021K23413
3484B3476910K68755J86617J91937L90608K00285J95000L47073J38216L24216
3475B5719617L57938J83294M29353J23917L54971N22949L01253L01751M54501
3466B8749544N20982M58463O22046Q13885P34371P90489R97641Q94617Q19792
3457C5401830J010881J267578J367846J460682J665578J716944J599456J468480
3449D6959275J540904J500075J528942J741318J898668J805562K065171K132433
$$ plain form
3441 61172348 63335937 65815727 68809900 72170934 76034632 80338800 85590997 91813858
3433 91813858 98704763 106529055 115744087 126583864 139565091 154890651 172791728 193602565
3425 193602565 217774648 245138490 274414746 302519555 322431963 326426647 311851864
3418 311851864 285306871 255261367 227030060 202528515 181762241 164262264 149646114
3411 149646114 137770072 127892310 119550059 112406420 106659198 101597426 97424818 93856014
3403 93856014 91151321 89108938 87961579 87203716 87027164 87367626 88071126 89085694 90086546
3394 90086546 90847363 90733511 89408758 86894037 83784175 80066685 76702820 73722775
3386 73722775 71075337 68383952 66144799 63841255 61693085 59524194 57161906 55019119
$$ packed form
3441F1172348K163589K479790K994173L361034L863698M304168N252197O222861
3433I1813858O890905P824292R215032J0839777J2981227J5325560J7901077K0810837
3425A93602565K4172083K7363842K9276256K8104809J9912408L994684j4574783
3418C11851864k6544993l0045504k8231307k4501545k0766274j7499977j4616150
3411A49646114j1876042r877762q342251p143639n747222n061772m172608l568804
3403I3856014k704693k042383j147359p57863j76552L40462P03500J014568J000852
3394I0086546P60817j13852j324753k514721l109862l717490l363865k980045
3386G3722775k647438k691385k239153k303544k148170k168891k362288k142787
$$ plain form
3378 55019119 53053705 51161359 49599159 48059247 46434545 44976286 43573577 42248858
3370 42248858 40947733 39630405 38472416 37506317 36547628 35406199 34455098 33670934 32765826
3361 32765826 31961715 31378151 30716800 30151692 29514937 28977830 28697695 28345104 27992697
3352 27992697 27759916 27489912 27239672 26828006 26440273 25990384 25633854 25433303 25077927
3343 25077927 24842324 24516140 23822126 23343661 22983514 22486802 22028561 21600397 21241318
3334 21241318 20859781 20494870 20203774 19881533 19521700 19390184 19232425 19035561 18709896
3325 18709896 18499352 18226724 18195401 18164807 17981010 17905618 17842071 17686120 17701369 17624676
3315 17624676 17574771 17419260 17258097 17205741 16953509 16974234 16825592 16726491 16748351 16825065
$$ packed form
3378E5019119j965414j892346j562200j539912j624702j458259j402709j324719
3370D2248858j301125j317328j157989r66099r58689j141429r51101p84164r05108
3361C2765826q04111n83564o61351n65108o36755n37107k80135l52591l52407
3352B7992697k32781k70004k50240m11666l87733m49889l56530k00551l55376
3343B5077927k35603l26184o94014m78465l60147m96712m58241m28164l59079
3334B1241318l81537l64911k91096l22241l59833j31516j57759j96864l25665
3325A8709896k10544k72628l1323l0594j83797p5392o3547j55951J5249p6693
3315A7624676m9905j55511j61163n2356k52232K0725j48642r9101K1860P6714
$$ plain form
3305 16825065 16789085 16815502 16845847 16964018 16786061 16595172 16573526 16376329 16274802 16097686
3295 16097686 15854701 15751281 15786299 15839590 15825520 15825588 15869324 15786158 15804861 15948679 16124282
3284 16124282 16280070 16421564 16809657 17094013 17582648 18168305 18673741 19654626 20596149
3275 20596149 21630404 22799475 24127748 25456772 27198721 28527928 29792106 30107657
3267 30107657 29402057 27892978 26048290 24432437 23239605 22053300 20948865 20131637
3259 20131637 19244352 18487764 17985672 17604257 17143290 16871728 16589457 16401674 16187187
3250 16187187 16174283 16141655 16161634 16231553 16324285 16441338 16467448 16620373 16707085 16788688 16939933
3239 16939933 17064588 17242603 17515067 17710941 17779021 17820212 18044595 18018548 17894554 18032972
$$ packed form
3305A6825065l5980K6417L0345J18171j77957j90889k1646j97197j01527j77116
3295A6097686k42985j03420L5018N3291j4070O8M3736q3166J8703J43818J75603
3284A6124282J55788J41494L88093K84356M88635N85657N05436R80885R41523
3275B0596149J034255J169071J328273J329024J741949J329207J264178L15551
3267C0107657p05600j509079j844688j615853j192832j186305j104435q17228
3259B0131637q87285p56588n02092l81415m60967k71562k82271j87783k14487
3250A6187187j2904l2628J9979O9919R2732J17053K6110J52925Q6712Q1603J51245
3239A6939933J24655J78015K72464J95874O8080M1191K24383k6047j23994J38418
$$ plain form
3229 18032972 18211666 18439424 18516549 18758321 19086490 19450105 20003206 20128694 20387953 20656675
3219 20656675 20678124 20934656 20997328 20938319 21076803 21041850 21059761 21467549 21538849 22041769
3209 22041769 22663538 23510937 24623838 25763957 27054686 28528670 29967275 30618766 30269864
3200 30269864 29266658 27772532 26269839 24933590 23913573 22910706 22225219 21609561
3192 21609561 21154104 20841263 20634430 20618521 20319282 20221101 20292282 20502421 20560257 20748909
3182 20748909 20914635 21337636 21706541 22263959 23047297 23944096 25105531 26219595 27592307
3173 27592307 29170876 30918732 32125915 32914057 32476050 31248875 29477009 27681214
3165 27681214 26171357 24902031 23820469 22937477 22403372 22062613 21591471 21153022 20745814
$$ packed form
3229A8032972J78694K27758P7125K41772L28169L63615N53101J25488K59259K68722
3219B0656675K1449K56532O2672n9009J38484l4953J7911M07788P1300N02920
3209B2041769O21769Q47399J112901J140119J290729J473984J438605O51491l48902
3200C0269864j003206j494126j502693j336249j020017j002867o85487o15658
3192B1609561m55457l12841k06833j5909k99239r8181P1181K10139N7836J88652
3182B0748909J65726M23001L68905N57418P83338Q96799J161435J114064J372712
3173B7592307J578569J747856J207183P88142m38007j227175j771866j795795
3165B7681214j509857j269326j081562q82992n34105l40759m71142m38449m07208
$$ plain form
3156 20745814 20337996 20100222 19986069 19786196 19613566 19503545 19330935 19307920 19292530 19113148
3146 19113148 19059177 19130052 19087396 19234862 19135856 19168570 19438426 19459182 19577585 19729824
3136 19729824 19850553 19855237 19819314 19918068 20079348 19944363 20105339 20224189 20349620 20692963
3126 20692963 20973505 21086814 21223137 21539029 21753420 22212567 22529465 22966684 23206879
3117 23206879 23658572 24351471 24805702 25111603 25504009 25759118 25989740 26479650 26958242
3108 26958242 27332065 28018375 28797143 29770624 30763935 31846412 33100741 34637300 35768956
3099 35768956 36693520 37122420 37120125 36593811 36005301 35486167 35187512 34873008 34669766 34762969
3089 34762969 34929918 35325358 35696088 36098567 36773396 37664118 38670788 39972193 41195576
$$ packed form
3156B0745814m07818k37774j14153j99873j72630j10021j72610k3015j5390j79382
3146A9113148n3971P0875m2656J47466r9006L2714K69856K0756J18403J52239
3136A9729824J20729M684l5923R8754J61280j34985J60976J18850J25431L43343
3126B0692963K80542J13309J36323L15892K14391M59147L16898M37219K40195
3117B3206879M51693O92899M54231L05901L92406K55109K30622M89910M78592
3108B6958242L73823O86310P78768R73481R93311J082477J254329J536559J131656
3099C5768956R24564M28900k295n26314n88510n19134k98655l14504k03242R3203
3089C4762969J66949L95440L70730M02479O74829Q90722J006670J301405J223383
$$ plain form
3080 41195576 42551561 44215106 46242681 48637258 51289046 54273736 57496794 60727550
3072 60727550 63902621 66724560 68894799 70684106 71774320 71931215 71352441 69637713
3064 69637713 67358228 64840106 62332006 60207992 58459954 57231962 56491514 56053610
3056 56053610 55987373 56463848 57452922 58753612 60616012 62966756 65575483 68580803 71597121
3047 71597121 74951015 78366405 82143469 86520863 91443376 95523832 97311892 97804854
3039 97804854 97764810 97084640 95225284 92263226 88377071 83940622 79083978 74042635 69439302
3030 69439302 65586114 61837595 58727096 56260023 54133014 52499785 51424122 50708488
3022 50708488 50062755 49789556 49828199 49997661 50700580 51768328 53213979 54969906 56955972
$$ packed form
3080D1195576J355985J663545K027575K394577K651788K984690L223058L230756
3072F0727550L175071K821939K170239J789307J090214J56895n78774j714728
3064F9637713k279485k518122k508100k124014j748038j227992p40448m37904
3056E6053610o6237M76475R89074J300690J862400K350744K608727L005320L016318
3047G1597121L353894L415390L777064M377394M922513M080456J788060M92962
3039I7804854m0044o80170j859356k962058l886155m436449m856644n041343m603333
3030F9439302l853188l748519l110499k467073k127009j633229j075663p15634
3022E0708488o45733k73199L8643J69462P02919J067748J445651J755927J986066
$$ plain form
3013 56955972 59352509 61596482 63511466 64649449 64657201 63881274 62412953 60590638 58450077
3004 58450077 55838331 53001324 49774877 46687507 44147432 41659756 39714244 38000516
2996 38000516 36395843 35032539 34037889 33276479 32639598 31883852 31290308 30770159 30393522
2987 30393522 30059597 30025697 29998345 29885085 30129159 30511450 30723159 31318728 31510165 31455570
2977 31455570 31141811 30241630 29109673 27726176 26406085 25231554 24249817 23197611 22262477
2968 22262477 21471073 20692880 20086405 19673108 19115275 18505371 18109051 17812074 17418278
2959 17418278 16990350 16559597 16357598 16185048 16024603 15989159 15861153 15696270 15741422 15575524
2949 15575524 15288703 15224290 15244908 14868092 14581582 14761030 14724247 14505062 14450650 14376236
$$ packed form
3013E6955972K396537K243973J914984J137983P752p75927j468321j822315k140561
3004E8450077k611746k837007l226447l087370k540075k487676j945512j713728
2996C8000516j604673j363304r94650p61410o36881p55746n93544n20149l76637
2987C0393522l33925l3900k7352j13260K44074L82291K11709N95569J91437n4595
2977C1455570l13759r00181j131957j383497j320091j174531r81737j052206r35134
2968B2262477p91404p78193o06475m13297n57833o09904l96320k96977l93796
2959A7418278m27928m30753k01999j72550j60445l5444j28006j64883M5152j65898
2949A5575524k86821o4413K0618l76816k86510J79448l6783k19185n4412p4414
$$ plain form
2939 14376236 14301462 14242069 14091833 13853631 13800073 13696211 13765531 13529960 13261715 13055265
2929 13055265 12831505 12650799 12446674 12406827 12316157 12221593 12252297 12189637 12385252 12202892
2919 12202892 12290293 12366652 12347621 12466454 12562065 12398793 12367157 12532781 12250980 12257255 12071692
2908 12071692 12085910 12201987 12114655 11993124 11717691 11626616 11491735 11318879 11445150 11133263
2898 11133263 10849495 10868377 10535340 10344404 10264037 10083680 10023622 10007486 9915201 9850477
2888 9850477 9815651 9810232 9911355 10081950 9956368 10038972 10319806 10468897 10615368 10672534
2878 10672534 10547154 10536198 10424935 10395102 10306806 10137195 10028225 9698466 9465787 9148681
2868 9148681 8985805 8780343 8507296 8315286 8142905 7739823 7565000 7631239 7516849 7390780
$$ packed form
2939A4376236p4774n9393j50236k38202n3558j03862O9320k35571k68245k06450
2929A3055265k23760j80706k04125l9847r0670r4564L0704o2660J95615j82360
2919A2202892Q7401P6359j9031J18833R5611j63272l1636J65624k81801O275j85563
2908A2071692J4218J16077q7332j21531k75433r1075j34881j72856J26271l11887
2898A1133263k83768J8882l33037j90936q0367j80357o0058j6136r2285o4724
2888I850477l4826n419J01123J70595j25582Q2604K80834J49091J46471N7166
2878A0672534j25380j0956j11263k9833q8296j69611j08970l29759k32679l17106
2868I148681j62876k05462k73047j92010j72381m03082j74823O6239j14390j26069
$$ plain form
2858 7390780 7308374 7117105 6950957 6901056 6908909 6789293 6636368 6446876 6491288 6528235 6368519
2847 6368519 6140949 6101158 6111036 6202564 6211690 6110070 6159769 5963574 5922651 6084147 5867559
2836 5867559 5649314 5695290 5623415 5688714 5523651 5455846 5435488 5316405 5274638 5171729 5234949
2825 5234949 5175383 5012521 5003203 4950167 4874920 4925861 4893209 4885163 4882941 4790693 4737150 4890447
2813 4890447 4884764 5000067 5121892 5102542 5180203 5349939 5277277 5372576 5349163 5095828 5088533
2802 5088533 5053998 5110533 5075476 5100848 5191231 5018412 4845470 4798576 4785919 4626009 4546750
2791 4546750 4561309 4488551 4517977 4540077 4413062 4347722 4375374 4462676 4529888 4669441 4523781
2780 4523781 4628763 4683215 4558442 4599677 4635038 4438467 4251088 4319128 4278247 4163312
$$ packed form
2858G390780q2406j91269j66148m9901P853j19616j52925j89492M4412L6947j59716
2847F368519k27570l9791R878R1528R126j01620M9699j96195m0923J61496k16588
2836E867559k18245M5976p1875O5299j65063o7805k0358j19083m1767j02909O3220
2825E234949n9566j62862r318n3036p5247N0941l2652q046k222r2248n3543J53297
2813D890447n683J15303J21825j9350P7661J69736p2662R5299k3413k53335p295
2802E088533l4535N6535l5057K5372R0383j72819j72942m6894j2657j59910p9259
2791D546750J4559p2758K9426K2100j27015o5340K7652Q7302O7212J39553j45660
2780D523781J04982N4452j24773M1235L5361j96571j87379O8040m0881j14935
$$ plain form
2770 4163312 4246158 4305484 4052182 4047653 3891746 3905035 3967893 3788984 3726804 3894131 3799279
2759 3799279 3853726 3810770 3761272 3692571 3720195 3917606 4072436 4128903 4066577 3888508 3893975
2748 3893975 3970691 3921173 3806264 3781990 3728919 3626589 3528627 3533257 3429188 3398690 3374316
2737 3374316 3288993 3476825 3428761 3336856 3280608 3321514 3347359 3303967 3282450 3195729 3169317
2726 3169317 3169938 3174816 3192037 3180864 3236409 3136053 3171828 3156940 3007438 2930309 3002503 2927793
2714 2927793 3040849 3110404 2913749 2867777 2832436 2901422 2938079 2750001 2799123 2787969 2547661
2703 2547661 2596590 2632874 2525306 2723764 2857757 2694399 2728059 2826741 2798139 2640648
2693 2640648 2697158 2802140 2595888 2642393 2704899 2737718 2937194 3066075 2926794 2764155
$$ packed form
2770D163312Q2846N9326k53302m529j55907J3289O2858j78909o2180J67327r4852
2759C799279N4447m2956m9498o8701K7624J97411J54830N6467o2326j78069N467
2748C893975P6716m9518j14909k4274n3071j02330r7962M630j04069l0498k4374
2737C374316q5323J87832m8064r1905n6248M0906K5845m3392k1517q6721k6412
2726C169317O21M878J7221j1173N5545j00356L5775j4888j49502p7129P2194p4710
2714B927793J13056O9555j96655m5972l5341O8986L6657j88078M9122j1154k40308
2703B547661M8929L6284j07568J98458J33993j63358L3660R8682k8602j57491
2693B640648N6510J04982k06252M6505O2506L2819J99476J28881j39281j62639
$$ plain form
2683 2764155 2955692 3076831 2927687 3008072 2969154 2938333 3129784 3345737 3257126 3150798
2673 3150798 3179791 3173695 3228162 3226137 3329233 3241445 3280841 3310772 3278593 3304622 3285708 3424167
2661 3424167 3399436 3266258 3444312 3348997 3226454 3392461 3637640 3759345 3713186 3764621
2651 3764621 3896224 3988327 4044556 4091550 4120862 4204462 4290641 4489482 4617211 4615079 4534322
2640 4534322 4313219 4214199 4327766 4511067 4520915 4328941 4294790 4345293 4309227 4451127 4300865
2629 4300865 4206891 4337651 4461628 4457615 4552999 4743641 4609037 4558131 4697866 4629773 4746055
2618 4746055 4943452 4846214 4868090 4773762 4783662 4865577 4717531 4640556 4590707 4351518 4355476
2607 4355476 4569016 4443236 4277870 4227510 4325105 4392218 4204369 4116605 4043938 4152058
$$ packed form
2683B764155J91537J21139j49144Q0385l8918l0821J91451K15953q8611j06328
2673C150798K8993o096N4467k025J03096q7788L9396K9931l2179K6029j8914J38459
2661C424167k4731j33178J78054r5315j22543J66007K45179J21705m6159N1435
2651C764621J31603R2103N6229M6994K9312Q3600Q6179J98841J27729k132q0757
2640D534322k21103r9020J13567J83301R848j91974l4151N0503l6066J41900j50262
2629D300865r3974J30760J23977m013R5384J90642j34604n0906J39735o8093J16282
2618D746055J97397r7238K1876r4328R900Q1915j48046p6975m9849k39189L958
2607D355476K13540j25780j65366n0360R7595O7113j87849q7764p2667J08120
$$ plain form
2597 4152058 4222013 4127040 4253218 4237144 4182140 4131166 4144792 4068422 3905054 4022715 3889883
2586 3889883 3760461 3657878 3601891 3604798 3681479 3725433 3593429 3508390 3406724 3457328 3161054
2575 3161054 3071321 3062089 3130084 3020284 2906563 2948170 2914272 3038894 3033286 2883860 2941724
2564 2941724 2890967 2785109 2892016 2823850 2766114 2740381 2888177 2709722 2702221 2665302 2628391
2553 2628391 2598073 2460429 2434929 2430899 2381041 2385532 2462263 2389912 2387919 2398039 2271544 2271844
2541 2271844 2316483 2240315 2015994 1921131 1981564 2083647 2226309 2129441 2004788 1968322 2017596
2530 2017596 2103666 1933100 1677608 1676486 1912221 1888915 1837105 1972179 1633093 1531064
2520 1531064 1756430 1744718 1753639 1834460 1834092 1821052 1849030 1771999 1781812 1805712 1705487 1557957
$$ packed form
2597D152058O9955r4973J26178j6074n5004n0974J3626p6370j63368J17661j32832
2586C889883j29422j02583n5987K907P6681M3954j32004q5039j01666N0604k96274
2575C161054q9733r232O7995j09800j13721M1607l3898J24622n608j49426N7864
2564B941724n0757j05858J06907o8166n7736k5733J47796j78455p501l6919l6911
2553B628391l0318j37644k5500m030m9858M491P6731p2351j993J0120j26495L00
2541B271844M4639p6168k24321r4863O0433J02083J42662r6868j24653l6466M9274
2530B017596Q6070j70566k55492j122K35735k3306n1810J35074l39086j02029
2520A531064K25366j1712Q921Q0821l68j3040K7978p7031R813K3900j00225j47530
$$ plain form
2508 1557957 1599132 1581022 1640710 1638441 1609465 1763841 1907935 1833490 1602900 1503160 1729299
2497 1729299 1794046 1705458 1766267 1715849 1684128 1606916 1643666 1666275 1635566 1697794 1717673
2486 1717673 1651236 1801444 1791831 1720409 1665061 1593272 1592041 1508960 1753541 1819097 1714477
2475 1714477 1491032 1527743 1579390 1476901 1448119 1594824 1729754 1588282 1559680 1533066
2465 1533066 1516560 1667425 1694504 1504464 1588612 1618342 1517526 1586498 1724367 1803518 1651191
2454 1651191 1365906 1385587 1580683 1618288 1600301 1562355 1438489 1464407 1496189 1591805 1533929
2443 1533929 1482542 1544322 1539073 1538001 1526948 1373475 1495107 1388797 1440486 1437864 1402575
2432 1402575 1566994 1689360 1655570 1597461 1601459 1420955 1444486 1524561 1523675 1528402 1491938 1426550
$$ packed form
2508A557957M1175j8110N9688k269k8976J54376J44094p4445k30590r9740K26139
2497A729299O4747q8588O0809n0418l1721p7212L6750K2609l0709O2228J9879
2486A717673o6437J50208r613p1422n5348p1789j231q3081K44581O5556j04620
2475A714477k23445L6711N1647j02489k8782J46705J34930j41472k8602k6614
2465A533066j6506J50865K7079j90040Q4148K9730j00816O8972J37869P9151j52327
2454A651191k85285J9681J95096L7605j7987l7946j23866K5918L1782R5616n7876
2443A533929n1387O1780n249j072j1053j53473J21632j06310N1689k622l5289
2432A402575J64419J22366l3790n8109L998j80504K3531Q0075q86M727l6464o5388
$$ plain form
2420 1426550 1406253 1578947 1606089 1635411 1628754 1403093 1473252 1527175 1392021 1460341 1483590
2409 1483590 1478235 1567655 1528967 1388216 1494901 1421371 1289283 1392910 1468180 1560352 1646250
2398 1646250 1622657 1484607 1558617 1400068 1283238 1497739 1655981 1546149 1525767 1613928
2388 1613928 1551449 1556944 1606646 1501804 1630990 1588581 1629225 1640298 1607638 1584863 1460899
2377 1460899 1568888 1540873 1640609 1550740 1453813 1443778 1456328 1408468 1423495 1486695 1531060
2366 1531060 1633643 1539523 1518407 1599018 1548538 1541865 1643435 1565431 1694222 1871395 1808386
2355 1808386 1589142 1642079 1677669 1732588 1693375 1700282 1618770 1506864 1535553 1773447 1907190
2344 1907190 1704237 1647443 1623615 1551691 1765474 1956291 1827548 1682118 1797729 1842742
$$ packed form
2420A426550k0297J72694K7142K9322o657k25661P0159N3923j35154O8320K3249
2409A483590n355Q9420l8688j40751J06685p3530j32088J03627P5270R2172Q5898
2398A646250k3593j38050P4010j58549j16830K14501J58242j09832k0382Q8161
2388A613928o2479N495M9702j04842J29186m2409M0644J1073l2660k2775j23964
2377A460899J07989k8015R9736q9869r6927j0035J2550m7860J5027O3200M4365
2366A531060J02583r4120k1116Q0611n0480o673J01570p8004J28791J77173o3009
2355A808386k19244N2937L5590N4919l9213O907q1512j11906K8689K37894J33743
2344A907190k02953n6794k3828p1924K13783J90817j28743j45430J15611M5013
$$ plain form
2334 1842742 1740891 1571534 1665642 1698029 1738383 1824848 1783331 1770842 1824484 1937016 1929354
2323 1929354 1848509 2004997 2136692 2085212 2290826 2337512 2097084 1999680 2044724 2049353 2162127
2312 2162127 2145117 2146699 2191490 2111168 2173828 2250422 2210739 2105574 2201666 2091788 2015988
2301 2015988 2152008 2263890 2329226 2316081 2319054 2435036 2614530 2534401 2421081 2477252 2642336
2290 2642336 2612673 2727719 2718840 2649485 2625268 2842309 2784975 2794339 2806325 2799945 2826732 2943413
2278 2943413 2889418 2959437 2974195 2941620 3148987 3131639 3105784 3109657 3143187 3178710 3322646
2267 3322646 3479270 3532782 3605583 3569306 3639488 3664883 3522631 3635326 3858977 3872991 3912038
2256 3912038 4042937 3992145 3962309 3936869 4098315 4184001 4316063 4314561 4261001 4462582 4423697
$$ packed form
2334A842742j01851j69357R4108L2387M0354Q6465m1517j2489N3642J12532p662
2323A929354q0845J56488J31695n1480K05614M6686k40428r7404M5044M629J12774
2312B162127j7010J582M4791q0322O2660P6594l9683j05165R6092j09878p5800
2301B015988J36020J11882O5336j3145K973J15982J79494q0129j13320N6171J65084
2290B642336k9663J15046q879o9355k4217K17041n7334R364J1986o380K6787J16681
2278B943413n3995P0019J4758l2575K07367j7348k5855L873L3530L5523J43936
2267C322646J56624N3512P2801l6277P0182K5395j42252J12695K23651J4014L9047
2256C912038J30899n0792k9836k5440J61446Q5686J32062j502n3560K01581l8885
$$ plain form
2245 4423697 4537096 4625844 4688883 4792588 4734325 4893992 5069439 5162478 5122574 5160357 5355101
2234 5355101 5341047 5486604 5701641 5650324 5800836 5981993 6038341 5950349 5969926 6167441
2224 6167441 6251483 6523736 6703596 6725934 6965463 7046915 7303746 7355038 7531798 7717606
2214 7717606 7701237 7860408 8157325 8340077 8338035 8494539 8660535 8929153 9194483 9372947
2204 9372947 9491282 9696158 9944341 10190421 10476410 10647704 10998099 11459137 11787072 12234139
2194 12234139 12717253 13072961 13327127 13840656 14429570 14996652 15639559 16251248 16960805
2185 16960805 17846741 18598731 19659816 20829207 22086693 23451874 24852032 26302704
2177 26302704 27677264 29181955 30580980 31867401 33176658 33738338 33899109 33809772 32979867
$$ packed form
2245D423697J13399Q8748O3039J03705n8263J59667J75447R3039l9904L7783J94744
2234E355101j4054J45557K15037n1317J50512J81157N6348q7992J9577J97515
2224F167441Q4042K72253J79860K2338K39529Q1452K56831N1292J76760J85808
2214G717606j6369J59171K96917J82752k042J56504J65996K68618K65330J78464
2204I372947J18335K04876K48183K46080K85989J71294L50395M61038L27935M47067
2194A2234139M83114L55708K54166N13529N88914N67082O42907O11689P09557
2185A6960805Q85936P51990J061085J169391J257486J365181J400158J450672
2177B6302704J374560J504691J399025J286421J309257N61680J60771q9337q29905
$$ plain form
2168 32979867 31811822 30257674 28573705 27047757 25744825 24553982 23409147 22311903
2160 22311903 21515840 20609153 19755146 19019322 18525883 17905518 17277263 16822498 16472428
2151 16472428 15972536 15813686 15510732 15040452 14931945 14928428 14802780 14652852 14582826 14449656
2141 14449656 14602472 14962748 15243296 15639047 15535220 14879652 14179711 13493790 13022096
2132 13022096 12427731 11898043 11484823 11266041 10876696 10541849 10393635 10237729 9950913
2123 9950913 9616897 9383555 9163097 8808842 8767696 8760535 8865007 8796266 8682658 8614090
2113 8614090 8492750 8698002 8954337 9005680 9139465 9462427 10030562 10726592 11661815 12603288
2103 12603288 12559710 11603540 10330478 9375103 8791759 8369098 7904949 7413765 7180198
$$ packed form
2168C2979867j168045j554148j683969j525948j302932j190843j144835j097244
2160B2311903p96063r06687q54007p35824m93439o20365o28255m54765l50070
2151A6472428m99892j58850l02954m70280j08507l517j25648j49928p0026j33170
2141A4449656J52816L60276K80548L95751j03827o55568o99941o85921m71694
2132A3022096n94365n29688m13220k18782l89345l34847j48214j55906k86816
2123I950913l34016k33342k20458l54255m1146p161J04472o8741j13608o8568
2113H614090j21340K05252K56335N1343J33785L22962N68135O96030R35223R41473
2103A2603288m3578r56170j273062r55375n83344m22661m64149m91184k33567
$$ plain form
2094 7180198 6901969 6588397 6389612 6260513 6170240 6081953 5837506 5686321 5450303 5402659
2084 5402659 5467893 5568786 5592704 5450962 5320675 5368242 5538803 5615442 5691172 5755438 5807198
2073 5807198 6189806 6605190 6990431 7383482 7200535 6713630 6222701 5865039 5483093 5106000
2063 5106000 4870012 4536852 4456998 4327343 4227057 4148189 3940855 4142469 3954081 3794043
2053 3794043 3744896 3712326 3622638 3584660 3505444 3465159 3420796 3550174 3439014 3341598 3312708
2042 3312708 3196294 3062370 3214627 3270665 3294267 3109730 2997244 2945699 3094050 3138410
2032 3138410 2995278 2901085 2904940 3062954 2981345 2884797 2908866 2933083 2653899 2783684 2876458
2021 2876458 2778041 2759664 2961915 2899509 2738484 2699990 2735883 2712804 2659023 2634422 2752342
$$ packed form
2094G180198k78229l13572j98785j29099r0273q8287k44447j51185k36018m7644
2084E402659O5234J00893K3918j41742j30287M7567J70561P6639P5730O4266N1760
2073E807198L82608M15384L85241L93051j82947m86905m90929l57662l81946l77093
2063E106000k35988l33160p9854j29655j00286p8868k07334K01614j88388j60038
2053C794043m9147l2570q9688l7978p9216m0285m4363J29378j11160r7416k8890
2042C312708j16414j33924J52257N6038K3602j84537j12486n1545J48351M4360
2032C138410j43132r4193L855J58014q1609r6548K4069K4217k79184J29785R2774
2021B876458r8417j8377K02251o2406j61025l8494L5893k3079n3781k4601J17920
$$ plain form
2010 2752342 2644980 2567178 2643326 2682417 2769464 2627987 2750913 2643743 2605750 2651382 2560291
1999 2560291 2529886 2500306 2416585 2408739 2643893 2487555 2386464 2418343 2431277 2390665 2358035
1988 2358035 2160227 2195241 2277395 2158125 2205904 2355818 2305312 2210685 2198250 2313775 2465210
1977 2465210 2319785 2181660 2273853 2281762 2230175 2185771 1960524 1776796 1908816 2088085
1967 2088085 1991648 1929966 1891225 1737113 1836384 1974217 1820385 1872778 1863898 1757855 1722998
1956 1722998 1824498 1785160 1742016 1791975 1719790 1769018 1685131 1516646 1471872 1557446 1625133
1945 1625133 1827113 1796768 1771489 1737578 1615085 1516122 1670710 1532153 1592284 1449342
1935 1449342 1446816 1643313 1916322 1779198 1466739 1565697 1399873 1347659 1511530 1507349 1298533
$$ packed form
2010B752342j07362p7802P6148L9091Q7047j41477J22926j07170l7993M5632r1091
1999B560291l0405k9580q3721p846K35154j56338j01091L1879J2934m0612l2630
1988B358035j97808L5014Q2154j19270M7779J49914n0506r4627j2435J15525J51435
1977B465210j45425j38125R2193P909n1587m4404k25247j83728J32020J79269
1967B088085r6437o1682l8741j54112R9271J37833j53832N2393q880j06043l4857
1956A722998J01500l9338m3144M9959p2185M9228q3887j68485m4774Q5574O7687
1945A625133K01980l0345k5279l3911j22493r8963J54588j38557O0131j42942
1935A449342k526J96497K73009j37124l12459R8958j65824n2214J63871m181k08816
$$ plain form
1924 1298533 1385230 1432186 1448746 1413007 1527327 1596485 1481503 1336839 1329785 1558771 1653069
1913 1653069 1558510 1647536 1528638 1551345 1681452 1579086 1481418 1555721 1428288 1536084
1903 1536084 1551724 1363219 1326935 1539454 1498092 1431200 1509896 1541817 1691938 1784604 1729289
1892 1729289 1649403 1636662 1685395 1908179 1933713 1900478 1860422 1860063 1821133 1758312 1894232
1881 1894232 1913107 1765835 1674763 1779332 1796956 1828046 1834859 2103734 2152057 2013633 2109863
1870 2109863 2125022 2028890 2188006 2301369 2231312 2214137 2296990 2326343 2376084 2435970 2522582
1859 2522582 2655699 2646192 2585417 2496280 2654687 2807940 2924799 2922307 2995201 2933491 3025825
1848 3025825 3373822 3581444 3595943 3826129 3852409 3795110 4058382 4070382 4250482 4334366
$$ packed form
1924A298533Q6697M6956J6560l5739J14320O9158j14982j44664p054K28986R4298
1913A653069r4559Q9026j18898K2707J30107j02366r7668P4303j27433J07796
1903A536084J5640j88505l6284K12519m1362o6892P8696L1921J50121R2666n5315
1892A729289p9886j2741M8733K22784K5534l3235m0056l59l8930o2821J35920
1881A894232J8875j47272r1072J04569J7624L1090O813K68875M8323j38424R6230
1870B109863J5159r6132J59116J13363p0057j7175Q2853K9353M9741N9886Q6612
1859B522582J33117r507o0775q9137J58407J53253J16859k492P2894o1710R2334
1848C025825L47997K07622J4499K30186K6280n7299K63272J2000J80100Q3884
$$ plain form
1838 4334366 4451747 4578410 4622169 4701441 4841719 4850152 4852487 4928422 4836748 4867047 5025315
1827 5025315 5059157 5049117 5129964 5146576 5413467 5547349 5693940 6105229 6273906 6369342
1817 6369342 6397144 6794678 7189568 7379349 7691598 7942495 8215222 8478990 8850240 9114907
1807 9114907 9370621 9384861 9276127 8925077 8638670 8323976 7921804 7824248 7743389 7687590
1797 7687590 7573412 7371963 7434246 7495588 7751979 7860338 7932851 8144538 8326854 8564731
1787 8564731 8736706 8759933 8872217 9104762 9332235 9644895 9916967 10078830 9956365 9863577
1777 9863577 9705660 9532799 9475511 9197252 8882140 8530745 8390247 8011091 7593398 7501238
1767 7501238 7191576 6939627 6906369 6829053 6783172 6798806 6830436 6923538 6994577 7034149 6930794
$$ packed form
1838D334366J17381J26663M3759P9272J40278Q433K335P5935r1674L0299J58268
1827E025315L3842j0040Q0847J6612K66891J33882J46591M11289J68677R5436
1817F369342K7802L97534L94890J89781L12249K50897K72727K63768L71250K64667
1807I114907K55714J4240j08734l51050k86407l14694m02172r7556q0859n5799
1797G687590j14178k01449O2283O1342K56391J08359P2513K11687J82316K37877
1787H564731J71975K3227J12284K32545K27473L12660K72072J61863j22465r2788
1777I863577j57917j72861n7288k78259l15112l51395j40498l79156m17693r2160
1767G501238l09662k51949l3258p7316m5881J5634L1630R3102P1039L9572j03355
$$ plain form
1756 6930794 6924049 6855319 6869926 6681546 6549259 6578251 6464730 6084443 5898462 5562110
1746 5562110 5189753 4988542 4759233 4513033 4373681 4240747 4094531 3916994 3726371 3691074
1736 3691074 3512437 3376322 3163299 3010197 2909788 2886405 2909748 2857525 2750289 2732884
1726 2732884 2584236 2426245 2497391 2525159 2290827 2157299 2161298 2088002 2111476 2043104 1921915
1715 1921915 2012536 1987448 1821534 1660708 1673967 1693532 1698231 1569167 1545660 1515486 1382475
1704 1382475 1406907 1498915 1353315 1177416 1188284 1282795 1236159 1095749 1108498 991165 1042337
1693 1042337 995517 1006334 1202222 1333235 1131299 1135453 1011321 710469 803339 898002 938180
1682 938180 980144 1029188 986462 1026484 887918 824815 918452 963902 1047193 901631 739030
$$ packed form
1756F930794o745o8730J4607j88380j32287K8992j13521l80287j85981l36352
1746E562110l72357k01211k29309k46200j39352j32934j46216j77537j90623l5297
1736C691074j78637j36115k13023j53102j00409k3383K3343n2223j07236j7405
1726B732884j48648j57991P1146K7768k34332j33528L999p3296K3474o8372j21189
1715A921915R0621k5088j65914j60826J3259J9565M699j29064k3507l0174j33011
1704A382475K4432R2008j45600j75899J0868R4511m6636j40410J2749j17333N1172
1693A042337m6820J0817J95888J31013k01936M154j24132l00852R2870R4663M0178
1682I38180M1964M9044m2726M0022j38566o3103R3637M5450Q3291j45562j62601
$$ plain form
1671 739030 856722 751542 710497 626358 666120 726534 700703 662412 746409 822389 718352
1660 718352 638450 672572 691079 491987 617634 635963 547555 373189 502473 561547 483152
1649 483152 547811 412693 514894 597717 499643 457255 484709 473088 507763 347161 285565
1638 285565 413418 455270 410937 497181 491936 263311 251987 339540 325210 236617 116307
1627 116307 86428 294118 84962 80432 208874 255648 323895 354413 122737 176317 121831
1616 121831 160611 223988 111057 166329 243533 271674 222603 238703 242383 212908 227967 134584
1604 134584 153315 171439 198078 107767 45857 213611 282361 188534 86117 108130 105789
1593 105789 80706 83179 62658 44594 33116 -459 46582 -1621 -10347 50328 8179 41796
$$ packed form
1671G39030J17692j05180m1045q4139L9762O0414k5831l8291Q3997P5980j04037
1660G18352p9902L4122J8507j99092J25647J8329q8408j74366J29284N9074p8395
1649D83152O4659j35118J02201Q2823r8074m2388K7454j1621L4675j60602o1596
1638B85565J27853M1852m4333Q6244n245k28625j1324Q7553j4330q8593j20310
1627A16307k9879K07690k09156m530J28442M6774O8247L0518k31676N3580n4486
1616A21831L8780O3377j12931N5272P7204K8141m9071J6100L680k9475J5059r3383
1604A34584J8731J8124K6639r0311o1910J67754O8750r3827j02417K2013k341
1593A05789k5083K473k0521j8064j1478l3575M7041m8203q726O0675m2149L3617
$$ plain form
1581 41796 104880 7420 100877 -75291 -156185 -18332 13896 45078 -19 -11534 -29506
1570 -29506 -16891 84706 -207323 -116501 -86539 -58357 137238 252554 178780 169793 71830
1559 71830 78253 79253 208968 241691 180123 217582 186171 99430 -112268 -79914 17588 -3057
1547 -3057 81475 66281 -2626 62971 98546 98708 -91144 81764 162970 188837 164354 170845
1535 170845 137040 149182 103384 294154 236138 53078 116081 83128 109557 108404 230147
1524 230147 121341 -126321 -59630 -69387 -65935 -29093 7784 13368 -23215 130563 82773 116300
1512 116300 59451 37003 62520 74826 -17279 18341 -37528 172526 165079 -18535 -34152
1501 -34152 -72858 10177 164514 110983 210697 272248 49148 -1444 -7096 27602 -49113 -56715
$$ packed form
1581D1796O3084r7460R3457j76168q0894J37853L2228L1182m5097j1515j7972
1570b9506J2615J01597k92029R0822K9962K8182J95595J15316p3774q987r7963
1559G1830O423J000J29715L2723o1568L7459l1411q6741k11698L2354R7502k0645
1547c057Q4532j5194o8907O5597L5575J62j89852J72908Q1206K5867k4483O491
1535A70845l3805J2142m5798J90770n8016j83060O3003l2953K6429j153J21743
1524B30147j08806k47662O6691r757L452L6842L6877N584l6583J53778m7790L3527
1512A16300n6849k2448K5517J2306r2105L5620n5869K10054p447j83614j5617
1501c4152l8706Q3035J54337n3531R9714O1551k23100n0592n652L4698p6715p602
$$ plain form
1489 -56715 -50251 97520 53909 -74271 37719 69690 101831 -112763 -136833 47007 -110523
1478 -110523 -243538 -130260 -2835 -66737 29489 81798 51799 86336 40800 24609 -6896
1467 -6896 48612 14103 36799 45958 53591 37434 -352728 -64957 57401 101846 154056 39714
1455 39714 76305 231675 131465 -75761 -94233 -117968 -156614 10664 -16906 -31317 77835
1444 77835 -79198 -142508 -128968 -81502 14108 56221 52664 -66513 46713 -1701 -10692 109583
1432 109583 101580 84550 -61824 -174939 -63644 -16416 -32414 39699 -88817 -105831 -157746
1421 -157746 15797 117600 164680 150137 -125577 -70168 -90040 -198251 -37475 -212945
1411 -212945 -316368 -166431 57245 293688 103092 -37183 75756 88734 145879 9643
$$ packed form
1489e6715O464J47771m3611j28180J11990L1971L2141k14594k4070J83840j57530
1478a10523j33015J13278J27425o3902R6226N2309k9999L4537m5536j6191l1505
1467f896N5508l4509K2696R159P633j6157l90162K87771J22358M4445N2210j14342
1455C9714L6591J55370j00210k07226j8472k3735l8646J67278k7570j4411J09152
1444G7835j57033o3310J3540M7466R5610M2113l557j19177J13226m8414q991J20275
1432A09583q003j7030j46374j13115J11295M7228j5998P2113j28516j7014n1915
1421a57746J73543J01803M7080j4543k75714N5409j9872j08211J60776j75470
1411b12945j03423J49937K23676K36443j90596j40275J12939J2978N7145j36236
$$ plain form
1401 9643 -49488 57315 3437 -11849 -14296 -93604 -47868 -43554 -115667 -12072 -84390 -216849
1389 -216849 -143474 -121116 -56107 -72616 -9255 11935 19110 -72043 -86666 77730 -6134 -51204
1377 -51204 -24921 13028 -84952 29565 66371 -35356 2456 -64018 -28297 132363 39145
1366 39145 -93326 -46244 8463 -22734 -18675 -102224 -148781 -8321 -8161 71045 102113 174218
1354 174218 108876 47029 -8898 -53697 -25052 -80633 51716 26932 81830 -19071 -136537
1343 -136537 -20740 16783 76476 -7242 -48913 -179739 -333624 -117250 1575 -50627 -45689
1332 -45689 92358 -63387 -214889 -83986 -146232 -114454 109939 35047 14831 -34510 -102327
1321 -102327 -30124 -37392 -20958 152028 -31119 -115228 -63089 90217 146782 -52955 -6500
$$ packed form
1401I643n9131J06803n3878j5286k447p9308M5736M314p2113J03595p2318j32459
1389b16849P3375K2358O5009j6509O3361K1190P175r1153j4623J64396q3864m5070
1377e1204K6283L7949r7980J14517L6806j01727L7812o6474L5721J60660r3218
1366C9145j32471M7082N4707l1197M059q3549m6557J40460J60P9206L1068P2105
1354A74218o5342o1847n5927m4799K8645n5581J32349k4784N4898j00901j17466
1343a36537J15797L7523N9693q3718m1671j30826j53885K16374J18825n2202M938
1332d5689J38047j55745j51502J30903o2246L1778K24393p4892k0216m9341o7817
1321a02327P2203p268J6434J72986j83147q4109N2139J53306N6565j99737M6455
$$ plain form
1310 -6500 -36175 -111484 -150919 -14009 186950 195124 105571 93392 59903 76598 -44701 -71576
1298 -71576 -30974 194823 65778 -4520 -137272 -166401 35064 233367 111930 -55718
1288 -55718 -37795 28878 16508 107665 74625 68545 21136 14024 -94746 -59013 -59503 -95825
1276 -95825 -74892 -95574 -48638 -54837 -115515 -106006 -9801 18702 6786 -72171 54869 111642
1264 111642 110443 -68343 -83971 53805 45319 39511 31776 15529 43333 98186 96281 48226
1252 48226 -30085 -5569 164125 129761 151796 211264 291420 119540 212797 439120 510709
1241 510709 461035 494504 526235 402207 257273 162333 193550 164950 90714 -53274 -215029
1230 -215029 44658 140593 223401 234392 291998 82198 117867 237185 283889 99370 -126769
$$ packed form
1310f500k9675p5309l9435J36910K00959Q174q9553j2179l3489J6695j21299k6875
1298g1576M0602K25797j29045p0298j32752k9129K01465J98303j21437j67648
1288e5718J7923O6673j2370R1157l3040o080m7409p112j08770L5733m90l6322
1276i5825K0933k0682M6936o199o0678R509R6205K8503j1916p8957J27040N6773
1264A11642j199j78786j5628J37776q486n808p735j6247K7804N4853j905m8055
1252D8226p8311K4516J69694l4364K2035N9468Q0156j71880R3257K26323P1589
1241E10709m9674L3469L1731j24028j44934r4940L1217k8600p4236j43988j61755
1230b15029K59687R5935Q2808J0991N7606k09800L5669J19318M6704j84519k26139
$$ plain form
1219 -126769 -33076 180384 112069 69607 83910 38069 167298 186731 120839 -125724 -22031
1208 -22031 43252 33152 78592 99976 51398 51933 55876 49982 134054 243127 243673 226952 167881
1195 167881 1828 -66141 -112710 38361 220776 245768 96269 -12437 73940 13033 11802
1184 11802 68682 262680 261707 126495 10140 47563 83401 59775 47857 56475 289411 287441
1172 287441 170260 300466 240460 239201 194773 143582 56787 219369 298601 125369 265544
1161 265544 123699 -21606 117185 125759 105354 257372 259850 320617 200589 244867 34182
1150 34182 113482 233121 80850 163814 212401 157522 179413 323012 385986 182333 553
1139 553 19988 53524 152331 233108 397508 361345 246878 269640 310068 278698 301399 299943
$$ packed form
1219a26769R3693K13460o8315m2462J4303m5841J29229J9433o5892k46563J03693
1208b2031O5283j0100M5440K1384m8578N35L943n894Q4072J09073N46j6721n9071
1195A67881j66053o7969m6569J51071J82415K4992j49499j08706Q6377o0907j231
1184A1802N6880J93998r73j35212j16355L7423L5838k3626j1918Q618K32936j970
1172B87441j17181J30206o0006j259m4428n1191q6795J62582P9232j73232J40175
1161B65544j41845j45305J38791Q574k0405J52018K478O0767j20028M4278k10685
1150C4182P9300J19639j52271Q2964M8587n4879K1891J43599O2974k03653j81780
1139E53J9435L3536R8807Q0777J64400l6163j14467K2762M0428l1370K2701j456
$$ plain form
1127 299943 331182 401588 377340 310384 350689 277371 167448 235112 285629 160197 212568
1116 212568 82631 165236 289794 209464 259600 274303 165151 213549 187386 364018 514006
1105 514006 505662 425016 332026 404969 351383 324829 439480 379436 476362 280127 283047 431723
1093 431723 595100 646504 545326 587169 471781 513933 385842 350772 619400 709532 658939
1082 658939 675098 699940 695962 787750 952147 837149 755637 838097 771463 782011 840851
1071 840851 743331 874665 931563 811340 927524 969689 894102 993538 1030237 981690 945796
1060 945796 1029335 1035839 1085470 1121269 1085015 1195374 1194686 1232619 1360061 1337637 1213602 1327840
1048 1327840 1399691 1344701 1372679 1466524 1479673 1488819 1543586 1421850 1539626 1564644 1530208
$$ packed form
1127B99943L1239P0406k4248o6956M0305p3318j09923O7664N0517j25432N2371
1116B12568j29937Q2605J24558q0330N0136J4703j09152M8398k6163J76632J49988
1105E14006q344q0646r2990P2943n3586k6554J14651o0044R6926j96235K920J48676
1093D31723J63377N1404j01178M1843j15388M2152j28091l5070K68628R0132n0593
1082F58939J6159K4842l978R1788J64397j14998q1512Q2460o6634J0548N8840
1071H40851r7520J31334N6898j20223J16184M2165p5587R9436L6699m8547l5894
1060I45796Q3539O504M9631L5799l6254J10359o88L7933J27442k2424j24035J14238
1048A327840P1851n4990K7978R3845J3149R146N4767j21736J17776K5018l4436
$$ plain form
1037 1530208 1663122 1567127 1561429 1943289 1957545 1845167 1867859 1881031 1930872 2067929 2172547
1026 2172547 2103428 2182185 2343899 2333034 2315069 2465691 2690350 2824212 2823148 2887531 2858942
1015 2858942 2682960 2759685 2873480 2821905 2727387 2866856 2978440 3008878 3255408 3349912
1005 3349912 3264914 3178310 3172350 3407441 3490864 3631646 3811181 3882101 3974554 4094777 4158482
994 4158482 4383108 4663530 4906109 5268491 5708673 6131147 6285059 6716747 6917816 7233437
984 7233437 7636218 7930955 8421886 8862472 9356526 9698291 10382818 10998022 11766246 12797711
974 12797711 14039640 15021651 15605953 16058785 17141488 18552402 20428188 22782058 26011700
965 26011700 29945646 34637359 40150912 47072731 55971484 68405786 84356003 104150506
$$ packed form
1037A530208J32914r5995n698L81860J4256j12378K2692J3172M9841J37057J04618
1026B172547o9119P8757J61714j0865j7965J50622K24659J33862j064O4383k8589
1015B858942j75982P6725J13795n1575r4518J39469J11584L0438K46530R4504
1005C349912q4998q6604n960K35091Q3423J40782J79535P0920R2453J20223O3705
994D158482K24626K80422K42579L62382M40182M22474J53912M31688K01069L15621
984G233437M02781K94737M90931M40586M94054L41765O84527O15204P68224J031465
974A2797711J241929R82011N84302M52832J082703J410914J875786K353870L229642
965B6011700L933946M691713N513553O921819Q898753J2434302J5950217J9794503
$$ plain form
957 104150506 111679324 95722597 74507599 59284971 49156892 41654371 35353329 29986486
949 29986486 26038572 23024949 20740708 18667881 17077953 15875714 14949171 14285558 13553445
940 13553445 12148301 10967559 9948271 9174676 8527485 8044226 7551637 7063103 6496820
931 6496820 6023592 5732947 5340462 5076241 4973722 4750463 4578655 4397406 4084945 3828022
921 3828022 3780710 3651829 3591988 3572762 3498921 3337872 3152355 3041178 3031038 2969390 2748365
910 2748365 2684499 2576682 2677465 2537969 2479826 2461915 2321312 2181923 2010807 1988043
900 1988043 2006849 2051812 1975521 1934754 1832652 1681819 1754426 1650205 1772739 1650446 1487738
889 1487738 1374204 1423636 1424898 1363236 1426902 1388951 1313663 1303251 1188596 1176368 1282128
$$ packed form
957A04150506P528818j5956727k1214998j5222628j0128079p502521o301042n366843
949B9986486l947914l013623k284241k072827j589928j202239r26543o63613p32113
940A3553445j405144j180742j019288p73595o47191m83259m92589m88534n66283
931F496820m73228k90645l92485k64221j02519k23259j71808j81249l12461k56923
921C828022m7312j28881n9841j9226p3841j61049j85517j11177j0140o1648k21025
910B748365o3866j07817J00783j39496n8143j7911j40603j39389j71116k2764
900A988043J8806M4963p6291m0767j02102j50833P2607j04221J22534j22293j62708
889A487738j13534M9432J262o1662O3666l7951p5288j0412j14655j2228J05760
$$ plain form
878 1282128 1184935 1149952 1107098 1167236 1078505 1104880 1161229 1113748 1041795 1038549 944950 929559
866 929559 972848 988952 719499 834447 891381 842890 778511 681369 649977 641713 625069 677663
854 677663 907246 887609 896646 757990 627133 696404 708031 592843 658770 562041 526938
843 526938 689041 663542 667000 476329 396493 591595 527853 665470 657517 574516 538332
832 538332 466778 357596 202899 393754 517731 438177 530221 426723 306458 228867 168361
821 168361 127893 98062 121433 201099 198024 258716 283196 366444 582850 496875 358047 367946
809 367946 374752 475619 382191 151082 186809 208184 -14565 -404 199215 245867 263562
798 263562 228259 187525 208565 302392 188025 122715 245895 150769 170376 156013 93205
$$ packed form
878A282128r7193l4983m2854O0138q8731K6375N6349m7481p1953l246r3599j5391
866I29559M3289J6104k69453J14948N6934m8491o4379r7142l1392q264j6644N2594
854F77663K29583j9637R037j38656j30857O9271J1627j15188O5927r6729l5103
843E26938J62103k5499L458j90671p9836J95102o3742J37617p953q3001l6184
832E38332p1554j09182j54697J90855J23977p9554R2044j03498j20265p7591o0506
821A68361m0468k9831K3371P9666l075O0692K4480Q3248K16406q5975j38828R899
809C67946O806J00867r3428k31109L5727K1375k22749J4161J99619M6652J7695
798B63562l5303m0734K1040R3827j14367o5310J23180r5126J9607j4363o2808
$$ plain form
787 93205 55630 33443 -30604 42107 107203 72188 125443 181783 95018 41338 160194 100367
775 100367 54504 156498 190213 237360 192595 123205 231274 196191 20642 86808 -32243
764 -32243 -59643 156857 154939 57539 27235 8573 -97113 -3938 122559 68262 174396
753 174396 307419 126794 -32044 -749 -3578 128087 117217 95578 93301 202374 118979
742 118979 -32733 -162632 -349609 -119848 31117 -89335 -19507 -12481 -234147 40762
732 40762 71624 -19144 -146824 -191968 -181972 -19334 24238 67080 -5643 -85743 -112690 16537
720 16537 -63535 -184954 21062 -18932 -151658 -129496 -59578 -122134 2457 -4359 -143217
709 -143217 -155804 24195 -86257 -59979 -36451 -283029 -118930 13504 15968 131398 119865
$$ packed form
787I3205l7575k2187o4047P2711O5096l5015N3255N6340q6765n3680J18856n9827
775A00367m5863J01994L3715M7147m4765o9390J08069l5083j75549O6166j19051
764c2243k7400K16500j918r7400l0304j8662j05686R3175J26497n4297J06134
753A74396J33023j80625j58838L1295k829J31665j0870k1639k277J09073q3395
742A18979j51712j29899j86977K29761J50965j20452O9828P026k21666K74909
732D0762L0862r0768j27680m5144R996J62638M3572M2842p2723q0100k6947J29227
720A6537q0072j21419K06016l9994j32726K2162O9918o2556J24591o816j38858
709a43217j2587J79999j10452K6278K3528k46578J64099J32434K464J15430j1533
$$ plain form
698 119865 -80176 72743 27820 -169201 -41035 -162854 -81944 62680 -1301 -91493 12964
687 12964 -10405 -100237 -107181 3574 132949 203552 69330 46954 123041 53794 190379
676 190379 217315 297630 444841 454773 437704 468050 405134 344948 334177 185810 46877
665 46877 87684 164403 113929 -7873 -88719 -182033 7989 -49969 -124157 -29246 83625
654 83625 -15201 -115370 -188431 -332817 -252532 -49940 -123429 -31813 -22074 -117519 22737
643 22737 -123914 -194717 12217 -107863 -163205 -60326 -43331 -21678 39255 62041 34430
632 34430 -88066 -290121 -272244 -207044 -141823 1674 -78928 -99576 -173426 -142382 -53229
621 -53229 -120670 239312 108017 -169586 -137553 -202252 -163450 -128324 -268179 -311698 -268231
$$ packed form
698A19865k00041J52919m4923j97021J28166j21819Q0910J44624o3981r0192J04457
687A2964k3369q9832o944J10755J29375P0603j34222k2376P6087o9247J36585
676A90379K6936Q0315J47211R932j7069L0346o2916o0186j0771j48367j38933
665D6877M0807P6719n0474j21802q0846r3314J90022n7958p4188R4911J12871
654H3625r8826j00169p3061j44386Q0285K02592p3489R1616R739r5445J40256
643B2737j46651p0803K06934j20080n5342J02879J6995K1653O0933K2786k7611
632C4430j22496k02055J7877O5200O5221J43497q0602k0648p3850L1044Q9153
621e3229o7441L59982j31295k77603L2033o4699L8802L5126j39855m3519M3467
$$ plain form
610 -268231 -257926 -194663 68478 -107993 -64601 61422 -38106 -101806 81042 25128 -65048
599 -65048 37453 -127579 -80758 -92883 -238932 -245163 -134441 -85024 -247724 -156046 -75482
588 -75482 -215222 -180718 -262691 -329441 -152511 -40858 -110757 -167663 -105914 -105499 -88100 -127731
576 -127731 -203667 -245184 -235832 -187530 -193092 -296109 -52246 38890 -287013 -264500 -212046 -311183
564 -311183 -215089 -176751 -203134 -76186 -109816 -266685 -274814 -159077 -45731 -43098 -47665 -91042
552 -91042 -158760 -217010 -113092 53859 153081 -54784 -59129 -137755 -81834 -20838 -156395
541 -156395 -151434 -142476 -48648 -150763 -201128 -201042 -157770 26654 77175 -48859 -3371 -88318
529 -88318 -114445 -54074 -152642 -365933 -164477 -120278 -111020 -46421 -248740 -126054 56875
$$ packed form
610b68231J0305O3263K63141j76471M3392J26023r9528o3700J82848n5914r0176
599f5048J02501j65032M6821j2125j46049o231J10722M9417j62700R1678Q0564
588g5482j39740L4504q1973o6750J76930J11653o9899n6906O1749M15J7399l9631
576a27731p5936m1517R352M8302n562j03017K43863R1136l25903K2513N2454r9137
564c11183R6094L8338k6383J26948l3630j56869q129J15737J13346K633m567m3377
552i1042o7718n8250J03918J66951R9222k07865m345p8626N5921O0996j35557
541a56395M961Q958R3828j02115n0365Q6M3272J84424N0521j26034M5488q4947
529h8318k6127O0371r8568k13291K01456M4199R258O4599k02319J22686J82929
$$ plain form
518 56875 -50661 -144522 -1932 -88189 -261517 -232441 -64932 -26327 -132964 -200131 -192429
507 -192429 -47884 -59785 -24824 -172742 -123414 -72317 -31630 -59382 -162269 -35073 36018
496 36018 -108636 -123392 -289170 -219535 58893 -73511 -79520 111388 44818 -203230 -121670
485 -121670 -243346 -177042 20032 97237 -81724 -79917 -40758 87664 6619 -196289 -112449
474 -112449 -207429 -182181 -164834 -164051 -196996 -215808 -209940 -276174 -225053 -6544 20572 -52571
462 -52571 -101299 -90416 -229480 -162806 -47260 -183652 -189162 -96949 -116059 -98474 -215817
451 -215817 -219084 -329439 -269793 -236150 -250778 -166136 -56827 -41571 -250811 -292959 -295804 -353779
$$ packed form
518E6875j07536r3861J42590q6257j73328K9076J67509L8605j06637o7167P702
507a92429J44545j1901L4961j47918M9328N1097M0687k7752j02887J27196P1091
496C6018j44654j4756j65778O9635K78428j32404o009J90908o6570k48048Q1560
485a21670j21676O6304J97074P7205j78961J807L9159J28422q1045k02908Q3840
474a12449r4980K5248J7347P83l2945j8812N868o6234N1121K18509K7116p3143
462e2571m8728J0883j39064O6674J15546j36392n510R2213j9110J7585j17343
451b15817l267j10355N9646L3643j4628Q4642J09309J5256k09240m2148k845n7975
$$ [...]
##END NTUPLES=NMR SPECTRUM
##END=
