##TITLE=1H_CG-1049-A spectr
 CDCl3, 8 sc, 
 18.11.2020
##JCAMPDX= 6.0         $$ Bruker NMR JCAMP-DX V2.0
##DATA TYPE= NMR SPECTRUM
##DATA CLASS= NTUPLES
##ORIGIN= UXNMR, Bruker Analytische Messtechnik GmbH
##OWNER= root
$$ XWIN-NMR		Version 3.5
$$ Wed Nov 18 13:09:50 2020 Russian Standard Time (UT+4h)  she@DPX200
##.OBSERVE FREQUENCY= 200.1315066352
##.OBSERVE NUCLEUS= ^1H
##.ACQUISITION MODE= SIMULTANEOUS
##.ACQUISITION SCHEME= undefined
##.AVERAGES= 8
##.DIGITISER RES= 18
##SPECTROMETER/DATA SYSTEM= spect
##.PULSE SEQUENCE= zg30
##.SOLVENT NAME= CDCl3
##.SHIFT REFERENCE= (INTERNAL, CDCl3, 0, 15.9833)
##AUDIT TRAIL= $$ (NUMBER, WHEN, WHO, WHERE, WHAT)
$$ ##TITLE= Audit trail, XWIN-NMR		Version 3.5
$$ ##JCAMPDX= 5.01
$$ ##ORIGIN= Bruker BioSpin GmbH
$$ ##OWNER= she
$$ F:/spectra/data/she/nmr/H-F/1/pdata/1/auditp.txt
$$ ##AUDIT TRAIL=  $$ (NUMBER, WHEN, WHO, WHERE, WHAT)
(   1,<2020-11-18 13:08:14.42 +0400>,<she>,<DPX200>,
      <created by zg, POWCHK disabled, PULCHK disabled
       configuration hash MD5:
       00 E9 B6 7A A2 85 ED C7 34 08 36 98 17 FE 4E 26
       data hash MD5: 16K
       9F 35 AC 23 45 DA 16 F8 4D 58 5F 83 75 13 E8 85>)
(   2,<2020-11-18 13:08:16.95 +0400>,<she>,<DPX200>,
      <Start of raw data processing
       efp BC_mod = 2 LB = 0.24 FT_mod = 6 PKNL = 1 PHC0 = -11115.37 PHC1 = -1.7991 SI = 16K 
       data hash MD5: 16K
       4F 10 40 89 DF 27 3A 80 77 68 78 A1 AF D7 5A 18>)
(   3,<2020-11-18 13:08:43.50 +0400>,<she>,<DPX200>,
      <pk PHC0 = 73.48093 PHC1 = 7.2 
       data hash MD5: 16K
       06 9D 36 13 53 E6 97 B2 FD 9B 12 8F A1 DA 4F E8>)
(   4,<2020-11-18 13:08:46.98 +0400>,<she>,<DPX200>,
      <abs ABSG = 5 
       data hash MD5: 16K
       48 E8 AF 83 B9 84 CA 60 20 4E D4 B0 F2 2A 20 E7>)
$$ ##END=
$$ 
$$ hash MD5
$$ DB F5 42 0E A7 A9 B9 C7 B1 14 64 0E 8B E0 57 FA
##$RELAX= 
##$RELAX= 
##$RELAX= 
##$RELAX= 
##$RELAX= 
##$RELAX= 
$$ Bruker specific parameters
$$ --------------------------
##$DU= <F:/spectra>
##$EXPNO= 1
##$NAME= <H-F>
##$PROCNO= 1
##$TYPE= <nmr>
##$USER= <she>
##$AMP= (0..31)
100 100 100 100 100 100 100 100 100 100 100 100 100 100 100 100 100 100 
100 100 100 100 100 100 100 100 100 100 100 100 100 100 
##$AQSEQ= 0
##$AQ_mod= 1
##$AUNM= <au_zg>
##$AUTOPOS= <>
##$BF1= 200.13
##$BF2= 200.13
##$BF3= 200.13
##$BF4= 200.13
##$BF5= 200.13
##$BF6= 200.13
##$BF7= 200.13
##$BF8= 200.13
##$BYTORDA= 1
##$CFDGTYP= 0
##$CFRGTYP= 5
##$CHEMSTR= <none>
##$CNST= (0..31)
1 1 145 1 1 1 1 1 1 1 1 1 1 1 1 1 1 1 1 1 1 1 1 1 1 1 1 1 1 1 1 1 
##$CPDPRG= <>
##$CPDPRG1= <>
##$CPDPRG2= <>
##$CPDPRG3= <>
##$CPDPRG4= <mlev>
##$CPDPRG5= <mlev>
##$CPDPRG6= <mlev>
##$CPDPRG7= <mlev>
##$CPDPRG8= <mlev>
##$CPDPRGB= <>
##$CPDPRGT= <>
##$D= (0..31)
0 1.2 0 0 0 0 0 0 0 0.06 0 0.03 0 0 0 0 0.0002 0 0 0 0 0 0 0 0 0 0 0 0 
0 0 0 
##$DATE= 1605690493
##$DBL= (0..7)
120 120 120 120 120 120 120 120 
##$DBP= (0..7)
150 150 150 150 150 150 150 150 
##$DBP07= 0
##$DBPNAM0= <>
##$DBPNAM1= <>
##$DBPNAM2= <>
##$DBPNAM3= <>
##$DBPNAM4= <>
$$ [...]
##$SUBNAM3= <"">
##$SUBNAM4= <"">
##$SUBNAM5= <"">
##$SUBNAM6= <"">
##$SUBNAM7= <"">
##$SUBNAM8= <"">
##$SUBNAM9= <"">
##$SW= 16.9725356469052
##$SWIBOX= (0..15)
0 0 2 0 0 0 0 0 0 0 0 0 0 0 0 0 
##$SW_h= 3396.73913043478
##$TD= 16384
##$TD0= 1
##$TE= 0
##$TE2= 300
##$TE3= 300
##$TEG= 300
##$TL= (0..7)
0 120 120 120 120 120 120 120 
##$TP= (0..7)
150 150 150 150 150 150 150 150 
##$TP07= 0
##$TPNAME0= <>
##$TPNAME1= <>
##$TPNAME2= <>
##$TPNAME3= <>
##$TPNAME4= <>
##$TPNAME5= <>
##$TPNAME6= <>
##$TPNAME7= <>
##$TPOAL= (0..7)
0.5 0.5 0.5 0.5 0.5 0.5 0.5 0.5 
##$TPOFFS= (0..7)
0 0 0 0 0 0 0 0 
##$TUNHIN= 0
##$TUNHOUT= 0
##$TUNXOUT= 0
##$USERA1= <user>
##$USERA2= <user>
##$USERA3= <user>
##$USERA4= <user>
##$USERA5= <user>
##$V9= 5
##$VALIST= <valist>
##$VCLIST= <CCCCCCCCCCCCCCC>
##$VD= 0
##$VDLIST= <DDDDDDDDDDDDDDD>
##$VPLIST= <PPPPPPPPPPPPPPP>
##$VTLIST= <TTTTTTTTTTTTTTT>
##$WBST= 1024
##$WBSW= 4
##$XGAIN= (0..3)
0 0 0 0 
##$XL= 0
##$YL= 0
##$YMAX_a= 475577
##$YMIN_a= -341910
##$ZGOPTNS= <>
##$ZL1= 120
##$ZL2= 120
##$ZL3= 120
##$ZL4= 120
##$ABSF1= 15.9761
##$ABSF2= -0.996562
##$ABSG= 5
##$ABSL= 3
##$ALPHA= 0
##$AQORDER= 0
##$ASSFAC= 0
##$ASSFACI= 0
##$ASSFACX= 0
##$ASSWID= 0
##$AUNMP= <proc_1d>
##$AZFE= 0.1
##$AZFW= 0.1
##$BCFW= 0
##$BC_mod= 2
##$BYTORDP= 0
##$COROFFS= 0
##$CY= -3
##$DATMOD= 1
##$DC= 0
##$DFILT= <>
##$DTYPP= 0
##$F1P= 0
##$F2P= 0
##$FCOR= 1
##$FTSIZE= 16384
##$FT_mod= 6
##$GAMMA= 0
##$GB= 0
##$INTBC= 1
##$INTSCL= 1.245715e-10
##$ISEN= 128
##$LB= 0.24
##$LEV0= 0
##$LPBIN= 0
##$MAXI= 10000
##$MC2= 0
##$MEAN= 0
##$ME_mod= 0
##$MI= 1.114404
##$NCOEF= 0
##$NC_proc= -5
##$NLEV= 6
##$NOISF1= 3.799351
##$NOISF2= 2.8
##$NSP= 0
##$NTH_PI= 0
##$NZP= 0
##$OFFSET= 15.98335
##$PC= 1
##$PHC0= -11041.89
##$PHC1= 5.4009
##$PH_mod= 1
##$PKNL= yes
##$PPARMOD= 0
##$PSCAL= 0
##$PSIGN= 0
##$REVERSE= no
##$SF= 200.130006257204
##$SI= 16384
##$SIGF1= 3
##$SIGF2= 2
##$SINO= 5.538805
##$SIOLD= 16384
##$SREGLST= <1H.CDCl3>
##$SSB= 0
##$STSI= 16384
##$STSR= 0
##$SW_p= 3396.73913043478
##$SYMM= 0
##$S_DEV= 0
##$TDeff= 16384
##$TDoff= 0
##$TI= <>
##$TILT= no
##$TM1= 0
##$TM2= 0
##$TOPLEV= 0
##$USERP1= <user>
##$USERP2= <user>
##$USERP3= <user>
##$USERP4= <user>
##$USERP5= <user>
##$WDW= 1
##$XDIM= 16384
##$YMAX_p= 391729536
##$YMIN_p= -137946
$$ End of Bruker specific parameters
$$ ---------------------------------
##NTUPLES= NMR SPECTRUM
##VAR_NAME=  FREQUENCY,     SPECTRUM/REAL,   SPECTRUM/IMAG
##SYMBOL=    X,             R,               I
##VAR_TYPE=  INDEPENDENT,   DEPENDENT,       DEPENDENT
##VAR_FORM=  AFFN,          ASDF,            ASDF
##VAR_DIM=   16384,         16384,           16384
##UNITS=     HZ,            ARBITRARY UNITS, ARBITRARY UNITS
##FACTOR=    0.207333158178281, 1,           1
##FIRST=     3198.74789550707, 0,            0
##LAST=      -197.991234927712, 0,           0
##MIN=       -197.991234927712, -137946,     0
##MAX=       3198.74789550707, 391729536,    0
$$ Real data points
##PAGE= N=1
##DATA TABLE= (X++(R..R)), XYDATA
$$ [...]
9172 36846 46943 39550 50497 36108 -4599 -23190 -7424 23944 23093 -23201 -22039 -4117 5697
9159 5697 33183 18697 14810 23320 20075 62278 64015 25278 30804 -2568 -10173 -5957 -11126 35104
9145 35104 36882 25372 7545 36029 58660 44931 22789 20698 19582 23377 21657 22770 41098
9132 41098 700 7911 22907 29671 16701 24522 23730 8315 30116 36545 -20540 -28733 -10485
9119 -10485 -8957 10739 -5216 -11835 10672 47319 72730 89396 94556 72892 72652 34726 25082
9106 25082 -1771 7292 -56117 -44767 -7010 -21190 14461 -52613 -14073 948 54240 43476
9094 43476 21306 91 34521 2627 -1400 54837 25446 23388 -13576 -12260 -9959 23857 24041
9081 24041 13024 -8609 -35093 9781 62720 69773 64752 38843 90 17459 3915 -10771
9069 -10771 -11872 -20883 -38506 -71562 -21429 -14476 -16267 -27196 -35817 15692 24895 6113 11310
9056 11310 12637 16137 16440 18110 42419 46325 40193 18382 -16644 -5137 -7683 -35025 -33420 31437
9042 31437 73418 53899 -9628 21000 23430 10648 4291 32509 60870 39671 44333 46376 31111
9029 31111 29861 9503 41617 47410 42881 60546 34840 71816 70101 97204 84554 89009 113302
9016 113302 89444 93051 101730 47613 20708 -4035 -26237 -24382 50719 69017 3895 45499
9004 45499 52412 49474 16348 46298 53911 3997 -14390 39350 97795 75779 55762 20647
8992 20647 16606 -6594 -50758 -16327 21117 31800 38075 38430 76592 91807 50610 53714 76992
8979 76992 79175 16872 -2708 17201 14187 31930 41791 37558 10431 26962 44179 68597 61834
8966 61834 45987 44366 64745 93062 76235 47561 32848 61054 55717 49141 74834 73204 68872
8953 68872 61977 31940 43913 67093 55124 60353 80964 177594 57888 10314 31302 12504
8941 12504 13657 22813 7872 -5884 -9100 27539 40417 12037 -2192 -1186 36814 60648 61520
8928 61520 23183 -7455 7044 -4322 8924 -13214 28019 51129 24887 24073 40049 26490
8916 26490 14077 40955 29813 -6171 19273 -5917 8034 40365 -4841 -25235 -15275 -9574
8904 -9574 -68635 -18185 -19393 40472 67896 61482 34093 31094 -13927 -50322 11041 14076 -23899
8891 -23899 -57390 15512 24421 -32198 1178 37730 68848 43203 72720 100326 98792 48878
8879 48878 28706 30858 91605 125468 85172 59725 55260 31739 -2509 29457 35298 22211
8867 22211 72132 100907 34560 43127 94100 75982 52515 32610 39744 13035 34762 5322
8855 5322 55030 73661 94344 125852 77528 49193 38290 46647 56508 53467 54415 64144 61194
8842 61194 104147 86641 86970 104854 139645 134257 90574 59284 42987 76856 70715 101525 87864
8829 87864 50248 98923 125387 172343 127200 87084 80962 91659 93100 45269 80277 109510
8817 109510 116907 120829 168617 144710 130593 178636 184651 184023 138382 131928 121560 150401 125850
8804 125850 105947 186087 176345 167388 109071 157912 224539 218001 197384 199593 243613 223874
8792 223874 225664 267861 240864 176665 220303 194111 142065 140321 209069 209062 210525 211945 213817
8779 213817 217313 272677 274324 217414 213637 206120 191484 216193 218445 237861 277263 304744 308537
8766 308537 298999 293799 307854 278927 260350 236584 244698 280953 312005 303017 276887 244190
8754 244190 288873 307200 292347 360328 401585 434170 416293 382220 359467 392398 424578 451366
8742 451366 494873 528958 542461 502002 514912 566442 531237 476543 476650 503088 478521 479389
8730 479389 451900 438157 440460 383330 357384 375789 332946 356504 405467 425716 404271 348355
8718 348355 381593 424076 408318 370338 316022 300505 345962 334103 278519 256131 269853 265154
8706 265154 248408 224501 203991 189187 272956 310622 286226 280212 295000 277939 287644 317244
8694 317244 272354 275804 262315 307873 290850 282267 288029 330399 321678 328127 353900 374708 381256
8681 381256 380457 332181 337825 312423 248084 260985 261627 217368 221005 219950 189060 212954 255009
8668 255009 238619 208165 228261 222843 207320 211280 247501 238234 268444 233657 191920 209829
8656 209829 182338 198916 207224 251780 234762 164383 186898 215579 245777 182132 212031 245647
8644 245647 190689 203348 235403 189337 175574 203137 251985 258020 216766 200923 186033 212415
8632 212415 212138 194449 210381 199092 189641 154375 169553 226447 229146 212311 193632 186301 194575
8619 194575 183955 175679 160776 190342 173845 180994 208516 199077 200547 240693 278272 310054
8607 310054 284160 305891 309377 302980 375196 244950 145740 143494 173819 172217 168975 198141
8595 198141 164968 144155 157363 104457 90123 135065 168085 180710 208240 257377 261622 240308
8583 240308 230204 240872 252959 227714 197576 229609 254163 249726 253964 293206 285832 250801
8571 250801 250801 304276 296088 263092 281673 276128 287021 278883 282504 279588 286313 250635 208174 272799
8557 272799 304524 297898 282060 283571 266592 260719 282450 276847 335088 341564 376523 292535 215601
8544 215601 221321 204012 254328 233368 229896 208782 225811 232934 206497 226489 216856 281197
8532 281197 309538 265376 313882 270333 238452 250657 227920 219380 244575 273178 248235 261228
8520 261228 224388 238587 262913 279797 235510 191061 215663 210540 149384 153784 199949 235822
8508 235822 178489 133421 217776 270074 265275 231777 267816 226811 223871 251192 241711 251112
8496 251112 196921 221300 213073 226625 247422 264088 287669 254441 240222 261984 221234 231124
8484 231124 250835 260393 299992 307182 314934 321935 360950 367222 415905 380969 336990 310467 326224
8471 326224 327490 302981 321984 312387 310021 291887 290869 305502 350754 370217 337749 306764
8459 306764 251306 270658 270848 263525 296419 327135 290802 248093 275878 317694 254089 249029
8447 249029 253839 315954 334197 330722 308527 316651 309111 292401 325368 349948 337061 300572
8435 300572 319520 303936 338129 348191 301056 284275 289537 311353 347429 309247 289022 262106
8423 262106 273122 231761 178010 250375 289860 267515 254899 285847 300577 334237 313452 300592
8411 300592 361893 378285 316104 295523 305762 314794 307325 305251 353715 365329 379505 386908
8399 386908 323776 338867 327573 309131 302722 289222 317030 353203 327145 290334 329493 313837
8387 313837 354801 325673 357676 341133 352245 345080 335886 327031 314201 347188 376609 333883
8375 333883 349038 340114 336149 323134 300897 348878 314666 295131 308529 343291 413292 393543
8363 393543 341043 366343 423815 353454 376373 392999 363393 338137 384928 428487 423346 385403
8351 385403 389563 411789 429238 424795 379526 391459 373276 357389 358868 387856 376901 397318
8339 397318 396324 401754 398596 397503 394447 423814 449744 411065 369943 393709 380351 413119 367559
8326 367559 367534 421992 463830 462440 422438 397832 415458 421767 422580 401944 360486 368383 392071
8313 392071 419865 408632 434874 414119 405003 417126 412882 441253 415037 359284 373363 437389
8301 437389 452185 464984 485445 471161 470513 480213 450475 432827 459327 473524 481304 499988
8289 499988 460538 476295 461558 471769 473611 481427 449988 481706 467084 466694 489767 484585 551523
8276 551523 555680 548875 543945 543286 588882 584026 549610 549380 506805 525906 536593 550528 591293
8263 591293 600099 605505 624317 633770 616545 631528 619336 602966 639784 649600 623547 614418 623035
8250 623035 600570 579608 604586 618856 600763 593913 628112 672065 669819 607325 628399 641167
8238 641167 613408 641885 611137 623204 669481 722267 725247 711411 720872 697398 692669 701490
8226 701490 701136 679530 676577 680777 674668 716597 764659 746599 748314 774698 758396 774141 795491
8213 795491 822621 824292 831799 799212 758350 732294 737427 731994 749775 793619 775609 767516 766262
8200 766262 741793 802277 786582 748930 841878 831842 800349 786007 630220 755663 884261
8189 884261 905469 938433 928022 879811 863750 865944 876034 910825 893639 907245 888286 937096
8177 937096 919055 933369 958183 922524 975325 1010494 945489 936180 1001199 973648 948509 956128
8165 956128 1013573 1026745 1015517 1011392 990287 968786 1003315 1026364 1022528 1044514 1050382 1081108
8153 1081108 1073438 1080794 1097844 1107258 1113297 1138042 1152206 1183954 1177083 1126562 1128352 1114844 1177363
8140 1177363 1234273 1242856 1269836 1290244 1267450 1236725 1298711 1335858 1342286 1368050 1405720 1452595
8128 1452595 1507866 1522646 1523905 1478158 1502571 1593768 1657186 1721439 1793861 1818734 1854132 1936101
8116 1936101 2063681 2158601 2179404 2269857 2388449 2508461 2640247 2830745 3046823 3261674
8106 3261674 3517914 3900018 4276200 4548372 4692491 4761566 4655054 4467369 4306406 4194222
8096 4194222 4181833 4247401 4390419 4580056 4821780 4933501 4967217 4938859 4729403 4430175
8086 4430175 4102441 3811174 3572696 3368274 3203549 3094970 2966501 2891829 2896469 2832560
8076 2832560 2807600 2823724 2847027 2856008 2888917 2872246 2920247 2940823 3065515 3168033 3274176
8065 3274176 3345314 3441031 3588808 3775520 4003775 4294500 4614101 4907919 5204602 5447373
8055 5447373 5574069 5545832 5453086 5322813 5176395 5157882 5159807 5185534 5295688 5491176 5647048
8044 5647048 5724774 5760961 5699464 5523815 5231220 4907391 4637644 4380657 4173255 3999352
8034 3999352 3826861 3692995 3629157 3538231 3524534 3499446 3503076 3529203 3554381 3559411 3515749
8023 3515749 3512293 3446250 3450476 3464708 3464038 3421931 3487641 3548298 3562443 3606679 3655570 3656724
8011 3656724 3728851 3762388 3776432 3826727 3858879 3907955 3965894 4012014 4112970 4189399 4327321
8000 4327321 4464733 4634287 4777019 4931566 5092406 5288279 5516844 5727807 5913522 6120032
7990 6120032 6312624 6591138 6933829 7297678 7765147 8278135 8958035 9785856 10643025 11772500
7980 11772500 13132544 14878874 17129227 20090206 23727471 28498353 34880329 40996822
7972 40996822 40418754 33912286 26480814 20341576 16469244 13878260 12151975 10809940
7964 10809940 9771547 9011336 8459536 7990634 7542296 7149817 6909443 6749586 6641021
7955 6641021 6551826 6554231 6553229 6637785 6714037 6919682 7105468 7298876 7364021 7371420 7192012
7944 7192012 6962564 6699833 6438530 6199313 6041281 5912466 5872393 5819834 5807183 5812134
7934 5812134 5843225 5928201 6024523 6099241 6268841 6433795 6667865 6883108 6968611 7022884 6903901
7923 6903901 6651564 6395755 6183345 5962712 5844478 5801273 5775632 5823667 5865366 5957856
7913 5957856 6121747 6253019 6367745 6656705 6933870 7216310 7561315 7959480 8361465 8616321
7903 8616321 8703877 8662093 8488801 8284182 8131192 8006714 7989974 8066330 8253866 8525218
7893 8525218 8909340 9477445 10168335 10969594 11764115 12454686 12980742 13199336 13181218 12962649
7883 12962649 12628921 12326251 11999184 11818615 11883576 12048024 12272015 12414311 12420275 12074236
7873 12074236 11440676 10716345 9971324 9317520 8766858 8335396 8019319 7711389 7553129
7864 7553129 7399373 7274687 7292872 7310173 7300519 7338011 7298866 7228679 7166166 7127236 7158554
7853 7158554 7279366 7435366 7637444 7854600 8097497 8370254 8714120 9167913 9676666 10297916
7843 10297916 11113030 12025384 12705119 13251374 13528830 13397065 13031440 12645035 12467737
7834 12467737 12545244 12978638 13771642 14855397 16060770 16991835 17390445 17159145 16199180
7825 16199180 14968808 13698919 12546651 11610387 10919717 10492973 10230929 9991510 9863647
7816 9863647 9750707 9705021 9770072 9945591 10220125 10633387 11153202 11624445 11911518 11987350
7806 11987350 11728020 11215400 10567902 9952453 9429090 9127035 8949076 8897733 8939338 8964904
7796 8964904 9017787 9050457 9128962 9333271 9572681 9887956 10450977 11167252 11887938 12447768
7786 12447768 12741960 12652699 12094472 11261020 10436814 9638065 9229884 8959111 8793160 8697223
7776 8697223 8704720 8708189 8716843 8775682 8846349 9050627 9421553 9812653 10442848 11158897 11645128
7765 11645128 11762051 11517535 10842439 9865685 8830264 7894196 7175265 6642307 6238110
7756 6238110 5903565 5709987 5500607 5336891 5245018 5087933 4960176 4782158 4633323 4546653
7746 4546653 4482666 4441316 4433441 4401997 4351527 4281124 4244627 4337857 4315773 4248291 4261716 4356663
7734 4356663 4382321 4428894 4466097 4421408 4346425 4300533 4232814 4208118 4205540 4197007 4175690 4164932
7722 4164932 4193888 4227959 4243391 4221811 4171337 4140590 4109205 4034074 4041785 4077789 4075312 4132202
7710 4132202 4216753 4321681 4420188 4526354 4744567 5007836 5183493 5412016 5602100 5662857
7700 5662857 5687886 5663588 5533300 5441299 5431605 5455333 5598821 5624653 5714324 5829012 5951927
7689 5951927 5921598 5867584 5726424 5563207 5427542 5243575 5133880 4985002 4849838 4779188
7679 4779188 4708913 4658008 4582625 4589378 4616057 4598078 4599817 4658381 4696447 4703001 4771219 4777481
7667 4777481 4835953 4984239 5124251 5322329 5591399 5870748 6227623 6562493 6895408 7032092
7657 7032092 6973239 6737690 6569941 6414027 6280889 6250132 6321603 6524564 6724545 6969218
7647 6969218 7137241 7239746 7119827 6857828 6599834 6308372 6079357 5832562 5722457 5619390
7637 5619390 5608793 5637382 5643318 5651771 5690964 5759350 5845897 5915407 5985794 6049308 6042179 6037613
7625 6037613 6097543 6160290 6294489 6477995 6715540 7016907 7415651 7906914 8351895 8846484
7615 8846484 9395797 9812656 9898383 9703291 9335186 8890368 8419925 8062063 7925204 8004718
7605 8004718 8166652 8434441 8815972 9108182 9146077 8888795 8438807 7856113 7219669 6694802
7595 6694802 6293095 6057553 5909115 5790824 5694493 5759644 5811681 5879168 6058187 6203143
7585 6203143 6321882 6474605 6615737 6691231 6830449 7007533 7209372 7506540 7825389 8154928
7575 8154928 8611086 9175488 9777186 10456768 11053869 11482786 11762034 11741916 11413630 10937283
7565 10937283 10427843 9997692 9686132 9634843 9785226 10039671 10283766 10526953 10611935 10434976
7555 10434976 10054516 9470778 8847058 8303687 7938580 7705620 7643345 7658547 7602912 7405037
7545 7405037 7154372 6883355 6632140 6392706 6241663 6110989 6048936 6020556 6014587 5963116
7535 5963116 5945691 5985072 6051690 6154311 6278402 6428411 6620578 6843681 7079829 7242410
7525 7242410 7186764 6964284 6641399 6332404 6021989 5808774 5681547 5742052 5789983 5881290
7515 5881290 5990948 6031373 5999456 5785655 5408799 4964467 4580673 4300433 4094895 3874381
7505 3874381 3753269 3704992 3643256 3601019 3607600 3646202 3729801 3871187 3996809 4114485 4300385
7494 4300385 4527553 4759756 5020844 5226863 5263844 5092460 4814889 4454326 4169224 3987762
7484 3987762 3789594 3675935 3596214 3493136 3464741 3350879 3249729 3180988 3111171 3086885
7474 3086885 3071539 3084805 3089567 3118979 3148734 3309005 3457602 3656054 3903203 4178687 4454068
7463 4454068 4634370 4713209 4516066 4219316 3849427 3480796 3194837 3015598 2884211 2743142
7453 2743142 2668779 2572258 2493178 2416104 2304306 2181427 2067534 1997801 1936997 1888369 1871119
7442 1871119 1833409 1819435 1811582 1826852 1790585 1769725 1729199 1699834 1721633 1716008 1687018 1666692
7430 1666692 1687006 1647778 1671419 1717284 1708751 1697168 1738754 1767334 1800158 1814802 1836533 1881261
7418 1881261 1929480 2043286 2128053 2163300 2288408 2397391 2598982 2790987 2969091 3278039
7408 3278039 3599444 3965249 4124272 4033276 3793763 3478890 3067892 2673004 2442700 2298170
7398 2298170 2148560 2084824 2069446 1980718 1894494 1779779 1694305 1593007 1458939 1365567 1320736
7387 1320736 1257845 1263424 1264674 1217437 1210612 1180687 1136426 1124777 1114486 1080691 1118175 1085255
7375 1085255 1086357 1095351 1118706 1098528 1048472 1005657 1016927 979339 929599 924304 944700 862683
7363 862683 848007 803624 761631 787693 797211 818864 814998 846960 866294 893548 881532 872423
7351 872423 851811 794454 782372 786286 738477 732018 742555 754641 763360 747860 765186 764510 752020
7338 752020 749401 709412 699356 723940 744000 728616 682344 656705 714163 664761 616243 663235
7326 663235 691492 659252 645403 630836 635824 655120 669529 636360 610271 625094 612173 607222
7314 607222 615256 617224 610202 622025 630409 606665 585750 566129 553165 512790 510940 491622 437794
7301 437794 463773 504970 482947 460176 490320 512895 528493 489089 461244 456274 451162 426750
7289 426750 408019 462209 470114 479364 430709 417019 454600 444071 418378 425101 437522 453230
7277 453230 370643 405834 446543 409936 405133 383471 368060 355523 345879 345470 367740 404777
7265 404777 388964 394028 426945 402204 353570 356032 373607 402158 400829 321668 359915 391597
7253 391597 386299 376072 332173 305303 330328 346367 354047 364311 343755 318900 342579 317117
7241 317117 295597 281430 308832 309120 277600 279206 268127 280206 245972 238574 311590 303452 306320
7228 306320 307799 295353 297587 297725 286614 280230 265891 264104 249020 215832 241145 217934 229275
7215 229275 242431 268954 294230 292447 288427 294047 318963 324486 246600 287409 321177 299184
7203 299184 284855 238538 206411 203159 224965 261011 282714 263608 268353 225761 239907 220778
7191 220778 226654 265287 266790 220780 226479 234414 234402 236948 245952 307942 310941 258641 258722 279993
7177 279993 303845 299537 259459 300139 299751 256930 298572 242881 206642 182344 216589 257876
7165 257876 219853 155599 178648 200606 235995 218037 212324 217095 249543 219029 208248 262879
7153 262879 278178 303564 285532 257375 274404 247313 237012 255410 209379 237283 244448 248188
7141 248188 260107 259977 244235 257842 265385 305950 252898 255781 280230 260416 308306 322369
7129 322369 293188 260528 261079 298576 287328 278366 277634 291797 236884 224965 240386 237254 191652
7116 191652 215971 234250 279589 317270 241294 279964 285521 299840 283246 236508 300664 246449
7104 246449 205012 254786 257150 218763 161867 169415 209972 180297 206807 222858 190920 246055
7092 246055 251445 231777 235136 212860 200725 161127 165356 168679 169898 156136 182449 219743 237079
7079 237079 202214 173312 153288 119145 132643 177512 191983 194361 182026 143040 180786 195091
7067 195091 220790 234225 186701 207826 252908 240972 241848 253207 220936 255005 221929 187006
7055 187006 223426 208349 252795 284724 266110 286989 292780 248299 291432 257689 225518 227093
7043 227093 268616 238462 180500 194395 216929 233156 211453 226227 203364 215659 255649 250434
7031 250434 247458 216828 154239 187754 224197 240328 263217 250921 230306 262645 259403 236121
7019 236121 223813 196007 213326 185184 133876 153267 208564 217977 195130 189696 163102 164242
7007 164242 193114 216342 236976 244145 240135 237908 183264 203613 197131 209532 211247 215251 229554
6994 229554 227515 254196 208872 194249 150183 224598 238869 220051 198854 253208 267699 243001
6982 243001 216937 212735 238814 231698 225979 256297 207845 240442 218790 272978 270216 218166
6970 218166 218545 195418 220241 235301 240437 236423 235028 219051 224235 245946 264155 262947 236609
6957 236609 212919 237896 207744 252857 260678 228313 223410 253903 237872 264943 251181 222299
6945 222299 246821 259151 237653 234297 236124 214974 238296 241301 230124 228021 208976 262678
6933 262678 249094 220231 221517 218769 235438 230045 180779 149322 204773 220707 237463 247862
6921 247862 240757 228906 209873 202080 209540 205128 182925 243662 265809 232989 248095 236989
6909 236989 228805 258457 299051 276680 269310 263996 272754 329993 333546 275797 292911 294056 295216
6896 295216 291522 256996 277019 292251 298650 297513 343715 336407 312316 320364 361743 327076 298962
6883 298962 307985 291788 357469 348285 282900 319496 314639 312780 347149 342147 336831 385461 389362
6870 389362 404775 340486 321319 357567 344601 371760 424781 432751 372193 366912 414482 417498
6858 417498 426547 425651 433733 494939 521550 462178 448593 422274 449224 462399 471823 480950 520315
6845 520315 497416 488555 542826 492133 489574 460867 517752 585345 546012 519659 578703 567395
6833 567395 552644 562492 574372 609786 591855 605733 636660 617980 630245 644862 668051 695231
6821 695231 713463 705158 737890 731537 740829 763625 747512 736624 732308 735281 813055 814689 856082
6808 856082 921598 958374 948003 931362 1002910 1043267 1045494 1038000 1022731 1060765 1118122 1136299
6796 1136299 1179388 1218151 1255715 1270772 1272116 1324288 1389411 1385717 1430088 1438729 1419371 1433605
6784 1433605 1455034 1475281 1549386 1640891 1642620 1656981 1713964 1762738 1842678 1911543 1994673 2152264
6772 2152264 2215901 2356887 2520207 2667210 2848864 2939734 2891510 2804112 2727607 2593956
6762 2593956 2502286 2492718 2476544 2500768 2553437 2606968 2676102 2782196 2933041 3058821 3164177
6751 3164177 3270670 3415882 3551023 3711197 3836306 3918507 3992864 4160413 4421474 4723394
6741 4723394 5058327 5486052 6065126 6551389 6845517 6991224 7095321 7160330 7241050 7384982
6731 7384982 7410538 7279003 7123864 7011515 6969787 7135756 7459006 7827964 8121111 8150430
6721 8150430 7991589 7815633 7575168 7232551 6829464 6481267 6097285 5785207 5610289 5551843
6711 5551843 5479959 5474278 5556912 5648950 5609030 5485343 5310378 5236735 5227811 5167647 5224342
6700 5224342 5263592 5315588 5392406 5413814 5499832 5635702 5820039 6158842 6541625 7064893
6690 7064893 7480995 7716623 7679547 7502675 7291466 6998205 6577070 6219567 5923279 5568706
6680 5568706 5283702 5200672 5202170 5161789 5145606 5207590 5324566 5503925 5720898 5917825 6204748
6669 6204748 6357698 6466823 6537723 6579956 6581374 6675864 6794312 7011856 7323763 7578596
6659 7578596 7838510 8058471 8401588 8695961 8694182 8493473 8213854 7885030 7732779 7760219
6649 7760219 7959680 8239851 8446305 8500987 8458198 8305265 8299259 8458590 8802521 9367728
6639 9367728 9968101 10341407 10306462 9925562 9424361 8754877 8100608 7608897 7240105 7037380
6629 7037380 6865557 6786383 6750448 6725280 6584914 6379389 6104369 5894828 5748313 5694599
6619 5694599 5633840 5569426 5589326 5604795 5642554 5624993 5639798 5795294 6023726 6345004 6768798
6608 6768798 7149586 7253787 7018780 6593512 6039838 5565935 5205824 4878980 4614326 4432924
6598 4432924 4309801 4224530 4159621 4170394 4204266 4196808 4239775 4292953 4384027 4497730 4655116
6587 4655116 4735685 4841027 4801262 4724035 4628958 4529403 4503830 4559199 4619664 4659453 4536297
6576 4536297 4365029 4104537 3804608 3584755 3404176 3297085 3162022 3070902 3031916 2997470
6566 2997470 2964494 2891800 2882468 2886764 2890532 2888115 2864459 2853556 2865091 2937581 2954736 2991075
6554 2991075 2993245 2980895 2880624 2796788 2705907 2590824 2576285 2523852 2450923 2471531 2462354
6543 2462354 2411239 2328853 2302713 2185285 2051856 1950672 1895058 1831238 1756732 1652115 1619559
6532 1619559 1595285 1584989 1574250 1523299 1479742 1464838 1489866 1468689 1453426 1436266 1429896 1432356
6520 1432356 1436192 1444078 1431401 1479601 1451111 1473679 1497545 1553968 1551985 1568514 1625668 1600410
6508 1600410 1561919 1587516 1577905 1491338 1454372 1423828 1346918 1314209 1357275 1316931 1315247 1351892
6496 1351892 1359063 1311009 1266913 1276728 1307261 1260585 1289078 1338868 1303928 1319256 1281143 1262367
6484 1262367 1282535 1285408 1279541 1277855 1302687 1295365 1272309 1258714 1200996 1214057 1282012 1239891
6472 1239891 1231456 1228473 1238051 1269234 1303401 1271426 1287618 1300318 1338590 1342684 1361947 1432102
6460 1432102 1456653 1391341 1370490 1334445 1375899 1414815 1369536 1370231 1381349 1415439 1428593 1488657
6448 1488657 1491617 1448660 1449946 1497470 1536438 1579684 1634351 1684821 1762720 1821960 1883899 1957856
6436 1957856 2084473 2239328 2424360 2578560 2864224 3158291 3469923 3856024 4290558 4704666
6426 4704666 4953037 4981367 4775538 4525651 4341383 4283434 4334308 4524179 4599581 4463074
6416 4463074 4105037 3681171 3252116 2875742 2610403 2429741 2271110 2146381 2057641 1994500
6406 1994500 1947494 1938794 1913235 1814866 1783802 1746467 1694717 1669862 1586480 1575697 1560849 1534912
6394 1534912 1555883 1554451 1549991 1585226 1620534 1653283 1635702 1652517 1684625 1737193 1786677 1857934
6382 1857934 1908885 1969231 2055519 2126711 2258751 2345805 2520650 2761329 3023779 3342314
6372 3342314 3679878 4071167 4341938 4407226 4369795 4152518 4049771 4015612 4050243 4215610
6362 4215610 4403563 4426094 4230588 3852604 3387710 2929535 2599917 2409509 2255874 2164633
6352 2164633 2081558 1994164 1907200 1752504 1591591 1529975 1491104 1357259 1309581 1257558 1227102
6341 1227102 1221700 1172174 1186225 1169943 1133789 1154961 1149928 1102980 1052392 1053577 1027800 1041219
6329 1041219 1088060 1111271 1083960 1055598 1063604 1030916 1099910 1131624 1160007 1176691 1156084 1171103
6317 1171103 1195740 1179207 1159613 1182864 1128250 1062666 1077788 1092065 1115373 1151337 1181611
6306 1181611 1256072 1261610 1286259 1353728 1319207 1296065 1272214 1318696 1256027 1267969 1316898 1304853
6294 1304853 1284294 1218130 1119094 1043796 989869 961461 943471 939034 947020 944813 885672 869565
6282 869565 839451 853428 865404 820312 795311 776930 786913 803519 812899 812349 812555 812962 816285
6269 816285 864872 827797 858440 876081 943258 934367 863561 866169 834951 805163 796948 785715
6257 785715 809288 797276 752552 767416 817370 840893 752994 745784 727237 787816 743910 778571
6245 778571 789978 745939 775367 793624 807806 816948 814880 812992 782889 741240 784017 771047
6233 771047 774815 801033 752435 774641 733958 700466 758448 734463 680373 694670 670056 704884
6221 704884 733767 753487 780148 768312 743166 740758 795800 759494 758375 731905 712219 733191
6209 733191 716798 699815 737662 779343 763137 776075 755571 777313 741125 722513 744541 743669
6197 743669 729838 723641 729838 782824 757349 783043 823237 842033 847825 832159 799815 763879
6185 763879 773420 793120 793026 744194 801028 821765 751256 744612 728548 763533 792165 824671 858985
6172 858985 825038 836578 811923 752065 747491 779035 734493 727627 739205 776283 727770 717447
6160 717447 729604 735935 754424 775763 802092 776473 828358 827894 808557 822463 822722 818961 789616
6147 789616 796603 826539 794269 850711 881748 897813 922186 894224 885198 922126 935306 898446
6135 898446 872034 906667 914316 879040 903851 895004 937793 967904 976857 994536 999743 1000751 980338
6122 980338 969736 968571 974434 959001 933883 934120 955253 1012701 998956 1015420 1018348 1042328 1028412
6109 1028412 1068003 1048322 1117367 1121473 1078229 1077978 1123453 1205671 1153854 1177132 1241373 1293667
6097 1293667 1312293 1237198 1236224 1308962 1312433 1307557 1300695 1245707 1244599 1275014 1269190 1261894 1323654
6084 1323654 1312084 1239346 1273225 1253667 1307890 1337199 1300390 1319226 1300741 1352792 1399984
6073 1399984 1371170 1353716 1345362 1411607 1439846 1454141 1461141 1501725 1510191 1547828 1617234 1617005
6061 1617005 1597247 1668890 1705426 1722203 1749474 1762251 1792511 1832604 1866889 1946556 1996221
6050 1996221 2083029 2166854 2208122 2261691 2351763 2470546 2566124 2654058 2746609 2779256 2838385
6039 2838385 2918931 3007355 3087904 3144033 3210785 3319593 3441756 3523028 3682906 3832396 4007742
6028 4007742 4183641 4369636 4564611 4760238 4964067 5162759 5387932 5612360 5764613 5908788
6018 5908788 6003806 6023057 6031321 6086780 6152743 6170195 6239786 6257358 6097545 5870079 5624713
6007 5624713 5356149 5116915 4921739 4796336 4637766 4414692 4213937 4079132 3976099 3793056
5997 3793056 3696905 3676828 3617756 3580482 3540280 3505608 3470632 3483471 3439577 3424674 3426476 3457594
5985 3457594 3518625 3477934 3428586 3397249 3405755 3421292 3418126 3418737 3443954 3431182 3453896 3507086
5973 3507086 3575439 3573078 3634749 3713811 3758964 3804690 3854806 3911004 3966241 4040270 4145833
5962 4145833 4200378 4276612 4430113 4577475 4697411 4834937 4976134 5157696 5313948 5485232
5952 5485232 5679075 5913195 6215344 6505031 6832592 7175006 7527328 7958711 8400170 8765770
5942 8765770 9137402 9493397 9886161 10298788 10654800 10841311 10923931 10919228 10832837 10724492
5932 10724492 10682145 10649361 10514981 10380904 10241901 9971538 9646217 9176638 8737690 8378272
5922 8378272 8040188 7753730 7467790 7216230 7003860 6764909 6628657 6511389 6403658 6322226
5912 6322226 6332727 6353745 6346872 6400668 6448371 6486532 6526956 6571539 6621722 6680576 6762294 6919899
5900 6919899 7023114 7154769 7244731 7342153 7514722 7657834 7847596 8032248 8131054 8258835
5890 8258835 8352519 8411123 8455565 8428110 8401357 8376610 8366285 8305934 8281394 8265325 8305626
5879 8305626 8305257 8317252 8343497 8375261 8488977 8635952 8799450 8860401 8830131 8903371 9099758
5868 9099758 9401839 9897866 10566884 11185993 11491734 11448981 11186791 10896748 10715023 10832166
5858 10832166 11152610 11599985 11922031 11775744 11215930 10499391 9705342 9068145 8625445
5849 8625445 8339904 8195941 7897379 7488920 7031891 6544735 6133288 5774397 5532647 5243263
5839 5243263 5006996 4806630 4671084 4562930 4470635 4411103 4310624 4234232 4228681 4165052 4140605
5828 4140605 4147886 4145808 4126866 4175367 4248595 4275983 4325940 4432970 4542008 4611413 4755630
5817 4755630 4939084 5124571 5323718 5605420 6004461 6448775 6902011 7322315 7652665 7883328
5807 7883328 8105709 8397220 8833157 9498833 10165399 10482835 10508274 10327482 10006876 9863828
5797 9863828 9900828 10086160 10265015 10503276 10554727 10332651 9955427 9533284 9157148 8990619
5787 8990619 9003590 9148488 9328587 9589322 9819931 9765061 9573314 9199038 8889221 8694936
5777 8694936 8673670 8897575 9254937 9560962 9529371 9190908 8625080 8069714 7690837 7545553
5767 7545553 7552668 7681060 7858338 7960360 7997986 7917727 7789358 7751042 7738320 7772582 8034319
5756 8034319 8498826 8907554 9060055 8994977 8697084 8286737 7923109 7799143 7748266 7743056
5746 7743056 7707504 7483537 6967325 6369364 5754710 5233167 4934328 4726426 4539809 4298024
5736 4298024 4013463 3708341 3415265 3133946 2960474 2800771 2709629 2630706 2571036 2520711
5726 2520711 2450280 2365383 2290810 2233696 2194614 2150798 2096130 2097252 2072850 2042153 2038664 2014956
5714 2014956 2028273 1961147 1904099 1861413 1849024 1838860 1840275 1788520 1739194 1734098 1746557 1734920
5702 1734920 1738738 1740920 1682173 1659901 1638420 1673657 1708530 1647259 1654144 1673135 1703415 1701111
5690 1701111 1635396 1679699 1730349 1788246 1787586 1761116 1762675 1756344 1740679 1804306 1850274 1870293
5678 1870293 1880606 1948945 2006018 1979281 1976687 2009623 2043393 2048784 2076729 2074890 2109401 2124786
5666 2124786 2115092 2108731 2126413 2154550 2163800 2197971 2160926 2157469 2185091 2215472 2205057 2207992
5654 2207992 2182747 2166504 2213919 2226320 2159324 2150808 2098290 2078109 2015665 1932751 1901843 1863523
5642 1863523 1824391 1786365 1825955 1791135 1701267 1700132 1665417 1659414 1661313 1588072 1654884 1657559
5630 1657559 1644640 1628253 1628045 1571864 1555690 1587991 1553478 1588340 1625535 1651453 1610775 1603782
5618 1603782 1617724 1588682 1570750 1570048 1605295 1614748 1603899 1598607 1610052 1605608 1705364 1745906
5606 1745906 1744298 1742926 1741795 1812151 1818239 1873814 1930022 1975868 1999143 1984799 2024125 2076117
5594 2076117 2096839 2140916 2194806 2243852 2270398 2285198 2341651 2355146 2344844 2406657 2491583
5583 2491583 2541545 2540337 2600857 2578843 2594041 2659361 2691775 2739291 2754158 2814853 2877566 2919197
5571 2919197 2937654 2954066 2985646 3026951 3079396 3143835 3084056 3030269 3044349 3033884 3009655
5560 3009655 3018839 3023717 2998499 2963271 2926562 2934469 2896165 2902571 2972229 2978136 2996194 3063622
5548 3063622 3134966 3201998 3282563 3403976 3511853 3591272 3603961 3607033 3648754 3621935 3619117
5537 3619117 3674116 3694678 3785879 3857359 3899492 3978075 3990680 3988702 4024661 4023954 3987511 4013707
5525 4013707 4121878 4199020 4297586 4367183 4436061 4545522 4599968 4675283 4715646 4735654 4810718
5514 4810718 4888534 4958687 4979309 4954666 4964133 4941853 4905248 4849817 4871151 4923066 4976470 5017517
5502 5017517 5134433 5262349 5322731 5391932 5443919 5554409 5668036 5760003 5905011 6001863
5492 6001863 6115434 6243072 6312400 6471511 6665546 6766860 6884674 7113145 7292229 7506282
5482 7506282 7717977 7982982 8329258 8662302 9004302 9413071 9775896 10082217 10509209 10939824
5472 10939824 11467067 12093939 12744534 13490411 14406758 15556209 16893888 18449955 20319866
5463 20319866 22601623 25402605 28652816 32461033 36591371 40556542 43700432 45392677
5455 45392677 45214971 43237069 39954236 35978528 31954096 28298498 25313455 22909505
5447 22909505 21033663 19413422 17946104 16613664 15297187 14061555 12867982 11789238
5439 11789238 10860752 10070777 9341481 8733963 8257759 7860550 7503785 7157587 6864587
5430 6864587 6624969 6362478 6122950 5931361 5757804 5555030 5410852 5295887 5165228 5066214
5420 5066214 4986710 4919194 4875360 4830541 4749630 4710426 4700465 4698882 4667680 4617776 4617406 4619919
5408 4619919 4568445 4534254 4516786 4482007 4489296 4540810 4516236 4538425 4476570 4355887 4286540
5397 4286540 4230401 4140287 4070734 4076439 4089627 4065349 4055456 4011395 3956630 3905166 3854646 3798418
5385 3798418 3781876 3772828 3792961 3883427 3936614 3954024 3890244 3763596 3665407 3581754 3480880
5374 3480880 3374766 3329092 3280962 3235499 3189566 3111143 3041128 2944722 2903044 2871672 2821807
5363 2821807 2790385 2782145 2749890 2772513 2784583 2793855 2786889 2770634 2745723 2653009 2626164 2624441
5351 2624441 2572304 2543795 2484829 2434908 2452095 2447715 2478793 2528109 2497642 2496355 2524312 2535868
5339 2535868 2506770 2521225 2533803 2573782 2608267 2637868 2694593 2694339 2631265 2646414 2662689 2630369
5327 2630369 2638947 2591902 2606438 2618437 2547702 2501575 2505846 2484073 2502672 2560642 2584694 2558149
5315 2558149 2573470 2554581 2576309 2658050 2677369 2731416 2796521 2839601 2891425 2929320 2963111
5304 2963111 2915640 2878431 2834778 2854566 2825152 2829697 2851547 2789259 2802722 2870317 2894629 2886594
5292 2886594 2854892 2952492 3019702 3028088 3057466 3104328 3144223 3140448 3216107 3252758 3261106 3303919
5280 3303919 3309677 3326887 3407301 3445216 3492825 3559905 3574489 3638829 3708411 3742580 3775214 3825805
5268 3825805 3877309 3928354 3970412 3978988 4041061 4111259 4157321 4180055 4263895 4324945 4344747 4432119
5256 4432119 4555435 4615227 4612940 4703177 4760988 4795343 4913333 4987637 5129824 5211997 5287195
5245 5287195 5415209 5529399 5587597 5656503 5735670 5851800 5940252 6002609 6061712 6171033 6277809
5234 6277809 6336018 6452130 6575800 6626373 6729642 6835587 6955668 7101493 7327971 7451081
5224 7451081 7545618 7737056 7921821 8122028 8363601 8570703 8779265 9010642 9275910 9447133
5214 9447133 9676510 9896248 10138434 10381356 10610038 10983409 11398956 11783747 12151806 12563082
5204 12563082 12982009 13478551 13981920 14543900 15212185 15919148 16724663 17605618 18538331
5195 18538331 19627904 20925091 22405116 24208689 26287502 28797067 31845294 35548834
5187 35548834 40094442 45584424 52082618 59546847 66161399 69187724 68554902 65471907
5179 65471907 60220562 53146732 46353329 41154959 37572522 35139981 33558749 32758696
5171 32758696 32463964 32562974 33028940 33857812 35035058 36593078 38604876 41204269 44516290
5162 44516290 48655573 53834315 60300822 68401970 78290552 89920401 102383243 113501318
5154 113501318 119675284 119523232 113886336 103849440 90565045 76810783 64960445 55717535
5146 55717535 48938257 44091348 40582504 38008662 36168688 34872372 34059546 33614480
5138 33614480 33519073 33890049 34761235 36079300 37832232 40185159 43158666 46835900 51398800
5129 51398800 56830088 63194128 69729972 73646867 73371701 69794799 63892924 55893566
5121 55893566 47005483 39525905 33893102 29766030 26690529 24332253 22534877 21086031
5113 21086031 19862430 18915613 18048830 17375615 16910591 16510512 16305031 16205916 16140484 16270160
5103 16270160 16480799 16746051 17028432 17311976 17514351 17539328 17387432 17040675 16461953 15733684
5093 15733684 14889392 13999918 13211240 12462251 11778720 11250656 10753964 10312382 9929628
5084 9929628 9652703 9390256 9163294 8961842 8806254 8658212 8578152 8498663 8433238 8372992
5074 8372992 8415872 8404753 8449281 8582691 8717637 8883889 9070764 9337680 9471116 9646390
5064 9646390 9705391 9537886 9344746 8993714 8564928 8190273 7797635 7344040 7025567 6796009
5054 6796009 6628227 6467758 6268499 6116631 5964219 5840659 5791631 5625663 5502232 5475419
5044 5475419 5429375 5320357 5245160 5197095 5155036 5080438 4998990 5048471 5053746 5022703 4992417
5033 4992417 5016890 4998848 4986391 4957552 4962832 5005737 5054026 5029651 5059245 5098197 5163949 5126502
5021 5126502 5026941 4895173 4805538 4737454 4608603 4540619 4521625 4504388 4439757 4366537 4329258
5010 4329258 4360655 4372007 4357625 4411271 4412499 4446875 4465552 4511518 4600504 4652564 4749066 4870774
4998 4870774 5036555 5154872 5323299 5562560 5708952 5802254 5825388 5744495 5574359 5353674
4988 5353674 5110238 4920987 4781561 4660947 4616966 4547746 4506625 4480513 4459501 4449123 4443549
4977 4443549 4404488 4437153 4533237 4580129 4639593 4788833 4890936 5012364 5245485 5461612
4967 5461612 5699005 5942064 6188742 6508331 6806245 7015348 7287966 7533706 7782226 8079877
4957 8079877 8392264 8632295 8727121 8633150 8338973 8019872 7625734 7183447 6832452 6596554
4947 6596554 6407043 6260790 6165743 6094195 6063890 6039489 6135550 6210832 6378104 6592568 6857475
4936 6857475 7191191 7572498 8023809 8563856 9187911 9863787 10611717 11266529 11804683 11976583
4926 11976583 11770232 11254729 10492807 9606595 8743226 7980149 7305663 6769445 6309803
4917 6309803 5983748 5680559 5466518 5314354 5199630 5129270 5151709 5207116 5247121 5379111
4907 5379111 5486283 5683522 5923980 6226083 6575496 6936977 7242766 7474359 7538926 7399366
4897 7399366 7064451 6579823 6056681 5492901 4983697 4634931 4361025 4089575 3889962 3757066
4887 3757066 3615936 3510267 3411999 3337360 3261780 3212128 3189379 3123837 3051992 3055417 2994863
4876 2994863 2914031 2903858 2916667 2951402 2931653 2949977 2951847 2956729 2949895 2952150 3030279 3077761
4864 3077761 3117538 3187686 3310731 3398784 3491505 3632030 3792838 3978170 4143812 4294421
4854 4294421 4424938 4441852 4396922 4279959 4113243 3940403 3733978 3587354 3403570 3274199
4844 3274199 3179061 3107916 3088046 3026456 3065938 3071100 3076849 3089793 3072595 3055175 2995038 2899498
4832 2899498 2833180 2747855 2673935 2602778 2519486 2468215 2435215 2367077 2324673 2311749 2312922 2299653
4820 2299653 2292481 2360242 2356488 2316276 2289792 2363497 2319705 2291482 2284630 2234238 2191135 2181448
4808 2181448 2119947 2099190 2091118 2061204 2028169 2018952 2010296 2008025 2029136 1962763 1953709 1980823
4796 1980823 1948423 1986194 2043962 2036796 2021450 2061137 2124184 2180094 2227548 2253159 2246232 2229964
4784 2229964 2171610 2137308 2077000 2030159 2010577 1973923 1967564 1927156 1896257 1880892 1841067 1800977
4772 1800977 1775100 1767413 1777348 1819388 1847283 1827846 1828574 1844909 1827104 1849931 1890253 1879211
4760 1879211 1927391 1947382 1981978 1990009 1923215 1825054 1807948 1764863 1769914 1752937 1666972 1677336
4748 1677336 1655348 1642781 1667188 1673390 1704635 1703123 1699241 1685605 1653331 1652367 1632522 1615182
4736 1615182 1619308 1601335 1571618 1551571 1552494 1534453 1510954 1512962 1521147 1448215 1447120 1491523 1467959
4723 1467959 1448884 1485776 1455300 1520858 1515912 1483562 1475689 1448423 1430770 1388627 1374357 1399644
4711 1399644 1425359 1406094 1391817 1430940 1480593 1494807 1470590 1469387 1455219 1414587 1452221 1465443
4699 1465443 1459547 1454549 1448154 1416088 1428040 1466584 1491873 1524934 1496485 1496827 1526400 1522619 1492795
4686 1492795 1527138 1556693 1559350 1585036 1572630 1586517 1566191 1570645 1573968 1569678 1596324 1590556
4674 1590556 1611218 1590557 1570862 1615074 1618453 1582012 1563320 1571771 1569270 1579398 1586357 1598653
4662 1598653 1643863 1688589 1660451 1592690 1595940 1622837 1603684 1628735 1640411 1642198 1627709 1617584
4650 1617584 1614602 1625011 1605061 1585659 1532718 1584199 1574437 1571121 1525969 1540419 1500174 1473017
4638 1473017 1472377 1500302 1536598 1587323 1587494 1589372 1555037 1547924 1581490 1581257 1574073 1576845 1617058
4625 1617058 1650629 1631656 1626408 1618064 1617605 1624267 1606854 1596708 1557825 1605247 1579601 1534726
4613 1534726 1506160 1533870 1565842 1578867 1610238 1617577 1632084 1631069 1591456 1616138 1621021 1654813
4601 1654813 1705220 1712736 1742333 1727461 1663107 1677976 1698751 1701569 1702749 1725911 1705009 1737985
4589 1737985 1697511 1699737 1741231 1699527 1695644 1730737 1739145 1740963 1733363 1712774 1720396 1742823 1744597
4576 1744597 1748766 1729994 1705411 1686005 1738672 1729690 1730434 1777190 1808474 1836730 1917520 1960577
4564 1960577 1924250 1870461 1933473 2006089 1986507 1983860 1979452 1936946 1912159 1914554 1926118 1947892
4552 1947892 1896918 1856907 1882489 1911085 1923671 1948686 1970130 1946669 1950399 1982205 2016351 2039777
4540 2039777 2112791 2094118 2134719 2130728 2190847 2240058 2245797 2275054 2300551 2375950 2400019 2436365
4528 2436365 2459458 2477569 2503755 2523980 2543179 2551512 2547690 2502499 2428798 2385851 2364033 2391108
4516 2391108 2390664 2366865 2444703 2480311 2478636 2510891 2527553 2566350 2535216 2563486 2610841 2652334
4504 2652334 2709289 2756343 2817891 2898773 2962314 3034921 3166275 3288037 3378146 3460785 3472348
4493 3472348 3476645 3429580 3401607 3339145 3324773 3320208 3306994 3351048 3378440 3421517 3478404 3537718
4481 3537718 3609005 3659658 3775282 3907725 4031494 4173700 4325282 4498163 4693176 4865501
4471 4865501 5079169 5340378 5601203 5843620 6139666 6378920 6597328 6780298 6928373 7084734
4461 7084734 7213213 7310949 7463457 7543595 7589044 7610278 7677899 7735988 7804146 7919768 8012724
4450 8012724 8134409 8179967 8187203 8110782 7980618 7859208 7725845 7667832 7705731 7812748 7976002
4439 7976002 8176825 8529380 8909429 9367515 9944870 10595253 11365385 12255262 13313862
4430 13313862 14575010 15920448 17297015 18421504 19093590 19207819 18619267 17494355 16008676
4421 16008676 14367573 12759174 11413929 10289229 9394762 8680753 8017721 7444001 7007834
4412 7007834 6614738 6302533 6046003 5778839 5559216 5384936 5257913 5086823 4941854 4827105
4402 4827105 4719752 4594671 4493434 4376473 4305146 4254995 4206736 4109023 4021657 3928246 3836913
4391 3836913 3771700 3649738 3593883 3540791 3474843 3413761 3380999 3313085 3235138 3223145 3259063
4380 3259063 3236412 3217843 3252026 3274315 3243866 3270043 3297705 3310078 3371564 3408536 3402590 3429625
4368 3429625 3444809 3425308 3470086 3413395 3285869 3185220 3101107 3058773 3013423 2977680 2935195
4357 2935195 2926101 2890804 2862144 2860263 2846374 2855766 2839173 2820385 2826174 2836088 2818810 2866578
4345 2866578 2836606 2839762 2825992 2811042 2813010 2788425 2759290 2749115 2752549 2704909 2652502 2664897
4333 2664897 2651987 2648043 2615449 2615090 2663969 2657937 2653700 2658337 2597625 2601157 2590779 2577675 2549194
4320 2549194 2574949 2560524 2572316 2599414 2622510 2616963 2631115 2617997 2644777 2677028 2629202 2612364
4308 2612364 2631341 2636836 2645340 2637558 2706879 2734611 2747410 2805558 2814700 2830831 2846744 2863848
4296 2863848 2915429 2984914 3014951 3045237 3085986 3129533 3112942 3178935 3231227 3299249 3275850
4285 3275850 3286876 3366676 3435183 3491864 3618091 3721427 3834065 3989769 4124009 4317429
4275 4317429 4519604 4668463 4753387 4779381 4759694 4802315 4800148 4706551 4605759 4496463 4518852
4264 4518852 4541077 4640192 4786173 4897176 4998440 5140790 5333905 5540108 5776391 5990623
4254 5990623 6208133 6479336 6841213 7156975 7621082 8109630 8645865 9349886 10145780 11136379
4244 11136379 12101883 13155932 14050479 14811685 15366385 15868817 16461576 17240963 18075102
4235 18075102 18805460 19313958 19283069 18890725 18250199 17520528 16945756 16533603 16225086 15968456
4225 15968456 15560224 15028523 14419269 13870801 13618538 13460087 13349540 13290959 13373043 13547363
4215 13547363 13889362 14508580 15117720 15543838 15907884 16114046 16328060 16693429 17231135
4206 17231135 17855548 18278476 18356601 17939886 17084304 16042711 15074491 14347837 13768898
4197 13768898 13191489 12567685 11766179 10798251 9786500 8938423 8143182 7459845 6958612
4188 6958612 6506207 6186705 5906976 5653850 5429146 5224243 5015850 4879156 4767176 4654011
4178 4654011 4553972 4446111 4388798 4337138 4280307 4251078 4117211 4017140 4002740 3888140
4168 3888140 3820277 3773251 3719119 3670541 3650197 3597533 3603462 3542172 3504725 3458342 3388281 3409940
4156 3409940 3359174 3341097 3277088 3222838 3205113 3195411 3184506 3213448 3214137 3151354 3186164 3136491
4144 3136491 3099700 3117866 3125710 3160896 3201227 3178425 3153590 3206212 3215093 3190914 3217310 3251367
4132 3251367 3283893 3242107 3243563 3265823 3281230 3274560 3345944 3402523 3411296 3426136 3488905 3496689
4120 3496689 3578885 3572949 3560385 3558045 3599973 3656583 3599304 3609161 3649083 3696279 3713879 3682867
4108 3682867 3643138 3575641 3587985 3585822 3511452 3494055 3524775 3522177 3506854 3455444 3422479 3444422
4096 3444422 3421507 3435918 3454565 3459333 3403385 3335091 3335931 3363353 3355994 3324303 3328232 3368794
4084 3368794 3421911 3463555 3446637 3427226 3452563 3414598 3419621 3401881 3369104 3411815 3392688 3396830
4072 3396830 3398005 3393948 3479041 3569389 3614026 3644193 3721431 3742620 3751470 3731944 3719919 3717977
4060 3717977 3751846 3809818 3794623 3809821 3834491 3844527 3884374 3930118 3989814 4043785 4105285
4049 4105285 4121819 4183111 4215310 4207576 4282887 4362853 4433388 4505812 4589078 4657729 4780409
4038 4780409 4883474 5024398 5142291 5202902 5253609 5220587 5205223 5246841 5252986 5291618 5285209
4027 5285209 5284914 5274731 5316334 5346321 5416888 5481084 5517517 5588451 5591749 5554975 5529391 5503004
4015 5503004 5542905 5554350 5575660 5576358 5632257 5674682 5702599 5735680 5759734 5830999 5939923 6035901
4003 6035901 6126145 6138977 6195717 6298209 6374699 6454555 6541422 6664621 6787071 6868209 6966334
3992 6966334 7080022 7137202 7236718 7331415 7433473 7532775 7644909 7754379 7822195 7977000
3982 7977000 8094258 8211189 8407784 8567937 8730465 8863230 9038142 9236865 9391659 9588156
3972 9588156 9770171 9918385 10089986 10348744 10507320 10709724 10907064 11165219 11340641 11602838
3962 11602838 11844137 12095109 12299707 12554517 12770565 13020609 13226569 13532228 13798384
3953 13798384 14055620 14375619 14719783 15028220 15353430 15676725 16066307 16485279 16953841
3944 16953841 17437647 17871955 18409677 18939547 19520555 20112057 20763604 21470787 22152135
3935 22152135 22902954 23621783 24403628 25145893 25846136 26505302 27128144 27686646 28234244
3926 28234244 28661810 29020378 29294956 29519904 29910428 30319855 30897971 31442791 32033129
3917 32033129 32744092 33576621 34601731 35863242 37246447 38952845 40875337 42940514
3909 42940514 44966246 47180102 49572919 52370211 55470417 58951808 62746078 67019103
3901 67019103 71677829 77062024 83035829 90249953 98911085 109384979 121433623 136051597
3893 136051597 154137223 177789547 207397072 244279899 289562764 346174419 388681377
3886 388681377 391729536 367259164 326323775 268418588 209102719 165513045 135567421
3879 135567421 114421538 98609008 86577304 76757250 69035831 62691980 57618732 53410402
3871 53410402 50044357 47075375 44701536 42671559 41032886 39518486 38274255 37080129
3863 37080129 36135102 35242708 34581287 33853467 33235561 32472469 31709709 30983535 30305815
3854 30305815 29610540 28996562 28355617 27779525 27166610 26602470 26054240 25539486 25020820
3845 25020820 24526514 24051014 23732488 23502093 23414683 23407797 23489166 23598349 23789762 24063725
3835 24063725 24481006 25028383 25728280 26571188 27653305 28849602 30267345 31786869 33667840
3826 33667840 35620482 36899825 37684088 38257899 38732419 39358313 40429127 42034661 44086297
3817 44086297 46671071 50017977 54198779 59397158 65571734 72773788 80483047 87905433
3809 87905433 93464212 95576692 93603912 88018857 79796295 70423846 61261759 53305757
3801 53305757 46954286 41930622 38129533 35234246 32952214 31177121 29838108 28858876
3793 28858876 28098915 27595292 27342136 27253866 27305415 27445001 27707213 28201375 28953948 30183503
3783 30183503 32077341 34669265 37942556 42272846 46941949 48804914 46925606 42818559
3775 42818559 37193668 31476032 26989872 23792084 21500242 19796552 18483268 17434236
3767 17434236 16458747 15685279 15096683 14620866 14152435 13803748 13477213 13215880 13019638
3758 13019638 12849953 12719975 12625200 12521131 12419652 12350037 12334046 12311881 12259699 12165149
3748 12165149 12050776 11954709 11926311 11791900 11683020 11508550 11342047 11202322 11141322 11128798
3738 11128798 11156124 11283795 11437101 11374778 11182053 10936227 10580159 10226421 10068919 9863690
3728 9863690 9740214 9666429 9625070 9591298 9570155 9533019 9494887 9481265 9478678 9480721 9439387 9417573
3716 9417573 9423482 9383511 9307663 9295546 9267260 9293916 9352452 9331567 9365598 9376165 9385288 9470299
3704 9470299 9568640 9635187 9722033 9889903 10037691 10137821 10284291 10423766 10565290 10681591
3694 10681591 10838560 11003571 11195457 11369969 11492310 11601391 11719411 11914562 11949175 11846238
3684 11846238 11731242 11560501 11337331 11109259 10801063 10529711 10195556 9818065 9543572
3675 9543572 9302084 9056877 8778172 8534556 8257218 8021100 7855895 7673022 7563465 7421018
3665 7421018 7329798 7185830 7122946 7030216 6933483 6779327 6693441 6651747 6552326 6471811 6407383
3654 6407383 6308689 6300339 6301544 6248279 6218040 6153928 6176832 6239891 6287959 6393322 6474437 6577890
3642 6577890 6688159 6818461 6931173 7000502 6952115 6867894 6778457 6600420 6412125 6242012
3632 6242012 6100658 5952147 5788190 5706016 5641696 5666799 5654574 5715356 5760805 5828693 5882822
3621 5882822 6020628 6259687 6486330 6810680 7199376 7673810 8191848 8570355 8681633 8544253
3611 8544253 8253079 7825660 7275458 6727801 6304772 6002753 5728882 5493823 5291376 4995111
3601 4995111 4843977 4714549 4568050 4409650 4269882 4173505 4140878 4073601 4023913 3973636
3591 3973636 3914477 3872136 3810713 3821719 3769713 3776291 3787224 3772749 3680649 3651657 3600926 3564547
3579 3564547 3509782 3507977 3504804 3543874 3495774 3420559 3375550 3368769 3392535 3380767 3431005 3463454
3567 3463454 3445389 3421370 3432140 3418746 3426176 3470558 3462558 3576449 3627750 3641852 3717650 3843695
3555 3843695 4003722 4135539 4314636 4560144 4776876 5011825 5089709 4979005 4794243 4496512
3545 4496512 4238171 3986345 3800690 3680895 3585267 3511418 3468616 3384280 3341511 3318928 3314982
3534 3314982 3337172 3287343 3285739 3275665 3294698 3314051 3313969 3322557 3347819 3354350 3350966 3357792 3354459
3521 3354459 3413064 3400026 3439374 3487176 3483607 3454649 3517617 3574316 3595011 3678064 3664959 3702062
3509 3702062 3708262 3714441 3772812 3819159 3862697 3899985 3935822 3959742 3975701 3999405 3995663 4113470
3497 4113470 4166342 4171819 4301015 4448283 4530109 4557508 4576151 4622004 4632944 4686909 4733789
3486 4733789 4726126 4723587 4756060 4790386 4839839 4911082 4939347 4993129 5052398 5147097 5234730 5250800
3474 5250800 5319101 5420247 5472416 5510178 5618725 5724673 5809305 5921321 6032490 6163859
3464 6163859 6337674 6456312 6580671 6733405 6960498 7116640 7329403 7571991 7785982 8054693
3454 8054693 8341932 8640241 8997407 9401127 9818218 10266132 10774798 11321748 11920609 12610174
3444 12610174 13243865 14076154 14915750 15825966 16856524 17956916 19255123 20752628 22406599
3435 22406599 24287871 26542615 29232552 32476269 36369828 41072135 46716585 53333759
3427 53333759 60666669 68223899 75002324 78664333 77618314 72560366 64745630 55479959
3419 55479959 46493945 39001373 33282064 28954539 25635372 23071166 20975175 19283294
3411 19283294 17923328 16753938 15742820 14832735 14094775 13553783 13162946 12743994 12402261
3402 12402261 12206536 12081313 12040492 12057875 12068825 12080450 12112924 12140745 12119587 12180742 12225016
3391 12225016 12185197 11923311 11471330 10909890 10309867 9667450 9113354 8652298 8173013 7793509
3381 7793509 7508064 7260452 7039302 6850884 6657747 6461409 6296420 6177569 5977269 5797578
3371 5797578 5690598 5557658 5478080 5379661 5294010 5219193 5127931 4996578 4914334 4862003 4728139
3360 4728139 4654366 4611887 4578391 4527004 4493229 4469308 4440725 4425925 4382689 4344089 4308512
3349 4308512 4269287 4202406 4105191 4081403 4071851 4103896 4083795 4018155 4009252 3999135 4026027 4012330
3337 4012330 3967661 3937875 3899738 3880006 3907044 3927236 3897087 3898197 3950928 3964347 3900157 3866489
3325 3866489 3839048 3748733 3764288 3686382 3629560 3678963 3658345 3683043 3723667 3722711 3743740 3765761
3313 3765761 3709500 3698034 3676842 3636210 3664135 3654396 3601799 3627787 3590451 3555730 3525772 3567990
3301 3567990 3581214 3534340 3559503 3635795 3669401 3590639 3606109 3640169 3597802 3557419 3481404
3290 3481404 3508276 3535154 3593008 3586860 3594881 3656057 3709828 3732460 3780522 3819213 3823197 3803794
3278 3803794 3852085 3881213 3950666 3999791 4003160 3998152 3982296 3928344 3878302 3917617 3872560 3815197
3266 3815197 3866643 3915327 3931132 3934144 3942810 3929312 3930514 3926771 3964907 3980558 3958923 3981399
3254 3981399 3983475 4046815 4081926 4111000 4118938 4202448 4247251 4249979 4264024 4326296 4461079 4567078
3242 4567078 4702442 4851194 5070883 5315285 5510732 5739591 5909834 5971218 5932737 5794805
3232 5794805 5623162 5441952 5269904 5147504 5031152 4940123 4793836 4708997 4694406 4633027
3222 4633027 4562253 4501992 4448294 4475518 4410420 4330608 4302802 4261653 4249956 4268359 4285373
3211 4285373 4352101 4344854 4344294 4337415 4313711 4398542 4413251 4405307 4497480 4477353 4494331 4572565
3199 4572565 4627076 4673472 4693113 4740635 4768723 4769544 4799594 4885787 4903893 4925608 4948862 4956210
3187 4956210 5004313 5029470 4969972 4939881 4972687 4958157 4916039 4958012 4986291 5001852 5034230
3176 5034230 5010489 5063434 5084978 5181311 5241180 5296367 5337659 5438699 5572165 5595752 5697109
3165 5697109 5787904 5902815 5946346 6028423 6102564 6174547 6235260 6267074 6314949 6307155 6310064 6341754
3153 6341754 6336369 6402360 6457124 6531829 6638075 6718331 6792045 6899014 6961550 7019422 7133273
3142 7133273 7254453 7414252 7509434 7612534 7797602 7957173 8103015 8276316 8456178 8630833
3132 8630833 8793751 9056140 9285786 9508628 9855336 10164313 10515730 10925954 11374368 11876012
3122 11876012 12438788 13044408 13705819 14521699 15412387 16378996 17301116 18094892 18532853
3113 18532853 18611508 18311576 17721982 17039660 16411978 15978610 15725778 15600230 15637090 15879152
3103 15879152 16192763 16639002 17217146 17823892 18584728 19550318 20649120 21862545 23252311
3094 23252311 24793473 26677456 28817683 31323342 34225836 37486646 40701011 43174790
3086 43174790 44407809 44020742 42297138 39704713 36610342 33625189 31282466 29634007
3078 29634007 28662478 28093831 27899594 27988857 28409511 29184023 30191512 31535659 33314257
3069 33314257 35406757 37823059 40630319 43725130 47161752 51006394 55462740 60551418
3061 60551418 65951369 71482584 76503315 79791370 80550531 78556019 73917708 67420200
3053 67420200 60101944 53029112 46857932 41832139 37931150 34931507 32540048 30652227
3045 30652227 29107306 27903053 27008819 26403572 26099247 26099217 26410552 27023713 27886026 29089386
3035 29089386 30742413 32836479 35299217 37891381 40061088 41465907 41625146 40408745
3027 40408745 38044368 35170417 32046908 28966187 26404345 24345923 22486392 20829024
3019 20829024 19452199 18215778 17204347 16365735 15654243 15032625 14494137 14075159 13765328
3010 13765328 13493433 13346490 13348660 13488625 13752994 14221815 14775845 15303253 15611176 15548167
3000 15548167 15081180 14378270 13425082 12399631 11404232 10506361 9790565 9213250 8731021
2991 8731021 8411015 8130399 7816510 7525710 7296301 7064773 6828641 6648262 6472873 6288644
2981 6288644 6134544 6016376 5911144 5837515 5780057 5721786 5724618 5661324 5626629 5656063 5656392
2970 5656392 5631742 5611945 5575280 5475555 5420857 5318308 5230338 5148356 4977051 4876769 4814259
2959 4814259 4722166 4597091 4596317 4519470 4434259 4353957 4259761 4193484 4183546 4152338 4133638 4113931
2947 4113931 4092896 4153308 4180724 4188932 4245778 4282069 4298195 4336847 4369843 4463226 4483423 4476417
2935 4476417 4438018 4353118 4284233 4189038 4090468 3962675 3838247 3764560 3692059 3628271 3536244
2924 3536244 3443431 3417038 3391668 3303113 3277824 3233349 3294078 3272343 3227085 3186037 3201642
2913 3201642 3270727 3287658 3352451 3406939 3473639 3522980 3566220 3570868 3589693 3628616 3579809 3534372
2901 3534372 3440708 3371613 3275864 3228598 3166281 3011516 2960977 2827914 2775862 2741816 2688055
2890 2688055 2656812 2617352 2569731 2573565 2601393 2610022 2588535 2598493 2687600 2717242 2752021 2742643
2878 2742643 2699651 2717682 2748958 2789357 2781989 2723431 2676807 2628231 2595523 2580272 2483011 2375714
2866 2375714 2385828 2321072 2261747 2289206 2294755 2246444 2263825 2237397 2206591 2187354 2185144 2145377
2854 2145377 2141845 2113711 2163202 2181244 2130930 2149292 2199905 2200164 2147054 2136161 2086894 2126664
2842 2126664 2090244 2079491 2004883 1996773 2035259 1979821 1961483 1909381 1911299 1937533 1965272 1957441
2830 1957441 1899625 1864606 1907892 1897325 1860440 1839594 1859716 1871428 1799609 1810432 1853661
2819 1853661 1835673 1851747 1847160 1861001 1841255 1793193 1825615 1838511 1836539 1766326 1763191 1765795
2807 1765795 1802095 1773822 1722784 1720606 1790925 1815262 1800244 1797706 1784786 1809901 1804867 1812851
2795 1812851 1789767 1780631 1759063 1732528 1767140 1802125 1769536 1731619 1763598 1757791 1731657 1742182
2783 1742182 1824117 1804254 1788388 1835371 1917409 1947925 1910067 1946137 1986746 2006656 1988981
2772 1988981 1995452 2008236 1979536 1937821 1951016 1917528 1918238 1879353 1863042 1885920 1875873 1855082
2760 1855082 1828063 1898600 1943404 1971833 2015360 2021635 2066567 2040770 2060259 2114254 2128039 2138015
2748 2138015 2228490 2285628 2260680 2284252 2300481 2333595 2279698 2237655 2224694 2255667 2275122
2737 2275122 2253491 2238702 2239160 2185251 2158902 2096127 2057536 2005872 1987388 2017353 2001919 2062835
2725 2062835 2071755 2064384 2044663 2080258 2150063 2113895 2086597 2137374 2153721 2178582 2144753 2089134
2713 2089134 2021026 1966474 1924306 1931400 1880375 1830763 1835076 1881032 1824657 1809305 1856296 1836517
2701 1836517 1843165 1817135 1819157 1813818 1787882 1784389 1813717 1839896 1851515 1836646 1843959 1873344
2689 1873344 1931704 1900211 1831290 1829211 1854686 1787974 1717624 1754342 1702826 1653103 1657765 1679389
2677 1679389 1685289 1652907 1651215 1690557 1665082 1645021 1707186 1714442 1698405 1695298 1727989 1696874
2665 1696874 1753135 1762372 1738226 1759344 1743258 1729118 1734094 1713962 1680710 1684408 1715115 1742832
2653 1742832 1752054 1786787 1784983 1762904 1758117 1786905 1791443 1754288 1745969 1753857 1773395 1747620 1791765
2640 1791765 1836696 1854228 1870127 1916522 1964640 1897285 1857970 1886181 1927926 1952101 1961855 1981103
2628 1981103 1979018 2006178 2015623 1985720 2017197 2063455 2054282 2083575 2099993 2095177 2068387 2068638 2114311
2615 2114311 2054250 2051553 2012388 2008859 1970478 2037349 2093145 2067878 2082272 2115269 2089890 2131362
2603 2131362 2142030 2135880 2148337 2180501 2206164 2190068 2194586 2193853 2243719 2262612 2276449 2281914
2591 2281914 2239435 2221270 2253060 2262136 2239252 2211801 2181683 2186664 2225773 2210769 2206471 2239092
2579 2239092 2245798 2178168 2197049 2200889 2199400 2195180 2223285 2224685 2188578 2229708 2258291 2248467 2302386
2566 2302386 2347525 2335392 2314067 2343655 2338424 2382955 2423691 2424360 2378260 2368170 2382523 2353928
2554 2353928 2334745 2332463 2303637 2293235 2280143 2303375 2283856 2261289 2285042 2283475 2262538 2292527
2542 2292527 2317123 2272893 2276248 2270527 2314783 2311106 2270755 2268179 2247959 2172757 2162088 2148082
2530 2148082 2185663 2181086 2157443 2142740 2206726 2221476 2202334 2249741 2227578 2223764 2251637 2161253
2518 2161253 2142817 2123479 2063570 2098827 2150807 2154066 2162246 2143366 2110414 2167506 2148041 2155798
2506 2155798 2145239 2101871 2131717 2097928 2140355 2131012 2118976 2156446 2138137 2160250 2177666 2189379
2494 2189379 2128565 2091786 2130852 2149003 2190352 2208153 2203643 2215550 2215222 2229803 2219877 2205900
2482 2205900 2224407 2235118 2259023 2263992 2270488 2280122 2251325 2284205 2299032 2274902 2235660 2255615
2470 2255615 2248892 2250471 2266348 2283077 2276542 2291677 2345309 2329817 2301091 2300731 2332635 2375565
2458 2375565 2393173 2377694 2403900 2395762 2436697 2454164 2477360 2479443 2483631 2506205 2450050 2452971
2446 2452971 2490949 2513682 2497910 2491976 2469564 2453140 2419209 2418076 2428509 2437477 2470807 2469839
2434 2469839 2488088 2516179 2512860 2525965 2495679 2469468 2503429 2504866 2496385 2540852 2549643 2561491
2422 2561491 2618401 2641353 2600847 2625635 2664089 2687979 2684045 2671423 2671951 2663881 2670903 2658970
2410 2658970 2676989 2633595 2632231 2651391 2610833 2633762 2654179 2613415 2584018 2583171 2612432 2648774
2398 2648774 2653130 2658890 2677023 2661842 2660991 2706083 2705351 2713947 2737314 2792601 2822106 2810594 2809672
2385 2809672 2776898 2739328 2794075 2806012 2846621 2811457 2749137 2776858 2787562 2836962 2862341
2374 2862341 2840060 2847184 2884451 2900014 2880169 2923771 2944506 2921159 2905346 2923200 2965362 2968205
2362 2968205 2969396 2966136 2965868 3022752 3116058 3119571 3093390 3089583 3122796 3140260 3127718 3124559 3163811
2349 3163811 3185962 3181707 3180975 3204534 3223469 3282230 3289116 3299154 3327652 3279057 3296941 3300877
2337 3300877 3266911 3321453 3416328 3410147 3385166 3521793 3564780 3578226 3586619 3583279 3586644 3694250
2325 3694250 3737407 3729058 3692537 3734229 3796474 3786480 3851181 3921642 3901911 3904039 3976646 4062381
2313 4062381 4084669 4118412 4108387 4135671 4169776 4201444 4270388 4329499 4347211 4339801 4421810 4474138
2301 4474138 4493587 4507771 4531556 4553162 4580667 4612059 4664399 4721110 4768844 4771502 4823785 4859491
2289 4859491 4922051 4958532 5002222 5053741 5067589 5139886 5200787 5244844 5344089 5444322 5480194
2278 5480194 5500410 5532092 5542038 5616098 5687078 5711045 5790767 5830760 5899009 6009676 6055626
2267 6055626 6124099 6195120 6247995 6323211 6423274 6511521 6594621 6626810 6806628 6939759 6972082
2256 6972082 7051564 7215096 7324067 7399782 7495320 7609355 7679595 7786567 7876652 7961482 8102880
2245 8102880 8170310 8290556 8422674 8561044 8669804 8798774 8850176 8948682 9180121 9276046
2235 9276046 9429260 9600071 9762127 9916231 10090115 10261513 10381439 10512742 10729412 10906367
2225 10906367 11118608 11325975 11536640 11742125 11950692 12184069 12362755 12531182 12736127
2216 12736127 12945244 13098623 13307827 13563091 13772780 14017022 14262705 14486430 14738674
2207 14738674 14998920 15343143 15614954 15922461 16241447 16551231 16855984 17200626 17574814
2198 17574814 18055090 18505010 18993053 19473724 19904194 20444907 21129862 21731167 22386761
2189 22386761 23169507 23966149 24847038 25828972 26876725 27896764 29098727 30442281 31888348
2180 31888348 33480981 35125319 36963844 38909215 40930832 43104254 45368821 47622960
2172 47622960 49810499 51890192 53681958 55006818 55675563 55653347 54803010 53119888 50851802
2163 50851802 48300009 45660464 43046700 40705158 38601508 36748072 35054504 33606050
2155 33606050 32343917 31131703 30064719 29097510 28252736 27405134 26628266 26061193 25528986
2146 25528986 24958602 24467471 24010561 23560145 23148269 22751918 22377135 22076057 21739293
2137 21739293 21396946 21102444 20723240 20352211 20075620 19703837 19380113 19055441 18608024
2128 18608024 18151581 17767288 17378715 16942880 16445414 16031069 15667131 15306185 14981936
2119 14981936 14602157 14297967 13973402 13647023 13340677 13085620 12869499 12628758 12355540
2110 12355540 12109773 11933323 11761435 11574450 11420314 11265039 11040859 10861408 10731881
2101 10731881 10593248 10423890 10259856 10161875 10020591 9909476 9758244 9646411 9526786 9370795
2091 9370795 9250751 9137304 9065786 8959510 8827733 8738535 8682122 8551640 8506341 8393548
2081 8393548 8282380 8176725 8069598 7952938 7837812 7807613 7763035 7713066 7667011 7570599
2071 7570599 7467878 7408011 7363983 7332032 7304166 7219307 7146168 7068964 7003890 6980324 6958975
2060 6958975 6876822 6784552 6736056 6651488 6590758 6535132 6521331 6456682 6357666 6235227 6222284
2049 6222284 6243633 6145070 6095199 6060385 6025265 5945774 5879278 5821735 5766579 5730790 5677046
2038 5677046 5663632 5615772 5568739 5579559 5560287 5504317 5434289 5438732 5428092 5395896 5367597 5323645
2026 5323645 5299891 5222422 5187442 5211668 5223813 5204724 5172883 5165331 5188696 5091236 5033897 5023925
2014 5023925 5009630 4979317 5012408 5000370 4904842 4907207 4894299 4815683 4787172 4765873 4780429 4834147
2002 4834147 4821510 4785358 4791290 4725241 4702679 4648968 4661038 4676128 4638717 4656501 4620956 4585609
1990 4585609 4610415 4597210 4578314 4554734 4547317 4487547 4415466 4429220 4381396 4340773 4307593 4256155
1978 4256155 4230193 4199173 4148966 4153338 4135999 4152642 4080721 4071806 4036478 3971208 3985593 3987395
1966 3987395 3988336 4028283 4031796 3971975 3933020 3908062 3854219 3799541 3772502 3781033 3768814 3754317
1954 3754317 3720727 3697173 3640355 3603653 3586572 3557639 3532391 3529413 3524347 3538519 3468409 3435505
1942 3435505 3411711 3386858 3380909 3398413 3382119 3365629 3352974 3344523 3314447 3308451 3314670 3258166
1930 3258166 3253016 3252132 3212169 3241483 3283422 3280814 3266233 3304095 3327864 3347077 3318924 3347654
1918 3347654 3398672 3385102 3341143 3283873 3310354 3353304 3388812 3419190 3429898 3392570 3415548
1907 3415548 3443026 3496479 3518920 3528680 3575601 3579518 3592306 3624002 3638614 3675366 3709041 3721933
1895 3721933 3727002 3813585 3846024 3916444 3944172 3973898 3932261 3966478 4043903 4133001 4144387 4187971
1883 4187971 4238616 4271329 4288750 4330616 4352319 4419956 4470663 4495040 4485061 4547520 4595776 4609949
1871 4609949 4702704 4774147 4830981 4851829 4870549 4870286 4953428 5018788 5103192 5206864 5315591
1860 5315591 5422391 5475892 5495606 5649390 5825570 5880254 5977454 6136609 6295771 6407015
1850 6407015 6507437 6673181 6836589 7024568 7214705 7392042 7625822 7837040 7992376 8225569
1840 8225569 8475787 8702329 8920972 9164579 9437210 9634781 9781500 9937011 10052343 10184533
1830 10184533 10314774 10421185 10479699 10613435 10701805 10820386 10965385 11073220 11264343 11437866
1820 11437866 11650690 11935002 12255977 12574798 12948803 13372235 13832044 14337887 14874995
1811 14874995 15415201 16102668 16710506 17300653 17919529 18512460 19029388 19390352 19474762 19354970
1801 19354970 19037746 18519436 17845058 17138311 16539289 16079112 15754316 15511646 15440776 15415034
1791 15415034 15533914 15641622 15860034 16138374 16473547 16805401 17166863 17551638 18007188
1782 18007188 18424811 18794435 19189593 19609424 19895919 20078798 20178306 20223446 20091579 19781858
1772 19781858 19349800 18876960 18333029 17797205 17132287 16423865 15712644 15113244 14614157
1763 14614157 14223455 13936046 13683595 13534083 13423107 13433673 13441409 13527710 13593402 13671908
1753 13671908 13644783 13588958 13568890 13443700 13235713 12987389 12758834 12428243 11999710 11493966
1743 11493966 10938893 10401608 9808956 9325901 8847663 8426946 8066339 7788041 7496885
1734 7496885 7209527 6951472 6730389 6531399 6339068 6131629 5935016 5814316 5668398 5578393
1724 5578393 5471715 5362812 5301691 5166027 5073565 4931451 4782816 4687437 4585129 4426160
1714 4426160 4238058 4136933 4022573 3923981 3857891 3724456 3614533 3510999 3445836 3371151
1704 3371151 3282115 3202044 3127946 3067338 2971938 2917711 2846607 2750215 2693278 2665297 2609392
1693 2609392 2566951 2553831 2496766 2439749 2407680 2391746 2369787 2357752 2311907 2268433 2236775
1682 2236775 2186740 2182013 2180410 2094245 2079087 2075833 2044931 2052798 1965686 1925244 1916394 1878827
1670 1878827 1805664 1709198 1701955 1649445 1656340 1614988 1562174 1562341 1532093 1496746 1486353 1420641
1658 1420641 1407743 1467480 1468793 1432451 1452651 1423230 1339954 1372300 1364906 1275899 1235359 1212345
1646 1212345 1196360 1155061 1105164 1107977 1073585 1103192 1067778 1020823 1008932 1016910 987227 953850
1634 953850 930380 882092 835510 832481 815704 838514 822361 800452 834975 876063 812286 777483
1622 777483 736086 731776 766850 708150 697557 695369 689423 638379 659183 631162 616221 591415
1610 591415 598391 598796 575411 535352 554293 547847 536632 544405 523864 512688 514371 471414 503900
1597 503900 515198 543951 555066 520489 490149 485087 471787 477887 462265 455123 460680 404595
1585 404595 437798 478670 488389 479264 446828 415301 456489 434532 387472 369790 392559 338027
1573 338027 375835 366596 399141 374378 407169 394505 362241 400084 412408 390628 392813 373877
1561 373877 375814 389985 370406 398693 439862 354499 332805 323064 328358 306755 284760 237450
1549 237450 261292 254059 246553 273682 289307 307475 321949 330026 290615 308919 300977 325130
1537 325130 322812 339707 303305 304121 281406 253612 238062 258073 248647 246307 286302 295306 280033
1524 280033 252241 214681 272055 247034 276559 267249 238687 200300 218496 266316 267657 292079
1512 292079 266716 280696 272846 230435 241915 251613 210472 221191 234713 255287 214615 265624
1500 265624 283847 271241 273318 264561 258067 237292 224888 197276 165955 170191 199022 218536
1488 218536 208403 174723 213251 235030 222164 197682 210203 252041 283616 234687 230000 237736
1476 237736 236722 195087 185633 195799 188418 185902 190719 232881 240391 207662 194476 178064 173692
1463 173692 139078 154900 186119 198983 183220 167801 136837 113928 75196 88895 127197 178312
1451 178312 175223 166347 178814 159580 174091 149091 88642 98265 108915 128648 142037 188358
1439 188358 128873 14678 58483 124878 69488 71460 87154 122958 123620 64742 92233 68499
1427 68499 39218 17106 27759 36834 84465 67224 106297 130076 56687 67053 94460 58348
1415 58348 57564 112968 103105 61433 43399 34822 53104 58782 34019 24160 57935 61284 55746
1402 55746 79820 74866 46738 64112 24481 19605 9851 26876 86894 116306 96307 62233
1390 62233 28696 30237 13870 18912 78844 47428 25881 112 -47482 -35606 -18839 2059
1378 2059 3735 29212 32740 38769 15514 22766 25007 12153 -1211 -52261 -36330 -243 -52732
1365 -52732 -63548 -24533 28255 21042 7215 21563 4469 12287 57988 41241 59335 54323
1353 54323 65589 12286 5943 60952 37590 -31532 10174 -13025 -9063 31168 56342 31222
1341 31222 -7545 21460 49064 29183 -4625 -6707 -31236 -19345 18085 67323 17685 21523
1329 21523 7159 -51052 -64838 -24236 -17727 -48677 -56556 -1427 3178 21439 -33836 -60131
1317 -60131 -63134 -28334 -31172 -9429 -24655 6232 -8987 -14731 -687 -12103 -21825 231 8956
1304 8956 -35952 -34335 3578 3180 797 30552 -26950 -29602 -11956 -2331 -6464 36104 20780
1291 20780 -62386 -59135 -25866 -38698 -48885 -48244 -46764 -63692 -40188 -31942 -62859 -38700 -4370
1278 -4370 -14878 -43859 -25014 2004 14518 9565 9846 -554 -10652 -21277 -49774 -60625 -38664
1265 -38664 -8550 19320 30191 12285 29535 9589 -35838 -5342 14104 55966 35227 32595
1253 32595 50005 35719 10280 9723 44630 -9188 -16177 10530 62968 86193 80139 93071 109942
1240 109942 124406 89928 153019 140960 112602 104806 122792 120532 60084 -15712 -23184 -19870
1228 -19870 8172 25590 2905 -14110 -38133 -42598 -22664 583 -40120 -66422 -18756 -7140
1216 -7140 -57305 -35016 -15965 -40480 -50972 -4555 3082 11619 25014 26362 52733 52080 -15320
1203 -15320 -6254 16397 44523 -574 -17372 19909 36166 -10324 -44350 -14811 14271 3099
1191 3099 2214 -5592 -24856 -27175 941 -19038 -77821 -39133 -18147 -16217 -2095 -57098 -50305
1178 -50305 -14028 -38778 5829 -43897 -69064 24632 71638 56932 38353 42159 33741 32403
1166 32403 22708 53143 50080 34866 59207 113767 94652 72818 15017 -15842 32334 9682
1154 9682 -21832 24423 55323 -6854 -16791 -9985 28320 17528 540 21965 -15317 -33759
1142 -33759 -2200 77991 87855 51401 2535 4887 1484 46748 71756 51344 99728 106094 99997
1129 99997 34772 23189 54201 25958 39453 60494 87762 87348 97766 106326 81555 82182 26490
1116 26490 14023 61073 113194 67232 23469 85571 130309 132715 113662 146634 216597 193210
1104 193210 180443 166186 161430 163825 130340 122678 77932 62550 113968 182981 162363 118796
1092 118796 149346 159508 207689 220391 207931 234205 207273 222500 215307 232402 214852 232864
1080 232864 251146 305994 393966 398167 408756 419570 453388 464177 451859 430670 430793 387306
1068 387306 335086 285693 298968 331619 277853 290383 319617 305253 299917 357198 368130 340144
1056 340144 352047 337124 382943 395551 404755 400413 403118 403347 389563 418496 463214 436051 450856
1043 450856 483280 497459 494502 497592 501770 536922 592921 675609 644987 612424 646411 639176
1031 639176 603193 623340 667455 706950 670238 735260 808481 797267 780898 829395 849928 812136
1019 812136 787305 825599 875937 919874 895980 898403 963393 965949 968462 955875 1003218 1012443
1007 1012443 1051015 1064627 1137254 1173621 1180040 1211331 1248569 1238365 1298197 1313622 1356463 1445392
995 1445392 1466575 1521690 1515465 1568538 1627884 1708511 1806373 1864682 1975845 2082475 2190001
984 2190001 2297987 2438209 2590931 2781576 2979233 3164917 3317138 3553524 3756141 4038391
974 4038391 4367103 4745299 5151810 5659486 6167061 6522337 6844844 7208620 7712478 8479798
964 8479798 9421855 10541024 11845182 13611147 15847858 18762619 22262130 26624397 32395869
955 32395869 39988721 44135721 40788409 33999004 26104911 19546632 15280396 12484495
947 12484495 10513220 8947882 7727116 6815458 6147426 5604776 5210633 4867107 4683141
938 4683141 4503902 4154606 3800893 3440575 3160620 2933422 2781708 2590209 2418767 2316371
928 2316371 2174945 2021762 1981277 1950281 1865654 1735277 1602370 1553338 1503552 1478187 1415990
917 1415990 1342296 1334967 1328798 1246238 1203786 1136546 1070814 989462 981432 959587 920973 832635
905 832635 787048 810279 757285 709494 679240 685271 688811 681443 637890 659905 636530 589652
893 589652 604483 588811 537554 485615 526717 492329 457564 460375 456697 424957 449182 406452
881 406452 463602 487404 433601 463654 472017 402286 363701 395652 447051 419630 375160 364932
869 364932 317978 316144 332221 295506 303574 319968 316591 324135 299949 319203 311347 303724 272575
856 272575 272761 300498 267051 294332 260717 255182 233977 188087 210947 256572 218505 143261
844 143261 169597 132993 176361 183848 150514 97306 80975 95227 119647 41319 89168 63076
832 63076 88636 126749 104290 115089 85743 87651 105178 75825 66268 82931 113190 100824
820 100824 100052 105773 88354 68396 90431 51266 35745 30541 29416 73649 88456 71811 38711
807 38711 51553 94667 117502 89054 59099 56910 47814 -7308 40655 46394 27056 17318 18683
794 18683 43875 99869 66015 46964 66602 57003 54855 30966 11528 42572 35528 13738 -5525
781 -5525 6831 9652 11922 2337 293 -17176 10437 12076 -9697 38892 27683 19554 48081
768 48081 -21034 -15202 74199 48250 9722 28789 26972 39143 10261 -7128 -17411 -31726
756 -31726 -3497 -44458 -41772 -20518 -56701 -73165 -111973 -87725 -47593 -61329 -71142 -47548
744 -47548 -25267 -22187 -27326 -7064 14696 -4599 -24145 -71861 -63240 -63755 -62197 -18722 -2872
731 -2872 19465 -17087 14179 -428 -48045 -33169 -15107 -34826 12380 -10059 -22580 -13820
719 -13820 -4082 -7062 -36422 -17032 -52145 -57226 2848 49633 33740 14473 -3665 46529 -333
706 -333 -59299 -51654 -23023 -29213 -10373 -2721 -6729 -48097 -63527 -51634 -60333 -39629 -3062
693 -3062 -15908 -37421 -20824 -26646 -67561 -85821 -44101 -65832 -70469 -45584 -49924 -57959 -20193
680 -20193 28603 11252 -6741 25583 5844 -9109 7877 23890 52667 53083 49570 104594 171608
667 171608 141753 112308 106146 94681 68962 75121 11461 8307 -18196 -11994 -20499 -19350 -4367
654 -4367 8096 24212 -4576 10802 5059 -15187 -25782 -35187 -20422 12970 10122 -26178 -4009
641 -4009 5688 -19758 -21987 -76318 -58764 -29155 -29351 -53264 -65583 -60649 -23111 -45014 -36614
628 -36614 -36145 -51764 -23588 -21019 -62117 -12098 33666 -4990 16401 -9432 37976 60943 25557
615 25557 -55276 -96398 -23642 -19630 -32613 -12581 -23752 -31229 -47312 -5637 939 -21449 -6294
602 -6294 -12828 -20159 -33689 -41032 -87632 -32065 -85189 -86979 -63176 -55381 -94371 -71492 -40767
589 -40767 -3391 883 -14362 -20131 -21992 -18280 -50669 6479 -5553 -32743 -34536 -13441 46021
576 46021 23140 -4818 -62414 -39765 -11626 -22336 -8885 -10069 3256 -53480 -36039 -39574
564 -39574 -21587 -67604 -48500 8418 11414 -11301 -2408 -18266 1688 21577 -17920 -11521 14461
551 14461 -9912 4297 -16853 -5595 -35244 -66816 -57972 -29643 -40429 -78995 -72407 -7983
539 -7983 -3662 -5118 6594 -55389 -38254 -33193 -55217 -70568 -49493 7978 12174 5243 -23707
526 -23707 -44733 -62447 -82948 -78226 -68928 -60174 -72853 -34290 -29323 -24015 -27554 -57884 -71613
513 -71613 -13507 -3332 -15561 -16577 -65055 -45348 -16036 -8325 9246 -35621 -83109 -92045 -84218
500 -84218 -73361 -70454 -40544 -14828 -466 -32855 -19078 -7696 -29957 -6051 -11061 -18687 -35442
487 -35442 -24006 -25746 -12348 -7175 -20224 -57649 -21572 -19980 -8141 -7964 1059 -2264 -27920
474 -27920 -70080 -95371 -112531 -39703 -38291 -41359 4973 -15418 -7712 4865 -19275 -20042 -14067
461 -14067 -79670 -40301 -38764 -8261 7533 -916 -28798 -29695 14822 40034 40063 6207 -22640
448 -22640 3670 6696 -18226 -4447 -39926 -21946 10341 -4935 -1862 5707 -75356 -69499 18453
435 18453 33136 23828 9815 -27400 15951 8559 -36837 -68433 -27484 36202 12691 29475
423 29475 47509 47373 14300 -24959 13044 472 -52664 -35798 -53275 -42774 -74910 -56894
411 -56894 -12450 438 5971 -6277 -23561 29550 19646 -26708 -36603 -32685 -17142 2321 12216
398 12216 -8128 -6984 7481 -8780 -33403 -33890 -7667 41863 34076 8777 -15144 -32310 -61578
385 -61578 -30427 -22544 -27977 3065 -4220 -4167 18945 52511 47681 64118 67300 50084 -12490 8501
371 8501 24122 44008 5669 -15713 -7684 25565 27687 -9534 15256 7955 -6891 5310 12372
358 12372 -5777 29421 26660 -2176 -7464 -38013 -50332 -48023 -30633 27502 6821 9392 41686
345 41686 25290 24456 36145 18645 -10047 -7625 -1984 31918 26420 9837 -26997 -29698 -16687
332 -16687 -30365 2033 35576 -17464 -36177 17895 3844 -39834 -46796 -13148 -20606 -42073
320 -42073 2326 1325 -26144 -21304 -34685 -20921 -28108 -20029 1097 -18263 -2847 23698 43428
307 43428 57073 17703 16998 19734 8437 33577 55224 9363 -5699 18815 18125 -5131 -12096
294 -12096 -21294 22846 46764 58483 -14250 -9380 11120 11226 -4825 1330 -3786 -38240 -32703
281 -32703 22948 71791 51644 27214 1174 46205 44107 25749 5365 -21570 -30435 1182
269 1182 11923 135 -4691 6842 19438 24231 -3661 -52324 -1438 2159 24646 3599 -27358
256 -27358 -5336 -12731 -2440 16760 6509 -15124 3594 34089 42453 3378 20357 13819 12670
243 12670 -7744 -16170 5897 26061 8901 7736 34708 30382 15058 -12192 22895 30691 77789
230 77789 75696 70244 64408 5680 -25569 25167 -8861 15871 14281 -16616 30385 25799 28662
217 28662 24274 64477 43149 25833 -3637 -28319 17481 49237 48571 35253 6104 2290 1127
204 1127 9793 1981 10195 17085 27335 30553 20903 14041 28575 6476 47153 26567 -15578 5159
190 5159 28125 13058 30476 66845 37450 8491 7450 17685 3643 11329 77438 83417 73487
177 73487 31163 19453 41190 19683 25780 42864 39978 28800 24628 22978 14057 37949 35510
164 35510 28267 9466 13035 30455 52345 32230 16946 26389 26764 42357 43080 74259 45711
151 45711 -9207 -34067 -867 17466 5912 23800 4812 -3743 -29257 -36601 6436 -10276
139 -10276 -2189 14986 5539 -15041 25312 36323 4291 20457 27321 20875 26874 14904 66125
126 66125 57729 13434 10591 -3290 18236 44727 46418 37598 -35394 -2791 40650 -7034 14639
113 14639 26567 37163 11162 -11347 56 30155 14637 -32752 3431 256 21102 12104
101 12104 11831 2696 15791 51944 43777 62546 70763 48713 39708 -9589 -10702 -6180 24331 29787
87 29787 13787 70311 55212 2920 -1837 22694 33317 59765 46196 15673 20301 -1091 19480
74 19480 22799 40734 31636 -4915 3192 21919 -3338 -49202 -17669 -29689 -48523 -13018 14092
61 14092 5705 9784 -9897 4319 -5910 -12132 6068 14261 7849 19482 16641 -18684 -31899
48 -31899 -33990 -30607 -15583 -19812 -27626 -22278 -5429 2035 3091 20594 21633 -7422 -20228 -34368
34 -34368 -34416 23340 26804 4562 -9221 -17477 1282 -21154 -15930 -11468 -23557 -11011 28074 -18929
20 -18929 -40330 -45923 -56975 -7605 -19083 -40779 -23726 7020 -23400 -35413 -55744 -41438
8 -41438 -64574 -52374 -29452 -41729 -12804 -54815 -33052 -10057
0 -10057
$$ Imaginary data points
##PAGE= N=2
##DATA TABLE= (X++(I..I)), XYDATA
16383 -1545320 -1549953 -1544338 -1521123 -1486937 -1496723 -1472055 -1434141 -1400032 -1373923 -1354801 -1359643 -1334361
16371 -1334361 -1292949 -1259258 -1265997 -1248957 -1210287 -1219027 -1221641 -1193306 -1137468 -1117447 -1119170 -1083881
16359 -1083881 -1075464 -1056584 -1028974 -993465 -968129 -981672 -978073 -948258 -913197 -939056 -908910 -867062
16347 -867062 -853501 -854723 -839688 -781382 -783770 -775207 -768026 -742767 -728618 -699678 -658258 -661967
16335 -661967 -653427 -652823 -597650 -553105 -537273 -555399 -532983 -505221 -494292 -465479 -432535 -413057
16323 -413057 -415391 -400010 -400131 -365381 -313870 -284265 -295445 -303770 -271674 -252667 -265170 -257247
16311 -257247 -218849 -215878 -224809 -215210 -189780 -186854 -136903 -143304 -113248 -83353 -94839 -44067
16299 -44067 14122 9557 -3343 13326 37182 31467 32610 49285 69384 78641 64461 98230
16287 98230 93159 126858 196275 233914 221389 189039 172104 227631 263610 279765 271916 270896
16275 270896 282525 322302 328632 326464 357367 361460 369018 405858 432010 450176 452386 442569 462834
16262 462834 457608 473753 517233 547817 569645 574103 574038 573005 587725 587640 551386 555779 575991
16249 575991 643577 621706 596256 638995 633735 632818 649721 687966 668316 661649 690038 719746
16237 719746 747405 743740 780898 809909 783527 763395 778739 787819 780383 821994 837421 795242
16225 795242 853271 877480 860877 874831 854867 883069 923923 940751 908662 952541 991018
16214 991018 942874 934528 972785 972442 947690 986737 990548 930889 956311 1003948 1056621 1084091
16202 1084091 1082977 1098217 1054797 1040285 1071081 1088228 1071079 1049563 1073826 1117954 1130371
16191 1130371 1112350 1107291 1118049 1103393 1087083 1133303 1137125 1152350 1160285 1170972 1146378 1167859
16179 1167859 1239323 1222913 1213420 1217219 1194092 1167599 1218095 1237311 1185918 1193618 1235272 1273025
16167 1273025 1281660 1248054 1265465 1250686 1222473 1189964 1198347 1233986 1263384 1257648 1275917 1284443
16155 1284443 1262933 1289114 1299946 1287315 1279700 1312315 1311915 1297828 1322387 1317324 1313768 1340135
16143 1340135 1343387 1380573 1355053 1292128 1328605 1326480 1340605 1316215 1332347 1341323 1322818 1345202
16131 1345202 1375233 1381573 1405152 1423271 1358409 1357817 1346889 1354144 1328961 1400922 1431976 1367180
16119 1367180 1383013 1409532 1367309 1373437 1406807 1373170 1355053 1378784 1365839 1349493 1385421
16108 1385421 1395771 1386626 1341908 1351765 1343683 1424415 1433708 1414156 1380708 1378039 1391105 1404009
16096 1404009 1428355 1448232 1418847 1430456 1453893 1452173 1463696 1447609 1427412 1424906 1389912 1422194
16084 1422194 1415297 1431880 1471149 1473080 1484106 1454411 1445801 1425022 1486249 1490793 1470090 1446045
16072 1446045 1375805 1362691 1414596 1420787 1435381 1440349 1436577 1404059 1407975 1484384 1507104 1487398
16060 1487398 1432718 1380331 1395409 1401778 1441009 1452895 1473454 1467752 1421042 1413525 1474379 1448835
16048 1448835 1430341 1456979 1487899 1451152 1473090 1487671 1513205 1497295 1451437 1466618 1472534
16037 1472534 1501156 1491212 1509906 1499162 1450330 1450644 1473522 1435537 1441224 1497846 1488955 1445720
16025 1445720 1431227 1483363 1501988 1480770 1456113 1467301 1448169 1466936 1464365 1423915 1426009 1417676
16013 1417676 1406455 1428605 1386977 1420387 1421272 1412872 1451899 1467454 1432885 1441185 1446312 1432048
16001 1432048 1461658 1485206 1472790 1450215 1417391 1440093 1459028 1447644 1496605 1469553 1434821
15990 1434821 1400411 1434933 1436576 1453148 1455795 1471089 1477138 1488558 1520942 1487380 1495598 1501872
15978 1501872 1497305 1510382 1465859 1454851 1500952 1493159 1478142 1513869 1507701 1540082 1527258 1479747
15966 1479747 1442196 1486002 1462927 1471136 1464891 1509124 1485565 1510857 1480988 1535150 1539604 1481393
15954 1481393 1477551 1503203 1509312 1491237 1473290 1478185 1460623 1411755 1456669 1509823 1494503 1472810
15942 1472810 1490037 1490789 1507180 1493501 1483615 1438272 1496996 1492685 1461815 1475671 1496716 1518171
15930 1518171 1492617 1498609 1490167 1467083 1481278 1433552 1470053 1508261 1521502 1466849 1455643 1476018
15918 1476018 1511537 1477981 1471172 1494919 1478018 1499843 1516138 1504304 1434031 1433439 1484533 1475311
15906 1475311 1498550 1493053 1511651 1566511 1571854 1509228 1475500 1491358 1517510 1494578 1497749 1500860
15894 1500860 1456246 1413526 1440210 1499995 1503571 1466901 1473577 1463697 1447856 1465743 1436125 1448650
15882 1448650 1468734 1492646 1507738 1483646 1470814 1441872 1484460 1520225 1500469 1494358 1455213
15871 1455213 1480330 1471372 1426449 1404183 1466883 1549223 1527125 1479694 1489904 1457698 1468764
15860 1468764 1469492 1478138 1497754 1499249 1529644 1502101 1490615 1495153 1445869 1393040 1415532 1419699
15848 1419699 1437737 1486310 1501665 1491930 1512555 1508907 1490714 1475194 1523979 1524139 1500364 1518264
15836 1518264 1509753 1550874 1534845 1501110 1463970 1497993 1485497 1469193 1503586 1515865 1519574 1524425
15824 1524425 1480334 1463741 1494090 1494200 1491097 1445749 1480062 1490866 1474218 1479396 1456139 1504008
15812 1504008 1508016 1507072 1550865 1572088 1479841 1459336 1503830 1534999 1548480 1510696 1500232 1499484
15800 1499484 1559876 1495492 1504693 1508587 1477745 1484284 1494888 1494154 1549856 1505051 1492662 1524379
15788 1524379 1474068 1456530 1474523 1461713 1448755 1511637 1532354 1501018 1453668 1468491 1469885
15777 1469885 1451966 1506228 1526055 1504753 1514333 1462810 1506856 1517239 1541969 1561334 1560793 1447915
15765 1447915 1446512 1479421 1456207 1449460 1426665 1458091 1473219 1499597 1518372 1521995 1501416 1519440
15753 1519440 1531612 1561379 1502694 1484905 1521204 1532858 1536948 1512626 1465536 1471518 1477519 1495663
15741 1495663 1481087 1486823 1472317 1424042 1450940 1501225 1554829 1589975 1590900 1514666 1492938 1543279
15729 1543279 1542763 1539198 1546297 1548707 1538786 1522600 1512804 1523737 1545398 1538699 1540522 1505852 1512496
15716 1512496 1520149 1555828 1516468 1555202 1538246 1488209 1463906 1503915 1558071 1528087 1528839 1528746
15704 1528746 1523672 1491201 1438585 1464904 1473723 1439733 1458467 1496121 1476081 1486855 1535487 1522341
15692 1522341 1504368 1525007 1516207 1488917 1511267 1501783 1520645 1512290 1522935 1545950 1548452 1509823
15680 1509823 1522454 1479436 1467585 1473683 1518537 1523000 1503294 1470027 1485259 1503518 1515515 1538205
15668 1538205 1486698 1530275 1504063 1519297 1514134 1477721 1478112 1514756 1553857 1602599 1586041 1506260
15656 1506260 1526240 1500596 1501724 1485085 1515527 1514027 1515525 1527753 1498284 1455553 1454662 1518820
15644 1518820 1511137 1520008 1495523 1511860 1525620 1442643 1447132 1477349 1488477 1470402 1507640 1505786
15632 1505786 1515971 1512717 1490320 1486862 1475918 1527887 1517566 1507260 1494064 1467466 1451989 1499379
15620 1499379 1513003 1521553 1502960 1477976 1533848 1509733 1513113 1552358 1527916 1546485 1541975 1531356
15608 1531356 1528791 1490577 1515488 1514608 1528464 1514885 1514783 1585501 1564018 1561616 1545555 1563698
15596 1563698 1549131 1521785 1516341 1514294 1505658 1526608 1560364 1636971 1597716 1552268 1575173 1568943
15584 1568943 1556731 1541726 1537656 1486191 1500286 1539808 1468562 1443296 1470365 1486870 1487401 1474129
15572 1474129 1524419 1527093 1510004 1468475 1441700 1448787 1461681 1475869 1514109 1534657 1513914 1515061
15560 1515061 1494039 1438930 1493138 1511237 1496614 1533577 1550750 1545231 1523691 1516035 1540372 1530071
15548 1530071 1535803 1567457 1544312 1532459 1549710 1557479 1544700 1551662 1565728 1562607 1536379 1505915
15536 1505915 1508339 1561738 1594529 1575659 1533886 1548638 1544481 1537624 1539886 1510254 1597571 1594962
15524 1594962 1499020 1533153 1575700 1537432 1489054 1449229 1462650 1519867 1533995 1542716 1560205
15513 1560205 1578687 1576419 1566292 1561857 1583363 1543945 1507005 1525161 1571968 1558237 1492066 1519500
15501 1519500 1554703 1564049 1552728 1545520 1576999 1562044 1559192 1621814 1601819 1576132 1577376 1563388
15489 1563388 1513401 1542108 1541698 1572563 1572277 1579873 1557594 1565555 1613934 1595514 1587460 1593878 1580129
15476 1580129 1565892 1614807 1606066 1578738 1571340 1561513 1523249 1549662 1548819 1554415 1586357 1576159
15464 1576159 1548621 1601279 1645705 1645922 1561096 1477085 1476426 1564812 1572745 1615907 1608532 1565976
15452 1565976 1548821 1514241 1510124 1502094 1506056 1509536 1540412 1600228 1590812 1577066 1540503 1515296
15440 1515296 1526441 1520647 1541851 1506807 1551525 1597366 1570759 1552278 1517001 1528152 1559615
15429 1559615 1521913 1504536 1548549 1584540 1591627 1611071 1575295 1567489 1525237 1499393 1535148 1551865
15417 1551865 1536663 1572486 1569466 1559414 1515490 1518393 1556015 1598172 1563685 1547438 1580154 1565962
15405 1565962 1546394 1534829 1555314 1619200 1623102 1592899 1590361 1553695 1561567 1523592 1522283 1537363
15393 1537363 1538927 1562717 1538470 1544256 1558412 1579126 1602865 1560332 1514427 1533191 1529266 1519081
15381 1519081 1486126 1511579 1547818 1580764 1577819 1602154 1567658 1516154 1527246 1510419 1535419
15370 1535419 1549962 1524946 1522764 1558031 1589710 1602993 1604244 1587983 1507702 1550458 1562336 1539502
15358 1539502 1528175 1505089 1488128 1542126 1555135 1537939 1503604 1521505 1553589 1556605 1536635
15347 1536635 1515326 1521860 1501522 1504936 1548575 1553648 1583249 1592714 1615904 1598199 1580311 1601695
15335 1601695 1601267 1553934 1541346 1596262 1583616 1531026 1560273 1582507 1560997 1581096 1591627 1570580
15323 1570580 1566507 1604268 1594724 1561025 1593989 1594225 1523864 1551344 1619870 1586866 1537769 1536063
15311 1536063 1570072 1587870 1616802 1580528 1552281 1536822 1555354 1534163 1560938 1601525 1589164
15300 1589164 1564406 1524394 1551692 1597823 1598809 1620320 1605306 1537924 1557037 1557870 1600124 1610096
15288 1610096 1635500 1612331 1614210 1601982 1586912 1566091 1556139 1582059 1598506 1554555 1570484 1562619
15276 1562619 1523060 1549377 1552547 1561001 1589151 1566519 1569792 1587301 1584241 1565633 1585302 1598866
15264 1598866 1607204 1573521 1554145 1589935 1604031 1632553 1585195 1593271 1644073 1608449 1579812 1572473
15252 1572473 1620331 1579949 1519192 1522685 1581077 1630379 1617904 1587822 1551901 1531446 1558411
15241 1558411 1549740 1524466 1532144 1561144 1581175 1634854 1604020 1569027 1599569 1604427 1615998 1604419
15229 1604419 1606306 1603354 1617330 1560349 1570793 1599877 1600736 1573052 1570574 1568064 1582017 1602288
15217 1602288 1564565 1594181 1615441 1667065 1657014 1622049 1585850 1565415 1571229 1573472 1549093 1507488
15205 1507488 1531364 1525680 1555519 1600887 1641568 1663267 1667466 1603373 1588846 1568075 1627951 1608765
15193 1608765 1605790 1632544 1576323 1543065 1563330 1619462 1599515 1580762 1614437 1599807 1565127
15182 1565127 1578976 1646561 1596086 1550054 1582990 1571815 1606064 1643061 1658818 1613032 1608645
15171 1608645 1591591 1574595 1587859 1592526 1580053 1596306 1593652 1602881 1622514 1590858 1609229 1588113
15159 1588113 1605100 1630055 1576963 1602456 1627621 1647270 1619237 1580825 1582573 1612231 1621454 1605052
15147 1605052 1614793 1593042 1600950 1557358 1557082 1584132 1596324 1591626 1623077 1613454 1599068 1636828
15135 1636828 1583515 1621860 1662883 1650913 1650397 1643871 1615398 1607329 1601157 1569189 1598923 1588639
15123 1588639 1600077 1618603 1615447 1591901 1614011 1653178 1670449 1690226 1667582 1670193 1659869 1625789
15111 1625789 1627897 1636181 1606402 1566797 1554151 1567080 1587012 1632835 1623602 1627161 1598729 1574219
15099 1574219 1591102 1587969 1546229 1562241 1576644 1516706 1591651 1609339 1598039 1598065 1585357 1641817
15087 1641817 1672117 1651207 1663576 1664009 1662793 1643246 1681981 1625623 1616032 1637377 1580519 1574999
15075 1574999 1608529 1633891 1620923 1600176 1581307 1551383 1618692 1649939 1635351 1669872 1612264
15064 1612264 1628966 1612689 1606739 1582916 1573019 1575269 1617569 1572746 1560069 1555466 1607455 1637758
15052 1637758 1649420 1626727 1641231 1649425 1604622 1577417 1532737 1527320 1592728 1596812 1588537 1562869
15040 1562869 1568403 1589370 1615089 1619475 1599407 1621441 1654399 1638156 1653218 1638452 1632101 1658196
15028 1658196 1585126 1592011 1643551 1608286 1564372 1617542 1664114 1662360 1621561 1618506 1591079 1603090
15016 1603090 1610946 1651168 1657295 1678359 1678847 1603044 1594596 1611248 1583020 1562379 1573661 1578528
15004 1578528 1602065 1594750 1598574 1611604 1667163 1643511 1559852 1604980 1614798 1649424 1656013 1643643
14992 1643643 1623725 1591362 1604286 1634472 1595432 1597562 1639014 1640619 1652292 1639053 1625842 1634633
14980 1634633 1631410 1623978 1647463 1620400 1579298 1592887 1608221 1665388 1665009 1660508 1656879 1611040
14968 1611040 1572956 1586194 1632390 1637194 1653169 1678506 1630523 1638354 1616856 1619801 1633874 1617945
14956 1617945 1576490 1552999 1568860 1612891 1605284 1625224 1632050 1613196 1600638 1571796 1605573 1620184
14944 1620184 1599547 1639337 1625723 1629629 1647003 1627497 1630007 1606342 1576570 1610262 1606993 1602842
14932 1602842 1649156 1663286 1672871 1647652 1594822 1626618 1642482 1700684 1717633 1698895 1658231
14921 1658231 1569411 1601542 1622303 1629961 1624191 1683374 1651275 1608177 1632101 1664513 1699778 1719837
14909 1719837 1719560 1701555 1689988 1689281 1651894 1660814 1702963 1685758 1608700 1635027 1608791 1639399
14897 1639399 1654625 1619979 1615025 1646821 1655295 1616704 1615243 1669282 1689749 1677540 1631292 1597316
$$ [...]
##END NTUPLES=NMR SPECTRUM
##END=
