##TITLE=1H_CG-1049-121
 CDCl3, 32 sc, 
 20.11.2020
##JCAMPDX= 6.0         $$ Bruker NMR JCAMP-DX V2.0
##DATA TYPE= NMR FID
##DATA CLASS= NTUPLES
##ORIGIN= UXNMR, Bruker Analytische Messtechnik GmbH
##OWNER= root
$$ XWIN-NMR		Version 3.5
$$ Fri Nov 20 10:30:46 2020 Russian Standard Time (UT+4h)  she@DPX200
##.OBSERVE FREQUENCY= 200.1315066352
##.OBSERVE NUCLEUS= ^1H
##.DELAY= (6, 6)
##.ACQUISITION MODE= SIMULTANEOUS
##.ACQUISITION SCHEME= undefined
##.AVERAGES= 32
##.DIGITISER RES= 18
##SPECTROMETER/DATA SYSTEM= spect
##.PULSE SEQUENCE= zg30
##.SOLVENT NAME= CDCl3
##.SHIFT REFERENCE= (INTERNAL, CDCl3, 0, 15.7039)
##AUDIT TRAIL= $$ (NUMBER, WHEN, WHO, WHERE, WHAT)
$$ ##TITLE= Audit trail, XWIN-NMR		Version 3.5
$$ ##JCAMPDX= 5.01
$$ ##ORIGIN= Bruker BioSpin GmbH
$$ ##OWNER= she
$$ F:/spectra/data/she/nmr/H-F/1/audita.txt
$$ ##AUDIT TRAIL=  $$ (NUMBER, WHEN, WHO, WHERE, WHAT)
(   1,<2020-11-20 10:28:44.46 +0400>,<she>,<DPX200>,
      <continue with go, POWCHK disabled, PULCHK disabled
       configuration hash MD5:
       00 E9 B6 7A A2 85 ED C7 34 08 36 98 17 FE 4E 26
       data hash MD5: 16K
       B8 7A E6 E1 3D B6 7D 59 8D 7A B3 81 E7 86 6E B6>)
$$ ##END=
$$ 
$$ hash MD5
$$ 56 AA 8B 3E 2D DB 85 53 41 00 99 D2 A8 1E 4A C0
##$RELAX= 
##$RELAX= 
##$RELAX= 
##$RELAX= 
##$RELAX= 
##$RELAX= 
$$ Bruker specific parameters
$$ --------------------------
##$DU= <F:/spectra>
##$EXPNO= 1
##$NAME= <H-F>
##$PROCNO= 1
##$TYPE= <nmr>
##$USER= <she>
##$AMP= (0..31)
100 100 100 100 100 100 100 100 100 100 100 100 100 100 100 100 100 100 
100 100 100 100 100 100 100 100 100 100 100 100 100 100 
##$AQSEQ= 0
##$AQ_mod= 1
##$AUNM= <au_zg>
##$AUTOPOS= <>
##$BF1= 200.13
##$BF2= 200.13
##$BF3= 200.13
##$BF4= 200.13
##$BF5= 200.13
##$BF6= 200.13
##$BF7= 200.13
##$BF8= 200.13
##$BYTORDA= 1
##$CFDGTYP= 0
##$CFRGTYP= 5
##$CHEMSTR= <none>
##$CNST= (0..31)
1 1 145 1 1 1 1 1 1 1 1 1 1 1 1 1 1 1 1 1 1 1 1 1 1 1 1 1 1 1 1 1 
##$CPDPRG= <>
##$CPDPRG1= <>
##$CPDPRG2= <>
##$CPDPRG3= <>
##$CPDPRG4= <mlev>
##$CPDPRG5= <mlev>
##$CPDPRG6= <mlev>
##$CPDPRG7= <mlev>
##$CPDPRG8= <mlev>
##$CPDPRGB= <>
##$CPDPRGT= <>
##$D= (0..31)
0 1.2 0 0 0 0 0 0 0 0.06 0 0.03 0 0 0 0 0.0002 0 0 0 0 0 0 0 0 0 0 0 0 
0 0 0 
##$DATE= 1605853554
##$DBL= (0..7)
120 120 120 120 120 120 120 120 
##$DBP= (0..7)
150 150 150 150 150 150 150 150 
##$DBP07= 0
##$DBPNAM0= <>
##$DBPNAM1= <>
##$DBPNAM2= <>
##$DBPNAM3= <>
##$DBPNAM4= <>
##$DBPNAM5= <>
##$DBPNAM6= <>
##$DBPNAM7= <>
##$DBPOAL= (0..7)
0.5 0.5 0.5 0.5 0.5 0.5 0.5 0.5 
##$DBPOFFS= (0..7)
0 0 0 0 0 0 0 0 
##$DE= 6
##$DECBNUC= <off>
##$DECIM= 32
##$DECNUC= <off>
##$DECSTAT= 4
##$DIGMOD= 1
##$DIGTYP= 9
##$DL= (0..7)
0 120 120 120 120 120 120 120 
##$DP= (0..7)
150 150 150 150 150 150 150 150 
##$DP07= 0
##$DPNAME0= <>
##$DPNAME1= <>
##$DPNAME2= <>
##$DPNAME3= <>
##$DPNAME4= <>
##$DPNAME5= <>
##$DPNAME6= <>
##$DPNAME7= <>
##$DPOAL= (0..7)
0.5 0.5 0.5 0.5 0.5 0.5 0.5 0.5 
##$DPOFFS= (0..7)
0 0 0 0 0 0 0 0 
##$DQDMODE= 0
##$DR= 18
##$DS= 0
$$ [...]
##$SUBNAM2= <"">
##$SUBNAM3= <"">
##$SUBNAM4= <"">
##$SUBNAM5= <"">
##$SUBNAM6= <"">
##$SUBNAM7= <"">
##$SUBNAM8= <"">
##$SUBNAM9= <"">
##$SW= 16.9725356469052
##$SWIBOX= (0..15)
0 0 2 0 0 0 0 0 0 0 0 0 0 0 0 0 
##$SW_h= 3396.73913043478
##$TD= 16384
##$TD0= 1
##$TE= 0
##$TE2= 300
##$TE3= 300
##$TEG= 300
##$TL= (0..7)
0 120 120 120 120 120 120 120 
##$TP= (0..7)
150 150 150 150 150 150 150 150 
##$TP07= 0
##$TPNAME0= <>
##$TPNAME1= <>
##$TPNAME2= <>
##$TPNAME3= <>
##$TPNAME4= <>
##$TPNAME5= <>
##$TPNAME6= <>
##$TPNAME7= <>
##$TPOAL= (0..7)
0.5 0.5 0.5 0.5 0.5 0.5 0.5 0.5 
##$TPOFFS= (0..7)
0 0 0 0 0 0 0 0 
##$TUNHIN= 0
##$TUNHOUT= 0
##$TUNXOUT= 0
##$USERA1= <user>
##$USERA2= <user>
##$USERA3= <user>
##$USERA4= <user>
##$USERA5= <user>
##$V9= 5
##$VALIST= <valist>
##$VCLIST= <CCCCCCCCCCCCCCC>
##$VD= 0
##$VDLIST= <DDDDDDDDDDDDDDD>
##$VPLIST= <PPPPPPPPPPPPPPP>
##$VTLIST= <TTTTTTTTTTTTTTT>
##$WBST= 1024
##$WBSW= 4
##$XGAIN= (0..3)
0 0 0 0 
##$XL= 0
##$YL= 0
##$YMAX_a= 198780
##$YMIN_a= -142723
##$ZGOPTNS= <>
##$ZL1= 120
##$ZL2= 120
##$ZL3= 120
##$ZL4= 120
##$ABSF1= 10
##$ABSF2= 0
##$ABSG= 5
##$ABSL= 3
##$ALPHA= 0
##$AQORDER= 0
##$ASSFAC= 0
##$ASSFACI= 0
##$ASSFACX= 0
##$ASSWID= 0
##$AUNMP= <proc_1d>
##$AZFE= 0.1
##$AZFW= 0.1
##$BCFW= 1
##$BC_mod= 2
##$BYTORDP= 1
##$COROFFS= 0
##$CY= 11.3945322036743
##$DATMOD= 1
##$DC= 2
##$DFILT= <>
##$DTYPP= 0
##$F1P= 15.9154993809931
##$F2P= -4.1035820241983
##$FCOR= 0.5
##$FTSIZE= 0
##$FT_mod= 4
##$GAMMA= 1
##$GB= 0.15
##$INTBC= 1
##$INTSCL= 1
##$ISEN= 128
##$LB= 0.24
##$LEV0= 0
##$LPBIN= 0
##$MAXI= 10000
##$MC2= 0
##$MEAN= 0
##$ME_mod= 0
##$MI= 1.114404
##$NCOEF= 0
##$NC_proc= 0
##$NLEV= 6
##$NOISF1= 3.799351
##$NOISF2= 2.8
##$NSP= 1
##$NTH_PI= 0
##$NZP= 0
##$OFFSET= 15.70392
##$PC= 1
##$PHC0= -11030.72
##$PHC1= -7.599093
##$PH_mod= 1
##$PKNL= yes
##$PPARMOD= 0
##$PSCAL= 0
##$PSIGN= 0
##$REVERSE= no
##$SF= 200.130013532006
##$SI= 16384
##$SIGF1= 3
##$SIGF2= 2
##$SINO= 400
##$SIOLD= 16384
##$SREGLST= <1H.CDCl3>
##$SSB= 0
##$STSI= 0
##$STSR= 0
##$SW_p= 3612.71676300578
##$SYMM= 0
##$S_DEV= 0
##$TDeff= 0
##$TDoff= 0
##$TI= <>
##$TILT= no
##$TM1= 0
##$TM2= 0
##$TOPLEV= 0
##$USERP1= <user>
##$USERP2= <user>
##$USERP3= <user>
##$USERP4= <user>
##$USERP5= <user>
##$WDW= 1
##$XDIM= 8192
##$YMAX_p= 0
##$YMIN_p= 0
$$ End of Bruker specific parameters
$$ ---------------------------------
##NTUPLES= NMR FID
##VAR_NAME=  TIME,          FID/REAL,        FID/IMAG
##SYMBOL=    X,             R,               I
##VAR_TYPE=  INDEPENDENT,   DEPENDENT,       DEPENDENT
##VAR_FORM=  AFFN,          ASDF,            ASDF
##VAR_DIM=   8192,          8192,            8192
##UNITS=     SECONDS,       ARBITRARY UNITS, ARBITRARY UNITS
##FACTOR=    0.0002944,     1,               1
##FIRST=     0,             0,               0
##LAST=      2.4114304,     0,               0
##MIN=       0,             -142723,         0
##MAX=       2.4114304,     198780,          0
$$ Real data points
##PAGE= N=1
##DATA TABLE= (X++(R..R)), XYDATA
$$ [...]
$$ plain form
3031 667 -810 3000 -2839 4135 -3417 3316 -2146 30 402 -2271 2974 -3803 3358 -2426 1107
3046 1107 -1426 148 1419 -2724 2346 -4400 2518 -3098 616 -1729 -386 1411 -3217 2885 -3934
3061 -3934 2682 -3247 1266 -895 -2180 1796 -3021 3648 -3329 2704 -1645 641 618 -2263 3012
3076 3012 -2303 2973 -2460 2449 -1001 -283 1177 -1657 3290 -3369 3809 -2858 1990 -238 249
3091 249 2149 -1949 3991 -2735 4065 -1966 1850 1367 -878 2404 -1593 3805 -2965 2541 -1642
3106 -1642 1605 506 -1746 3222 -2814 3421 -3297 2662 -1553 -93 1271 -2837 3169 -3781 3419
3121 3419 -3127 1788 -1222 -960 1282 -3035 2810 -4416 2857 -3012 448 -594 -1481 1152 -3719
3136 -3719 3185 -3407 1791 -2206 967 667 -2074 2742 -3354 3153 -3696 2036 -1470 446 514 -1361
$$ packed form
3031F67j477L810n839O974p552O733n462K176L72k673N245o777P161n784L533
3046A107k533J574J271m143N070o746O918n616L714k345J343J797m628O102o819
3061c934O616n929M513k161j285L976m817O669o977O033m349K286k3k881N275
3076C012n315N276n433M909l450P18J460k834M947o659P178o667M848k228M87
3091B49J900m098N940o726O800o031L816m83k245L282l997N398o770N506m183
3106a642L247j099k252M968o036O235o718N959m215J460J364m108O006o950P200
3121C419o546M915l010K62K242m317N845p226P273n869L460j042q87K633m871
3136c719O904o592N198l997L173l00k741M816o096O507o849N732l506J916O8j875
$$ plain form
3152 -1361 3809 -3727 3837 -1777 2188 -1147 -135 1780 -2575 3584 -3200 3967 -1938 1437 383
3167 383 -315 3018 -2944 3856 -2551 3035 -1505 1237 673 -1534 2477 -2298 3538 -3092 2401 -775
3183 -775 535 787 -2328 3539 -3210 2770 -2995 2245 -1032 -245 1889 -2812 2695 -3907 2820 -1961
3199 -1961 777 -901 -945 1864 -3855 2637 -3441 2757 -3406 357 246 -2074 1850 -3555 3548 -3695
3215 -3695 2216 -1373 177 401 -2346 2455 -3088 2819 -3493 2428 -738 -347 1510 -2003 3143
3230 3143 -3360 3323 -1720 1707 -818 -650 3303 -2185 2992 -2829 2945 -1922 1151 472 -716
3245 -716 2671 -2328 3721 -2711 2548 -1617 1023 1337 -1834 2685 -2198 3045 -2848 2653 -481
3260 -481 -44 982 -2153 3108 -3333 2846 -3757 1659 -1027 -936 1881 -2454 2885 -3876 2548 -2203
$$ packed form
3152a361N170p536P564n614L965l335J012J915m355O159o784P167n905L375j054
3167C83o98L333n962O800o407N586m540K742n64k207M011m775N836o630N493l176
3183g75J310K52l115N867o749N980n765N240l277P87K134m701N507o602O727m781
3199a961K738j678m4K809n719O492o078O198o163L763j11k320L924n405P103p243
3215c695N911l589J550K24k747M801n543N907o312N921l166L91J857l513N146
3230C143o503O683n043L427k525J68L953n488N177n821N774m867L073o79j188
3245g16L387m999O049o432N259m165K640L14l171M519m883N243n893N501l134
3260d81M37J026l135N261o441O179o603N416k686R1K817m335N339o761O424m751
$$ plain form
3276 -2203 496 -521 -1582 1761 -3290 2603 -3276 1875 -2209 245 798 -2142 2111 -3163 3390
3291 3390 -3562 1951 -1118 -478 676 -2468 2959 -3083 3179 -2482 1739 -639 -1338 1304 -1776
3306 -1776 3348 -2697 3488 -1280 499 155 -785 3127 -2541 3174 -2192 2864 -1602 587 1639
3321 1639 -1315 2799 -2592 3633 -2223 2056 -514 606 900 -2106 3057 -2537 2989 -2682 2054
3336 2054 -154 -676 1767 -2812 3197 -3034 2222 -1986 994 -439 -1529 1608 -2836 2658 -2944
3351 -2944 2070 -2340 137 670 -1733 2234 -3425 2836 -2970 1865 -1593 -63 818 -2539 2306
3366 2306 -2758 2811 -2309 1328 -710 -731 1555 -2554 2899 -2809 2495 -1626 1195 176 -1354
3381 -1354 2356 -2355 2957 -2714 2680 -1278 132 370 -1029 2982 -2131 2898 -1664 2318 -797
$$ packed form
3276b203K699j017j061L343n051N893n879N151m084K454N53k940M253n274O553
3291C390o952N513l069O40J154l144N427o042O262n661M221k378o99K642l080
3306a776N124o045O185m768J779l44r40L912n668N715n366N056m466K189J052
3321A639k954M114n391O225n856M279k570J120K94l006N163n594N526n671M736
3336B054k208n22K443m579O009o231N256m208K980j433j090L137m444N494n602
3351b944N014m410K477N33k403L967n659O261n806M835l458J530Q81l357M845
3366B306n064N569n120L637k038k1K286m109N453n708N304m121K821j019j530
3381a354L710m711N312n671N394l958J410K38j399M011n113N029m562L982l115
$$ plain form
3396 -797 938 1669 -1943 2962 -2534 3481 -2489 1687 -195 -69 1460 -2363 2895 -2941 2518 -1544
3412 -1544 942 -90 -1230 1981 -2460 2625 -3236 2455 -2048 419 -150 -1699 1985 -3166 2325
3427 2325 -3010 1939 -1334 -424 503 -2541 2017 -3639 2251 -2796 635 -866 -530 1129 -2110 2824
3443 2824 -2807 2299 -2128 1379 -478 -1092 1590 -2322 2774 -2557 2302 -1096 531 967 -1007
3458 -1007 2465 -2175 2615 -1352 2488 -618 685 1215 -983 2580 -2552 2400 -1978 1754 -286
3473 -286 208 1924 -1632 2669 -1993 2872 -1475 1592 33 -964 1451 -2728 2967 -2515 2248 -1397
3489 -1397 822 -272 -1160 1880 -2486 2304 -3490 1921 -1493 -433 619 -1895 1423 -3149 2154
3504 2154 -2044 1160 -1711 -311 867 -2102 2017 -2807 2144 -2248 323 -530 -867 1371 -2858
$$ packed form
3396g97J735P31l612M905n496O015n970M176j882J26J529l823N258n836N459m062
3412a544K486j032j140L211m441N085n861N691m503K467n69j549L684n151N491
3427B325n335M949l273R10R27l044M558n656N890n047L431j501L36J659l239M934
3443B824n631N106m427L507j857o14K682l912N096n331M859l398J627M36j974
3458a007L472m640M790l967L840l106J303N30k198L563n132M952m378L732k040
3473b86M94J716l556M301m662M865m347L067j559r97K415m179N695n482M763l645
3489a397K219j094q88L040m366M790n794N411l414J060J052k514L318m572N303
3504B154m198L204k871J400J178k969M119m824M951m392K571q53l37K238m229
$$ plain form
3519 -2858 2818 -2502 1896 -1408 525 587 -1550 1601 -2162 2472 -2796 2676 -565 283 1033 -1223
3535 -1223 2889 -2275 3325 -1385 1984 -599 282 1822 -1418 2671 -2313 2748 -2174 1058 450
3550 450 -16 1935 -1866 2940 -1733 2460 -1018 972 513 -1178 1858 -2756 3243 -2747 2069 -621
3566 -621 610 -91 -1605 2418 -2381 2079 -2354 1593 -645 -743 778 -1732 2203 -2476 1771 -1772
3582 -1772 599 -1257 -683 1408 -2246 2293 -1432 2134 -2184 814 591 -615 2438 -2746 2074
3597 2074 -3062 1505 -714 878 196 -1780 2576 -1963 1893 -1790 1969 -107 -643 1102 -992
3612 -992 2530 -2412 3121 -1388 1366 -212 -141 1377 -1349 2827 -1792 2279 -1859 1209 562 -697
3628 -697 1500 -1436 2420 -1587 1849 -992 457 621 -1288 1406 -1888 2450 -1982 1937 -398
$$ packed form
3519b858N676n320M398l304J933O2k137L151l763M634n268N472l241Q48P50k256
3535a223M112n164N600m710L369k583Q81J540l240M089m984N061m922L232o08
3550D50m66J951l801M806m673M193l478J990m59j691L036m614N999n990M816k690
3566f21J231p01j514M023m799M460m433L947k238r8J521k510L935m679M247l543
3582a772K371j856N74K091l654M539l725L566m318K998k23j206L053n184M820
3597B074n136M567k219J592o82j976M356m539L856l683L759k076n36J745k094
3612i92L522m942N533m509K754j578P1J518k726M176m619M071m138L068o47j259
3628f97K197k936L856m007L436k841J449J64j909K694l294M338m432L919k335
$$ plain form
3643 -398 -116 243 -2093 1945 -3288 1588 -2279 994 -970 -784 270 -2545 1657 -3200 1980 -2173
3659 -2173 114 -654 -755 1263 -2603 1899 -1995 1680 -1531 -182 697 -1369 1194 -2146 2681 -2035
3675 -2035 1221 -371 -142 1325 -1551 2918 -2230 2095 -1789 1510 44 -509 1558 -1226 2259
3690 2259 -1978 2304 -1312 729 -332 -462 1869 -1707 2355 -1757 1844 -895 1242 861 -812
3705 -812 2051 -2152 2692 -2071 1401 -823 605 981 -1516 1954 -2155 2175 -2051 1395 -524
3720 -524 -807 647 -1728 1444 -2712 2011 -1729 578 -397 -653 1425 -2784 1430 -1975 1979 -1586
3736 -1586 79 740 -1076 1196 -2704 2235 -1826 1385 -1326 190 546 -1839 2017 -2088 2235
3751 2235 -1704 1281 -280 163 956 -1211 2175 -2300 2002 -1408 1333 300 -458 2158 -1706 2644
$$ packed form
3643c98K82L59k336M038n233M876l867L273j964J86J054k815M202m857N180m153
3659b173K287p68j01K018l866M502l894L675l211J349Q79k066K563l340M827m716
3675b035L256j592K29J467k876M469n148M325l884L299j466n53K067k784L485
3690B259m237M282l616K041j061j30K331l576M062m112L601k739K137l81j673
3705h12K863m203M844m763L472k224J428L76k497L470m109M330m226L446j919
3720e24k83J454k375L172m156M723l740K307r75k56K078m209M214l405L954l565
3736a586J665O61j816K272l900M939m061L211k711J516L56k385L856m105M323
3751B235l939K985j561M43P93k167L386m475M302l410K741j033p58K616l864M350
$$ plain form
3767 2644 -1940 2640 -965 997 866 -243 2045 -1963 2500 -1668 1292 -1001 635 1051 -757
3782 -757 2102 -1871 2228 -1525 1289 -915 -285 826 -1961 1882 -1846 1675 -1256 1044 -229
3797 -229 -1160 1234 -1914 1933 -2504 1459 -1637 130 286 -1251 882 -2929 1730 -2000 1474 -902
3813 -902 -367 -9 -1690 1167 -2080 2340 -2278 1348 -692 -342 894 -1874 2162 -2112 2248 -1172
3829 -1172 1344 15 -168 1467 -1311 2132 -1967 2355 -937 853 446 -444 1839 -2118 2081 -2072
3845 -2072 1766 -621 687 928 -1498 1795 -1709 2916 -1113 1767 -127 54 1418 -1331 2138
3860 2138 -2125 1748 -1335 1164 202 -885 1524 -2095 1849 -1943 1021 -1705 660 -97 -1064 1848
3876 1848 -2460 1778 -2342 1578 -1590 -436 519 -1362 1484 -2819 1611 -2063 397 -1579 -409
$$ packed form
3767B644m584M580l605J962j31j109K288m008M463m168K960k293J636M16j808
3782g57K859l973M099l753K814k204O30J111k787L843l728L521k931K300j273
3797b29r31K394l148L847m437L963l096J767J56j537K133l811M659l730L474k376
3813i02N35L58j681K857l247M420m618L626k040L50J236k768M036m274M360l420
3829a172K516j329j83J635k778L443m099M322l292J790m07q90K283l957M199m153
3845b072L838k387J308K41k426L293l504M625m029K880j894J81J364k749L469
3860B138m263L873l083K499r62j087K409l619L944l792K964k726K365p57r67K912
3876A848m308M238m120L920l168J154R55j881K846m303M430l674K460j976J170
$$ plain form
3891 -409 436 -1809 1948 -1979 1898 -1447 759 43 -483 1094 -1467 1997 -2720 1884 -436 1165
3907 1165 134 -689 1558 -1342 2089 -1785 2021 -831 700 630 -313 2012 -2187 2679 -1668 1418
3923 1418 -690 14 1267 -1359 1736 -1410 2482 -1272 1307 -79 -378 928 -1649 1915 -1921
3938 -1921 1780 -1598 422 -172 -1306 1137 -2020 1788 -3056 1631 -1279 364 -242 -1198 1738 -1982
3954 -1982 1764 -1741 1010 -1284 -479 622 -2086 1480 -2646 2135 -1963 -108 -308 -608 812 -2596
3970 -2596 1526 -1997 1991 -1313 831 869 -1083 1070 -1487 1592 -1593 1789 -291 356 -222 -858
3986 -858 2309 -788 2356 -1795 2500 -324 926 1238 -549 2140 -1028 2250 -2131 1462 15
4001 15 505 1294 -1859 2255 -1591 1310 -140 524 -73 -980 1667 -1661 1868 -1941 1106 -1754 -690
$$ packed form
3891d09Q45k245L757l927L877l345K206p16n26J577k561L464m717M604k320J601
3907A165j031q23K247k900L431l874L806k852J531p0r43K325m199M866m347L086
3923A418k108P04J253k626L095l146L892l754K579j386k99J306k577L564l836
3938a921L701l378K020n94j134K443l157L808m844M687k910J643o06r56K936l720
3954a982L746l505K751k294Q05J101k708L566m126M781m098J855k00l00J420l408
3970b596M122l523L988l304K144L8j952K153k557L079l185L382k080O47n78o36
3986h58L167l097L144m151M295k824J250L12j787K689l168L278m381L593j447
4001A5M90P89l153M114l846K901j450O64n97r07K647l328L529l809L047k860J064
$$ plain form
4018 -690 3 -535 1476 -2080 1478 -2277 1710 -693 201 393 -1202 1676 -2878 2320 -1736 1188
4034 1188 -629 -1234 1655 -1380 2384 -1813 2136 -1226 -387 216 -428 686 -1203 860 -1815 1260
4050 1260 -1195 1192 52 -1456 1020 -1985 1985 -1849 1522 -1127 286 281 -1118 2118 -1525 1959
4066 1959 -1743 894 -304 -60 1345 -1428 2329 -1541 2163 -1441 545 463 -12 1357 -1498 1727
4082 1727 -1736 2188 -1405 825 194 -1285 1503 -1926 1954 -2020 1188 -752 1242 1364 -1672
4097 -1672 952 -2637 1541 -1333 679 -694 -1103 184 -1330 1227 -2692 1595 -1457 749 -306
4112 -306 -655 1582 -2219 1965 -1474 1312 -1848 1029 347 -1421 1416 -1761 1342 -1951 2441 -550
4128 -550 29 697 -1591 1117 -1977 2820 -1413 1606 -853 -766 1429 -872 1797 -1063 2554 -765
$$ packed form
4018f90O93n38K011l556L558l755L987k403Q94J92j595K878m554N198m056K924
4034A188j817o05K889l035L764m197L949l362Q39O03o44J114j889K063k675L075
4050A260k455K387j140j508K476l005L970l834L371k649J413nj399L236l643L484
4066A959l702K637j198K44J405k773L757l870L704l604J986q2m75J369k855L225
4082A727l463L924l593K230o31j479K788l429L880l974L208j940J994J22l036
4097a672K624l589M178k874K012j373m09J287j514K557l919M287l052K206j055
4112c06l49K237l801M184l439K786l160K877o82j768K837l177L103l293M392k991
4128e50N79O68k288K708l094M797m233L019k459Q7K195k301K669k860L617l319
$$ plain form
4144 -765 990 -174 -417 2061 -1612 2111 -1335 1525 -656 134 367 -200 1698 -1434 1205 -998
4160 -998 1414 -1605 449 -486 -1645 1481 -1845 1373 -1675 1432 -1065 -1561 225 -1359 2011 -2345
4176 -2345 825 -1839 406 -233 -159 926 -1366 1789 -2221 1202 -1741 280 19 -511 665 -1314
4192 -1314 1850 -1608 801 -1010 1067 331 -1459 1325 -1561 1410 -1127 1612 -79 14 1192 -1735
4208 -1735 1897 -2414 1628 -900 693 407 543 1387 -1443 1925 -1394 2334 -1140 -270 -159 -111 1662
4225 1662 -2100 1578 -1096 1499 -1224 -273 729 -1057 1379 -1891 2147 -1495 1899 -531 449
4240 449 850 -1018 1455 -1601 1763 -2465 637 -443 -386 826 -1137 1655 -1950 1652 -1140 285
4256 285 -610 -338 986 -2097 958 -1773 1302 -1353 266 479 -1893 1341 -1554 1554 -1861 793
$$ packed form
4144g65J755j164k43K478l673L723l446K860k181P90K33n67J898l132K639k203
4160i98K412l019K054r35j159L126l326L218l048L107k497m96J786j584L370m356
4176b345L170k664K245o39P4J085k292L155m010L423k943K021k61n30J176j979
4192a314L164l458K409j811K077p36j790K784k886K971k537K739j691R3J178k927
4208a735L632m311M042k528J593k86J36Q44k830L368l319L728l474Q70J11M8J773
4225A662l762L678k674K595k723R51J002j786K436l270M038l642L394k430R80
4240D49M01j868K473l056L364m228L102j080N7J212j963K792l605L602k792J425
4256B85q95K72J324l083L055k731L075k655J619K13k372L234k895L108l415K654
$$ plain form
4272 793 -263 -99 821 -1591 1739 -1835 2129 -937 1150 -114 -264 1439 -1041 1979 -1263 1810
4288 1810 -465 1187 138 -364 1111 -1203 2028 -1347 1933 -638 440 936 -937 1894 -1452
4303 -1452 1467 -1559 1683 -476 160 1134 -1080 1849 -496 1778 -1364 534 -152 93 620 -1417
4319 -1417 1589 -1644 1484 -1605 285 80 -625 821 -1876 1366 -1801 1429 -1436 29 -82 -716
4335 -716 1082 -1915 1225 -1611 1049 -1078 -65 788 -876 970 -1971 1495 -1264 871 115 536
4351 536 634 -1478 2053 -1214 1685 -848 1085 466 -600 1164 -738 2147 -1124 1583 -606 533
4367 533 435 -558 1568 -1319 1971 -1094 1316 -277 108 1312 -726 1216 -1338 1837 -1024 1344
4383 1344 -320 -39 800 -1286 1422 -1586 984 -1059 469 16 -749 931 -1481 1353 -1439 752
$$ packed form
4272G93j056J64R20k412L330l574L964l066K087j264j50J703k480L020l242L073
4288A810k275J652j049n02J475k314L231l375L280k571J078M96j873K831l346
4303a452K919l026L242k159O36R74k214K929k345K274l142J898o86K45N27k037
4319a417L006l233L128l089J890k05p05J446k697L242l167L230k865J465j11o34
4335g16J798k997L140k836K660k127J013Q53j664J846k941L466k759K135p56M21
4351E36R8k112L531l267K899k533J933o19j066J764j902K885l271K707k189J139
4367E33r8r93K126k887L290l065K410j593L85J204k038J942k554L175k861K368
4383A344j664K81Q39k086K708l008K570k043J528m53p65J680k412K834k792K191
$$ plain form
4399 752 -525 697 -147 -902 858 -1362 1297 -1641 1059 -759 -255 293 -847 937 -2060 1631
4415 1631 -2083 1108 -651 -25 548 -1421 694 -1918 1510 -1411 567 308 -338 315 -847 1609
4431 1609 -1087 982 -745 558 667 -841 1184 -759 1942 -1342 1243 11 89 671 -126 1871
4447 1871 -1413 1418 -1031 1298 -637 55 1297 -333 1267 -1420 1895 -1077 512 -511 -285
4462 -285 280 -1462 1189 -1679 663 -1095 806 580 -896 610 -1664 1355 -1447 798 -134 -384
4478 -384 426 -1308 1640 -1523 874 -1069 701 -538 -478 -5 -1055 1191 -1280 1370 -916 341
4494 341 -195 125 753 -1515 1457 -1237 903 -833 502 500 -475 655 -946 1344 -1236 851 -305
4511 -305 212 1010 -397 876 -1133 1501 -1030 772 -598 -90 616 -633 1531 -1136 1431 -1042
$$ packed form
4399G52j277J222q44p55J760k220K659k938K700j818N04N48j140J784k997L691
4415A631l714L191j759O26N73j969K115k612L428k921J978k59o46O53j162K456
4431A609k696K069j727J303J09j508K025j943K701l284K585j232P8N82p97J997
4447A871l284K831k449K329j935O92J242j630J600k687L315k972J589j023K26
4462b85N65j742K651k868K342j758J901k26j476J506k274L019k802K245r32k50
4478c84Q10j734K948l163K397j943J770j239O0M73j050K246k471K650k286J257
4494C41n36L20O28k268K972k694K140j736J335kr75J130j601K290k580K087j156
4511c05N17P98j407J273k009K634k531J802j370N08P06j249K164k667K567k473
$$ plain form
4527 -1042 1099 319 -267 1591 -1046 1260 -862 1250 -907 749 456 -339 950 -1078 1753 -1512
4543 -1512 493 -613 69 259 -1316 1348 -1104 817 -848 623 -799 -611 647 -567 1143 -1697
4559 -1697 958 -569 293 -576 -46 851 -1095 849 -1482 950 -804 466 172 -389 1026 -1053
4575 -1053 1229 -996 1215 -573 401 768 -570 1352 -508 1389 -576 1487 364 -50 540 -733
4591 -733 1768 -1274 1406 -795 404 -8 -188 852 -215 1327 -1591 1098 -480 208 52 -227
4607 -227 712 -1130 592 -1257 548 -616 -95 238 -673 802 -1220 1327 -1193 530 -861 -564
4623 -564 -301 -1112 932 -1239 997 -808 390 -367 -886 352 -830 1231 -1293 -34 -1003 45
4639 45 -395 -339 997 -1573 932 -1081 538 -730 -116 44 -508 953 -1075 1515 -810 881 -241
$$ packed form
4527a042K141p80n86J858k637K306k122K112k157J656k93p95J289k028K831l265
4543a512K005j106O82J90j575K664k452J921j665J471j422J88J258j214J710k840
4559a697K655j527Q62q69N30Q97j946J944k331K432j754J270k94n61J415k079
4575a053K282k225K211j788R74L67j338J922j860J897j965K063j123m14N90j273
4591g33K501l042K680k201J199m12j80J040j067J542k918K689j578O88j56k79
4607b27R39j842J722j849J805j164N21L33r11J475k022K547k520J723j391K97
4623e64K63q11K044k171K236j805J198p57n19J238j182K061k524J259r69J048
4639D5m40N6J336k570K505k013J619j268O14J60n52J461k028K590k325J691j122
$$ plain form
4656 -241 369 796 -986 1318 -755 1314 -161 600 -136 -526 1103 -385 1181 -760 1498 -555
4672 -555 492 -147 -367 1624 -695 1156 -1380 1186 -539 349 131 -282 1073 -1389 1261 -1247
4688 -1247 641 -219 -293 316 -1062 1181 -1742 784 -1330 88 384 -613 70 -1308 829 -1118 1350
4705 1350 -1019 54 -135 -488 274 -884 1140 -1424 936 -647 133 -264 -771 593 -1697 1307
4721 1307 -778 674 -246 59 97 -734 1178 -1467 1398 -940 911 -274 171 730 -957 1649 -265
4738 -265 1315 -23 1019 -304 -255 1025 -555 1414 -1261 741 -445 68 278 -39 1303 -1105
4754 -1105 1602 -688 1456 -417 305 419 -257 1332 -796 1598 -1192 1254 -506 -126 528 -1439
4770 -1439 694 -1373 675 -872 404 186 -294 703 -1189 997 -1303 386 -442 96 212 -665 1377
$$ packed form
4656b41O10M27j782K304k073K069j475P61p36l90J629j488J566j941K258k053
4672e55J047o39k20J991k319J851k536K566j725Q88k18m13J355k462K650k508
4688a247J888q60p4O09j378K243k923K526k114J418K96r97O83j378K137j947K468
4705A350k369J073j89l53P62j158K024k564K360j583P80l97n07J364k290L004
4721A307k085J452r20L05L8q31J912k645K865k338J851j185M45N59j687K606j914
4738b65J580j338J042j323M9J280j580J969k675K002j186N13K10l17J342k408
4754a105K707k290K144j873P22J14o76J589k128K394k790K446j760L80O54j967
4770a439K133k067K048j547J276k18m80R97j892K186k300J689q28N38J16q77K042
$$ plain form
4787 1377 -846 747 -991 688 -188 326 553 -925 1383 -1109 1351 -1506 743 -802 -81 507
4803 507 -775 1146 -1114 1247 -786 572 307 -14 600 -739 537 -749 993 -59 777 236
4819 236 -410 759 -630 1370 -1368 941 -474 227 464 -619 1117 -427 687 -993 1045 -254
4835 -254 223 472 -472 1011 -727 1115 -1172 318 -350 -313 566 -984 832 -1265 923 -1083 -218
4852 -218 85 -909 696 -1269 897 -1613 948 -763 -599 -81 -966 898 -1047 891 -806 266
4868 266 -16 234 627 -670 971 -1497 911 -435 446 332 -405 607 -1042 1064 -916 992 -619
4885 -619 535 191 -334 896 -618 1863 -944 964 -440 395 321 -492 1581 -858 904 -788 1475
4902 1475 -283 -177 667 -885 1194 -897 837 -314 718 131 -526 699 -1252 911 -839 675
$$ packed form
4787A377k223J593j738J679q76N14K27j478K308k492K460k857K249j545P21N88
4803E07j282J921k260K361k033J358k65l21O14j339J276j286J742j052Q36n41
4819B36o46J169j389K000k738K309j415P01K37j083J736j544J114j680K038j299
4835b54M77K49r44J483j738J842k287J490o68L7Q79j550J816k097K188k006Q65
4852b18L03r94J605j965K166k510K561j711J64N18q85J864j945J938j697J072
4868B66k82K50L93j297J641k468K408j346Q81j14p37J012j649K106j980J908j611
4885f19J154l44n25J230j514K481k807J908j404Q35p4q13K073k439J762j692K263
4902A475j758J06Q44j552K079k091J734j151J032n87o57J225j951K163j750J514
$$ plain form
4918 675 -1433 308 413 -842 315 -1345 1278 -1567 319 -411 117 -183 -643 903 -1395 583
4934 583 -1188 339 -705 -312 471 -604 447 -1519 979 -701 561 -705 -553 603 -224 1344
4950 1344 -806 1373 -500 424 298 -362 1050 -784 1365 -513 578 -378 319 514 18 970 -646
4967 -646 1000 -873 713 -278 -312 705 -232 1057 -455 594 -675 633 99 -720 563 -820 1080
4984 1080 -1048 962 -754 595 87 -328 441 -1210 1338 -1047 440 -339 99 417 -535 339 -1309
5001 -1309 1332 -814 300 -705 45 243 -1060 549 -918 735 -1106 662 -392 -35 481 -1300
5017 -1300 1291 -1323 1079 -200 654 190 82 375 -789 1383 -1031 692 -1003 218 730 -338
5033 -338 1113 -745 1125 -536 1146 -521 152 397 -1235 756 -940 1007 -1043 459 -258 -200
$$ packed form
4918F75k108J741J05j255J157j660K623k845J886p30N28l00m60J546k298J978
4934E83j771J527j044L93P83j075J051j966K498j680J262j266J52J156q27J568
4950A344k150K179j873R24j26o60J412j834K149j878J091r56O97J95m96R52j616
4967f46J646j873J586r91l4J017r37J289j512J049j269J308n34q19J283j383J900
4984A080k128K010j716J349n08m15P69j651K548k385J487p79M38L18r52Q74j648
5001a309K641k146J114j005P50J98j303J609j467J653j841J768j054L57N16j781
5017a300K591k614K402j279Q54m64j08K93j164K172k414J723j695J221N12j068
5033c38J451j858J870j661J682j667O73K45j632J991j696J947k050J502p17N8
$$ plain form
5049 -200 527 -647 1376 -1286 705 -258 22 124 -286 462 -648 890 -1256 885 -455 124 351
5066 351 -518 730 -995 1316 -1116 522 -863 -235 649 -911 781 -676 1281 -1029 115 -470
5082 -470 -364 269 -553 761 -1070 875 -546 432 -133 -636 1010 -1356 687 -981 793 -617 102
5099 102 -107 -359 1283 -1027 1104 -645 848 -447 -39 970 -834 813 -831 1546 -1277 1126
5115 1126 -524 238 1110 -1021 1654 -905 550 -868 234 102 -405 599 -262 1160 -464 680
5131 680 -732 806 -189 -120 310 -802 1412 -575 485 -877 -1027 181 -573 1207 -266 1507 -1152
5148 -1152 1136 -28 210 518 -1136 725 -1577 977 -378 366 -89 -262 133 -296 1016 -1030 1033
5165 1033 -573 214 -71 -436 442 -1204 1130 -567 462 66 90 410 -53 1205 -982 492 -655
$$ packed form
5049b00P27j174K023k662J991r63K80J02m10P48j110J538k146K141j340N79K27
5066C51q69J248j725K311k432J638j385O28Q84j560J692j457J957k310J144n85
5082d70J06O33q22J314j831J945j421R78n65n03J646k366K043j668J774j410P19
5099A02k09k52J642k310K131j749J493j295M08J009j804J647j644K377k823K403
5115A126j650P62Q72k131K675k559J455j418J102j32n07J004q61J422j624J144
5131F80j412J538r95O9M30j112K214j987J060j362j50J208p54J780j473J773k659
5148a152K288j164K38L08j654J861k302K554j355P44m55j73L95m29J312k046K063
5165A033j606P87k85l65Q78j646K334j697J029l96K4L20m63J258k187J474j147
$$ plain form
5182 -655 704 -215 -155 27 -502 899 -512 523 -633 783 553 -582 649 -432 1405 -934 780
5199 780 -365 451 321 77 798 -481 963 -707 918 -556 -36 -158 -471 815 -829 479 -933
5216 -933 564 -198 -436 603 -826 750 -1027 1034 -776 162 -8 -771 387 -1090 973 -861
5232 -861 843 -885 237 255 -535 534 -1261 963 -1274 827 -324 82 -390 -844 892 -864 502
5249 502 -969 507 -468 219 287 -351 1291 -494 736 -586 376 42 -189 290 -616 1238 -299 1068
5267 1068 -374 633 218 -112 637 -294 1107 -974 697 -313 -93 528 -749 1132 -429 596
5283 596 -773 717 -877 -136 323 -879 1035 -612 327 -650 149 -607 -472 349 -628 1000 -1139
5300 -1139 516 -688 210 -142 -504 654 -771 608 -906 490 -603 155 62 -1037 112 -1128
$$ packed form
5182f55J359r19O0J82n29J401j411J035j156J416k30j135J231j081J837k339J714
5199G80j145Q16j30k44P21j279J444j670J625j474N20j22l13J286j644J308j412
5216i33J497p62k38J039j429J576j777K061j810R38j70p63J158j477K063j834
5232h61J704j728J122J8p90J069j795K224k237K101j151M06m72m54J736j756J366
5249E02j471J476r75O87O8o38J642j785J230j322R62l34k31M79r06J854j537J367
5267A068j442J007m15l30P49r31J401k081J671j010K20O21j277J881j561J025
5283E96j369J490j594P41M59j202J914j647R39r77P99p56J35Q21r77J628k139
5300a139J655j204Q98l52l62J158j425J379j514J396j093P58r3j099J149j240
$$ plain form
5316 -1128 787 -378 536 69 -283 -94 -157 1042 -961 878 -647 344 355 -138 465 -531 384 -609
5334 -609 1662 -780 519 252 -546 635 -928 990 -748 376 -353 418 427 -687 1038 -355 1351
5351 1351 -629 857 -22 -31 418 -765 709 -660 587 -451 829 95 -329 536 -731 790 -623
5368 -623 1389 -541 70 336 279 24 -897 754 -984 565 -485 118 134 -754 99 -911 739 -806
5386 -806 456 -345 -271 -84 -395 604 -1139 717 -761 924 -110 314 340 -866 744 -613 556
5403 556 -131 419 147 -66 284 -555 462 -524 846 -127 713 1021 -194 605 -803 814 -787 193
5421 193 -573 -90 -176 -603 859 -980 1109 -817 442 30 297 489 -385 610 -936 882 -753 84
5439 84 115 -312 521 -833 708 -939 506 -195 11 -234 -485 335 -519 844 -1090 225 -408 -86
$$ packed form
5316a128J915j165R14m67l52J89o3J199k003J839j525R91J1m93O03r96R15r93
5334f09K271k442J299k67p98J181j563J918j738J124p29P71Rj114J725j393J706
5351A351j980J486q79rM49j183J474j369J247j038J280p34m24Q65j267J521j413
5368f23K012j930O11K66n7k55r21J651j738J549j050O03J6q88Q53j010J650j545
5386h06J262q01P4J87l11R99j743J856j478J685j034M24K6j206J610j357J169
5403E56o87N50k72k13L50q39J017r86J370r73Q40L08j215P99j408J617j601R80
5421A93p66M83q6m27J462j839K089j926J259m12K67J92q74R95j546J818j635Q37
5439H4L1m27Q33j354J541j647J445p01K06k45k51Q20q54J363j934J315o33L22
$$ plain form
5457 -86 616 -810 792 -694 499 -258 385 -168 -69 372 -913 765 -922 492 -779 478 -262
5474 -262 104 1033 -454 515 -492 1046 90 89 213 -294 1011 -1080 1357 -469 846 -688 -71 535
5492 535 -624 390 -822 835 -895 285 -312 373 270 -439 658 -354 1043 30 -326 383 3
5509 3 26 -533 931 -953 879 -41 -49 -287 -199 497 -960 970 -486 511 -491 210 308 -1008 275
5528 275 -682 1032 -433 350 -478 -91 163 -627 227 -1170 428 -588 206 -222 -14 187 -720 341
5546 341 -960 1004 47 -74 189 -303 760 -472 924 -650 1104 -440 -230 291 -339 725 -1184
5563 -1184 1201 -866 303 209 42 502 -410 620 -695 634 -212 105 28 -34 280 -54 660 -610
5581 -610 696 -679 205 122 -426 407 -565 1071 -324 345 30 -342 44 -284 424 -763 183 -796 159
$$ packed form
5457h6P02j426J602j486J193p57O43n53R9M41j285J678j687J414j271J257p40
5474b62L66R29j487R69j007J538r56jJ24n07J305k091K437j826J315j534O17O06
5492E35j159J014j212J657j730J180n97O85j03p09J097j012J397j013l56P09l80
5509CK3n59J464j884J832r20qk38Q8O96j457J930j456R97j002P01R8j316J283
5528B75r57J714j465P83q28L87K54p90Q54j397J598j016P94m28K08K01r07J061
5546C41j301J964r57j21K63m92J063j232J396j574J754j544K10N21o30J064j909
5563a184K385k067J169r4j67M60r12J030j315J329q46L17p7o2L14l34P14j270
5581f10J306j375Q84q3n48Q33r72J636j395O69l15l72L86l28P08j187R46r79R55
$$ plain form
5600 159 -510 -190 47 -178 594 -656 257 -759 462 14 -329 22 -1015 492 -690 287 -552 649
5618 649 -64 -247 369 -738 738 -508 479 -396 -17 344 -424 438 -1416 470 -953 500 -33 -227
5636 -227 488 -212 505 -1041 325 -935 -166 228 -165 195 -434 479 -371 560 -130 -220 -50 -187 349
5655 349 -770 213 -540 404 -475 -21 212 -528 488 -860 1061 -731 384 167 23 433 -176 615
5673 615 -472 556 -525 280 -372 -185 -13 -263 673 -611 640 -618 -500 -369 -529 536 -1113
5690 -1113 403 -771 341 34 175 427 -292 481 -720 376 -793 316 -168 280 252 -23 575 -348
5708 -348 834 25 492 -225 82 821 -221 340 -958 383 -359 396 47 -187 629 -27 788 -435
5726 -435 294 -380 102 381 -225 590 -8 490 -770 245 -209 -137 254 64 661 -831 427 -730 99
$$ packed form
5600A59o69L20K37k25P72j250R13j016J221m48l43L51j037J507j182R77q39J201
5618F49p13j83O16j107J476j246R87q75L79L61p68Q62j854J886j423J453n33j94
5636b27P15p00P17j546J366j260P69L94l93L60o29R13q50R31o90r0J70j37N36
5655C49j119R83p53R44q79M54K33p40J016j348J921j792J115k17j44M10o09P91
5673F15j087J028j081Q05o52J87J72k50R36j284J251j258J18J31j60J065j649
5690a113J516j174J112l07J41K52p19P73j201J096j169J109m84M48k8k75N98r23
5708c48J182q09M67p17L07P39j042N61j298J341p42P55l49k34Q16o56Q15j223
5726d35P29o74M82K79o06Q15n98M98j260J015m54P2L91j90N97j492J258j157Q29
$$ plain form
5745 99 -161 -232 174 -727 -59 -662 708 -939 -216 -455 -540 414 -396 580 -467 98 -456 -57 359 -85
5765 -85 338 -636 -178 -521 710 -171 -17 -20 -374 864 -918 708 -150 643 186 -333 255 -30 524 -344
5785 -344 722 -522 395 -229 -639 138 -331 623 -728 1089 -371 205 653 -325 554 -543 814 -198
5803 -198 105 0 -183 465 -133 570 -769 267 -342 297 -468 -84 88 -354 802 -679 453 -242
5821 -242 390 55 101 657 12 620 -780 299 -551 202 364 -381 551 -345 995 -477 84 -286 399
5840 399 12 -760 879 -119 615 -661 416 -194 -250 140 -118 507 -533 794 -513 599 -90 139
5858 139 467 -712 639 -659 531 -542 294 186 -416 963 -17 739 -255 527 -365 491 291 -464
5876 -464 322 -708 804 -790 72 47 -106 266 -520 953 -605 526 -369 551 -494 -302 313 -561
$$ packed form
5745I9k60p1M06r01O68o03J370j647P23k39q5R54q10R76j047N65n54L99M16m44
5765h5M23r74M58l43J231q81J54ll54J238j782J626q58P93m57n19N88k85N54q68
5785c44J066j244R17o24m10P77m69R54j351J817j460N76M48r78Q79j097J357j012
5803a98L03j05j83O48n98P03j339J036o09O39p65L84J72m42J156j481J132o95
5821b42O32l35M6N56o45O08j400J079q50P53J62p45R32q96J340j472N61l70O85
5840C99l87p72J639r98P34j276J077o10n6L90k58O25j040J327j307J112o89K29
5858A39L28j179J351j298J190j073Q36j08o02J379r80P56r94P82q92Q56k00p55
5876d64P86j030J512j594Q62k5j53L72p86J473j558J131q95R20j045J92O15q74
$$ plain form
5894 -561 245 -569 620 -408 502 386 -338 184 -212 458 -821 423 -660 -170 249 -117 507 -733
5912 -733 226 -518 619 -313 -214 651 -100 587 -668 712 -269 412 160 -202 620 -472 908 -535
5930 -535 -154 -368 311 -451 -355 422 23 818 86 391 124 -7 -17 -78 830 188 971 -523 331 -18 174
5951 174 369 -365 106 -428 936 -355 511 -329 -163 218 -662 255 -172 715 -751 244 111 223 543
5970 543 -776 441 -248 561 -358 169 213 -242 172 -600 237 -709 -39 -201 -149 507 -393 187 -543 346
5990 346 -592 384 -364 157 64 -29 554 -666 799 -286 532 68 -67 185 -609 355 -443 700 -190
6009 -190 49 209 -345 1001 -201 224 -496 72 -581 -117 515 -244 -157 -1147 766 -731 249 -3 441
6028 441 405 -694 335 -1044 649 -280 326 -200 -175 513 -961 457 -622 437 -406 162 183 96 672
$$ packed form
5894e61Q06q14J189j028R10j16p24N22l96O70j279J244j083M90M19l66O24j240
5912g33R59p44J137r32R9Q65p51O87j255J380r81O81k52l62Q22j092J380j443
5930e35L81k14O79p62R6P77l99P95p32L05k67j31j0o1R08o42P83j494Q54l49J92
5951A74J95p34M71n34J364j291Q66q40J66L81q80R17m27Q87j466R95j33J12L20
5970E43j319J217o89Q09r19N27M4m55M14p72Q37r46O70j62N2O56r00N80p30Q89
5990C46r38R76p48N21r3r3N83j220J465j085Q18m64j35K52p94R64p98J143q90
6009a90K39J60n54J346j202M25p20N68o53M64O32p59Q7r90J913j497R80k52M44
6028D41l6j099J029j379J693r29O06n26K5O88j474J418j079J059q43N68K1q7N76
$$ plain form
6047 672 -538 429 -616 289 -10 -220 83 -652 423 -670 67 -412 -69 15 -37 14 -541 504 -726
6066 -726 385 -697 400 -221 -323 775 -565 801 -71 722 -629 243 -42 -659 397 -349 397
6083 397 -621 712 -122 -224 6 -96 658 -211 456 274 68 56 322 468 -556 34 -213 906 -476
6102 -476 485 256 -221 248 -395 433 -346 861 251 624 327 -139 518 -941 689 -185 590 365 -558
6121 -558 171 -149 516 -418 101 -212 402 -347 -83 -155 -435 404 -278 205 -468 429 418 -164 100 -807 273
6142 273 301 374 -251 -251 167 263 284 -171 914 -737 62 -142 321 384 15 405 -112 395 -405 -56 65 4
6164 4 547 -571 90 -988 433 -402 126 113 257 319 -459 252 -531 52 40 590 -15 -388 484 -525
6184 -525 201 -352 327 -164 144 -17 -329 140 -469 412 -472 514 16 -300 112 -188 770 -504 591
$$ packed form
6047F72j210R67j045R05k99k10L03p35J075j093P37m79L43Q4n2N1n55J045j230
6066g26J111j082J097o21j02J098j340J366q72P93j351Q72k85o17J056p46P46
6083C97j018J333q34j02K30j02P54q69O67j82k06j2K66J46j024N90k47J119j382
6102d76R61k29m77M69o43Q28p79J207o10L73k97m66O57j459J630q74P75k25r23
6121e58P29l20O65r34N19l13O14p49K64p2k80Q39o82M83o73Q97j1n82K64r07J080
6142B73K8P3o25%M18R6K1m55J085j651P99k04M63O3l69L90n17N07q00L49J21o1
6164DN43j118O61j078J421q35N28j3J44O2p78P11p83N83j2N50o05l73Q72j009
6184e25P26n53O79m91L08j61l12M69o09Q81q84R86m98l16M12l00R58j274J095
$$ plain form
6203 591 -582 397 -271 -289 92 -413 9 -505 884 -432 -126 197 2 -25 -784 565 -272 102 -462
6222 -462 143 90 -598 261 -577 525 -922 556 -33 -287 183 -368 141 -636 273 -11 -46 -86 121 225
6242 225 -269 109 -696 702 -397 74 475 -357 254 193 403 -85 -134 71 -60 382 -212 172 -472 350
6262 350 -446 458 54 -85 131 -384 168 -602 270 -43 167 -113 -5 241 -326 634 -492 147 -367 -6
6282 -6 -187 42 -32 -327 1196 -669 321 -822 -147 77 -446 653 -388 164 -383 558 -173 51 239
6301 239 189 602 14 -112 -107 594 375 -288 400 -495 276 -184 462 -371 460 -565 -324 338 -332 98 -679
6322 -679 460 262 55 73 -133 382 -133 385 -507 -86 24 258 306 -578 346 -150 1001 -253 334 -407
6342 -407 -16 397 -369 88 -180 262 -217 112 -51 25 -231 -781 339 -874 667 -119 178 -19 -599
$$ packed form
6203E91j173R79o68j8L81n05M22n14J389j316L06L23j95k7p59J349q37L74n64
6222d62O05n3o88Q59q38J102j447J478n89k54M70n51N09p77R09k84l5m0K07J04
6242B25m94L78q05J398j099M71M01q32O11o1K10m88m9K05j31M42n94L84o44Q22
6262C50p96R04m04j39K16n15N52p70Q72l13K10k80J08K46n67R60j126O39n14L61
6282fj81K29p4k95J523j865R90j143O75K24n23J099j041N52n47R41p31K24J88
6301B39n0M13n88j26NP01k19o63O88q95P71m60O46q33Q31j025K41O62o70M30p77
6322f79J139j98k07J8k06N15n15N18q92M21J10K34M8q84R24m96J151j254N87p41
6342d07L91M13p66M57k68M42m79L29j63P6k56n50J120j213J541p86K97j97n80
$$ plain form
6361 -599 282 -722 193 -559 565 -112 -7 -16 -404 41 -332 769 -561 -73 -327 -470 41 -233 312
6380 312 -236 217 -518 393 -136 -516 274 -221 258 -163 559 81 -118 272 -661 96 -571 195 -515 673
6400 673 387 297 284 -89 700 -70 323 -433 98 141 195 65 -482 739 -396 725 240 238 -239 -381 502
6421 502 -591 560 -398 166 -211 91 -207 -303 471 -525 119 -28 -28 -69 -350 234 160 145 -779 -129 -478
6442 -478 -8 157 -202 279 -129 348 -650 27 -353 127 161 -52 -56 -285 478 -402 324 -168 477 -407 -84
6463 -84 353 -297 123 -264 126 -408 122 447 -5 438 -499 508 -57 607 -107 120 36 -308 607 -628
6483 -628 540 -371 -377 321 -53 295 -348 753 -603 651 -621 313 9 -687 683 -367 5 -470
6501 -470 429 -274 -144 -188 -330 735 -683 43 -571 197 -299 -372 84 -137 619 -557 319 25 -352 -347
$$ packed form
6361e99Q81j004R15p52J124o77J05rl88M45l73J101j330M88k54j43N11k74N45
6380C12n48M53p35R11n29l80P90m95M79m21P22m78j99L90r33P57o67P66p10J188
6400F73k86r0j3l73P89p70L93p56N31M3N4j30n47J221j135J121m85km77j42Q83
6421E02j093J151r58N64l77L02k98r6P74r96O44j47%m1k81N84p4j5r24O50l49
6442d78M70J65l59M81m08M77r98O77l80M80L4k13mk29P63q80P26m92O45q84L23
6463h4M37o50M20l87L90n34N30L25m52M43r37J007n65O64p14K27q4l44R15j235
6483f28J168r11oO98l74L48o43J101j356J254j272R34l04o96J370j050L72m75
6501d70Q99p03J30m4j42J065j418P26o14P68m96p3M56k21P56j176Q76k94l77N
$$ plain form
6521 -347 -226 -544 -336 309 -375 58 72 -107 -296 -404 553 -122 459 -224 82 16 286 295 416 257 -306
6542 -306 392 153 569 221 130 218 -530 177 -438 207 -1007 -104 147 -110 -73 -379 581 -218 562 -560
6562 -560 245 -193 224 169 -118 101 -180 663 -620 29 24 -326 517 -126 -187 -333 -4 144 -129 619 -540
6583 -540 351 -382 409 134 -139 87 -342 -192 -35 -206 -94 423 -674 286 -98 52 426 118 542 -272
6603 -272 811 -100 -179 -284 -268 201 -18 -119 -333 150 -23 134 162 -499 556 -346 190 215 -121 -106 -340
6624 -340 166 284 546 -219 450 -493 -310 -2 -584 358 208 692 -338 237 -482 54 287 -154 -185 118
6644 118 -125 -238 403 -391 -390 154 -54 93 -307 174 -288 229 -216 1 -34 -180 187 -562 708 102 226
6665 226 -123 -610 110 -161 371 -397 -101 -336 -92 291 -163 373 -452 4 -302 -203 240 55 437 -131
$$ packed form
6521c47J21l18K08O45o84M33J4j79j89j08R57o75N81o83L06o6K70RJ21j59n63
6542c06O98k39M16l48r1Q8p48P07o15O45j214R03K51k57L7l06R60p99P80j122
6562e60Q05m38M17n5k87K19k81Q43j283O49nl50Q43o43o1j46L29J48k73P48j159
6583e40Q91p33P91k75k73K26m29J50J57j71J12N17j097R60l84J50L74l08M24q14
6603b72J083r11p9j05J6M69k19j01k14M83j73J57K8o61J055r02N36K5l36J5k34
6624c40N06J18K62p65O69r43J83L08n82R42j50M84j030N75p19N36K33m41l1L03
6644A18k43j13O41p94JN44k08J47m00M81m62N17m45K17l5j46L67p49J270o06J24
6665B26l49m87P20k71N32p68K96k35K44L83m54N36q25M56l06R9M43j85L82n68
$$ plain form
6685 -131 262 -898 828 -241 212 120 -153 -58 -310 79 -516 101 -305 297 66 423 354 -39 58 -389
6705 -389 -101 -160 147 64 -5 -12 -206 -161 -413 367 -219 -175 -198 245 814 -231 -39 -160 101 -147 -226 129 228
6728 228 -169 -538 604 -453 -377 34 -267 177 -270 222 3 445 -419 298 604 360 -188 -262 795 -601
6748 -601 12 -511 -346 -322 -482 104 -579 -13 -194 58 335 -41 -39 4 284 -831 284 -245 474 280 -91
6769 -91 -132 177 676 -51 385 -124 120 -295 265 -38 -112 351 -42 -158 249 320 135 -765 241 -496 228
6790 228 134 637 1 135 682 -262 47 -686 464 -375 51 -227 -196 -84 -270 275 80 211 -96 -161 -174
6811 -174 35 540 163 113 -212 756 163 -234 313 -18 -163 -525 380 202 20 -218 95 -215 -107 594
6831 594 -639 49 -355 89 -10 -155 379 -382 963 -427 27 68 34 -112 -241 209 -391 -301 248 270 -99
$$ packed form
6685a31L93j160J726j069M53r2k73R5k52L89n95O17m06O02k31L57o9l93R7m47
6705c89K88n9L07q3o9pj94M5k52P80n86M4k3M43N69j045J92j21K61k48p9L55R9
6728B28l97l69J142j057P6M11l01M44m47M92k19M42q64P17L06k44n48p4J057j396
6748f01O13n23J65K4j60N86o83N66j81K52K77l76KM3K80j115J115n29P19j94l71
6769i1m1L09M99p27M36n09K44m15N60l03p4M63l93j16M07P1j85r00J006p37P24
6790B28r4N03o36J34N47r44L09p33J150q39M26k78L1J12j86N45j95J31l07o5j3
6811a74K09N05l77n0l25R68n93l97N47l31j45l62R05j78j82k38L13l10J08P01
6831E94j233O88m04M44r9j45N34p61J345j390M54M1l4j46j29M50o00R0N49K2l69
$$ plain form
6852 -99 -334 -194 260 22 195 229 -453 620 235 -45 -115 -21 81 -509 211 148 67 67 23 59 -1 415 243
6875 243 221 -283 127 -367 -285 311 73 217 331 -17 -334 264 460 -523 311 -57 -194 -132 1 126 -57
6896 -57 -266 -52 45 -439 202 93 10 488 147 230 -206 562 -168 -87 132 230 32 -454 70 -385 790 -173
6918 -173 646 -54 -356 -511 -409 481 20 41 108 -197 -144 75 -110 -35 454 -152 430 -184 -235 59 -492 350
6940 350 -132 375 -306 -292 151 -335 -252 -183 368 -251 562 -295 3 -56 -375 454 -261 33 -475 -46 285
6961 285 58 269 27 -181 -61 193 -89 466 -588 122 -48 -94 14 -380 433 139 379 -3 185 -10
6981 -10 220 420 -126 230 -166 -33 -205 -365 152 -142 329 37 -54 -213 556 227 -246 366 -27 -14 -333
7002 -333 285 201 261 5 70 10 -41 406 -110 135 84 -310 -50 -146 25 -405 403 -225 -370 -47 146 449
$$ packed form
6852i9k35J40M54k38J73L4o82J073l85k80p0R4J02n90P20o3q1%m4L6o0M16j72
6875B43k2n04M10m94Q2N96k38J44J14l48l17N98J96r83Q34l68j37O2J33J25j83
6896e7k09K14R7m84O41j09q3M78l41Q3m36P68p30Q1K19R8j98m86N24m55J175r63
6918a73Q19p00l02j55J02Q90m61K1O7l05N3K19j85P5M89o06N82o14n1K94n51Q42
6940C50m82N07o81J4M43m86Q3O9N51o19Q13q57K98n9l19Q29p15K94n08M29L31
6961B85k27K11k42k08J20K54k82N55j054P10j70m6J08l94Q13k94K40l82J88j95
6981a0K30K00n46L56l96J33j72j60N17k94M71k92r1j59P69l29m73O12l93J3l19
7002c33O18q4O0k56O5o0n1M47n16K45n1l94K60r6J71m30Q08o28j45L23J93L03
$$ plain form
7024 449 -43 -258 -212 52 -59 -421 -228 -136 -279 -358 569 -223 145 -174 -141 -112 -421 -6 -162 -18 -271 -65
7046 -65 -490 -45 -26 -322 -286 -119 439 -470 -24 136 -51 973 -172 146 -13 474 -749 296 -546 -237
7066 -237 457 40 -48 -468 33 -393 224 -417 -148 289 -491 268 -191 47 -82 114 -85 -237 481 -667
7086 -667 509 -77 39 90 12 162 -264 624 -330 548 -294 340 513 -44 -234 357 227 -521 52 142 -221
7107 -221 -400 337 -115 430 51 -646 242 -241 -103 -22 -395 34 -496 670 -437 32 -51 -119 -224 -27
7127 -27 212 -213 342 348 204 -37 -146 -314 -122 504 52 -104 -218 17 -477 -282 345 -160 147 -63 -107
7148 -107 167 308 -309 66 106 119 544 -308 649 58 -121 261 -359 467 128 -143 375 169 -205 -30 261
7169 261 -689 105 -308 67 220 -400 152 -204 91 -509 591 -98 104 -361 -327 524 127 331 -370 -1
$$ packed form
7024D49m92k15M6K64j11l62J93R2j43p9R27p92L68l19L3K9l09M15j56J44k53K06
7046f5m25M45J9k96L6J67N58r09M46J60j87J024j145L18j59M87j223J045q42L09
7066b37O94m17q8m20N01m26O17o41K69M37p80P59m59K38j29J96j99j52P18j148
7086f67J176n86J16N1p8J50m26Q88r54Q78q42O34J73n57j90N91j30p48N73R0l63
7107b21j79P37m52N45l79o97Q88m83J38Q1l73M29n30J166j107M69q3o8j05J97
7127b7K39m25N55Oj44k41j09j68J92O26m52j56j14K35m94J95O27n05L07k10m4
7148a07K74J41o17L75M0J3M25q52R57n91j79L82o20Q26l39k71N18k06l74J75K91
7169B61r50P94m13L75J53o20N52l56K95o00J100o89K02m65L4Q51l97K04p01L69
$$ plain form
7189 -1 -327 -33 -96 57 301 -74 -93 -898 201 58 -41 137 21 300 -278 214 -145 659 -698 357 215
7210 215 96 5 115 515 -355 25 -139 23 -266 118 41 -109 349 -146 161 -140 -73 277 -263 364 -483
7231 -483 280 41 -59 56 -402 450 173 499 -225 491 -507 -559 605 477 694 -113 639 83 504 123
7251 123 197 -96 -309 -103 94 -49 -337 179 509 -97 -328 -27 -427 20 215 88 342 -116 -366 -224
7271 -224 -98 313 115 -30 -142 -108 -249 159 -169 -148 733 -233 144 -74 108 -121 628 4 -639 -359 -163
7292 -163 -231 3 462 55 33 -157 -325 20 -137 285 487 250 -544 -327 192 -667 130 -68 396 -234 18
7313 18 -73 -270 329 63 324 226 -290 112 -216 333 151 4 114 153 248 -130 184 -287 64 -347 157 -22
7335 -22 217 99 -163 91 75 -359 10 302 -146 -102 48 -502 -135 -304 68 -20 -20 342 121 452 39 276
$$ packed form
7189al26K94o3J53K44l75j9q05J099j43r9J78j16K79n78M92l59Q04j357J055j42
7210B15j19r1J10M00q70L80j64J62k89L84p7j50M58m95L07l01O7L50n40O27q47
7231d83P63k39j00J15m58Q52k77L26p24P16r98n2J164j28K17q07P52n56M21l81
7251A23P4k93k13K06J97j43k88N16L30o06k31L01m00M47J95j27K54m58k50J42
7271b24J26M11j98j45j12L4j41M08l28K1Q81r66L77k18J82k29P49o24o43K80J96
7292a63o8K34M59m07k2j90j68L45j57M22K02k37p94K17N19q59P97j98M64o30K52
7313A8r1j97N99k66K61r8n16M02l28N49j82j47J10L9R5l78L14m71L51m11N04j79
7335b2K39j18k62K54j6m34L69K92m48M4J50n50L67j69L72q8%L62k21L31m13K37
$$ plain form
7357 276 -86 410 -110 160 14 -216 107 11 53 -339 191 346 308 -183 -97 100 -155 -42 -81 92 112 183
7379 183 132 -244 -18 97 -283 -421 -287 90 83 -372 -557 183 29 435 -371 182 16 42 633 -515 379
7400 379 -160 -299 101 -184 -478 -605 11 215 149 -380 296 -558 489 300 -145 70 -316 274 93 355
7420 355 269 -233 569 13 327 -359 -29 -318 -351 -125 -40 180 -177 123 -282 545 -29 104 285 577 -216
7441 -216 -97 22 -684 19 -142 -3 315 4 181 -866 -55 -146 291 -32 362 210 -281 -306 190 581
7461 581 245 329 57 -206 209 65 21 11 66 25 -400 233 108 -44 -252 190 28 195 -202 28 194 -415
7483 -415 578 -259 282 -520 334 303 188 -392 -18 -50 -1102 969 -448 -74 76 582 -193 -84 170 -99
7503 -99 -105 358 -124 462 25 86 275 -255 83 368 -198 477 214 -111 -283 250 116 -203 149 -17 -530
$$ packed form
7357B76l62M96n20K70j46k30L23r6M2l92N30J55l8m91Q6J97k55J13l9J73K0P1
7379A83n1l76K26J15l80j38J34L77pm55j85P40j54M06q06N53j66K6N91j148Q94
7400C79n39j39M00k85k94j27O16K04o6n29O76q54J047j89m45K15l86N90j81K62
7420C55q6n02Q02n56L14o86L30k89l3K26Q5K20l57L00m05Q27n74J33J81K92p93
7441b16J19J19p06P03j61J39L18l11J77j047Q11r1M37l23L94j52m91k5M96L91
7461E81l36Q4k72k63M15j44m4j0N5m1m25O33j25j52k08M42j62J67l97K30J66o09
7483d15R93q37N41q02Q54l1j15n80L74l2j052K071j417L74J50N06p75J09K54k69
7503i9oM63m82N86m37O1J89n30L38K85n66O75k63l25j72N33j34l19L52j66n13
$$ plain form
7524 -530 43 -53 331 -484 397 -415 175 183 9 -287 -282 -355 -295 318 -289 267 -289 69 -181 -302 -175 -176 282
7547 282 -10 271 -129 -151 -68 -14 514 133 -126 -226 19 224 114 18 -372 270 123 30 327 -158 -446 -165
7569 -165 413 -273 172 147 218 -421 46 59 -26 367 32 95 49 -350 -369 113 440 -127 231 -89 219 -391
7591 -391 87 245 -135 93 -97 150 -241 141 99 2 -26 -92 1005 70 -326 -552 28 109 -148 -258 110
7612 110 462 -391 150 66 -294 129 260 186 -173 -130 -755 54 128 -121 144 -359 -115 -143 -6 -203 529 -12
7634 -12 95 176 -187 379 316 71 -122 -168 19 347 220 -243 278 -601 -356 -212 312 121 283 621 -258
7655 -258 165 -613 140 -56 255 -188 -242 661 -251 -72 -600 544 194 -174 -197 -361 102 -202 554 -7
7675 -7 -80 15 -120 -324 228 227 -402 752 -322 -328 -194 13 -61 -97 132 -461 507 188 -82 -142 318 231 -495
$$ packed form
7524e30N73r6L84q15Q81q12N90Qj74k96Np3O0O13o07N56n56L58k50j21J27jM58
7547B82k92K81m00k2Q3N4N28l81k59j00K45K05j10r6l90O42j47r3K97m85k88K81
7569a65N78o86M45k5P1o39M67J3q5L93l35O3m6l99j9M82L27n67L58l20L08o10
7591c91M78J58l80K28j90K47l91L82m2r7k8o6J097r35l96k26N80Q1k57j10L68
7612A10L52q53N41q4l60M23J31p4l59M3o25Q09P4k49K65n03K44k8J37j97P32n41
7634a2J07Q1l63N66o3k45j93m6J87L28j27m63N21q79K45J44N24j91J62L38q79
7655b58M23p78P53j96L11m43n4R03r12J79n28J144l50l68k3j64M63l04P56n61
7675gp3R5j35k04N52jo29J154j074oJ34K07p4l6K29n93R68l19k70o0M60q7p26
$$ plain form
7698 -495 475 91 67 348 -266 169 137 73 -48 69 -54 288 257 13 23 20 111 -156 161 141 34 -193 -25
7721 -25 106 -108 -68 176 473 -71 -33 160 45 301 -344 -99 -93 286 -187 -254 -193 -256 188 -377 171 217 34
7744 34 11 -101 357 -142 188 -201 116 272 145 -278 -31 50 -129 138 -353 225 -5 13 -278 -53 214
7765 214 -560 128 -292 -36 8 255 -207 -412 299 -82 174 108 -202 -127 -376 463 -975 226 141 61 -289
7786 -289 42 -173 287 103 -143 70 -64 220 141 -120 212 2 -140 -289 -313 462 -27 -158 -509 49 240
7807 240 220 -283 -300 -361 -4 -71 -36 274 -55 286 5 -100 -187 -6 64 280 233 -366 36 182 28 -436 86
7830 86 145 -158 309 213 -49 -328 303 -47 444 420 70 367 -23 175 -291 170 131 -87 -40 -376 -49 155
7852 155 346 66 393 -328 -12 126 202 73 41 8 -53 -87 45 -30 407 -266 38 -301 -182 -25 -157 234
$$ packed form
7698d95R70l84k4K81o14M35l2o4j21J17j23L42l1k44J0lR1k67L17k0j07k27J68
7721b5J31k14M0K44K97n44L8J93j15K56o45K45OL79m73o7O1o3M44n65N48M6j83
7744C4k3j12M58m99L30l89L17J56j27m23K47Q1j79K67m91N78k30J8k91K25K67
7765B14p74O88m20K56M4K47m62k05P11l81K56o6l10P5k49Q39j438J201q5q0l50
7786b89L31k15M60j84k46K13j34K84p9k61L32k10j42j49k4P75m89j31l51N58J91
7807B40k0n03j7o1L57o7L5L10l29L41k81j05q7J81P0K16m7n99M02J46j54m64N22
7830H6N9l03M67r6k62k79O31l50M91k4l50K97l90J98m66M61l9k18M7l36L27K04
7852A55J91k80L27p21L16J38P6j29l2l3o1l4J32p5M37o73L04l39J19J57j32L91
$$ plain form
7874 234 -350 68 -71 -244 118 -279 -114 -147 -7 -75 -229 2 431 172 181 229 235 -1 452 -401 92 20 193
7897 193 -169 498 -31 161 115 226 86 -1 -373 13 -34 -136 214 -654 -168 -11 -307 341 37 437 -186
7918 -186 -229 -660 -105 309 166 -16 -221 534 -455 -251 -464 172 67 299 314 299 -143 126 -37 -517 184
7939 184 104 -338 -514 -598 95 -47 134 23 154 -339 29 -68 -404 12 37 220 -115 210 -709 141 -214
7960 -214 21 128 113 74 -94 -200 176 323 43 -55 -167 -166 -8 213 19 264 -413 -134 -201 45 431 -67
7982 -67 -207 -124 102 -222 127 -188 -218 230 64 201 -16 -130 265 -295 -171 -8 -507 104 -80 -199 163
8003 163 -363 -96 -129 222 -366 49 101 -6 72 -333 -1 -306 205 -233 585 -40 29 155 -290 -330 -411 -441
8025 -441 303 401 559 -905 215 414 514 186 162 -101 -612 503 116 -22 -227 -40 71 249 193 116
$$ packed form
7874B34n84M18j39j73L62l97J65l3J40o8j54K31M29k59RM8Ok36M53q53M93p2J73
7897A93l62O67n29J92m6J11j40q7l72L86m7j02L50q68M86J57k96O48l04M00o23
7918a86m3m31N55M14j43j82k05P55r89K04k13O36j05K32J5j5m42K69j63m80P01
7939A84q0m42j76q4O93j42J81j11J31m93L68r7l36M16K5J83l35L25r19Q50l55
7960b14K35J07j5l9j68j06L76J47k80r8j12JJ58K21j94K45o77K79o7K46L86m98
7982f7j40Q3K26l24L49l15l0M48j66J37k17j14L95n60J24J63m99O11j84j19L62
8003A63n26K67l3L51n88M15N2j07P8m05L32l05N11m38Q18o25O9J26m45m0q1l0
8025d41P44R8J58j464J120J99J00l28k4k63n11J115l87j38k05J87J11J78n6p7
$$ plain form
8045 116 824 706 457 -406 732 119 436 159 -671 217 -98 766 -757 51 -942 349 78 -383 -277
8064 -277 -189 271 -591 -2 -54 524 -626 -510 125 -333 447 -356 -238 -18 58 229 -79 -37 -228 569 52
8085 52 268 258 -199 558 44 82 -237 -368 188 -187 -43 -507 128 48 80 -78 645 291 302 -225 18 712
8107 712 -577 162 -107 -139 -107 156 338 -286 201 -96 -544 -25 -127 -347 121 147 -152 59 -199 187 57
8128 57 -550 298 -162 460 118 -527 -21 -33 344 78 24 -438 109 -330 233 121 380 -435 -346 -328 -840 -173
8150 -173 -11 208 173 -31 129 311 52 -349 -106 285 -220 101 6 258 51 53 18 56 56 101 -65 -342 -278
8173 -278 162 -5 -275 2 -650 272 637 -3 338 -391 296 -254 -60 -362 -12 242 -35 -34
$$ packed form
8045A16P08j18k49q63J138o13L17k77q30Q88l15Q64j523Q08r93J291k71m61J06
8064b77Q8M60q62N89n2N78j150J16O35m58P80q03J18K20P6J71l08M2j91P97n17
8085E2K16j0m57P57n14L8l19j31N56l75J44m64O35q0L2j58P23l54J1n27K43O94
8107G12j289P39k69l2L2K63J82o24M87k97m48N19j02k20M68K6k99K11k58L86j30
8128E7o07Q48m60O22l42o45N06j2L77k66n4m62N47m39N63j12K59q15Q9J8n12O67
8150a73J62K19l5k04J60J82k59m01K43L91n05L21r5K52k07Kl5L8%M5j66k77O4
8173b78M40j67k70K77o52R22L65o40L41p29O87n50J94l02L50K54k77J
8191c4
$$ Imaginary data points
##PAGE= N=2
##DATA TABLE= (X++(I..I)), XYDATA
$$ plain form
0 0 0 0 0 0 0 0 0 0 0 0 0 0 0 0 -32 32 -32 32 -32 63 -64 64 -96 96 -128 129 -160 192 -217 247 -282 320 -355
33 -355 408 -452 511 -574 641 -717 799 -892 990 -1095 1213 -1339 1479 -1633 1796 -1981
49 -1981 2178 -2399 2638 -2906 3206 -3540 3918 -4344 4838 -5404 6076 -6882 7860 -9095
63 -9095 10681 -12832 15906 -20698 29262 -49432 198780 151529 -80875 66743 20291 95718
75 95718 -56063 108875 10728 78865 -68671 48129 76077 -49682 71121 -59539 70802
86 70802 -59832 8184 -8698 -10103 24847 -60542 83770 -70464 38341 -51227 34632 -11422
98 -11422 -52349 55338 -49877 42143 -81206 47758 -11970 -16886 -27990 2887 37205 -142723
110 -142723 66836 -34282 21800 -41574 -20059 34122 -68084 10414 -19822 71411 -90165
$$ packed form
0@%%%%%%%%%%%%%%l2O4o4O4o4R5j27J28j60J92k24K57k89L52m09M64n29O02o75
33c55P63q60R63j085J215j358J516j691J882k085K308k552K818l112L429l777
49a981M159m577N037n544O112o746P458q262R182j0242J1480j2958J4742j6955
63i095J9776k3513K8738l6604M9960p8694K48212m7251k32404J47618m6452P5427
75I5718j51781J64938r8147O8137j47536J16800K7948j25759J20803j30660J30341
86G0802j30634O8016j6882j405L4950q5389J44312j54234J08805q9568Q5859m6054
98a1422m0927J07687j05215R2020j23349J28964n9728m916j1104L0877L4318j79928
110a42723K09559j01118N6082o3374K1515N4181j02206P8498l0236R1233j61576
$$ plain form
121 -90165 24554 -18086 -11491 57676 -47973 54582 -56781 41200 -36204 31108 10352
132 10352 -17336 25689 -56026 68559 -54274 47539 -21399 1273 10233 -18532 48874 -59221
144 -59221 52278 -25383 37868 -33611 27142 39666 -49585 52994 -31569 68642 -46113
155 -46113 22726 28068 -8784 2652 -14476 63966 -58892 56002 -34021 16437 1684 -18016
167 -18016 49187 -48512 37677 -44044 30108 -27208 27075 5843 -39243 32912 -52623 57387
179 57387 -39799 22272 -26525 -7941 12237 -36909 39723 -38040 33265 -69955 26528 2961
191 2961 -21307 6186 -39522 49995 -67472 24544 -6931 14431 -28841 -11050 36050 -49288
203 -49288 39288 -39384 43555 -36452 3186 27138 -26054 25750 -27572 43018 -45559 36437
$$ packed form
121i0165J14719m2640O595O9167j05649J02555j11363R7981p7404O7312k0756
132A0352k7688M3025q1715J24585j22833J01813o8938K2672Q960k8765O7406j08095
144e9221J11499p7661O3251p1479O0753J2524q9251J02579q4563J00211j14755
155d6113O8839N342l6852J1436j7128P8442j22858J14894r0023N0458j4753j9700
167a8016O7203r7699Q6189q1721P4152n7316N4283k1232m5086P2155q5535J10010
179E7387r7186O2071m8797J8584K0178m9146P6632p7763P1305j03220R6483k3567
191B961k4268K7493m5708Q9517j17467R2016l1475K1362m3272J7791M7100q5338
203d9288Q8576p8672Q2939q0007L9638K3952n3192N1804n3322P0590q8577Q1996
$$ plain form
215 36437 -8140 8882 9827 -32360 51088 -35826 42750 -26874 27275 -4313 -9166 22094 -8795
228 -8795 52092 -55462 37923 -13969 26349 -2540 -6089 47314 -46881 22048 -17493 52855
240 52855 -32597 4915 12945 -17815 21131 -34891 61441 -46763 11991 -5498 1225 1588 -23949
253 -23949 36027 -43701 27239 -36708 29740 -17855 -17684 17953 -35182 31808 -44579 26382
265 26382 -25698 7222 -20053 -9214 29914 -41028 23692 -40186 34950 -36174 -1347 21812
277 21812 -17475 3962 -37993 50352 -35238 17752 -10996 12869 -2610 -33267 53965 -28904
289 -28904 26820 -25193 28671 -9516 -4771 26814 -13232 29420 -40729 48421 -19112 17144
301 17144 3028 -6678 29356 -28791 36413 -18744 36957 -26611 11572 15118 -5416 24559
$$ packed form
215C6437m4577J7022R45m2187Q3448q6914P8576o9624N4149l1588m853L1260l0889
228h795O0887j07554R3385n1892M0318k8889l549N3403r4195O8929l9541P0348
240E2855q5452L7512Q030l0760L8946n6022R6332j08204N8754j7489O723L63k5537
253b3949N9976p9728P0940o3947O6448m7595J71L5637n3135O6990p6387P0961
265B6382n2080L2920k7275J0839L9128p0942O4720o3878P5136p1124L4827K3159
277B1812l9287K1437m1955Q8345q5590N2990k8748K3865j5479l0657Q7232q2869
289b8904N5724n2013N3864l8187M745L1585m0046M2652p0149Q9150o7533L6256
301A7144j4116r706L6034n8147O5204n5157N5701o3568L8183L546k0534K9975
$$ plain form
313 24559 -32501 50406 -34571 11492 98 17946 1293 -29993 35433 -28022 20401 -30135
325 -30135 37154 -17355 -26048 17793 -20329 19804 -42697 30930 -26095 -2581 -11540 -1488
337 -1488 14537 -42223 27925 -36168 23493 -24466 1004 3744 -19997 13654 -29317 35125
349 35125 -30993 15689 -22025 9448 8580 -27220 34639 -29177 20512 -28984 28911 -151
361 -151 -5435 13523 -12805 26551 -33924 46328 -13217 9302 -847 -1471 23267 -23257 38082
374 38082 -19843 21674 -19936 17823 4100 -11778 28267 -28844 28331 -25735 24615 -9998
386 -9998 1642 9861 -14284 21140 -23638 34147 -29502 19903 -5773 -1454 17585 -19151 25720
399 25720 -29961 26536 -18584 11952 -3364 -1968 7287 -33518 34154 -26449 15317 -22571
$$ packed form
313B4559n7060Q2907q4977M6063j1394J7848j6653l1286O5426o3455M8423n0536
325c0135O7289n4509q693M3841l8122M0133o2501P3627n7025K3514q959J0052
337a488J6025n6760P0148o4093N9661m7959K5470K740k3741L3651m2971O4442
349C5125o6118M6682l7714L1473q68l5800O1859o3816M9689m9496N7895k9062
361a51n284J8958k6328L9356o0475Q0252n9545K2519j0149o24K4738m6524O1339
374C8082n7925M1517m1610L7759j3723j5878M0045n7111N7175n4066N0350l4613
386i998J1640Q219k4145L5424m4778N7785o3649M9405k5676M319J9039l6736M4871
399B5720n5681N6497m5120L0536j5316J396R255m0805O7672o0603M1766l7888
$$ plain form
411 -22571 9434 -4580 -26102 20419 -15581 17084 -40059 25086 -15382 -5861 4637 -11594
423 -11594 20719 -39179 25224 -16566 12039 -13341 763 7860 -23081 22544 -25067 30119
435 30119 -26167 7455 969 -3354 13884 -23683 29088 -20116 16213 -16169 26303 5295
447 5295 -18629 23725 -10281 28292 -28627 31967 1391 -5244 1873 6222 30673 -31628 27483
460 27483 -13225 19025 -15374 6688 21299 -23203 16746 -18654 29154 -20621 13079 -4171
472 -4171 -3075 9008 -23286 30330 -25385 17306 -20376 9471 2073 -16223 12105 -17751 16369
485 16369 -38750 19727 -10222 -3725 -7578 -13907 20569 -38868 15989 -13491 10725 -24571 -2663
498 -2663 13789 -19647 14352 -21616 27918 -28172 7315 4174 -1422 9183 -19599 24908 -18329
$$ packed form
411b2571L2005j4014k1522M6521l6000L2665n7143O5145m0468R521J0498j6231
423a1594L2313n9898O4403m1790K8605k5380J4104P097l0941M5625m7611N5186
435C0119n6286L3622o486m323J7238l7567N2771m9204L6329l2382M2472k1008
447E295k3924M2354l4006L8573n6919O0594l0576o635P117M349K4451o2301N9111
460B7483m0708L2250l4399K2062J4611m4502L9949l5400M7808m9775L3700j7250
472d171J096J2083l2294N3616n5715M2691l7682K9847p398j8296K8328k9856L4120
485A6369n5119N8477k9949O497l853o329L4476n9437N4857k9480K4216l5296K1908
498b663J6452l3436L3999l5968M9534n6090L5487l141n596J0605k8782M4507m3237
$$ plain form
511 -18329 23932 -14005 13414 451 -8233 19212 -16652 30724 -23689 16908 -4729 8524
523 8524 3796 -3746 24211 -25363 22522 -13086 24487 -13127 1893 19339 -15999 16336 -13496
536 -13496 28605 -21295 10928 555 439 6663 -16097 28890 -25355 15768 -14913 8922 -934
549 -934 -7706 13199 -22511 17568 -22790 18891 -15942 2168 -503 -17810 16636 -20241 17148
562 17148 -24845 10132 -12983 -353 4700 -16800 11797 -26558 21653 -23094 10193 -1219
574 -1219 -8165 1804 -15509 23982 -23880 15260 -13685 11803 -6816 -5058 21207 -20954 18985
587 18985 -16121 21394 -12476 7117 8311 -6803 14706 -16468 27027 -20048 17715 -2118
599 -2118 3554 6094 -11567 23709 -15600 20508 -16337 14701 -4146 1897 12875 -13199 22567
$$ packed form
511a8329M2261l7937K7419j2963q684K7445l5864M7376n4413M0597k1637J3253
523H524m728p542K7957m9574M7885l5608L7573l7614J5020J7446l5338L2335k9832
536a3496M2101m9900L2223j0373j16O224k2760M4987n4245M1123l0681K3835r856
549i34o772K0905l5710M0079m0358M1681l4833J8110k671j7307L4446l6877L7389
562A7148m1993L4977k3115J2630N053k1500K8597l8355M8211m4747L3287j1412
574a219o946R969j7313L9491m7862L9140k8945K5488j8619J758K6265m2161L9939
587A8985l5106L7515l3870J9593J194j5114K1509l1174M3495m7075L7763j9833
599b118N672K540j7661L5276l9309L6108l6845L1038j8847O043J0978k6074L5766
$$ plain form
612 22567 -24622 17925 -5974 13511 -4563 -9203 16291 -14755 16512 -16653 23176 -19756
624 -19756 -808 7400 -8271 10837 -22613 20787 -21958 9966 -6399 1416 -2906 -16883 18669
637 18669 -23597 14653 -20364 9778 -9444 -6590 9012 -15505 12030 -24709 17835 -16367
649 -16367 5738 -5610 -5512 14888 -20011 15751 -16998 18685 -12929 2941 4425 -6020 7346
662 7346 -16248 31133 -16936 10142 -4865 6877 4131 -11847 24957 -15155 11453 -12897
674 -12897 22073 -3506 -1733 12902 -10230 16403 -19041 24683 -9585 5196 -1374 3074 15659
687 15659 -15884 17895 -15477 19345 -15714 6447 7073 -8202 9900 -16813 23938 -16010
699 -16010 7218 -9851 8189 -1287 -19050 18888 -15200 12698 -22193 15366 -6579 -12055
$$ packed form
612B2567m7189M2547k3899J9485j8074m640K5494l1046L1267l3165L9829m2932
624a9756J8948Q208j5671J9108l3450M3400m2745L1924j6365P815m322j3977L5552
637A8669m2266L8250l5017L0142j9222K854J5602k4517K7535l6739M2544l4202
649a6367K2105j1348R8K0400l4899L5762l2749L5683l1614J5870J484j0445J3366
662G346k3594M7381m8069K7078j5007J1742k746j5978L6804m0112K6608k4350
674a2897L4970k5579J773J4635k3132K6633l5444M3724l4268J4781o570M448J2585
687A5659l1543L3779l3372L4822l5059K2161O26j5275J8102k6713M0751l9948
699a6010K3228j7069J8040r476j7763L7938l4088K7898l4891L7559k1945n476
$$ plain form
711 -12055 5925 -8362 10624 -27272 15516 -14947 4593 -5842 -3597 8075 -23314 14245
723 14245 -16772 14684 -15096 1234 28 -5820 11186 -16728 20920 -18742 10179 -7561
735 -7561 7678 6943 -14212 15737 -10284 18662 -16524 17098 -1513 -2182 7883 -5084 22217
748 22217 -20747 18793 -6481 8775 -2449 1338 12844 -15407 18094 -14764 17059 -11273
760 -11273 9224 2299 -7870 13207 -15538 17272 -14140 14578 -10229 1452 3288 -8630
772 -8630 14286 -16719 17122 -18254 9243 -4304 -1133 4398 -11961 12777 -19681 16245 -12560
785 -12560 7355 -7470 -5961 8634 -16156 15714 -16567 9856 -14932 5576 -1412 -10856 8991
798 8991 -15971 12670 -21227 14667 -8668 -2887 1093 -8002 11424 -19211 17024 -12285 9405
$$ packed form
711a2055J7980j4287J8986l7896M2788l0463J9540j0435K245J1672l1389L7559
723A4245l1017L1456k9780J6330j206n848J7006k7914L7648l9662K8921j7740
735g561J5239p35k1155K9949k6021K8946l5186L3622j8611o69J0065j2967K7301
748B2217m2964L9540k5274J5256j1224L787J1506k8251L3501l2858L1823k8332
760a1273K0497o925j0169K1077k8745L2810l1412K8718k4807J1681J836j1918
772h630K2916l1005L3841l5376K7497j3547L171N531j6359K4738l2458L5926k8805
785a2560J9915j4825J509J4595k4790L1870l2281K6423k4788K0508o988r444J9847
798H991k4962K8641l3897L5894k3335N781L980r095J9426l0635L6235k9309K1690
$$ plain form
811 9405 -8345 3643 8523 -12273 16901 -13740 17322 -12090 10492 1903 1290 10005 -11677
824 -11677 19392 -13445 17481 -8784 10899 2681 -7355 14428 -7697 17698 -16708 16319
836 16319 -5149 2204 2576 -2040 15190 -21283 16136 -8779 10168 -9470 982 8047 -15019
849 -15019 9907 -12941 15722 -19122 5193 -2846 -4370 4398 -15345 15064 -18272 8850 -12664
862 -12664 6468 -1125 -9813 7247 -13413 15556 -20368 13227 -5292 -767 -3255 -6397 14786
875 14786 -17579 12132 -11036 12314 -12561 792 9464 -11297 9185 -14092 18026 -13732
887 -13732 6196 629 -625 4807 -11567 19378 -13370 14039 -10206 8964 2093 -4714 12652
900 12652 -9062 16665 -14228 14204 -3691 6847 2087 -4826 16030 -14253 15261 -8934
$$ packed form
811I405j7750J1988M880k0796K9174l0641L1062k9412K2582q589o13Q715k1682
824a1677L1069l2837L0926k6265J9683q218j0036K1783k2125K5395l4406L3027
836A6319k1468P353L72m616J7230l6473L7419k4915J8947j9638J0452P065k3066
849a5019K4926k2848K8663l4844K4315q039j524Q768j9743L0409l3336K7122k1514
862a2664J9132p593q688J7060k0660K8969l5924L3595j8519M525k488l142K1183
875A4786l2365K9711k3168K3350k4875J3353Q672k0761K0482k3277L2118l1758
887a3732J9928n567j254N432j6374L0945l2748K7409k4245J9170o871o807J7366
900A2652k1714K5727l0893K8432j7895J0538m760o913K0856l0283K9514k4195
$$ plain form
912 -8934 13697 -6901 280 9477 -7361 11569 -13734 17691 -15105 6705 -705 -988 4208
925 4208 -13498 15463 -16992 9836 -10059 5737 -6036 -7633 8351 -15642 11684 -17288
937 -17288 10414 -12095 49 778 -8977 9228 -16080 11450 -15074 10347 -7409 -426 4541
950 4541 -10578 10816 -14479 16141 -12320 6039 -2231 -39 5402 -10408 16784 -14220 11760
963 11760 -9197 9272 -18 -4030 12089 -11030 12945 -11082 15948 -7476 4242 3792 -4741
976 -4741 11718 -11532 17371 -12043 10724 -4439 2445 6007 -6229 12368 -13350 15824 -11238
989 -11238 9954 -2796 200 6212 -12368 14880 -12200 12473 -10886 7143 -3148 -5601 8941
1002 8941 -10984 12063 -16125 11151 -9972 1169 1202 -6751 5705 -14577 13544 -15786 7002
$$ packed form
912h934K2631k0598P181R197j6838J8930k5303L1425l2796K1810p410k83N196
925D208j7706K8961l2455K6828j9895J5796j1773j597J5984k3993K7326k8972
937a7288K7702k2509J2144P29r755J8205k5308K7530k6524K5421j7756O983M967
950D541j5119K1394k5295L0620k8461J8359q270K192N441j5810K7192l1004K5980
963A1760k0957J8469r290m012J6119k3119K3975k4027K7030k3424J1718m50q533
976d741J6459k3250K8903k9414K2767j5163O884L562j2236J8597k5718K9174k7062
989a1238K1192j2750K996O012j8580K7248k7080K4673k3359J8029j0291k453J4542
1002H941j9925K3047k8188K7276k1123J1141L3p953J2456k0282K8121k9330K2788
$$ plain form
1015 7002 -7446 213 -159 -10982 12764 -14388 9525 -12088 7508 -6246 -3263 6253 -9596
1028 -9596 10593 -14941 13684 -10147 5619 -1853 -3441 8042 -12149 12666 -10145 13454
1040 13454 -9390 3893 3031 -3853 9106 -11396 16943 -12308 8837 -2501 6660 3087 -7668
1053 -7668 15273 -9808 11953 -10085 14074 -2769 -3334 8525 -4230 12963 -13444 15272
1065 15272 -7981 4781 -2404 103 8496 -12469 12439 -10846 12794 -8976 2089 1071 -6789
1078 -6789 5738 -13519 13539 -12466 5520 -8355 2972 410 -12494 9460 -12720 7379
1090 7379 -15378 8560 -4762 -5004 2275 -7712 9335 -17627 11525 -8927 4039 -5318 -2711
1103 -2711 7761 -11019 11963 -9838 12085 -10452 4881 2477 -2386 9101 -11540 15380
$$ packed form
1015G002j4448P659l72j0823K3746k7152K3913k1613J9596j3754K983R516j5849
1028i596K0189k5534K8625k3831J5766p472j588J1483k0191K4815k2811K3599
1040A3454k2844J3283q62o884J2959k0502K8339k9251K1145j1338R161l573j0755
1053g668K2941k5081K1761k2038K4159j6843n65J1859j2755J7193k6407K8716
1065A5272k3253J2762p185K507Q393k0965K4908k3285K3640k1770J1065j018p860
1078f789J2527j9257K7058k6005J7986j3875J1327k562j2904K1954k2180K0099
1090G379k2757K3938j3322k42P279r987J7047k6962K9152k0452J2966r357K607
1103b711J0472j8780K2982k1801K1923k2537J5333k404m863J1487k0641K6920
$$ plain form
1115 15380 -9291 10844 -4206 5192 3752 -7517 11474 -7480 13728 -12737 11027 -548
1127 -548 -160 5237 -4755 13162 -14110 11973 -4974 7622 -3259 -175 9515 -10163 11498
1140 11498 -10277 12408 -8613 3914 1002 -4380 6886 -10519 12522 -12080 7797 -8594
1152 -8594 1010 1839 -8409 7892 -12921 10594 -12853 6734 -4022 -1001 519 -9377 11408
1165 11408 -13029 9819 -9902 4911 -4501 -2933 7386 -10294 8197 -12868 9899 -8630
1177 -8630 4211 -1213 -6330 7252 -10448 11002 -11456 9350 -5815 982 2745 -3694 9258
1190 9258 -11595 13621 -7636 8325 -3152 2688 5948 -7236 12054 -7803 11885 -8878
1202 -8878 8328 -314 -1200 5075 -7519 12524 -10345 11777 -6872 5208 462 -3870 8239
$$ packed form
1115A5380k4671K0135j5050R398j440j1269J8991j8954K1208k6465K3764j1575
1127e48L88N397r992J7917k7272K6083j6947J2596j0881L084R690j9678K1661
1140A1498k1775K2685k1021J2527k912n382J1266j7405K3041k4602J9877j6391
1152h594R604Q29j0248J6301k0813K3515k3447J9587j0756L021J520r896K0785
1165A1408k4437K2848j9721J4813r412J568J0319j7680J8491k1065K2767j8529
1177h630J2841n424n117J3582j7700K1450k2458K0806j5165O797J763o439J2952
1190I258k0853K5216k1257J5961j1477N840L260j3184J9290j9857J9688k0763
1202h878J7206q642q86O275j2594K0043k2869K2122j8649J2080m746m332J2109
$$ plain form
1215 8239 -7399 11461 -12024 10885 -3235 3787 955 -4191 8678 -12225 11592 -7365 6599
1228 6599 -8080 113 4532 -8976 6807 -11788 8879 -12526 3633 -2592 -2744 1313 -10920
1241 -10920 9677 -11712 7307 -9496 3746 -2295 -4923 6014 -9275 10357 -12225 7899
1253 7899 -4579 1801 -1009 -4233 9346 -11001 8599 -8442 9518 -6177 961 6069 -7064
1266 -7064 7324 -8612 13583 -8321 6329 -441 243 5302 -5759 13051 -9807 9570 -6146
1279 -6146 7544 1401 -2515 7694 -6774 11115 -9543 10761 -5178 2578 328 -3192 9973
1292 9973 -9422 9187 -8741 7838 -4762 842 3960 -5630 6219 -10560 11525 -10040 3525
1305 3525 -2052 -948 1741 -9206 9649 -11384 6301 -8490 3815 -4205 -5952 5481 -9443
$$ packed form
1215H239j5638J8860k3485K2909j4120P022k832n146J2869k0903K3817j8957J3964
1228F599j4679Q193M419j3508J5783j8595K0667k1405J6159o225j52M057j2233
1241a0920K0597k1389J9019j6803J3242o041k628J0937j5289J9632k2582K0124
1253G899j2478O380k810l224J3579k0347J9600j7041J7960j5695P138N108j3133
1266g064J4388j5936K2195k1904J4650o770O84N059j1061J8810k2858J9377j5716
1279f146J3690o143l916J0209j4468J7889k0658K0304j5939P756k250l520J3165
1292I973j9395J8609j7928J6579j2600N604L118r590J1849j6779K2085k1565J3565
1305C525n577J104K689j0947J8855k1033J7685j4791J2305q020j747J1433j4924
$$ plain form
1318 -9443 7208 -11787 6732 -7169 1277 -377 -4964 5981 -11093 8558 -8473 8096 -5791
1331 -5791 -212 3130 -5158 7502 -8833 11550 -8344 5140 -895 2251 4703 -7524 11265
1344 11265 -7876 9405 -5904 7148 680 -2521 7333 -3991 10591 -8838 10231 -4364
1356 -4364 3817 1820 -2092 8697 -8090 9403 -7528 7558 -4119 830 2456 -3658 6989
1369 6989 -10319 9735 -7480 4909 -3835 -466 2893 -8296 7968 -9052 7410 -9576 3977
1382 3977 -1771 -4169 4055 -8660 6944 -11405 7275 -6253 1337 -921 -5011 4976 -9337
1395 -9337 9106 -9475 5799 -4680 958 1093 -4748 7848 -9089 7720 -7090 6936 -3529
1408 -3529 -366 4910 -5879 7539 -8736 9981 -6211 3817 -368 -166 5115 -5912 10390
$$ packed form
1318i443J6651j8995J8519j3901Q446j654m587J0945j7074J9651j7031J6569j3887
1331e791N579L342q288J2660j6335K0383j9894J3484o035L146K452j2227J8789
1344A1265j9141J7281j5309J3052o468l201R854j1324J4582j9429J9069j4595
1356d364Q181j997l912J0789j6787J7493j6931J5086j1677M949J626o114J0647
1369F989j7308K0054j7215J2389q744L369L359j1189J6264j7020J6462j6986J3553
1382C977n748k398Q224j2715J5604j8349J8680j3528P590k258m090R987j4313
1395i337J8443j8581J5274j0479N638J35n841J2596j6937J6809j4810J4026j0465
1408c529L163N276j0789J3418j6275J8717j6192J0028m185K02N281j1027J6302
$$ plain form
1421 10390 -7445 8579 -5062 3631 2246 -2568 6715 -7143 10468 -7370 7017 -2889 3373
1434 3373 1279 -4500 9245 -7026 8308 -7186 7273 -3339 -936 4537 -3616 6732 -9233
1447 -9233 9719 -6837 3591 -1714 -519 4425 -9162 7703 -7759 7043 -7514 2318 318
1460 318 -3886 4024 -8908 8172 -9765 3907 -5435 1578 -26 -7264 5094 -7914 5803
1473 5803 -9973 5785 -3252 -3662 1382 -4938 7296 -10490 7417 -5054 3270 -2704 -167 6428
1487 6428 -7624 7498 -6098 8797 -5664 4403 2584 -1405 5920 -6314 10757 -5737 7181
1500 7181 -3084 3880 2704 -3973 8066 -4936 9480 -8029 7100 -563 595 2224 -2622
1513 -2622 9159 -9078 7702 -4044 5568 -3256 -1921 5821 -6964 6226 -7775 7297 -7056
$$ packed form
1421A0390j7835J6024j3641Q693j385m814R283j3858J7611j7838J4387r906O262
1434C373k094n779J3745j6271J5334j5494J4459j0612K403N473q153J0348j5965
1447i233J8952j6556J0428n305J195M944j3587J6865j5462J4802j4557R832k000
1460C18m204P910j2932J7080j7937J3672r342P013j604p238J2358j3008J3717
1473E803j5776J5758r037m10N044o320J2234j7786J7907j2471Q324n974K537O595
1487F428j4052J5122j3596J4895j4461J0067j819l989P325j2234J7071j6494J2918
1500G181j0265O964j176o677J2039j3002J4416j7509J5129p663J158J629m846
1513b622J1781j8237J6780j1746R612q824J335P742j2785J3190j4001J5072j4353
$$ plain form
1526 -7056 1440 -858 -2602 3651 -8566 6438 -9312 5199 -6235 844 260 -5318 3921 -7962
1540 -7962 7321 -8615 4820 -3195 434 1282 -5590 7801 -8204 5324 -6348 5525 -2464
1553 -2464 -1501 3963 -5750 6305 -8497 7800 -6020 2550 -677 -1718 5340 -6287 8241 -7143
1567 -7143 7457 -3558 2785 2624 -1236 7246 -7331 9583 -5205 6207 -1719 2045 3629 -4180
1581 -4180 7631 -5521 8127 -6143 5187 -1430 -609 4262 -4788 7700 -7550 7001 -5132
1594 -5132 3369 -749 -2144 3416 -7383 6735 -8108 5593 -4943 1012 -1071 -4119 5188 -8336
1608 -8336 6414 -7337 3958 -5380 424 2198 -6673 4835 -7688 6970 -8206 3448 -1998
1621 -1998 -1260 1526 -4711 7244 -8018 6283 -5641 3415 -667 -2110 4756 -5799 7305 -7179
$$ packed form
1526g056Q496k298j744O253j2217J5004j5750J4511j1434P079n84n578R239j1883
1540g962J5283j5936J3435q015L629Q48o872J3391j6005J3528j1672J1873p989
1553b464R63N464r713J2055j4802J6297j3820Q570l227j041P058j1627J4528j5384
1567g143J4600j1015O343j61l860Q482j4577J6914j4788J1412p926L764J584p809
1581d180J1811j3152J3648j4270J1330o617Q21M871r050J2488j5250J4551j2133
1594e132Q501m118j395N560j0799J4118j4843J3701j0536N955k083l048R307j3524
1608h336J4750j3751J1295r338N804J774q871J1508j2523J4658j5176J1654n446
1621a998P38K786o237J1955j5262J4301j1924R056m082j443O866j0555J3104j4484
$$ plain form
1635 -7179 6706 -4065 2647 256 -3280 5350 -6859 8048 -6043 6591 -3655 1195 3188
1648 3188 -3904 6402 -5624 9098 -6192 5094 -52 764 3545 -4247 8824 -7366 6381
1661 6381 -3847 5444 -583 -1597 5765 -5027 7354 -7558 6400 -4475 1832 95 -3290
1674 -3290 4825 -7189 5581 -6559 6200 -4890 -453 1151 -5189 4465 -7631 7224 -7542
1687 -7542 2270 -2222 -766 887 -6700 6786 -8526 4762 -6380 3216 -1878 -2845 4278 -5463
1701 -5463 5410 -8230 6233 -4489 1834 -143 -2036 5522 -6732 6877 -5397 5779 -3438
1714 -3438 764 2589 -3006 5571 -7079 7993 -4328 4650 -1454 1324 3008 -4876 8218 -4812
1728 -4812 7059 -5564 4337 -245 -447 5222 -3720 7061 -7179 7307 -3375 2953 133 -1233
$$ packed form
1635g179J3885j0771O712k391l536Q630j2209J4907j4091J2634j0246M850J993
1648C188p092J0306j2026J4722j5290J1286n146Q16K781p792J3071j6190J3747
1661F381j0228R291o027j014P362j0792J2381j4912J3958j0875O307j737l385
1674c290Q115j2014J2770j2140J2759j1090M437J604o340R654j2096J4855j4766
1687g542R812m492J456J653p587J3486j5312J3288j1142R596n094r67P123r741
1701e463J0873j3640J4463j0722O323j977j893P558j2254J3609j2274J1176r217
1714c438M202J825n595Q577j2650J5072j2321Q978o104K778J684p884J3094j3030
1728d812J1871j2623R901m582k02N669q942J0781j4240J4486j0682O328k820j366
$$ plain form
1742 -1233 5103 -6154 6614 -6377 5816 -3533 1668 1670 -3824 4337 -6977 7000 -5484 3127
1756 3127 -4011 -761 1460 -6469 4967 -6647 4417 -8401 2444 -1246 -3414 1430 -6337 5677
1770 5677 -8107 5027 -5442 1644 -1285 -2544 5133 -6846 5941 -6883 5688 -3002 1756
1783 1756 919 -3212 5756 -6675 7436 -5462 5031 -2306 1102 3741 -3851 6764 -5285 7844
1797 7844 -5417 4254 189 612 3710 -4180 8512 -5953 5294 -3568 4470 765 -2163 5210
1811 5210 -5197 6895 -6510 6435 -2917 1243 -160 -3636 6250 -6405 5868 -6112 5409
1824 5409 -2869 -1361 2766 -4606 4389 -7495 7082 -6007 1931 -2759 -1484 1767 -7100 5770
1838 5770 -6929 4629 -7044 2537 199 -3889 2320 -6265 6144 -7452 4810 -3455 970
$$ packed form
1742a233O336j1257J2768j2991J2193r349N201Kn494Q161j1314J3977j2484Q611
1756C127p138L250K221p929J1436j1614J1064j2818J0845l690k168M844p767J2014
1770E677j3784J3134j0469P086k929j259P677j1979J2787j2824J2571q690M758
1783A756q37m131Q968j2431J4111j2898J0493p337L408K639p592J0615j2049J3129
1797G844j3261R671m065M23L098p890J2692j4465J1247q862Q038l705k928P373
1811E210j0407J2092j3405J2945r352M160j403l476R886j2655J2273j1980J1521
1824E409q278J508M127p372Q995j1884J4577j3089P938m690J275L251q867J2870
1838E770j2699J1558j1673R581k338m088O209q585J2409j3596J2262q265M425
$$ plain form
1851 970 -937 -4329 5492 -5818 5512 -7040 6249 -2238 -1216 1758 -2929 6413 -7234 7005
1865 7005 -3991 3148 -2159 1559 5191 -5476 5811 -4802 7356 -4549 3385 1635 -1002
1878 -1002 4556 -5125 7662 -5986 5894 -3163 3518 1583 -3259 5289 -4903 7374 -5821
1891 -5821 6437 -2101 -311 1185 -2797 6722 -7299 6014 -5106 3453 -3124 -994 3759 -6367
1905 -6367 3991 -6815 5952 -6478 1557 -741 -2277 2980 -6926 5443 -7733 4027 -4809
1918 -4809 1312 -476 -4457 3333 -6384 6745 -6699 4083 -3523 210 1031 -4312 6088 -6536
1932 -6536 5829 -5403 4651 -1455 -749 3319 -4221 6916 -5954 7159 -4756 3185 415
1945 415 -673 4252 -4657 7491 -4853 6640 -3005 3028 1486 -2195 5644 -5019 7705 -5292
$$ packed form
1851I70j907l392R821j1310J1330j2552J3289q487J022K974m687R342j3647J4239
1865G005j0996P139n307L718L632j0667J1287j0613J2158j1905P934j750k637
1878a002N558r681J2787j3648J1880r057O681j935m842Q548j0192J2277j3195
1891e821J2258q538J790J496l982R519j4021J3313j1120Q559o577K130M753j0126
1905f367J0358j0806J2767j2430Q035k298j536N257r906J2369j3176J1760q836
1918d809O121j788l981P790r717J3129j3444J0782p606L733Q21n343J0400j2624
1932f536J2365j1232J0054o106P06M068p540J1137j2870J3113j1915P941k770
1945D15j088M925q909J2148j2344J1493r645O033j542l681P839j0663J2724j2997
$$ plain form
1959 -5292 5221 -2410 1938 1161 -3802 5820 -5887 5894 -5759 4784 -1630 -896 2641 -4229
1973 -4229 5573 -6964 6008 -4641 2289 -1771 -2117 3224 -6758 5470 -6657 4325 -5050 846
1987 846 -76 -3457 4074 -6278 4867 -6876 3831 -4167 178 762 -5064 4573 -6355 5936
2001 5936 -6720 3687 -1822 -862 2308 -4483 5778 -6655 5848 -3724 4005 -1021 -954 3934
2015 3934 -5132 6619 -5408 7037 -3449 2610 715 -1375 5471 -4737 6945 -4743 5785
2028 5785 -2683 2132 2904 -2685 5577 -5078 7171 -5916 4415 -286 485 2157 -3716 6391
2042 6391 -6460 5352 -3898 3933 -1649 -1418 3650 -5329 4805 -6429 5873 -4372 1387 -381
2056 -381 -3064 3007 -6445 5344 -6655 4079 -4425 -36 819 -3867 3913 -6973 5557 -7309
$$ packed form
1959e292J0513p631M348p77m963R622j1707J1781j1653J0543o414P34L537o870
1973d229R802j2537J2972j0649O930m060l46N341r982J2228j2127J0982r375N896
1987H46r22l381P531j0352J1145j1743J0707p998M345N84n826R637j0928J2291
2001E936j2656J0407n509R60L170o791J0261j2433J2503r572P729n026O7M888
2015C934r066J1751j2027J2445j0486O059j895k090O846j0208J1682j1688J0528
2028E785q468M815P72n589Q262j0655J2249j3087J0331m701P71J672n873J0107
2042F391j2851J1812r250P831n582K31N068q979J0134j1234J2302j0245N759j768
2056c81k683O071r452J1789j1999J0734q504M389Q55m686P780j0886J2530j2866
$$ plain form
2070 -7309 2793 -2797 14 1432 -5070 5375 -6545 4943 -4699 3553 -1231 -2158 3276 -4338
2084 -4338 5469 -6171 6373 -3850 2170 7 -1398 4814 -5372 6774 -4514 5749 -2830
2097 -2830 2676 1980 -1996 4836 -4948 7287 -4544 4298 -980 1626 2666 -3924 6723 -5268
2111 -5268 5835 -4897 4330 -805 -1253 3448 -4155 5801 -7050 5787 -3371 1760 -1094 -1651
2125 -1651 4122 -6248 5033 -5894 4756 -4980 784 904 -3399 3151 -6943 5486 -6192
2138 -6192 3017 -3596 -289 1571 -5886 4565 -5556 4659 -6834 2913 -989 -2135 1665 -4625
2152 -4625 5709 -6672 4384 -3792 2509 -1354 -1628 3964 -4968 5531 -5627 5206 -2869 1495
2166 1495 1477 -2084 4910 -5296 7051 -4162 4615 -2208 1738 3515 -3583 5604 -4393 7216
$$ packed form
2070g309J0102n590K811J418o502J0445j1920J1488r642Q252m784r27N434p614
2084d338R807j1640J2544j0223O020k163j405O212j0186J2146j1288J0263q579
2097b830N506o96l976O832r784J2235j1831Q842n278K606J040o590J0647j1991
2111e268J1103j0732R227n135m48M701p603R956j2851J2837r158N131k854n57
2125a651N773j0370J1281j0927J0650r736N764J20m303O550j0094J2429j1678
2138f192R209o613L307J860p457J0451j0121J0215j1493R747l902j146L800o290
2152d625J0334j2381J1056q176O301l863k74N592q932J0499j1158J0833q075M364
2166A495j8l561O994j0206J2347j1213Q777o823L946J777p098R187r997J1609
$$ plain form
2180 7216 -4741 3766 741 309 2215 -4032 7335 -5223 5127 -4335 3425 -716 -1845 3468
2194 3468 -3827 5418 -6715 4701 -3435 1180 198 -2726 4200 -6251 4038 -6125 4055 -3205
2208 -3205 -960 1086 -4300 3571 -6189 5541 -5367 1719 -2377 -834 1726 -5244 4683 -5936
2222 -5936 4387 -4825 2295 -690 -2658 2780 -4475 5814 -5735 4248 -2967 1799 52 -2482
2236 -2482 5188 -4638 4885 -4909 4921 -2160 598 2760 -1600 5079 -6140 6153 -3428 3990
2250 3990 -1698 942 4005 -3976 5230 -3920 6144 -4124 3150 306 -832 3149 -3773 6354
2264 6354 -5078 4832 -3158 1621 -213 -2718 3941 -4605 5232 -5717 3148 -3032 -315 1287
2278 1287 -3096 4216 -6853 4308 -4491 2651 -2309 -853 2460 -4828 3217 -5568 4816 -5843
$$ packed form
2180G216j1957Q507l025m32J906o247J1367j2558J0350r462P760m141j129N313
2194C468p295R245j2133J1416q136M615r82k924O926j0451J0289j0163J0180p260
2208c205K245K046n386P871r760J1730j0908P086m096J543K560o970R927j0619
2222e936J0323r212P120k985j968N438p255J0289j1549R983p215M766j747k534
2236b482P670r826R523r794R830p081K758K162m360O679j1219J2293r581P418
2250C990n688K640L063p981R206r150J0064j0268P274k844j138L981o922J0127
2264F354j1432R910p990M779j834k505O659q546R837j0949Q865o180K717J602
2278A287m383P312j1069J1161q799P142m960J456L313p288Q045q785J0384j0659
$$ plain form
2292 -5843 1778 -950 -1683 1670 -5352 5077 -5998 4001 -4093 1379 -329 -3113 3456 -4394 5156
2307 5156 -5510 3823 -1859 1049 857 -3007 5195 -4732 5472 -3924 4735 -1055 336 3075 -3201
2322 -3201 4954 -5213 5957 -3752 3070 624 -134 3013 -4067 6162 -4480 4706 -2932 2734
2336 2734 1120 -1992 3771 -4152 5408 -4695 4111 -2201 1165 349 -3312 4940 -5383 4424 -4963
2351 -4963 3110 -1818 -1135 1075 -3453 4319 -6480 4477 -4509 1205 -2004 -1485 2004 -4670 3913
2366 3913 -6109 3431 -3880 1375 -334 -2231 3344 -4945 4653 -4613 3757 -3225 126 529 -2340
2381 -2340 4335 -4912 4489 -4485 4286 -1630 -96 1912 -3071 4555 -4805 5107 -2882 3097 -958
2396 -958 -161 3406 -3545 5524 -3902 5600 -2684 2139 1323 -1324 3831 -3806 6007 -4391 3864
$$ packed form
2292e843P621k728p33L353p022J0429j1075R999q094N472j708k784O569p850R550
2307E156j0666R333n682K908j92l864Q202r927J0204r396Q659n790J391K739o276
2322c201Q155j0167J1170r709O822k446p58L147p080J0229j0642R186p638N666
2336B734j614l112N763p923R560j0103Q806o312L366q16l661Q252j0323R807r387
2351d963Q073m928O83K210m528P772j0799J0957q986N714l209N19L489o674Q583
2366C913j0022R540p311N255j709j897N575q289R598r266Q370o982L351M03k869
2381b340O675r247R401q974Q771n916J534K008m983P626r360R912p989N979m055
2396i58P97L567o951R069r426R502q284M823q16k647N155p637R813j0398Q255
$$ plain form
2411 3864 -2705 1699 1434 -1990 3938 -4217 5169 -4334 3614 -1653 -170 1055 -3027 4049 -5162
2426 -5162 4158 -3732 2150 -1676 -901 2180 -5029 3374 -5143 4274 -4967 1201 -438 -1916 2261
2441 2261 -4776 4744 -5352 2882 -3132 1126 650 -2565 3282 -4472 4651 -5293 3226 -1732 447
2456 447 717 -2587 4567 -4847 4037 -3595 3129 -1224 -931 2560 -2763 4292 -4116 5772 -2568 1783
2472 1783 514 -85 3418 -3914 5230 -3628 4087 -2965 1782 1793 -2301 3716 -2673 5701 -3710 3121
2488 3121 -1111 885 1254 -3124 4953 -4006 3919 -3533 3877 -866 -1191 2231 -2523 4116 -5424
2503 -5424 3826 -2754 989 -1287 -1929 2456 -4758 3424 -4693 3439 -3644 -22 -77 -2933 2123 -4982
2519 -4982 4588 -4173 2066 -2550 303 747 -3669 3320 -4695 3940 -4598 2623 -662 -630 2010 -2468
$$ packed form
2411C864o569M404k65l424N928q155R386r503P948n267J483J225m082P076r211
2426e162R320p890N882l826P75L081p209Q403q517R417r241O168j639j478M177
2441B261p037R520j0096Q234o014M258m76l215N847p754R123r944Q519m958K179
2456D47K70l304P154r414Q884p632O724m353K93L491n323P055q408R888q340M351
2472A783j269n99L503p332R144q858P715p052M747J1m094O017o389Q374r411O831
2488C121m232J996L69m378Q077q959P925p452P410m743l25L422m754O639r540
2503e424R250o580L743k276o42M385p214Q182q117Q132p083L622n5k856N056p105
2519d982R570q761O239m616K853M44m416O989q015Q635q538P221l285L2K640m478
$$ plain form
2535 -2468 4276 -5110 4094 -2748 2743 -708 -876 3611 -2989 4351 -3179 5268 -2343 1543 730
2550 730 -875 3770 -3586 5539 -2864 3597 -1289 1379 1885 -2128 3923 -4015 4978 -3624 2266
2565 2266 -592 302 1408 -3286 4664 -4590 3349 -3708 2398 -931 -1379 2066 -3835 3480 -4460
2580 -4460 3555 -3008 243 -536 -1942 2327 -4975 3121 -4250 3327 -3290 -439 1053 -2521 2985
2595 2985 -4918 3684 -4580 2183 -961 21 1150 -3746 3522 -4167 3411 -3830 3036 176 -1440
2610 -1440 2377 -2197 4097 -4352 4119 -2300 1473 216 -630 3661 -3420 4092 -2867 4346 -1682
2625 -1682 866 1680 -1226 4113 -3879 4951 -2998 2522 -1206 1103 2474 -2905 4086 -3415 4575
2640 4575 -3069 2222 347 -748 1914 -2776 4329 -4401 3357 -2924 1364 -554 -2192 2642 -4184
$$ packed form
2535b468O744r386R204o842N491l451j68M487o600P340p530Q447p611L886q13
2550G30j605M645p356R125q403O461m886K668N06m013O051p938Q993q602N890
2565B266k858Q94J106m694P950r254P939p057O106l329m48L445n901P315p940
2580d460Q015o563L251p79j406M269p302Q096p371P577o617K851J492l574N506
2595B985p903Q602q264O763l144R82J129m896P268p689P578p241O866k860j616
2610a440L817m574O294q449Q471o419L773j257q46M291p081P512o959P213o028
2625a682K548Q14k906N339p992Q830p949N520l728K309J371n379O991p501P990
2640D575p644N291j875j095K662m690P105q730P758o281M288j918j638M834o826
$$ plain form
2655 -4184 3085 -5151 2945 -2851 -120 -167 -2243 3068 -5113 3528 -4288 2483 -2343 78 1492
2670 1492 -3035 2737 -4639 4090 -3962 1104 -499 -1129 1319 -3939 3683 -3897 3319 -2549 1662
2685 1662 -221 -1630 3079 -3213 4299 -3745 3446 -1705 1294 1254 -1442 3611 -2848 4174 -3313
2700 -3313 3864 -1195 259 2259 -2087 3783 -3550 4888 -3015 2096 -594 349 2071 -2879 4927
2715 4927 -3246 4075 -2532 1937 -619 -1439 2927 -3451 3720 -4366 3387 -2794 771 74 -2318
2730 -2318 3112 -4663 3499 -4461 2331 -2324 -854 337 -3156 2862 -4589 3285 -3490 1687 -1905
2745 -1905 -1124 1358 -3153 3277 -4132 3132 -3171 1795 -641 -1771 2402 -3384 3638 -4110 3258
2760 3258 -1833 1155 676 -1898 3588 -3324 4285 -3145 3939 -1138 949 2301 -887 3714 -3224
$$ packed form
2655d184P269q236Q096n796K731m7k076N311q181Q641p816O771m826K421J414
2670A492m527N772p376Q729q052N066j603o30K448n258P622p580P216n868M211
2685A662j883j409M709o292P512q044P191n151K999m0k696N053o459P022p487
2700c313P177n059J454K000m346N870p333Q438p903N111k690R43J722m950P806
2715D927q173P321o607M469k556q20M366o378P171q086P753o181L565o97k392
2730b318N430p775Q162p960O792m655J470J191l493O018p451P874o775N177l592
2745a905P81K482m511O430p409P264o303M966k436j130M173n786P022p748P368
2760C258n091K988m79k574N486o912P609p430P084n077K087J352l188M601o938
$$ plain form
2775 -3224 4726 -1778 2304 -385 412 2442 -2826 4473 -3132 4185 -2764 1631 524 -1727 2523
2790 2523 -3348 4074 -4240 2961 -1923 1176 367 -2113 3173 -3595 2913 -3944 2910 -1474 -256
2805 -256 585 -2481 2803 -5156 3141 -3961 1605 -1942 -1069 1885 -3427 2527 -4328 3170 -3647 878
2821 878 -359 -1227 1670 -3442 3568 -3640 2375 -2352 1973 156 -2360 2549 -2992 4101 -3984
2836 -3984 3143 -852 906 1087 -2128 3969 -4129 3880 -2394 3067 -1162 183 2790 -2138 3713
2851 3713 -3326 4564 -2556 2041 -316 523 2591 -3055 4308 -3125 3338 -2339 1608 164 -1937
2866 -1937 3330 -3278 3622 -3806 2651 -1374 589 513 -2960 3526 -3607 3084 -3535 2528 -1578
2881 -1578 -942 820 -2828 2705 -4328 3865 -3319 756 -1532 -1112 1807 -4171 3264 -3742 2899
$$ packed form
2775c224P950o504M082k689P97K030n268P299p605P317o949M395j107k251M250
2790B523n871P422q314P201m884L099q09k480N286o768O508o857O854m384J218
2805b56Q41l066N284p959Q297p102N566l547Q73K954n312N954o855P498o817M525
2821H78j237q68K897n112P010p208O015m727M325j817k516M909n541P093q085
2836c984P127l995J758J81l215O097q098Q009o274N461m229J345K607m928N851
2851C713p039P890p120M597k357Q39K068n646P363p433O463n677L947j444k101
2866a937N267o608O900p428O457m025J963p6l473O486p133O691o619O063m106
2881a578O36J762l648N533p033Q193p184M075k288M20K919n978P435p006O641
$$ plain form
2896 2899 -3119 900 423 -1683 2146 -4271 3993 -3871 2551 -1339 532 461 -2296 3353 -3007 4047
2912 4047 -3110 3314 -724 -128 959 -1805 4042 -4140 3775 -1761 2290 -1281 -497 3320 -2399
2927 -2399 3665 -3598 4619 -1791 1408 1109 82 3063 -3070 4039 -3226 2753 -1978 653 748 -2328
2943 -2328 2868 -3759 3585 -4182 2493 -1114 -75 368 -2506 3567 -3916 2408 -3308 2204 -1545
2958 -1545 -1146 2212 -3371 2973 -4015 3320 -3231 312 -748 -1265 2428 -3936 3428 -3565 3115
2973 3115 -2569 252 142 -2557 2224 -4138 3961 -3902 2219 -1345 433 920 -2656 3569 -3061
2988 -3061 3347 -2107 3186 -324 -317 3022 -1562 3480 -3491 3504 -1196 1608 -164 -422 3367 -2196
3004 -2196 4780 -1910 3674 -1569 503 1076 -703 2976 -3282 3849 -2692 2462 -1757 710 973
$$ packed form
2896B899o018M019m77k106L829o417Q264p864O422l890J871p1k757N649o360P054
2912D047p157O424m038N96J087k764N847q182P915n536M051l571P84L817n719
2927b399O064p263Q217o410L199k99j027K981o133P109p265N979m731K631R5l076
2943b328N196o627P344p767O675l607J039M43k874O073p483O324n716N512l749
2958a545L99L358n583O344o988P335o551L543j060n17L693o364P364o993O680
2973C115n684K821j10k699M781o362Q099p863O121l564J778M87l576O225o630
2988c061O408n454N293l510PL339m584N042o971O995m700K804j772k58L789n563
3004b196O976o690N584n243K072N73j779L679o258P131o541N154m219K467K63
$$ plain form
3019 973 -2680 2989 -3375 3199 -3765 2483 -786 -1214 1048 -2993 2924 -4405 2778 -2606 1182
3034 1182 -1071 -1754 2196 -3469 3062 -3387 2956 -2322 390 -577 -1917 2279 -4207 3031 -2983
3049 -2983 1193 -2177 -209 1458 -2871 2145 -3360 3216 -2729 2027 -402 -552 660 -1920 3438
3064 3438 -3121 4288 -2226 2457 3 -927 2975 -2449 3926 -2915 3442 -1302 1404 780 -920
3079 -920 3039 -2758 4247 -3281 2987 -1389 953 1112 -2124 2831 -3205 4264 -3023 1949 -536
3094 -536 -270 1709 -2960 3816 -4117 2855 -2858 1519 -1020 -2274 1531 -3804 2839 -3465 3564
3109 3564 -2056 562 -601 -1795 1862 -3590 2532 -3291 2362 -2485 355 405 -2482 2535 -3438
3124 -3438 3158 -3629 1773 -1353 345 1472 -2839 3177 -3434 3254 -2814 2286 -591 -1077 1932
$$ packed form
3019I73l653N669o364O574o964O248l269m28K262m041N917p329P183n384L788
3034A182k253o83L950n665O531o449O343n278K712r67j340M196o486P238o014
3049b983M176l370J968J667m329N016n505O576n945M756k429j50J212k580N358
3064C438o559P409o514M683k454r30L902n424O375o841O357m744K706o24j700
3079i20L959n797P005p528O268m376K342J59l236M955o036P469p287M972k485
3094e36K66J979m669O776p933O972n713M377k539j254L805n335O643o304P029
3109C564n620K618j163j194L657n452O122n823N653m847K840N0k887N017n973
3124c438O596o787N402l126J698J127m311O016o611O688o068N100k877m86L009
$$ plain form
3139 1932 -2252 3513 -3137 3095 -1429 1430 596 -921 3310 -3576 3783 -3111 3353 -2008 938
3154 938 1846 -1647 2681 -3686 3804 -2367 2333 -1019 398 1783 -2634 3453 -3693 3014 -3006
3169 -3006 1512 -124 -763 1137 -2361 3688 -3656 2438 -2276 961 -1221 -1642 1967 -3192 3001
3184 3001 -3711 2546 -2322 -37 249 -2301 1840 -4342 3024 -3081 1837 -1398 -582 1402 -3001
3199 -3001 2540 -3203 2852 -2650 1121 -779 -527 1487 -3050 3653 -3418 2081 -2501 1764 62
3214 62 -830 2676 -2773 3011 -2897 2822 -1513 777 1174 -817 3420 -3011 3640 -2010 2537 -1011
3230 -1011 292 1411 -1794 3141 -2836 3794 -2762 1879 -80 -353 1737 -2778 3099 -3040 2309
3245 2309 -3046 1269 -201 -1680 1576 -2723 2570 -3816 2337 -1750 215 93 -1741 2622 -3904
$$ packed form
3139A932m184N765o650O232m524K859q34j517M231o886P359o894O464n361K946
3154I38R08l493M328o367P490o171M700l352J417J385m417O087p146O707o020
3169c006M518j636o39J900l498O049p344O094m714L237k182m21L609n159O193
3184C001o712O257m868K285K86k550M141o182P366o105M918l235Q16J984m403
3199c001N541n743O055n502L771j900K52K014m537O703p071N499m582M265j702
3214F2q92L506n449N784n908N719m335K290L97j991M237o431O651n650M547l548
3230a011J303J119l205M935n977O630o556M641j959k73K090m515N877o139N349
3245B309n355M315j470j479L256m299N293o386O153m087J965j22j834M363o526
$$ plain form
3260 -3904 2536 -3213 1660 -1919 -38 1110 -2290 2418 -3722 2836 -2482 578 -1469 -147 1635
3275 1635 -2898 2981 -2825 2705 -2815 1311 254 -1066 1949 -2571 3850 -3119 2250 -1012 1518
3290 1518 197 -1541 3084 -2558 3815 -2293 2635 -1212 189 1345 -1441 3467 -3348 3007 -1565
3305 -1565 1928 -206 -139 2094 -1954 2930 -2530 3373 -2481 1255 29 -458 1397 -2948 3309 -2806
3321 -2806 2397 -1661 653 301 -2278 1856 -2907 2921 -3592 1761 -1522 -57 543 -1969 2718
3336 2718 -3748 2522 -2689 2084 -1141 -750 1463 -1958 2030 -3783 2047 -2731 276 -376 -517 1564
3352 1564 -3101 2888 -2863 2327 -2205 609 763 -1230 1782 -2232 3330 -2797 2327 -1193 386
3367 386 747 -1175 2383 -2629 2884 -2304 2175 -605 68 2081 -1580 3230 -2939 2946 -1424 1863
$$ packed form
3260c904O440n749M873l579J881J148l400M708o140O558n318L060k047J322J782
3275A635m533N879n806N530n520M126j057j320L015m520O421o969N369l262K530
3290A518j321j738M625n642O373o108M928l847J401J156k786M908o815O355m572
3305a565L493k134O7K233m048M884n460N903n854L736j226m87J855m345O257o115
3321b806N203m058K314l52k579M134m763N828o513N353l283J465O00k512M687
3336B718o466O270n211M773l225L91K213l421L988n813N830m778L007o52j41K081
3352A564m665N989n751N190m532K814J54j993L012m014N562o127N124l520J579
3367C86L61j922L558n012N513n188M479k780O73K013l661M810o169N885m370L287
$$ plain form
3383 1863 208 -37 1803 -2271 3077 -2179 2459 -1454 1283 577 -672 2352 -2821 2642 -3515
3398 -3515 2286 -1645 127 523 -1926 2096 -2771 2582 -3227 2053 -1317 -375 527 -2131 1766 -3367
3414 -3367 2030 -2406 1115 -930 -809 1609 -2616 2680 -3055 2364 -2154 545 293 -1224 1632
3429 1632 -2707 3020 -2006 2136 -1255 1122 754 -1657 2349 -2030 2730 -2454 2608 -492 -93
3444 -93 997 -1874 3286 -2944 2567 -1713 1772 -142 -375 2113 -1871 2367 -2598 2857 -1528 520
3460 520 615 -935 1792 -2120 2997 -2216 2136 -901 692 879 -1828 1881 -2873 2858 -2007 1069
3476 1069 -795 -496 -183 -1899 2016 -2539 1996 -2600 1017 -954 -1521 1050 -2321 2052 -2987 2295
3492 2295 -1409 648 -211 -974 1469 -2824 2896 -2527 2061 -1840 180 746 -1411 2444 -2148 3158
$$ packed form
3383A863j655k45J840m074N348n256M638l913K737p06j249L024n173N463o157
3398c515N801l931J772L96k449M022m867N353n809N280l370R42R02k658L897n133
3414c367N397m436L521k045J21K418m225N296n735N419m518K699k52j517K856
3429A632m339N727n026M142l391K377l68k411M006m379M760n184N062l100L99
3444i3J090k871N160o230N511m280L485j914k33K488l984M238m965N455m385K048
3460E20R5j550K727l912N117n213M352l037J593J87k707L709m754N731m865L076
3476A069j864K99L13j716L915m555M535m596L617j971n67K571l371M373n039N282
3492B295l704K057q59p63K443m293N720n423M588l901K020N66k157L855m592N306
$$ plain form
3508 3158 -1885 1639 -886 66 545 -1420 2708 -2231 2268 -1982 1523 -393 -184 1439 -1521 2560
3524 2560 -2112 3373 -567 1352 -51 -325 1521 -2770 3168 -2829 3562 -1442 584 682 -1263 2432
3540 2432 -2089 2619 -2530 1979 -680 1138 449 -2263 2257 -1815 2028 -3013 1078 -393 -716
3555 -716 527 -1592 2091 -3531 1453 -1741 87 -691 -490 1620 -3063 1605 -2440 2253 -1480 -489
3571 -489 -543 -1744 2113 -3254 2161 -2868 1519 -1205 52 477 -1321 1719 -3055 3009 -2497 1570
3587 1570 -22 -124 1166 -1417 2594 -2110 2204 -1714 1749 79 -96 2279 -1716 2638 -2579
3602 -2579 3285 -1445 658 213 -942 1791 -2161 1687 -1842 1694 -1462 166 1110 -1560 1070
3617 1070 -2958 1313 -2114 686 -696 -229 180 -3075 2651 -2492 1349 -1866 1030 -802 -988 1147
$$ packed form
3508C158n043L524k525R52M79j965M128m939M499m250L505j916K09J623k960M081
3524B560m672N485l940J919j403k74J846m291N938n997O391n004K026R8j945L695
3540B432m521M708n149M509k659J818o89k712M520m072L843n041M091j471l23
3555g16J243k119L683n622M984l194J828p78K01K110m683M668m045M693l733R91
3571d89n4j201L857n367N415n029M387k724J257M25j798L040m774O064n506M067
3587A570j592j02J290k583M011m704M314l918L463j670j75K375l995M354n217
3602b579N864m730K103m45j155K733l952L848l529L536l156J628R44k670K630
3617A070m028M271l427K800j382M67M09l255N726n143L841l215K896j832j86K135
$$ plain form
3633 1147 -1895 1818 -2762 1097 -1288 180 -663 -1217 1873 -3621 1447 -2702 1716 -1036 -5
3648 -5 494 -1280 1919 -2784 2236 -2070 1443 -849 -503 1135 -1458 2344 -1910 2450 -1682 904
3664 904 220 -245 1787 -1416 3123 -2108 2110 -912 1154 386 -1041 1991 -1906 2503 -2404 1427
3680 1427 -995 463 296 -970 2198 -2524 2647 -1547 1494 -1049 -298 1627 -1903 2577 -2180
3695 -2180 1895 -2441 615 -44 -790 1044 -1978 2302 -2396 1815 -1746 627 406 -1138 1387 -2655
3711 -2655 1737 -2244 1365 -1600 -388 432 -2099 2060 -2449 2056 -2134 1221 -894 -734 1096
3726 1096 -1452 2277 -2170 1764 -1438 629 -385 -343 965 -1812 2970 -1836 2090 -862 965
3741 965 899 -625 1839 -1601 2535 -1612 1855 -622 562 458 -705 2442 -1942 2655 -1368 1658
$$ packed form
3633A147l042L713m580L859k385J468q43n54L090n494N068m149M418k752J031
3648eM99j774L199m703N020m306L513k292L46J638k593L802m254M360m132K586
3664I04o84m65K032l203M539n231M218l022K066p68j427L032l897M409m907L831
3680A427k422J458j67j266L168m722N171m194L041k543P51J925l530M480m757
3695b180M075m336L056o59p46J834l022M280m698M211l561K373k21j544K525m042
3711b655M392l981L609k965J212Q20k531M159m509M505m190L355k115J60J830
3726A096k548L729m447L934l202K067j014M2J308k777M782m806L926k952J827
3741I65o6j524K464l440M136m147L467k477J184j04j163L147m384M597m023L026
$$ plain form
3757 1658 -596 -19 1140 -1076 2036 -2474 1882 -1978 1179 -429 71 1187 -2374 2090 -2533
3772 -2533 1834 -1869 465 -254 -1346 1028 -1939 2049 -2469 1650 -1615 23 12 -1908 1427 -2236
3788 -2236 1960 -2694 1346 -1111 -244 471 -1657 2104 -2170 1949 -1366 528 -706 -547 1246 -2048
3804 -2048 1998 -1853 2074 -1506 459 553 -135 888 -2003 2439 -1505 1866 -874 510 551 -1210
3820 -1210 1938 -1700 2739 -1449 1761 -226 -490 1146 -1567 2113 -1842 2083 -1561 989 -909
3835 -909 -374 1192 -1423 2352 -1940 2048 -1758 947 -345 -675 1551 -2135 2410 -2492 1633 -899
3851 -899 846 558 -1683 1733 -1835 2345 -2017 1649 -737 -224 182 -1852 1451 -2833 1468 -1629
3867 -1629 667 -897 -848 864 -2000 2001 -1765 1770 -1937 821 -402 -624 1312 -2036 2090 -1829
$$ packed form
3757A658k254N77J159k216L112m510M356l860L157j608N00J116l561M464m623
3772b533M367l703K334p19j092K374k967L988m518M119l265J638j1j920L335l663
3788b236M196m654M040k457Q67P15k128L761m274M119l315J894j234J59J793l294
3804b048M046l851L927l580J965R4o88J023k891M442l944L371k740J384M1j761
3820a210L148l638M439m188L210j987k64J636k713L680l955L925l644K550j898
3835i09N35J566k615L775m292L988l806K705j292l30K226l686M545m902M125k532
3851h99J745k88k241L416l568M180m362L666k386N13M06k034L303m284M301l097
3867a629K296j564M9J712k864M001l766L535l707K758j223k22J936l348M126l919
$$ plain form
3883 -1829 1578 -1530 704 532 -1065 1177 -1423 2230 -1882 1715 -425 790 653 -1185 2220
3898 2220 -2051 2011 -1432 2291 -652 -434 768 -1414 2075 -2653 2059 -820 1035 252 -543 1518
3914 1518 -1365 2279 -1759 1837 -1808 -130 668 -886 1686 -1475 2211 -2494 1086 -748 200
3929 200 714 -1849 1868 -1689 1560 -1997 1154 -703 -967 840 -1377 1632 -2636 2145 -856 446
3945 446 -760 -309 1043 -1730 1506 -2261 1529 -1638 475 514 -867 1666 -2053 2133 -1802 1891
3961 1891 -424 791 974 -986 2227 -1355 1845 -1146 1389 230 -56 441 -1154 2853 -1861 2125
3977 2125 -779 1448 -335 196 1559 -1733 2980 -2025 1525 -1041 318 1254 -350 1446 -1570
3992 -1570 2313 -1994 2058 -1330 995 444 -1081 1408 -1642 1863 -1847 824 -1228 -338 807
$$ packed form
3883a829L407l108K234j72j597K242k600L653m112L597k140J215j37j838L405
3898B220m271M062l443L723k943K18J202k182L489m728M712k879J855p83p95K061
3914A518k883L644m038L596l645J678P98j554K572l161L686m705L580j834R48
3929B00N14k563L717l557L249l557L151j857k64J807k217L009m268M781l001J302
3945D46j206M51J352k773L236l767L790l167K113L9j381K533l719M186l935L693
3961A891k315J215J83j960L213l582L200k991K535j159k86M97j595M007m714L986
3977B125k904K227j783N31J363l292M713n005L550k566J359R36j604J796l016
3992a570L883m307M052l388K325n51j525K489l050L505l710K671k052Q90J145
$$ plain form
4007 807 -1540 1918 -1718 2076 -1712 -27 -575 -657 1101 -1643 1559 -2511 2054 -1020 807 44
4023 44 -1155 1214 -1701 1915 -1875 1912 -1122 382 1212 -964 2044 -2219 1816 -1465 1274 138
4039 138 436 1202 -1548 2473 -2171 2260 -457 1809 70 -751 1634 -1775 1782 -1795 2498 -829
4055 -829 555 -43 203 1992 -1746 1762 -1549 1519 -1419 272 638 -469 1592 -2305 2122 -1373
4071 -1373 1041 -997 -115 768 -1151 1590 -2368 2091 -1920 814 -492 -194 1105 -1766 2373 -1851
4087 -1851 891 -1488 136 510 -1793 1330 -2467 1316 -1929 948 -1577 291 942 -1089 846
4102 846 -1483 2501 -1750 1294 -957 -403 1250 -1640 1520 -1288 1838 -839 745 730 -489 868
4118 868 -1186 1659 -882 1564 -980 812 666 -597 1553 -1845 2319 -2065 1483 -945 371
$$ packed form
4007H07k347L458l636L794l788J685n48q2J758k744L202m070M565l074J827p63
4023D4j199K369k915L616l790L787l034J504Q30k176L008m263M035l281K739j136
4039A38K98P66k750M021m644M431k717K266j739q21K385l409L557l577M293l327
4055h29J384n98K46J789l738L508l311L068k938J691L66j107K061l897M427l495
4071a373K414k038Q82Q83j919K741l958M459m011K734j306K98J299k871M139m224
4087a851K742k379J624L74k303L123l797L783l245K877k525J868O51k031J935
4102H46k329L984m251L044k251N54J653k890L160k808L126k677J584j5j219J357
4118H68k054K845k541K446k544J792j46j263K150l398M164m384L548k428J316
$$ plain form
4133 371 1126 -614 2695 -2118 2358 -1330 592 -829 1291 1273 -1607 1638 -1826 2596 -1544 707
4149 707 -1441 -398 242 -1426 1577 -583 2336 -2133 888 -220 -758 549 -2106 2111 -1765 1113
4165 1113 -1458 -542 664 -1133 1294 -2112 2058 -1528 766 -1004 -40 883 -859 1256 -1441 1973
4181 1973 -1044 659 -362 -81 932 -1018 1792 -763 1657 -1120 851 59 -72 981 -926 2457
4197 2457 -1450 1921 -1570 695 120 -776 1673 -1512 1812 -1526 2064 82 -77 -15 -518 1894
4213 1894 -1764 2276 -1358 1458 -563 -7 981 -2088 1465 -1567 2015 -1083 1206 -591 -669 220
4229 220 -1969 920 -1951 1376 -1032 768 -328 -942 1007 -2436 1124 -2254 892 -786 -855 940
4245 940 -1451 1566 -1485 2350 -1431 949 -862 -586 1455 -1660 1734 -2036 2255 -1032 325
$$ packed form
4133C71P55j740L309m813M476l688J922j421K120j8k880L245l464M422m140K251
4149G07k148J043O40j668L003k160K919m469L021j108n38J307k655M217l876K878
4165A113k571R16J206j797K427l406M170l586K294j770R64R23j742K115k697L414
4181A973l017J703j021K81J013j950K810k555K420k777J971p92j31J053j907L383
4197B457l907L371l491K265n75q96K449l185L324l338L590j982j59O2n03K412
4213A894l658M040l634K816k021N56R88l069L553l032L582l098K289j797p8Q89
4229B20k189K889k871L327k408J800j096o14J949l443L560l378L146j678o9J795
4245I40k391L017l051L835l781K380j811K76K041l115L394l770M291l287J357
$$ plain form
4260 325 542 -713 1228 -1510 1790 -1372 1281 -1463 931 297 -1569 937 -1087 2388 -1218 1871
4276 1871 -487 415 330 -1261 1606 -1639 2128 -1593 1290 -48 -606 1230 -1176 1285 -1752 2413
4292 2413 -1060 584 -1006 -431 661 -1284 1627 -1727 1215 -1297 769 -475 -761 866 -1516
$$ packed form
4260C25K17j255J941k738L300l162K653k744K394o34j866K506k024L475l606L089
4276A871k358R02q5j591K867l245L767l721K883j338n58J836k406K461l037M165
4292B413l473J644j590N75J092j945K911l354K942k512K066j244k86J627k382
$$ [...]
8191b05
##END NTUPLES=NMR FID
##END=
