##TITLE=1H_CG-1042-c
 200.13MHz,CDCl3,
 8 sc
 
 4.8.2025
##JCAMPDX= 6.0         $$ Bruker NMR JCAMP-DX V2.0
##DATA TYPE= NMR SPECTRUM
##DATA CLASS= NTUPLES
##ORIGIN= UXNMR, Bruker Analytische Messtechnik GmbH
##OWNER= pz
$$ XWIN-NMR		Version 3.5
$$ Mon Aug  4 14:14:28 2025 Russian Standard Time (UT+4h)  she@DPX200
##.OBSERVE FREQUENCY= 200.1313
##.OBSERVE NUCLEUS= ^1H
##.ACQUISITION MODE= SIMULTANEOUS
##.ACQUISITION SCHEME= undefined
##.AVERAGES= 8
##.DIGITISER RES= 18
##SPECTROMETER/DATA SYSTEM= spect
##.PULSE SEQUENCE= zg30
##.SOLVENT NAME= CDCl3
##.SHIFT REFERENCE= (INTERNAL, CDCl3, 0, 15.5309)
##AUDIT TRAIL= $$ (NUMBER, WHEN, WHO, WHERE, WHAT)
$$ ##TITLE= Audit trail, XWIN-NMR		Version 3.5
$$ ##JCAMPDX= 5.01
$$ ##ORIGIN= Bruker BioSpin GmbH
$$ ##OWNER= she
$$ F:/spectra/data/she/nmr/H-C/1/pdata/1/auditp.txt
$$ ##AUDIT TRAIL=  $$ (NUMBER, WHEN, WHO, WHERE, WHAT)
(   1,<2025-08-04 14:13:01.81 +0400>,<she>,<DPX200>,
      <created by zg, POWCHK disabled, PULCHK disabled
       configuration hash MD5:
       00 E9 B6 7A A2 85 ED C7 34 08 36 98 17 FE 4E 26
       data hash MD5: 16K
       CB 10 C3 45 11 BA 92 9A AA 73 28 A5 28 FC 8E 64>)
(   2,<2025-08-04 14:13:03.90 +0400>,<she>,<DPX200>,
      <Start of raw data processing
       efp BC_mod = 2 LB = 0.25 FT_mod = 6 PKNL = 1 PHC0 = -1082.354 PHC1 = -134.4079 SI = 16K 
       data hash MD5: 16K
       9D 81 25 1C 86 01 32 47 CA A2 CD 53 34 76 7A 15>)
(   3,<2025-08-04 14:13:39.10 +0400>,<she>,<DPX200>,
      <pk PHC0 = -120.4958 PHC1 = 152.0002 
       data hash MD5: 16K
       E1 7B 72 4F 4F DC ED 93 7F 17 97 8B 89 A2 A5 C5>)
(   4,<2025-08-04 14:13:44.15 +0400>,<she>,<DPX200>,
      <abs ABSG = 5 
       data hash MD5: 16K
       C0 92 A4 DD 93 B1 A7 3D 66 30 5F F8 51 34 64 A0>)
$$ ##END=
$$ 
$$ hash MD5
$$ 39 88 E9 E1 F5 A8 13 57 E6 38 5F EE 9E 22 FC FE
##$RELAX= 
##$RELAX= 
##$RELAX= 
##$RELAX= 
##$RELAX= 
##$RELAX= 
$$ Bruker specific parameters
$$ --------------------------
##$DU= <F:/spectra>
##$EXPNO= 1
##$NAME= <H-C>
##$PROCNO= 1
##$TYPE= <nmr>
##$USER= <she>
##$AMP= (0..31)
100 100 100 100 100 100 100 100 100 100 100 100 100 100 100 100 100 100 
100 100 100 100 100 100 100 100 100 100 100 100 100 100 
##$AQSEQ= 0
##$AQ_mod= 1
##$AUNM= <au_zg>
##$AUTOPOS= <>
##$BF1= 200.13
##$BF2= 200.13
##$BF3= 200.13
##$BF4= 200.13
##$BF5= 200.13
##$BF6= 200.13
##$BF7= 200.13
##$BF8= 200.13
##$BYTORDA= 1
##$CFDGTYP= 0
##$CFRGTYP= 5
##$CHEMSTR= <none>
##$CNST= (0..31)
1 1 145 1 1 1 1 1 1 1 1 1 1 1 1 1 1 1 1 1 1 1 1 1 1 1 1 1 1 1 1 1 
##$CPDPRG= <>
##$CPDPRG1= <>
##$CPDPRG2= <>
##$CPDPRG3= <>
##$CPDPRG4= <mlev>
##$CPDPRG5= <mlev>
##$CPDPRG6= <mlev>
##$CPDPRG7= <mlev>
##$CPDPRG8= <mlev>
##$CPDPRGB= <>
##$CPDPRGT= <>
##$D= (0..31)
0 0.7 0 0 0 0 0 0 0 0 0 0.03 0 0 0 0 0 0 0 0 0 0 0 0 0 0 0 0 0 0 0 0 
##$DATE= 1754302380
##$DBL= (0..7)
120 120 120 120 120 120 120 120 
##$DBP= (0..7)
150 150 150 150 150 150 150 150 
##$DBP07= 0
##$DBPNAM0= <>
##$DBPNAM1= <>
##$DBPNAM2= <>
##$DBPNAM3= <>
##$DBPNAM4= <>
$$ [...]
##$SUBNAM3= <"">
##$SUBNAM4= <"">
##$SUBNAM5= <"">
##$SUBNAM6= <"">
##$SUBNAM7= <"">
##$SUBNAM8= <"">
##$SUBNAM9= <"">
##$SW= 18.0517328524113
##$SWIBOX= (0..15)
0 0 2 0 0 0 0 0 0 0 0 0 0 0 0 0 
##$SW_h= 3612.71676300578
##$TD= 16384
##$TD0= 1
##$TE= 0
##$TE2= 300
##$TE3= 300
##$TEG= 300
##$TL= (0..7)
0 120 120 120 120 120 120 120 
##$TP= (0..7)
150 150 150 150 150 150 150 150 
##$TP07= 0
##$TPNAME0= <>
##$TPNAME1= <>
##$TPNAME2= <>
##$TPNAME3= <>
##$TPNAME4= <>
##$TPNAME5= <>
##$TPNAME6= <>
##$TPNAME7= <>
##$TPOAL= (0..7)
0.5 0.5 0.5 0.5 0.5 0.5 0.5 0.5 
##$TPOFFS= (0..7)
0 0 0 0 0 0 0 0 
##$TUNHIN= 0
##$TUNHOUT= 0
##$TUNXOUT= 0
##$USERA1= <user>
##$USERA2= <user>
##$USERA3= <user>
##$USERA4= <user>
##$USERA5= <user>
##$V9= 5
##$VALIST= <valist>
##$VCLIST= <CCCCCCCCCCCCCCC>
##$VD= 0
##$VDLIST= <DDDDDDDDDDDDDDD>
##$VPLIST= <PPPPPPPPPPPPPPP>
##$VTLIST= <TTTTTTTTTTTTTTT>
##$WBST= 1024
##$WBSW= 4
##$XGAIN= (0..3)
0 0 0 0 
##$XL= 0
##$YL= 0
##$YMAX_a= 657549
##$YMIN_a= -721231
##$ZGOPTNS= <>
##$ZL1= 120
##$ZL2= 120
##$ZL3= 120
##$ZL4= 120
##$ABSF1= 15.47364
##$ABSF2= -2.578209
##$ABSG= 5
##$ABSL= 3
##$ALPHA= 0
##$AQORDER= 0
##$ASSFAC= 0
##$ASSFACI= 0
##$ASSFACX= 0
##$ASSWID= 0
##$AUNMP= <proc_1d>
##$AZFE= 0.1
##$AZFW= 0.1
##$BCFW= 0
##$BC_mod= 2
##$BYTORDP= 0
##$COROFFS= 0
##$CY= -3
##$DATMOD= 1
##$DC= 0
##$DFILT= <>
##$DTYPP= 0
##$F1P= 0
##$F2P= 0
##$FCOR= 1
##$FTSIZE= 16384
##$FT_mod= 6
##$GAMMA= 0
##$GB= 0
##$INTBC= 1
##$INTSCL= 3.241238e-09
##$ISEN= 128
##$LB= 0.25
##$LEV0= 0
##$LPBIN= 0
##$MAXI= 10000
##$MC2= 0
##$MEAN= 0
##$ME_mod= 0
##$MI= 1.114404
##$NCOEF= 0
##$NC_proc= -6
##$NLEV= 6
##$NOISF1= 3.799351
##$NOISF2= 2.8
##$NSP= 0
##$NTH_PI= 0
##$NZP= 0
##$OFFSET= 15.53094
##$PC= 1
##$PHC0= -1202.85
##$PHC1= 17.5923
##$PH_mod= 1
##$PKNL= yes
##$PPARMOD= 0
##$PSCAL= 0
##$PSIGN= 0
##$REVERSE= no
##$SF= 200.129998151044
##$SI= 16384
##$SIGF1= 3
##$SIGF2= 2
##$SINO= 0.751879
##$SIOLD= 32768
##$SREGLST= <19F.Aceton>
##$SSB= 0
##$STSI= 16384
##$STSR= 0
##$SW_p= 3612.71676300578
##$SYMM= 0
##$S_DEV= 0
##$TDeff= 16384
##$TDoff= 0
##$TI= <>
##$TILT= no
##$TM1= 0
##$TM2= 0
##$TOPLEV= 0
##$USERP1= <user>
##$USERP2= <user>
##$USERP3= <user>
##$USERP4= <user>
##$USERP5= <user>
##$WDW= 1
##$XDIM= 16384
##$YMAX_p= 476258609
##$YMIN_p= -407441
$$ End of Bruker specific parameters
$$ ---------------------------------
##NTUPLES= NMR SPECTRUM
##VAR_NAME=  FREQUENCY,     SPECTRUM/REAL,   SPECTRUM/IMAG
##SYMBOL=    X,             R,               I
##VAR_TYPE=  INDEPENDENT,   DEPENDENT,       DEPENDENT
##VAR_FORM=  AFFN,          ASDF,            ASDF
##VAR_DIM=   16384,         16384,           16384
##UNITS=     HZ,            ARBITRARY UNITS, ARBITRARY UNITS
##FACTOR=    0.220516191357247, 1,           1
##FIRST=     3108.20700466067, 0,            0
##LAST=      -504.509758345112, 0,           0
##MIN=       -504.509758345112, -407441,     0
##MAX=       3108.20700466067, 476258609,    0
$$ Real data points
##PAGE= N=1
##DATA TABLE= (X++(R..R)), XYDATA
$$ [...]
5967A162568o8565p5161j46371R1345J23302q4147J1236n0368j1930L5719p720
$$ 1162568 1094003 1018842 872471 963816 1087118 1002971 1014207 963839 951909 987628 979908
5956I79908J35883n4483k2857m142l5581J27912J12521K5600n5212R3471J1167
$$ 979908 1115791 1061308 1038451 1034309 998728 1126640 1239161 1264761 1209549 1303020 1314187
5945A314187j5901r9554L1720N6566N0669l3222O434q9399m8772m9759K9859m6014
$$ 1314187 1298286 1198732 1230452 1287018 1337687 1304465 1310899 1221500 1172728 1122969 1152828 1106814
5933A106814J01779J44128o980m6493K1150j18058K2088k5448J29154L1650j12628
$$ 1106814 1208593 1352721 1345741 1299248 1320398 1202340 1224428 1198980 1328134 1359784 1247156
5922A247156K05176N860p8611O0834K0015K5009J78450q3223k10871n3657J3822
$$ 1247156 1452332 1458192 1379581 1440415 1460430 1485439 1663889 1580666 1369795 1316138 1329960
5911A329960r5852j1116l6235p001j9675J01199k9442j3433L8904p4865p0605
$$ 1329960 1234108 1222992 1186757 1179756 1160081 1261280 1231838 1218405 1257309 1182444 1111839
5900A111839J47977k1492o4481r0816q9002J13087J70266M3877j21642Q4472J03223
$$ 1111839 1259816 1238324 1173843 1083027 994025 1107112 1277378 1321255 1199613 1284085 1387308
5889A387308L8093J7873m9296p5268p6818j28476j2579l9962P3757P2591l289
$$ 1387308 1425401 1443274 1393978 1318710 1241892 1113416 1100837 1060875 1134632 1207223 1203934
5878A203934j1370m1986J0307o031L6901q768J43450j05224m8418l1626r0167
$$ 1203934 1192564 1150578 1160885 1154854 1191755 1182987 1326437 1221213 1172795 1141169 1051002
5867A051002M6387N5723k4683J01660J16361p9409k2075k8503m5881o6197m0016
$$ 1051002 1097389 1153112 1128429 1230089 1346450 1267041 1244966 1216463 1170582 1104385 1064369
5856A064369M3654O9929J5555J8411R06m8983N8684M1015n4733n7336m5219o4681
$$ 1064369 1108023 1177952 1193507 1211918 1212824 1163841 1222525 1263540 1208807 1151471 1106252 1041571
5844A041571J25924J50738n4195o5814o6515r1478M1425r463J27519K8028j10220
$$ 1041571 1167495 1318233 1264038 1198224 1131709 1040231 1081656 1072193 1199712 1227740 1117520
5833A117520q6432O2939n4665k8147m892L0282J17483R7688p3811p5045M4799
$$ 1117520 1031088 1094027 1039362 1011215 1006323 1036605 1154088 1251776 1177965 1102920 1147719
5822A147719K0597J34964j27385q691j08123O0448Q71R726J02449L3709R2014
$$ 1147719 1168316 1303280 1175895 1167204 1059081 1119529 1120400 1130126 1232575 1266284 1358298
5811A358298n8539L3068l1184l9238l3775j8037J20025N7725P1849P7369k38063
$$ 1358298 1299759 1332827 1301643 1262405 1228630 1210593 1330618 1388343 1460192 1537561 1299498
5800A299498l4705k576n802O6557L5484O0476O0287j0002o2141m7645o0113Q095
$$ 1299498 1264793 1262217 1256415 1322972 1358456 1418932 1479219 1469217 1407076 1359431 1299318 1307413
5788A307413Q1309l2210M8927k1802J19252M6066j12928j120M6759K5513Q190
$$ 1307413 1388722 1356512 1405439 1383637 1502889 1548955 1436027 1434907 1481666 1507179 1515369
5777A515369j27320J5822O2032K36Q2003n6366J6375N3874k4691r7408M063J14843
$$ 1515369 1388049 1403871 1465903 1466139 1548142 1491776 1508151 1562025 1537334 1439926 1443989 1558832
5765A558832o3405j47553R8435r3277k3579P8849M0486L8498P2612j01140N154
$$ 1558832 1495427 1347874 1446309 1353032 1329453 1408302 1448788 1487286 1559898 1458758 1463912
5754A463912M5240Q1139n3501l3549J05300j2890j5543n0065r7162k8974J48405
$$ 1463912 1509152 1590291 1536790 1503241 1608541 1595651 1580108 1530043 1432881 1403907 1552312
5743A552312k4293j15381R5071o9380Q5053P5317j03598j27168O0168M1807M3832
$$ 1552312 1528019 1412638 1507709 1438329 1523382 1598699 1495101 1367933 1428101 1469908 1513740
5732A513740l1499L8684m997p793k18152J756P0099L0142l2619M5751P8018Q2724
$$ 1513740 1482241 1520925 1515928 1508135 1289983 1291739 1361838 1391980 1359361 1405112 1483130 1565854
5720A565854j16705o5764m2949n3414K2959l1438J21380M0113k6830n188K8266
$$ 1565854 1449149 1383385 1340436 1287022 1309981 1278543 1399923 1440036 1413206 1408018 1436284
5709A436284k4501J93059o9279k1163l2693n227O8971L1239r3949K4117J5211
$$ 1436284 1411783 1604842 1535563 1514400 1481707 1476480 1545451 1576690 1482741 1506858 1522069
5698A522069j7906n3616n2264n6111l9650Q3159K8996j404j299J11028j5379n7903
$$ 1522069 1504163 1450547 1398283 1342172 1302522 1385681 1414677 1413273 1411974 1523002 1507623 1449720
5686A449720K7278j1031j06644O0132J19521j8221O8048j05651N9855j8156r4281
$$ 1449720 1476998 1465967 1359323 1419455 1538976 1520755 1588803 1483152 1543007 1524851 1430570
5675A430570J4110O7021k8815R106r182J1286m6340j8298J21764l7829j20205
$$ 1430570 1444680 1511701 1482886 1491992 1482810 1494096 1447756 1429458 1551222 1513393 1393188
5664A393188J28498Q5388q6164Q4056J16414m44J1551p4470k3598q5614k8235
$$ 1393188 1521686 1607074 1520910 1604966 1721380 1720936 1732487 1658017 1634419 1548805 1520570
5653A520570O4811J5492q3625o04K8045k940j488M0414K4643j7199q1679R279
$$ 1520570 1585381 1600873 1517248 1516644 1544689 1541749 1540261 1580675 1605318 1588119 1506440 1515719
5641A515719p7379m0940L3635j317R2126M3170j57179N2597J34119k8268J9123
$$ 1515719 1438340 1397400 1431035 1429718 1521844 1565014 1407835 1460432 1594551 1566283 1585406
5630A585406j6141J9494K5181L404l8478N0875j04467N6032O015n7613j13176
$$ 1585406 1569265 1588759 1613940 1617344 1578866 1629741 1525274 1581306 1587321 1529708 1416532
5619A416532k1190N2587n7836M6824J80067l2651j22830J5805k2055l0551j44059
$$ 1416532 1395342 1447929 1390093 1436917 1616984 1584333 1461503 1477308 1455253 1424702 1280643
5608A280643J4871K6906J22250Q4578m8853K7053j0335N2649j41750R280k5270
$$ 1280643 1295514 1322420 1444670 1529248 1480395 1507448 1497113 1549762 1408012 1417292 1392022
5597A392022J95138L7566J1248r2903m9892Q905J8757J8775j97382O0238O3719
$$ 1392022 1587160 1624726 1635974 1543071 1493179 1502084 1520841 1539616 1342234 1402472 1466191
5586A466191m6619N3819j00363j33631M5248N8637N9135J17894q9479j42784Q3557
$$ 1466191 1419572 1473391 1373028 1239397 1284645 1343282 1402417 1520311 1430832 1288048 1371605
5575A371605J971L8140p0260J20294K0607n0156r8332J34713j07534M6924k4599
$$ 1371605 1373576 1411716 1341456 1461750 1482357 1432201 1333869 1468582 1361048 1407972 1383373
5564A383373n1832L1986q2208r8671N3972J07175l729Q7932p9423J3314p7175
$$ 1383373 1331541 1363527 1281319 1182648 1236620 1343795 1340066 1427998 1348575 1361889 1284714
5553A284714L1136q0183N811j3423O5684l835k6158l8373P9071j21285k20736
$$ 1284714 1315850 1235667 1241478 1228055 1293739 1289904 1263746 1225373 1304444 1183159 962423
5542I62423K3257M6892J76780J06935l7267k5084o3728L8557O3983q4420R9326
$$ 962423 985680 1032572 1209352 1316287 1279020 1253936 1190208 1228765 1292748 1208328 1307654
5531A307654j8249M7138m0185p1529P8251P859j35955J51375p9171l0637J0541
$$ 1307654 1289405 1336543 1296358 1224829 1303080 1310939 1174984 1326359 1247188 1216551 1227092
5520A227092N5231Q1415k5473j05748O4374J55533j28608j07380O6741K0817j2048
$$ 1227092 1282323 1363738 1338265 1232517 1296891 1452424 1323816 1216436 1283177 1303994 1291946
5509A291946J07859J6616j0739q5425L3231L4652J06565j63892m655p713j5813
$$ 1291946 1399805 1416421 1405682 1320257 1353488 1388140 1494705 1330813 1326158 1318445 1302632
5498A302632K3857o168N6854l1552j12940j0867M6262K7642M1416j1903k1114
$$ 1302632 1326489 1320321 1377175 1345623 1232683 1221816 1268078 1295720 1337136 1325233 1304119
5487A304119O5941j08171k3042P3058J26895j00520J4965J11957j06122m7031
$$ 1304119 1370060 1261889 1238847 1311905 1438800 1338280 1353245 1465202 1359080 1312049
5477A312049q9619m3756M2943m5532N0588O1127j904Q4279m6371j7338L5555Q9284
$$ 1312049 1222430 1178674 1221617 1176085 1226673 1287800 1285896 1370175 1323804 1306466 1342021 1431305
5465A431305R3145j4997j53370j5052l9620J38776M9329j06016K2977j34346P1010
$$ 1431305 1524450 1509453 1356083 1341031 1301411 1440187 1489516 1383500 1406477 1272131 1343141
5454A343141M1900r4202P7248P627k7467R6084n0888k2293M073K0722j33315O4745
$$ 1343141 1385041 1290839 1368087 1375714 1348247 1444331 1393443 1371150 1375223 1395945 1262630 1327375
5442A327375M3306m2800Q9092L7218r2487J19543o8655n0130J1258K9758n9699
$$ 1327375 1370681 1327881 1416973 1454191 1361704 1481247 1412592 1362462 1373720 1403478 1343779
5431A343779O5088K5269j34606N4252j346O8474O547m558o7771J11797Q6172m9613
$$ 1343779 1408867 1434136 1299530 1353782 1352436 1420910 1427457 1422899 1355128 1466925 1553097 1503484
5419A503484k0817r5979N6415O8902P379M237j42003K4717r979O6759O678O2690
$$ 1503484 1482667 1386688 1443103 1512005 1519384 1523621 1381618 1406335 1396356 1463115 1469793 1532483
5407A532483R752N436M6371Q9539j33866J27604j09933q4089J461M4422j58548
$$ 1532483 1542235 1547671 1594042 1683581 1549715 1677319 1567386 1483297 1484758 1529180 1370632
5396A370632m5185P3619O1088j38913M3193O7547m606L8304k6622K3207n5930
$$ 1370632 1325447 1399066 1460154 1321241 1364434 1431981 1427375 1465679 1439057 1462264 1406334
5385A406334L3890k7332N713j8458M3885J6689k5415M6662M3606J19989j03943
$$ 1406334 1440224 1412892 1418605 1400147 1444032 1460721 1435306 1481968 1525574 1645563 1541620
5374A541620J6683L5611n2268j46045n0819L7981J7533R6808q3141M3652M7215
$$ 1541620 1558303 1593914 1541646 1395601 1344782 1382763 1400296 1497104 1413963 1457615 1504830
5363A504830j2974n6448j04821J34179L4544m6749K3371m0342J48631K0044p0543
$$ 1504830 1491856 1435408 1330587 1464766 1499310 1452561 1475932 1435590 1584221 1604265 1533722
5352A533722j7492J2888l5880Q7243l2002p7206N9892n6313j28265P2211J7151
$$ 1533722 1516230 1529118 1493238 1580481 1548479 1471273 1531165 1474852 1346587 1418798 1435949
5341A435949K22919Q6374j81782K0023P0014J3346p8739n0197P0997K3864O9491
$$ 1435949 1658868 1745242 1563460 1583483 1653497 1666843 1588104 1537907 1608904 1632768 1702259
5330A702259p5538k9602N1457O4354P4790o2785o987p6377n8570J62121n6504
$$ 1702259 1626721 1597119 1648576 1712930 1787720 1724935 1717948 1641571 1583001 1745122 1688618
5319A688618q7318O9857j0640j19290J93921k4816q4305J2260N9544Q4679J7821
$$ 1688618 1601300 1671157 1660517 1541227 1735148 1710332 1626027 1638287 1697831 1782510 1800331
5308A800331j3460l5338p0736J02558n4594J7132N7179L7886N7129K7165J2854
$$ 1800331 1786871 1751533 1680797 1783355 1728761 1745893 1803072 1840958 1898087 1925252 1938106
5297A938106o1767p5968O0686q9337o5874R9273M0216k1854l3730n7369k2638
$$ 1938106 1876339 1800371 1861057 1771720 1705846 1805119 1845335 1823481 1789751 1732382 1709744
5286A709744Q1079J41215P5782m4519m302L427m5395M9475M8863m419l8098L0190
$$ 1709744 1790823 1932038 2007820 1963301 1958999 1962426 1917031 1966506 2015369 2010950 1972852 2003042
5274B003042J09973J8409l2608r9942K0169O0586J14057l3184j28829P290R3688
$$ 2003042 2113015 2131424 2098816 1998874 2019043 2079629 2193686 2160502 2031673 2038963 2132651
5263B132651J09766J1727m8326j1179n354O5402o6286L0396N5077K2958r5301
$$ 2132651 2242417 2254144 2205818 2194639 2189285 2254687 2188401 2218797 2273874 2296832 2201531
5252B201531k436L6406N1703J01478L7000j12421j4339L2641p0351k6102J17540
$$ 2201531 2199095 2235501 2287204 2388682 2425682 2313261 2298922 2331563 2261212 2235110 2352650
5241B352650J32123L5606j22734n5822J50546r6801j3648K32754j7794m254l4244
$$ 2352650 2484773 2520379 2397645 2341823 2492369 2395568 2381920 2614674 2596880 2592626 2558382
5230B558382Q1803N0760O2613R2389m7256o6621j00305L558P3412K14904O2840
$$ 2558382 2640185 2690945 2753558 2845947 2798691 2732070 2631765 2635323 2708735 2923639 2986479
5219B986479J9177L7686O6368J1723k3481k2352J56871J6147j14659P3755M2760
$$ 2986479 3005656 3043342 3109710 3121433 3097952 3075600 3232471 3248618 3133959 3207714 3250474
5208C250474P4638m1418N9948j9115J66265M8907j5047R5042J18010j6318j31620
$$ 3250474 3325112 3283694 3343642 3324527 3490792 3539699 3524652 3619694 3737704 3721386 3589766
5197C589766L4097J51384p003l6345j00401J03165N769R6562N8072n2812N496
$$ 3589766 3623863 3775247 3768244 3731899 3631498 3734663 3740432 3836994 3895066 3842254 3847750
5186C847750j61085J86012M6069K0105K0351J56821J35028j25566J31246O8151
$$ 3847750 3686665 3872677 3918746 3938851 3959202 4116023 4251051 4125485 4256731 4324882
5176D324882q4643m1782n0848K22092Q3660K5697J36156J08988J06454n0799L428
$$ 4324882 4240239 4198457 4147609 4369701 4453361 4479058 4615214 4724202 4830656 4779857 4783285
5165D783285K6315P7887O4690L2822J47800P1313R1574o3391o2373J41833J24984
$$ 4783285 4809600 4887487 4952177 4984999 5132799 5204112 5295686 5232295 5169922 5311755 5436739
5154E436739O8013k28153R6855J05800m8490K5694q0130K3817J54454J73065J14895
$$ 5436739 5504752 5276599 5373454 5479254 5430764 5456458 5376328 5400145 5554599 5727664 5842559
5143E842559M1574M0293J08576n0295N2485J9008K6396O153J31490J73353L8587
$$ 5842559 5884133 5924426 6033002 5982707 6035192 6054200 6080596 6086749 6218239 6391592 6430179
5132F430179R9446J69339J50105K5781J55861J54484J12915M5216J63524L38192
$$ 6430179 6529625 6698964 6849069 6874850 7030711 7185195 7298110 7343326 7506850 7845042
5122G845042J60051K49882K53631K72333L33836K68786K10311J97049L58914L81968
$$ 7845042 8005093 8254975 8508606 8780939 9114775 9383561 9593872 9790921 10149835 10531803
5112A0531803L18137L44733N45074N58898P25729Q09554Q13510R69361Q99486
$$ 10531803 10849940 11194673 11739747 12298645 13024374 13833928 14647438 15616799 16516285
5103A6516285J165589J352147J381106J695572J343158J536010J857991K267213
$$ 16516285 17681874 19034021 20415127 22110699 23453857 24989867 26847858 29115071
5095B9115071L021262L076298K121374k583747m531654l299797k574673j868170
$$ 29115071 32136333 35212631 37334005 34750258 30218604 26918807 24344134 22475964
5087B2475964j434856j179910q18088j209997j699031j537583j172857j058186
$$ 22475964 21041108 19861198 19043110 17833113 16134082 14596499 13423642 12365456
5079A2365456j066853r03937p74275o28128o25292n06252m42121m57523l69614
$$ 12365456 11298603 10394666 9620391 8992263 8366971 7860719 7418598 6961075 6591461
5070F591461l62639m59228k67059j83300j18174j96827n5463j12765k93317J1522
$$ 6591461 6228822 5769594 5502535 5319235 5201061 5004234 4948771 4836006 4542689 4554211
5060D554211j80681j40050j26560j17692q8111J2825k6977j49375k4088j34680
$$ 4554211 4373530 4233480 4106920 3989228 3901117 3913942 3886965 3737590 3713502 3578822
5050C578822L683j32355r5629r9191O228N4221p9942k07659q0207N2272J0090
$$ 3578822 3582505 3450150 3354521 3255330 3261558 3315779 3235837 3028178 2947971 3000243 3010333
5039C010333J02K6693j33494l6973k9211J03818j44980p7489L9586j16975l0255
$$ 3010333 3010435 3037128 2903634 2866661 2837450 2941268 2796288 2718799 2758385 2641410 2611155
5028B611155p8801N6960k1526j38953k1943J76448J05330l8972P195j8577j65200
$$ 2611155 2532354 2589314 2567788 2428835 2406892 2583340 2688670 2649698 2656893 2638316 2473116
5017B473116q2953N7391l6947j15900l283N6999r4773J16652J19730L5695R9814
$$ 2473116 2390163 2447554 2410607 2294707 2291424 2348423 2253650 2370302 2490032 2525727 2625541
5006B625541n7704r0338m2987p2551M6184n6774o5085Q2137P1117o6353K293K5350
$$ 2625541 2567837 2477499 2434512 2361961 2408145 2351371 2286286 2368423 2439540 2373187 2375480 2400830
4994B400830k2170p5209j16668o6772J75437q2219q0886K7062P6289M5237J5773
$$ 2400830 2378660 2303451 2186783 2120011 2295448 2213229 2132343 2159405 2235694 2280931 2296704
4983B296704j27652j9613J99180k1503j27150J51980J58889j48512J6669K5320
$$ 2296704 2169052 2149439 2348619 2327116 2199966 2351946 2510835 2362323 2378992 2404312
4973B404312m763M6401J7783j56853p1786M7837J50629m3109M2236n2030m0979
$$ 2404312 2399549 2445950 2463733 2306880 2235094 2282931 2433560 2390451 2432687 2380657 2339678
4962B339678K5965N7116p5197J2969K5469o9351O8857m9846P110J4794P7247J14759
$$ 2339678 2365643 2422759 2347562 2360531 2386000 2316649 2385506 2335660 2342770 2357564 2434811 2549570
4950B549570m8944j56785R8545J7437j73835J24895O2564M6062j3640J5559K33930
$$ 2549570 2500626 2343841 2442386 2459823 2285988 2410883 2473447 2519509 2505869 2521428 2755358
4939B755358r4623n3425P6491m2806l5909L519m633O0019J55595k4834J140m3327
$$ 2755358 2660735 2607310 2683801 2640995 2605086 2608605 2603972 2663991 2819586 2794752 2795892 2752565
4927B752565O6526o5965n9873N3457m8577N434p4483n5045J42556O7166m7528
$$ 2752565 2819091 2753126 2693253 2746710 2698133 2703567 2629084 2574039 2716595 2783761 2736233
4916B736233J54782L1804O3875L6657k55990M1153J7226o6967O7052L3339J03242
$$ 2736233 2891015 2922819 2986694 3023351 2767361 2808514 2825740 2758773 2825825 2859164 2962406
4905B962406R2551r2673m5857k5018o8567J10038Q2492N5816N9852N7795n4839
$$ 2962406 3054957 2962284 2916427 2891409 2822842 2932880 3015372 3071188 3131040 3188835 3133996
4894C133996q2360k1920R5456R6723M625O5368n4415J9887p4563J221N2792m1065
$$ 3133996 3051636 3029716 3125172 3221895 3226520 3291888 3237473 3257360 3182797 3184018 3236810 3195745
4882C195745o8559K1493K1437j6621Q0803j8011k9969J87476O2823n6818j75202
$$ 3195745 3127186 3148679 3170116 3153495 3234298 3216287 3186318 3373794 3436617 3379799 3204597
4871C204597k767O672n6531Q5309J6297L0695Q934J14335o9113K3294J8914M9306
$$ 3204597 3201830 3208502 3151971 3237280 3253577 3284272 3293206 3407541 3338428 3361722 3380636 3429942
4859C429942q0419J8138m0330n6335j51062q2336J18222J15171N9368j07619P92
$$ 3429942 3349523 3367661 3327331 3270996 3119934 3037598 3155820 3270991 3330359 3222740 3223532
4848C223532N2536N4133L1694j02271m4403m4580J30275J20876k00713o636M2778
$$ 3223532 3276068 3330201 3361895 3259624 3215221 3170641 3300916 3421792 3221079 3214443 3257221
4837C257221M6842J20348Q522o4514r1370N6812N1133L3933K5477p3922o6939
$$ 3257221 3304063 3424411 3432933 3368419 3277049 3333861 3384994 3418927 3444404 3370482 3303543
4826C303543j23584j50892J52228j9750k0431K11802r1177n0136M5865p8930j7501
$$ 3303543 3179959 3029067 3181295 3161545 3141114 3352916 3261739 3211603 3257468 3178538 3161037
4815C161037R748k877J39842R1642o2507q1830N8209l3573K7201j4206N2348n3105
$$ 3161037 3170785 3167908 3307750 3399392 3336885 3255055 3313264 3279691 3306892 3292686 3345034 3291929
4803C291929K0280k8356j24697o1813J22129J10547p2208p1648Q9112M9530l3432
$$ 3291929 3312209 3283853 3159156 3097343 3219472 3330019 3257811 3186163 3275275 3324805 3291373
4792C291373k2586J38909j0420j34354N5830J30505N8110o0047K9680o3041p2343
$$ 3291373 3268787 3407696 3397276 3262922 3318752 3449257 3507367 3447320 3477000 3413959 3341616
4781C341616R5615j26634j14074l8950M0999Q3288N1719N6167m9221n0236j49992
$$ 3341616 3437231 3310597 3196523 3157573 3198572 3281860 3333579 3389746 3340525 3290289 3140297
4770C140297J19086r2287R2983L4987j3077K3535j23065j2649L0472k6934m6802
$$ 3140297 3259383 3167096 3260079 3295066 3281989 3305524 3182459 3169810 3200282 3173348 3126546
4759C126546O6280P0738r8996p1896J10876J5534k7663o8419j3134K017o3625
$$ 3126546 3192826 3263564 3164568 3092672 3203548 3219082 3191419 3123000 3109866 3111883 3048258
4748C048258J8414k5529P8650J2339m5368N0314n5620L6028M963k43640P8389
$$ 3048258 3066672 3041143 3119793 3132132 3086764 3137078 3081458 3117486 3122449 2878809 2957198
4737B957198K43205n1216L4093J20139j75189k9474M2077q7598q0396J04556L3683
$$ 2957198 3200403 3149187 3183280 3303419 3128230 3098756 3140833 3053235 2972839 3077395 3111078
4726C111078l1895K1101m3194m9192R0855R1797j66855j68092P3044J65802J24209
$$ 3111078 3079183 3100284 3057090 3007898 3098753 3190550 3023695 2855603 2928647 3094449 3218658
4715C218658p1439j04638P7863n2228J1780j68444j12139N2087J14361J06668
$$ 3218658 3147219 3042581 3120444 3068216 3079996 2911552 2799413 2851500 2965861 3072529
4705C072529j50049K9518j1386J05880N0678M988J3573j18532J33159n8231m2047
$$ 3072529 2922480 2951998 2940612 3046492 3097170 3102158 3115731 2997199 3130358 3072127 3030080
4694C030080l9697q7426n1137M6507J5397M7188p4887J44170J6792j33638K0999
$$ 3030080 2990383 2902957 2851820 2898327 2913724 2960912 2886025 3030195 3046987 2913349 2934348
4683B934348N0003Q0462r2421j04244j9968J51353J8476k5862J40925j3113j73914
$$ 2934348 2984351 3064813 2972392 2868148 2848180 2999533 3018009 2992147 3133072 3119959 2946045
4672B946045J25576j27110m010J87027N0992k7394r4602Q906l1092j29889N5087
$$ 2946045 3071621 2944511 2940501 3127528 3178520 3151126 3056524 3065430 3034338 2904449 2959536
4661B959536J55391j12525o6604l815J1928n5499O431J2254o6879J66695J14844
$$ 2959536 3114927 3002402 2935798 2931983 2943911 2888412 2894843 2907097 2840218 3006913 3121757
4650C121757l4724l3012m3742K0714P0983k6451q4576J15949k18726q886M0194
$$ 3121757 3087033 3054021 3010279 3030993 3101976 3075525 2990949 3106898 2888172 2879286 2919480
4639B919480P734Q1734l0963K9323K5236m6335j09783J35699J17750p8410K5170
$$ 2919480 2927214 3008948 2977985 3007308 3032544 2986209 2876426 3012125 3129875 3051465 3076635
4628C076635l2802k8928J6279j445K7210Q2839n521r4152J8690L5874P6398j9556
$$ 3076635 3043833 3014905 3031184 3029739 3056949 3139788 3134267 3040115 3058805 3094679 3171077 3151521
4616C151521M0619J17165j9036R130Q318p2397l9464J27895j3439r9298O1260
$$ 3151521 3192140 3309305 3290269 3299399 3307717 3235320 3195856 3323751 3310312 3211014 3272274
4605C272274J6331K7929Q4763n8516p6998P4397k2322n3702N4563k1637q2747
$$ 3272274 3288605 3316534 3401297 3342781 3265783 3340180 3317858 3264156 3318719 3297082 3214335
4594C214335J49458j3948J02424L8076j11027p7025J55744M9210j2031m1112O4227
$$ 3214335 3363793 3349845 3452269 3490345 3379318 3302293 3458037 3507247 3495216 3454104 3518331
4583C518331O8024M914l0000o0149j4331R3248O3098K3796L218q874N3396q8464
$$ 3518331 3586355 3591269 3561269 3501120 3486789 3580037 3643135 3666931 3670149 3661275 3714671 3626207
4571C626207K0380J62103P1023m920N5868l1395q6462k050J26022K7554k1534
$$ 3626207 3646587 3808690 3879713 3874793 3930661 3899266 3812804 3810754 3936776 3964330 3942796
4560C942796J17723J17082q4511J50226k8307p2033L6143k7746J75431J1176K5790
$$ 3942796 4060519 4177601 4093090 4243316 4215009 4142976 4179119 4151373 4326804 4337980 4363770
4549D363770j7445K6996M1337k02816N4651J41344K8315n9399J25020J81298P3740
$$ 4363770 4346325 4373321 4414658 4211842 4266493 4407837 4436152 4376753 4501773 4683071 4756811
4538D756811o1520Q4098l1582k816R8047J51678m7540j3057m678j11489J10026
$$ 4756811 4695291 4779389 4747807 4744991 4843038 4994716 4947176 4934119 4929441 4817952 4927978
4527D927978N8192P4237J77503M0201J6330N6371O0216q219K4787L4235j33061
$$ 4927978 4986170 5060407 5237910 5278111 5294441 5350812 5411028 5402809 5427596 5461831 5328770
4516E328770R217M4089J0788Q9988k96K4128Q4097j10955J58975j7569O0239k0887
$$ 5328770 5337987 5382076 5392864 5482852 5482556 5506684 5590781 5479826 5638801 5621232 5681471 5660584
4504E660584O9720J42892r532m7263O8949Q4289P2253N8038m7480j08403j0035
$$ 5660584 5730304 5873196 5863664 5816401 5885350 5969639 6041892 6099930 6052450 5944047 5934012
4493E934012N1954k4188k8301n6728K72789J9917p9048j1700N4151J67386l5989
$$ 5934012 5985966 5961778 5933477 5876749 6149538 6169455 6090407 6078707 6132858 6300244 6264255
4482F264255Q7039p1448l3152Q0734R5882O9976l9445j4171L1427P0588J51127
$$ 6264255 6351294 6279846 6246694 6327428 6423310 6493286 6453841 6439670 6471097 6541685 6692812
4471F692812j08099j62470J6271J28022O4945L0065J18999k6376R8936O1332J61622
$$ 6692812 6584713 6422243 6438514 6566536 6631481 6661546 6780545 6754169 6853105 6914437 7076059
4460G076059J17652n8629p2818M2217R9407K9305L3378Q6702P3807M2725J16034
$$ 7076059 7193711 7135082 7062264 7104481 7203888 7233193 7266571 7353273 7427080 7469805 7585839
4449G585839o1400O9443J38877m351J34806m3170J50144J33940J09299N2674L7038
$$ 7585839 7524439 7593882 7732759 7728408 7863214 7820044 7970188 8104128 8213427 8266101 8303139
4438H303139O2907Q0893O5354J07531J56607R8516L1844N5879J58857O2247P2828
$$ 8303139 8366046 8446939 8512293 8619824 8776431 8874947 8906791 8962670 9121527 9183774 9256602
4427I256602L357k0646J0098J55664K12797J14263J70163L6957j563Q0368L0890
$$ 9256602 9259959 9239313 9249411 9405075 9617872 9732135 9902298 9939255 9937692 10018060 10048950
4416A0048950N2089J13656K44735J9914K7771J63996Q7600p327O3470J46519R4313
$$ 10048950 10101039 10214695 10459430 10479344 10507115 10671111 10758711 10751384 10814854 10961373 11055686
4405A1055686J60000J12712R0431J37363J72420J18306j3511j9357J19260R7310
$$ 11055686 11215686 11328398 11418829 11556192 11728612 11846918 11833407 11814050 11933310 12030620
4395A2030620J49286J20007J35338R0631O1508J68451J07985R7083J17496L5837
$$ 12030620 12179906 12299913 12435251 12525882 12587390 12755841 12863826 12960909 13078405 13114242
4385A3114242K6820Q3738K25183J26575L2515J51373J46739J01397O176K55550
$$ 13114242 13141062 13224800 13449983 13576558 13609073 13760446 13907185 14008582 14014758 14270308
4375A4270308J67316J8051J81470J23039l7011J34325J59849Q8239J26064K15559
$$ 14270308 14437624 14455675 14637145 14760184 14723173 14857498 15017347 15105586 15231650 15447209
4365A5447209k116J6916K42411J95547J38296p144J94234K17015J2447L4574J08883
$$ 15447209 15445093 15462009 15704420 15899967 16038263 16031119 16225353 16442368 16454815 16489389 16598272
4354A6598272J69316K57567J45023Q5737J70230K03723J95160J83207Q3856M2395
$$ 16598272 16767588 17025155 17170178 17255915 17426145 17629868 17825028 18008235 18092091 18134486
4344A8134486K24683P7642p1884K2968K22910J31973J64661K28779J74715R8315
$$ 18134486 18359169 18436811 18364927 18387895 18610805 18742778 18907439 19136218 19310933 19409248
4334A9409248P5941J67446N5840J52020L8956J00805J03220K21327J23341J85214
$$ 19409248 19485189 19652635 19708475 19860495 19899451 20000256 20103476 20324803 20448144 20633358
4324B0633358J22247J72873K00485O0617J93548K15201K38398J07947Q4250O9270
$$ 20633358 20755605 20928478 21128963 21189580 21383128 21598329 21836727 21944674 22028924 22098194
4314B2098194K65099J49329j9770J79257K24698J45673J58824J73768J19676k8424
$$ 22098194 22363293 22512622 22492852 22672109 22896807 23042480 23201304 23375072 23494748 23466324
4304B3466324Q2457J89092K92252J69676J44839J05323P6843J42033J99499J80057
$$ 23466324 23548781 23737873 24030125 24199801 24344640 24449963 24526806 24668839 24868338 25048395
4294B5048395J69697J07984J47057Q2784K55029J82229K44143J55876J51672K22029
$$ 25048395 25218092 25326076 25473133 25555917 25810946 25993175 26237318 26393194 26544866 26766895
4284B6766895O2072J69673Q9206J70170K86844J57167J72520J78766K57071K02533
$$ 26766895 26828967 26998640 27087846 27258016 27544860 27702027 27874547 28053313 28310384 28512917
4274B8512917K42868K63981J39245K18719L23380K12304J17970K72947L22802
$$ 28512917 28755785 29019766 29159011 29377730 29701110 29913414 30031384 30304331 30627133
4265C0627133K24291J76942M51065K91794K39396L45291L59094L23064M27289
$$ 30627133 30851424 31028366 31479431 31771225 32010621 32355912 32715006 33038070 33465359
4256C3465359M23311K89638K96340N10442K80878N27241M51162L59322N78460
$$ 33465359 33888670 34178308 34474648 34985090 35265968 35793209 36244371 36603693 37182153
4247C7182153N79734N34684O58929N99702O85186O74587P11254P05900O26562
$$ 37182153 37761887 38296571 38955500 39555202 40240388 40914975 41626229 42332129 42958691
4238D2958691O51730O89287M47799M68996N82597O07881P72434P60019Q62020
$$ 42958691 43610421 44299708 44747507 45216503 45799100 46406981 47179415 47939434 48801454
4229D8801454Q90229Q82824J097377J063045P80441O40024L17566J39204q832
$$ 48801454 49691683 50574507 51671884 52734929 53515370 54155394 54472960 54612164 54603332
4220E4603332O1464J71770K15032K96403M09394N18396O50303O90462Q60453O84798
$$ 54603332 54664796 54836566 55051598 55348001 55757395 56275791 56926094 57616556 58477009 59161807
4210E9161807L62022o0504n76051r03349q73324j021115q16814n74099m71995
$$ 59161807 59523829 59463325 58887274 57983925 57110601 56089486 55272672 54698573 54226578
4201E4226578j90888j6486J078Q4276J63320q8124m36388p92524j192057j447121
$$ 54226578 54035690 54019204 54020282 54104558 54267878 54179754 53743366 52950842 51758785 50311664
4191E0311664j390531j072446j036010j043986n47037o00534n27478l41124l21148
$$ 50311664 48921133 47848687 46812677 45768691 45221654 44621120 44093642 43752518 43431370
4182D3431370j24335m99604o42804o87050p34579q77525p82331o06529o26295
$$ 43431370 43307035 42807431 42164627 41477577 40742998 39865473 39083142 38476613 37850318
4173C7850318n79308l27480l06091l67996l22272k10340j94962j99146k68886
$$ 37850318 37271010 36943530 36637439 36269443 35947171 35736831 35541869 35342723 35073837
4164C5073837k81028j61196j81216j76147k61829j19173j24725r6981m1693m8139
$$ 35073837 34792809 34631613 34450397 34274250 34012421 33893248 33768523 33671542 33629849 33581710
4154C3581710O027j09268J1754Q9506l8799O8999N7380j0625J66958R9129J39299
$$ 33581710 33587737 33478469 33490223 33579729 33540930 33609929 33667309 33656684 33823642 33922771 34062070
4143C4062070R1020n9936N2353n7881P1145J10914J81709O0421r9112r657J50779
$$ 34062070 34153090 34093154 34145507 34087626 34158771 34269685 34451394 34511815 34412703 34403046 34553825
4132C4553825N1855J4645J04660Q8707K5335J6759J75795J132R133P40J36708
$$ 34553825 34605680 34620325 34724985 34813692 34839027 34855786 35031581 35032713 35041846 35042586 35179294
4121C5179294J12238k3693J03338k3262O0637p8587J7792J20110K2757Q972o8151
$$ 35179294 35291532 35267839 35371177 35347915 35408552 35329965 35347757 35467867 35490624 35499596 35431445
4110C5431445M229Q3528M0383l9141J871J16506J0649Q7464J6543Q9488L3285
$$ 35431445 35435674 35519202 35559585 35520444 35522315 35638821 35649470 35736934 35753477 35842965 35876250
4099C5876250j0357j14045K7977P9959L6995J27836r2011l2096J55742L8997n4657
$$ 35876250 35865893 35751848 35779825 35859784 35896779 36024615 35932604 35900508 36056250 36095247 36040590
4088C6040590j8822J48723Q0997M327o4744M9660R631l0422J58349o9725k4748
$$ 36040590 36021768 36170491 36251488 36255815 36191071 36240731 36250362 36219940 36378289 36308564 36283816
4077C6283816p3319J23121P7110J78195p8396O5182j8864O0180Q3730q2146Q555
$$ 36283816 36210497 36333618 36410728 36588923 36510527 36575709 36556845 36617025 36700755 36618609 36627164
4066C6627164R2576J40063J25386p1624K8465J14363M8314j799p1161M2255p2598
$$ 36627164 36719740 36859803 36985189 36913565 36942030 37056393 37104707 37102908 37031747 37074002 37001404
4055C7001404J58348K2587Q3145K9978m1623J8984N8706J72435J05495l8057L891
$$ 37001404 37159752 37182339 37265484 37295462 37253839 37272823 37331529 37503964 37609459 37571402 37575293
4044C7575293N0430L4607R4211j8538O1422J07119Q2603J08475j10114J4063J86207
$$ 37575293 37625723 37660330 37754541 37736003 37797425 37904544 37987147 38095622 37985508 37999571 38185778
4033C8185778l464K15573N9067n3457J26457n3793O6688J88991l2720o12J43972
$$ 38185778 38182314 38397887 38456954 38403497 38529954 38476161 38542849 38731840 38699120 38698508 38842480
4022C8842480M0088N3404O2341N8581M8541K22713n9782L6337M1990J1047L5939
$$ 38842480 38882568 38935972 38998313 39056894 39105435 39328148 39268366 39304703 39346693 39357740 39393679
4011C9393679r14O9731N6022J31939J47470j81051K8179J70160M0927n8539L4590
$$ 39393679 39392765 39462496 39518518 39650457 39797927 39616876 39645055 39815215 39856142 39797603 39832193
4000C9832193k8803l5950R5338N771Q9676J6201m4110j9021R3852o2141K5024
$$ 39832193 39803390 39767440 39862778 39868549 39958225 39974426 39930316 39911295 40005147 39943006 39968030
3989C9968030J72466p5991L6206J09655j0810l3212Q9236K52418l982J37408j27512
$$ 39968030 40140496 40064505 40100711 40210366 40199556 40166344 40255580 40507998 40504016 40641424 40513912
3978D0513912O1780J17560K678o5754Q4309P3263k1515N6975J30636q0294o6326
$$ 40513912 40575692 40693252 40695930 40630176 40714485 40787748 40766233 40823208 40953844 40873550 40807224
3967D0807224J00505O6467j281j14620j4864K23865q991m8175J03502r680j16441
$$ 40807224 40907729 40974196 40972915 40858295 40843431 41067296 41058305 41010130 41113632 41103952 40987511
3956D0987511J632r20o8071K06403N1262P2672m2245N9667L4286R9520j66877
$$ 40987511 40989143 40988223 40920152 41126555 41177817 41250489 41208244 41267911 41302197 41401717 41234840
3945D1234840j06475P8459q297o456n2243j00558o874P4961K4331L8305l6724
$$ 41234840 41128365 41206824 41198527 41192071 41139828 41039270 41032396 41107357 41131688 41169993 41133269
3934D1133269M8307O7776N8327o3174M0373o6928J10141K0320q096J6635o4238
$$ 41133269 41181576 41249352 41307679 41244505 41284878 41217950 41328091 41348411 41340315 41356950 41292712
3923D1292712J28993R4015l6990M0703J01091q7256j7479k6257M5318j4237n9297
$$ 41292712 41421705 41515720 41478730 41519433 41620524 41533268 41515789 41489532 41534850 41520613 41461316
3912D1461316Q6767L4570L5450L8463j15457J9658K270L0290P7608J8741l5887
$$ 41461316 41548083 41582653 41618103 41656566 41541109 41560767 41563037 41593327 41670935 41689676 41653789
3901D1653789m1541k4539N4402Q2729K5592p0924p3603M1549J03949m0480m8472
$$ 41653789 41612248 41587709 41642111 41724840 41750432 41679508 41605905 41647454 41751403 41710923 41662451
3890D1662451k362k1307K5870N1134l0046n193L3304j300n9362k1668J54671m467
$$ 41662451 41660089 41638782 41664652 41715786 41685740 41680547 41713851 41712551 41653189 41631521 41786192 41781725
3878D1781725N5385P0328O7332J11663m8893k3049J50251R4263m0408L0415N4865
$$ 41781725 41837110 41907438 41974770 42086433 42037540 42014491 42164742 42259005 42218597 42249012 42303877
3867D2303877L1035J24164M1766K2153J68774k4551N6427m6636L8709M3038K1264
$$ 42303877 42334912 42459076 42500842 42522995 42691769 42667218 42723645 42677009 42715718 42758756 42780020
3856D2780020R244O3021J8892L8308Q9016Q1p8239p3638K3887M1064N6871j08109
$$ 42780020 42789264 42852285 42871177 42909485 42998501 42998582 42920343 42846705 42870592 42911656 42968527 42860418
3844D2860418K8589J71822j304N1844Q6832o6131L631O5843N8110l0913N8039
$$ 42860418 42889007 43060829 43059525 43111369 43198201 43132070 43135701 43201544 43259654 43228741 43286780
3833D3286780K5807P4931l695K2003M3988J20529l982K439J47190L3139O7076
$$ 43286780 43312587 43387518 43383823 43405826 43449814 43570343 43566361 43568800 43715990 43749129 43816205
3822D3816205k6402J17787J3999K2306J42385J50079J99022m9053K0525J96848
$$ 43816205 43789803 43907590 43921589 43943895 44086280 44236359 44435381 44386328 44406853 44603701
3812D4603701N7615l4360R5820q6795J0633J2557K19551J64503N2603M8303K9389
$$ 44603701 44661316 44626956 44722776 44635981 44646614 44659171 44878722 45043225 45095828 45144131 45173520
3801D5173520Q8144L2103n876K06374K29517J0916J27403N7019n4979Q2613J61778
$$ 45173520 45261664 45293767 45287891 45494265 45723782 45734698 45862101 45919120 45864141 45946754 46108532
3790D6108532J49051j05331R0630J69975J33320K35929R4126M2435O8977n9897
$$ 46108532 46257583 46152252 46242882 46412857 46546177 46782106 46876232 46918667 46987644 46927747
3780D6927747K1627K26606p5740N2085J34404R2198Q8144n3959O2819J05158J10856
$$ 46927747 46949374 47175980 47100240 47152325 47286729 47378927 47467071 47413112 47475931 47581089 47691945
3769D7691945K83377R1427J32976N8505J58083Q59J03954J50440J39868K71761
$$ 47691945 47975322 48066749 48199725 48258230 48416313 48417172 48521126 48671566 48811434 49083195
3759D9083195K28896J68457K8472J92584K29376K53021J65677K43969J67706K89007
$$ 49083195 49312091 49480548 49509020 49701604 49930980 50184001 50349678 50593647 50761353 51050360
3749E1050360K69295L47397J43088J55122K77375K78212L87835L31511L29231
$$ 51050360 51319655 51667052 51810140 51965262 52242637 52520849 52908684 53240195 53569426
3740E3569426K76741K13977J96541K69201K10699K84661J49276K84242J68327
$$ 53569426 53846167 54060144 54256685 54525886 54736585 55021246 55170522 55454764 55623091
3731E5623091J07099J53797J63588J05229J22083J83026L5807R4250J45341J34486
$$ 55623091 55730190 55883987 56047575 56152804 56274887 56457913 56493720 56587970 56733311 56867797
3721E6867797K18561K04913K16840M7537P5485J42300J75511J14381K04832J25368
$$ 56867797 57086358 57291271 57508111 57555648 57631133 57773433 57948944 58063325 58268157 58393525
3711E8393525J28155K90181Q1979L7526J73891K07660J46257K05892j157K0284
$$ 58393525 58521680 58811861 58893840 58931366 59105257 59312917 59459174 59665066 59663909 59684193
3701E9684193K28613K26699M5013J13557L39192K70124K38087K09912L81285K25641
$$ 59684193 59912806 60139505 60184518 60298075 60637267 60907391 61145478 61355390 61736675 61962316
3691F1962316J31234L13046K26698K17127J06433L27092K55015K02475M35058
$$ 61962316 62093550 62406596 62633294 62850421 62956854 63283946 63538961 63741436 64176494
3682F4176494J84626J24289K00995K89318K83948R4799RK48171K03406K60233
$$ 64176494 64361120 64485409 64686404 64975722 65259670 65354469 65354478 65602649 65806055 66066288
3672F6066288K30466N4277J60732P9306J41594K46227J76970K05947K21323K76700
$$ 66066288 66296754 66351031 66511763 66591069 66732663 66978890 67155860 67361807 67583130 67859830
3662F7859830J60493J43403K72495K36504K09416K62028M12095K31084K92350
$$ 67859830 68020323 68163726 68436221 68672725 68882141 69144169 69556264 69787348 70079698
3653G0079698K67960K82603L88648N32534L66886L75614M12726N80589L47356
$$ 70079698 70347658 70630261 71018909 71551443 71918329 72293943 72706669 73287258 73634614
3644G3634614L73005M34442M59812N90579N15414M47091N51609N06715N84784
$$ 73634614 74007619 74442061 74901873 75492452 76007866 76454957 77006566 77513281 78098065
3635G8098065N40794O02759L00603K52646M28982K72785N50393N23025N56202
$$ 78098065 78638859 79241618 79542221 79794867 80223849 80496634 81047027 81570052 82126254
3626H2126254O62413O08541N45921O62802P50403Q64552Q71572Q61392J182434
$$ 82126254 82788667 83397208 83943129 84605931 85356334 86220886 87092458 87953850 89136284
3617H9136284J415733J250053J319061J233137J362144J249575J581500J688249
$$ 89136284 90552017 91802070 93121131 94354268 95716412 96965987 98547487 100235736
3609A00235736J605326Q44705J57687R8913J80695J88376J37286M05432M73248
$$ 100235736 101841062 102685767 102843454 102942367 103123062 103311438 103448724 103854156 104327404
3600A04327404R24242J254074J391023J622631K081739K270087K580520K887310
$$ 104327404 105251646 106505720 107896743 109519374 111601113 113871200 116451720 119339030
3592A19339030L335993L612878L675872M235932M464081M845419M830359M784890
$$ 119339030 122675023 126287901 129963773 134199705 138663786 143509205 148339564 153124454
3584A53124454M315934L686731L070611K439237J815840R86366o4706j289921
$$ 153124454 157440388 161127119 164197730 166636967 168452807 169439173 169374467 168084546
3576A68084546j934944j670114j340957j221483j020978o94945p33624q65995
$$ 168084546 166149602 164479488 163138531 161917048 160896070 160201125 159467501 158601506
3568A58601506j032491j620388k180524k779566l353121l779015m040870m418992
$$ 158601506 157569015 155948627 153768103 150988537 147635416 143856401 139815531 135396539
3560A35396539m429866m174175m023659l860167l285018k937524k578464k170991
$$ 135396539 130966673 126792498 122768839 118908672 115623654 112686130 110107666 107936675
3552A07936675k010070j614419j365207j269472j245859r36922q48662q09708
$$ 107936675 105926605 104312186 102946979 101677507 100431648 99494726 98646064 97836356
3544I7836356o97393n41490l51158l29270j77606k70428p4411K5567P0969O563
$$ 97836356 97138963 96597473 96246315 95917045 95739439 95469011 95394600 95420167 95491136 95497699
3534I5497699J82463J35027L51909L29214M17687L96225L60642M06616N16633
$$ 95497699 95680162 95815189 96167098 96496312 96913999 97310224 97670866 98077482 98594115
3525I8594115N86043M63949O52061N62042O30249Q09905P48350O68868P14730
$$ 98594115 99180158 99644107 100296168 100858210 101488459 102298364 103046714 103715582 104430312
3516A04430312Q06944P93459P68292Q56364R17865Q87894Q43153P94316Q13609
$$ 104430312 105237256 106030715 106799007 107655371 108573236 109461130 110304283 111098599 111912208
3507A11912208P38027P44566Q46927R12468Q77933Q51883P77465R57024R71157
$$ 111912208 112650235 113394801 114241728 115154196 116032129 116884012 117661477 118618501 119589658
3498A19589658R29722J121817J076444J020847P95039J116034J189668J307422
$$ 119589658 120519380 121641197 122717641 123738488 124533527 125649561 126839229 128146651
3490A28146651J532872J481076J420121J447519J624647J771836J894788J989500
$$ 128146651 129679523 131160599 132580720 134028239 135652886 137424722 139319510 141309010
3482A41309010J964518K151096K329360K425784K518552K706025K911342K989592
$$ 141309010 143273528 145424624 147753984 150179768 152698320 155404345 158315687 161305279
3474A61305279L259933L327075L659563L811747L936665M337203M358534M802641
$$ 161305279 164565212 167892287 171551850 175363597 179300262 183637465 187995999 192798640
3466A92798640N072466N224511N687878O028101O089274O576137P024553P276418
$$ 192798640 197871106 203095617 208783495 214811596 220900870 227477007 234501560 241777978
3458B41777978P582437P767273P694434P501134O886916N883798M663654L351995
$$ 241777978 249360415 257127688 264822122 272323256 279210172 285093970 289757624 293109619
3450B93109619J940472N75596q56002k087706k743379l241770l078826k789487
$$ 293109619 295050091 295625687 294769685 292681979 289938600 286696830 283618004 280828517
3442B80828517k532388k352487k446667k753261l215918l666495m331843n343907
$$ 280828517 278296129 275943642 273496975 270743714 267527796 263861301 259529458 254185551
3434B54185551o478381p403396q235130q862102r092830q983103q569083q027081
$$ 254185551 247707170 240303774 232068644 223206542 214113712 205130609 196561526 188534445
3426A88534445p572893o917608o142732n279092m454814l695206l151221k544609
$$ 188534445 180961552 174043944 167901212 162622120 158167306 154472100 151320879 148776270
3418A48776270j831036j424396q57359l25130L17918Q46944J413761J853662K301608
$$ 148776270 146945234 145520838 144663479 144338349 144656267 145503211 146916972 148770634 151072242
3409A51072242L124010L645698L955559M466093M960115N324381N424530N163625
$$ 151072242 154196252 157841950 161797509 166263602 171223717 176548098 181972628 187136253
3401A87136253M692912M119769L626939L298945K868672K265006J518312N31995
$$ 187136253 191829165 195948934 199575873 202874818 205743490 208008496 209526808 210058803
3393B10058803l02360r46374j649780j933041k182307k450972k223081k239965
$$ 210058803 209756443 208810069 207160289 205227248 203044941 200593969 198370888 196130923
3385A96130923k078397k566633l504459l738517l801909l981598m463518m695615
$$ 196130923 194052526 191485893 187981434 184242917 180441008 176459410 171995892 167300277
3377A67300277n177853n611400n774151o137778o136384o238544o163119n821460
$$ 167300277 162122424 156511024 150736873 144599095 138462711 132224167 126061048 120239588
3369A20239588n449457n115154m764378m306986l923576l469467l021606k798523
$$ 120239588 114790131 109674977 104910599 100603613 96680037 93210570 90188964 87390441
3361H7390441k521110j912275j520396j404787j192099j388924k076750j872407
$$ 87390441 84869331 82957056 81436660 80031873 78839774 77450850 75374100 73501693
3353G3501693j636851j246100j035383p55723o64454n62886k14102m73805l67909
$$ 73501693 71864842 70618742 69583359 68827636 68163182 67600296 67386194 66912389 66544480
3344F6544480j84923j93176k62132k62472k93151j24489j29819J8110Q1093K2972
$$ 66544480 66359557 66166381 65904249 65641777 65348626 65224137 65094318 65112428 65193521 65216493
3334F5216493J16680J01895Q3590J74049O1507q7350j8953l40227n84991n87660
$$ 65216493 65333173 65435068 65518658 65692707 65754214 65666864 65647911 65307684 64722693 64135033
3324F4135033p26155q36355p65335q54409p73071p17963n85232o92620n82375
$$ 64135033 63408878 62572523 61807188 60952779 60179708 59461745 58876513 58183893 57601518
3315E7601518m12591k97906m33368j13756j66656M6486L33633L55286M18833N66298
$$ 57601518 57188927 56891021 56457653 56343897 56177241 56223727 56557360 56912646 57331479 57897777
3305E7897777Q75313R04194J071676J184906J486988J600356J898476J989325
$$ 57897777 58773090 59677284 60748960 61933866 63420854 65021210 66919686 68909011
3297F8909011K269904K542478K857030L109675L374892L723107L890066M167285
$$ 68909011 71178915 73721393 76578423 79688098 83062990 86786097 90676163 94843448
3289I4843448M289431M189483L791959L659580L439519L158204K923574K444666
$$ 94843448 99132879 103322362 107114321 110773901 114213420 117371624 120295198 122739864
3281A22739864J739617N58103l57093j175929j844106k558660l229665l897661
$$ 122739864 124479481 125037584 124680491 123504562 121660456 119101796 115872131 111974470
3273A11974470m386775n014968n379526n415546n350894n140332m844624m665891
$$ 111974470 107587695 102572727 97193201 91777655 86426761 81286429 76441805 71775914
3265G1775914m288959l953150l461792l126579k855398k590248k226953k127916
$$ 71775914 67486955 63533805 60072013 56945434 54090036 51499788 49272835 47144919
3257D7144919j680947j515868j523721j243455j041411j017608r83154q72918
$$ 47144919 45463972 43948104 42424383 41180928 40139517 39121909 38138755 37265837
3249C7265837o78737o09632n54234m82054n57959m47433l54862j42209l86612
$$ 37265837 36587100 35977468 35423234 34941180 34383221 33935788 33580926 33438717 33052105
3240C3052105k87846k27154k39534k69874j89522j97954r0330p4568n5969j28527
$$ 33052105 32764259 32537105 32297571 32027697 31838175 31640221 31549891 31475323 31419354 31290827
3230C1290827j90972R2397J69158M9264P6629P4334j07854L9493N0298m4033j59277
$$ 31290827 31099855 31192252 31361410 31410674 31487303 31561637 31453783 31493276 31543574 31499541 31340264
3219C1340264O8712M702j38752r7326o0463j28879j75183j09723j42268n8664
$$ 31340264 31408976 31413678 31274926 31177600 31117137 30988258 30813075 30703352 30561084 30502420
3209C0502420j32809j0535L9113N846O4788J20809j5196m1392J8901j3914Q7473
$$ 30502420 30369611 30359076 30398189 30404035 30468823 30589632 30574436 30533044 30551945 30538031 30625504
3198C0625504J39128J02757L41941J57498R6482N2367O5259k7864J90033K85846
$$ 30625504 30764632 30867389 31209330 31366828 31463310 31515677 31580936 31553072 31743105 32028951
3188C2028951J91506J80499L4858K11466L61238L56297K96453J42156J61880K49670
$$ 32028951 32220457 32400956 32435814 32647280 33008518 33364815 33661268 33803424 33965304 34214974
3178C4214974L11776L37885J60356J56593J43108L09844K58293J73733L78059
$$ 34214974 34526750 34864635 35024991 35181584 35324692 35634536 35892829 36066562 36444621
3169C6444621L45880L14498L04233L51164L96442O24983O32098N52298O01381
$$ 36444621 36790501 37104999 37409232 37760396 38156838 38781821 39413919 39966217 40567598
3160D0567598P05530N52085M05490R1782J60715K2772M460Q3666q262P2220J30355
$$ 40567598 41273128 41825213 42230703 42322485 42483200 42505972 42510432 42594098 42585836 42658056 42788411
3149D2788411J3688M0109J76976J59505J27761J90484P3454K7158J67252J95195
$$ 42788411 42802099 42842208 43019184 43178689 43306450 43496934 43570388 43597546 43764798 43959993
3139D3959993L9784J92845M33400J85983K65789L79431M02289M52075M17468L92913
$$ 43959993 43999777 44192622 44626022 44812005 45077794 45457225 45859514 46311589 46729057 47121970
3129D7121970M28521M25303N24874O07701P73365O41678N82367O45971P54919
$$ 47121970 47550491 47975794 48500668 49108369 49881734 50523412 51105779 51751750 52506669
3120E2506669N96689R08315P93310P81395O35458P41829O58592O56265O40852
$$ 52506669 53103358 54011673 54804983 55586378 56221836 56963665 57622257 58278522 58919374
3111E8919374M30419K38880r7482j44493l9001J8029K6508J84860J85049M54203
$$ 58919374 59349793 59588673 59491191 59346698 59307697 59325726 59352234 59537094 59722143 60176346
3101F0176346N53173N66809N94600N79170N11497M14661N14286P24311Q66654
$$ 60176346 60729519 61296328 61890928 62470098 62981595 63396256 63910542 64634853 65501507
3092F5501507N60730O78201R60856Q98525J047868J117193J139324J522352J712262
$$ 65501507 66062237 66740438 67701294 68599819 69647687 70764880 71904204 73426556 75138818
3083G5138818J759454J921708K206046K052317K262334K145955K274092K750831
$$ 75138818 76898272 78819980 81026026 83078343 85340677 87486632 89760724 92511555
3075I2511555K914630K982291L423561L638824L701149M163037M663337N211804
$$ 92511555 95426185 98408476 101832037 105470861 109172010 113335047 117998384 123210188
3067A23210188N989477O906295P756343Q724901R856163J0778797J1831559J3193973
$$ 123210188 129199665 136105960 143862303 152587204 162443367 173222164 185053723 198247696
3059A98247696J4533549J6198124J8081708J9570946K0347481K0294727K0927712
$$ 198247696 212781245 228979369 247061077 266632023 286979504 307274231 328201943
3052C28201943K4773551L0412652L6470914L6276429K0123120j4249872m5046258
$$ 328201943 352975494 383388146 419859060 456135489 476258609 462008737 416962479
3045D16962479n3071159m6562117l8008151l1062179k6207828k2141579j8340425
$$ 416962479 363891320 317329203 279321052 248258873 222051045 199909466 181569041
3038A81569041j5385078j3329120j1912884j1106691j0141824r641683r112456
$$ 181569041 166183963 152854843 140941959 129835268 119693444 110051761 100939305
3031A00939305p976546o973333o322297n737697n265612m579049l937067l557981
$$ 100939305 92962759 85989426 79667129 73929432 68663820 64084771 60147704 56589723
3023E6589723k944223k640455k346001k257191k277455k075582j780095j667778
$$ 56589723 53645500 51005045 48659044 46401853 44124398 42048816 40268721 38600943
3015C8600943j387900j335267j336601j306070j374160j120371q60063q72487
$$ 38600943 37213043 35877776 34541175 33235105 31860945 30740574 29880511 29008024
3007B9008024r87099q10951q66159r78914r65632q47600q50584q29807p77612
$$ 29008024 28020925 27209974 26343815 25364901 24399269 23551669 22701085 21871278 21093666
2998B1093666o90949n47638n80809n23498m17185m39512n14291o46679p08594
$$ 21093666 20402717 19855079 19274270 18750772 18333587 17894075 17379784 16733105 16024511
2989A6024511m93678o81619p07269n07224l98175l76824l70416k79049k30869
$$ 16024511 15530833 14849214 14141945 13634721 13236546 12859722 12489306 12210257 11979388
2980A1979388j78685l28809j47150j39514k46642k04304j71328l59915n19298
$$ 11979388 11800703 11471894 11324744 11185230 10938588 10734284 10562956 10203041 9683743
2971I683743k28126K869n7455k19233q6272j47278k17377k54546r5564j78000
$$ 9683743 9455617 9458486 9401031 9181798 9095526 8948248 8730871 8476325 8380761 8202761
2961H202761j377k7658k80965j65914j04415k12739l97949l12958j97923j53737
$$ 8202761 8201384 8173726 7892761 7726847 7622432 7409693 7011744 6698786 6500863 6347126
2951F347126j37555j67308l61243l26537r2283j63784k12530j06757j92845j89575
$$ 6347126 6209571 6042263 5681020 5354483 5262200 5098416 4885886 4779129 4586284 4396709
2941D396709j63220k24731j42178m5804k13444k05751j02966j04969j39739j95124
$$ 4396709 4233489 4008758 3866580 3820776 3607332 3401581 3298615 3193646 3053907 2858783
2931B858783N837o9969N1547k06791j67032j21870R994n365k11041m3058N9967
$$ 2858783 2864620 2794651 2846198 2639407 2472375 2350505 2360499 2355134 2144093 2101035 2161002
2920B161002j41921j26262q6098k05164l5314N9337j61019O616O5838P5809q1466
$$ 2161002 2019081 1892819 1806721 1601557 1566243 1625580 1464561 1471177 1537015 1612824 1531358
2909A531358J49489K16682q4137r1655j60320O070P5725J2437M1996N0439J16923
$$ 1531358 1680847 1897529 1813392 1721737 1561417 1567487 1643212 1655649 1697645 1748084 1865007
2898A865007J52701J88678M2838n3901L6193L8439L8093l8760q1310k8069R646
$$ 1865007 2017708 2206386 2249224 2195323 2231516 2269955 2308048 2269288 2187978 2159909 2169555
2887B169555L5341l614J7348p1015j54636J46769R8881j34875j15125P0352j90444
$$ 2169555 2204896 2201282 2218630 2147615 1992979 2139748 2238629 2103754 1988629 2058981 1868537
2876A868537r990p5725p4194j7002N3161J02315o3501k26311O0191L394j32631
$$ 1868537 1858547 1782822 1708628 1691626 1744787 1847102 1783601 1557290 1617481 1620875 1488244
2865A488244j14001M6100R4939P402M6548j41116j29914k3213j33589m3850N9556
$$ 1488244 1374243 1420343 1515282 1522684 1569232 1428116 1298202 1274989 1141400 1097550 1157106
2854A157106k1062J1313J8277P4082J21820j8887r1301o676o8657M6575Q6896
$$ 1157106 1136044 1147357 1165634 1239716 1361536 1342649 1251348 1244672 1176015 1222590 1309486
2843A309486q6995p4154q7301P394n4177j64144O3683J4628M7191L7301J991o7708
$$ 1309486 1222491 1148337 1061036 1068430 1014253 850109 913792 928420 975611 1012912 1014903 947195
2831I47195o8191J0262j05078l6232o6205O5869M0767l5083l0372m2845N3353
$$ 947195 879004 889266 784188 747956 681751 747620 788387 753304 722932 680087 733440
2820G33440Q5430n7080O491l3499J4874J12534J03399N8613P8711L2582o2733
$$ 733440 818870 761790 768281 734782 749656 862190 965589 1024202 1102913 1135495 1072762
2809A072762l2675N1371m0674n259J43989K991p1923J43139k0980j9215K6289
$$ 1072762 1040087 1091458 1050784 1045525 1189514 1192505 1120582 1263721 1242741 1223526 1249815
2798A249815O8367Q6353M246J62049j9905P8174P919l4419K1025j49797J2826
$$ 1249815 1318182 1404535 1408781 1570830 1550925 1629099 1637018 1602599 1623624 1473827 1486653
2787A486653P4375J0085j3269N2985Q04j2463n0747K91n7123j14415Q0498K13200
$$ 1486653 1561028 1571113 1557844 1610829 1611633 1599170 1548423 1548714 1491591 1377176 1457674 1670874
2775A670874J27338k5856J43482J17687K98398R1582J28921N2414J26059J64399
$$ 1670874 1798212 1772356 1915838 2033525 2331923 2423505 2552426 2604840 2730899 2895298
2765B895298J56653j528j55937l91969l16926j01218k55762k50465j52427n8491
$$ 2895298 3051951 3050423 2894486 2502517 2185591 2084373 1828611 1578146 1425719 1367228
2755A367228J3075j5005j07424l8490r7999j57712J11976l691k7419m4317N1787
$$ 1367228 1380303 1365298 1257874 1219384 1121385 963673 1075649 1071958 1044539 1000222 1052009
2744A052009P9499j989k03494N567Q9686j1163L6513k5992p8942j39117M5138
$$ 1052009 1131508 1129519 926025 931592 1021278 1010115 1046628 1020636 941694 802577 847715
2733H47715L7692l3083L341r6563O776q007r9157o2914j5849J74345n7394q3595
$$ 847715 885407 852324 855665 759102 765878 757871 658714 595800 579951 754296 696902 613307
2721F13307l5243l7378l4032R0626j5871l7013n6748k951n880K0441K0713R39
$$ 613307 578064 540686 506654 597280 581409 544396 487648 484697 478817 499258 519971 520910
2709E20910L014n8678p3236Q2547J10110l5061K9088P2936j66355r667Q3592r8549
$$ 520910 523924 465246 392010 474557 584667 549606 578694 651630 485275 475608 559200 460651
2697D60651L4228m1119k7059j24095P0215J1674p3325l1437N779J03811l0995
$$ 460651 494879 453760 426701 302606 372821 384495 311170 279733 285512 389323 358328
2686C58328O5702o6126j1307l0534p0897N3813J22064l4598R4481l7050p3925
$$ 358328 424030 357904 346597 316063 245166 298979 421043 386445 480926 443876 369951
2675C69951J38460k6367K5250N0447J3166L0191l7559R795N2744l1204j63527
$$ 369951 508411 482044 507294 557741 570907 601098 563539 573334 626078 594874 431347
2664D31347j6871L6066o1716L5460M0962j3934j029l1312n0144M86j410r230J4004
$$ 431347 414476 450542 388826 424286 465248 451314 450285 418973 368829 369315 367905 358675 372679
2651C72679O9263J3783j27398m0546Q2529m2800j36307M7654J34739Q765Q509
$$ 372679 441942 455725 328327 287781 370310 327510 191203 238857 373596 382361 390870
2640C90870K2301K6084q785k2897n7957N2946J6414M1995j4917n8620m2499p7175
$$ 390870 413171 439255 430470 407573 349616 402562 418976 460971 446054 387434 344935 267760
2628B67760j01o0387J15914N4698J2040J6921j4184q7260J28789r0540j65667
$$ 267760 267659 207272 323186 377884 389924 406845 392661 305401 434190 343650 177983
2617A77983N5280J34109J6111J2442M570j37120O9225p8675p5259k7342J19787
$$ 177983 233263 367372 383483 395925 400495 263375 332600 253925 178666 151324 271111
2606B71111L3811L666O4963n3777q5487p3294j8250Q7980O2912p6009m2944J42658
$$ 271111 304922 308588 373551 319774 234287 160993 142743 230723 293635 217626 174682 317340
2594C17340k6813n1186L9956j31039m4241J62770l0324j11316N9098j06015r779
$$ 317340 290527 239341 279297 148258 104017 266787 236463 125147 184245 78230 68451
2583F8451p3694N5438J07149M0319q3445l2960K1901l4284K4856k0286l5913l1332
$$ 68451 -5243 50195 157344 197663 114218 81258 103159 68875 93731 73445 37532 6200
2571F200Q4301M5512j27597R218Q7496O3565l239K8945O5250J06940k8756j62497
$$ 6200 90501 136013 8416 17634 105130 168695 165456 194401 259651 366591 337835 175338
2559A75338J68730j17599o6970K457L2150L6109J83360l3880j68431K0014O6696
$$ 175338 344068 226469 159499 161956 194106 230215 413575 379695 211264 231278 297974
2548B97974j30690K4909O4664L9252l7212j7453j28064L2369O9262j69666j09176
$$ 297974 167284 192193 256857 296109 258897 241444 113380 145749 215011 45345 -63831
2537f3831J409P5985q3497m1452J38176Q7747M5998P0005k96027P2947J44588
$$ -63831 -62422 13563 -69934 -111386 26790 114537 160535 230540 -65487 7460 152048
2526A52048j5915R5545j2228p8011J44737n0468j56655r337J29144R7500m2711
$$ 152048 136133 231678 219450 141439 286176 235708 79053 69716 198860 296360 253649
2515B53649l495k8695j09309m6922J43325m0396J0350n8677M3007N9365J3229
$$ 253649 250154 221459 112150 65228 208553 168157 178507 119830 162837 222202 235431
2504B35431r1690r0244J34128J24549o2314r9119l4183P4481J01759p8701L9036
$$ 235431 143741 53497 187625 312174 249860 150741 116558 191039 292798 214097 253133
2493B53133P2595j14550p9593R4389M6743J4704L6028M060r8473J4779n3385p8938
$$ 253133 325728 211178 131585 225974 272717 287421 323449 327509 229036 243815 190430 111492
2481A11492j22974J54398R991M9569M677L5047O791o2896J520p0619J06997J75643
$$ 111492 -11482 142916 152907 202476 207153 242200 248991 186095 187615 116996 223993 399636
2469C99636o1097o5669K5918n2399o2767n1473J14266m7211P7967O1325L9937
$$ 399636 338539 272870 298788 246389 183622 132149 246415 199204 277171 338496 378433
2458C78433J15506n5214j28759l8958p9554L9362J08632J1721K6903o0213J16388
$$ 378433 493939 438725 309966 271008 191454 230816 339448 351169 378072 317859 434247
2447D34247k3139M5422j5702k9195M1876J8552j25329J4070k1740M2843J26932
$$ 434247 411108 456530 440828 411633 453509 472061 346732 360802 339062 381905 508837
2436E08837Q6387M334N306L7547k54503r4646K5788J04742O0502O1761q0016j15730
$$ 508837 595224 599558 604864 642411 387908 293262 319050 423792 484294 546055 466039 350309
2424C50309K5705m5938R8166K7464R241J29734k7372j7518l5045K7455K3887L0536
$$ 350309 376014 330076 428242 455706 464947 594681 567309 549791 514746 542201 566088 596624
2412E96624l7940m1138j09004J48549m4611R5532m6404K5370J15983j7696K7894
$$ 596624 558684 517546 408542 557091 512480 608012 561608 586978 702961 685265 713159
2401G13159L3870N5325l3836K0k0090k876j2812L176k4248j55083O3326J54884
$$ 713159 747029 802354 768518 768538 748448 745572 732760 735936 711688 556605 619931 774815
2389G74815M7511l7675k9354N93M9634P7694q5724j64278m4285Q0483K8046N1513
$$ 774815 822326 784651 755297 755890 805524 883218 797494 633216 588931 669414 697460 748973
2377G48973n1077M7040n522L2417N3335O9168j06727L7903j7405n2383P62Q2386
$$ 748973 697896 744936 739414 771831 825166 894334 787607 825510 808105 755722 756484 838870
2365H38870Q8220q6307o1354K856J18668N7579o75p6920M6693M9757J35377J8834
$$ 838870 927090 840783 779429 782285 900953 958532 957857 880937 927630 977387 1112764 1131598
2353A131598L7639l0662j6103q0340k4003M8304N5807M210r6304O9389k5723k7996
$$ 1131598 1169237 1138575 1122472 1042132 1018129 1066433 1122240 1126450 1030146 1099535 1073812 1045816
2341A045816P9789L3971r3768J972J35498J12051p7716m3260l0866P6331J2198
$$ 1045816 1125605 1159576 1065808 1067780 1203278 1315329 1237613 1194353 1163487 1239818 1252016
2330A252016J23788q2885p1513M1774P1484R5005j04821P3563J9209O9508K25067
$$ 1252016 1375804 1292919 1221406 1263180 1334664 1429669 1324848 1398411 1417620 1487128 1712195
2319A712195N7431n6097m4181J8359P4033Q0055J08800J15178K7637K4736J48623
$$ 1712195 1769626 1713529 1669348 1687707 1761740 1841795 1950595 2065773 2093410 2118146 2266769
2308B266769J54258Q1706K12557J57615L01061K24483J41505K88969K74581J90328
$$ 2266769 2421027 2502733 2715290 2872905 3173966 3398449 3539954 3828923 4103504 4293832
2298D293832L90273M63004N37883M19873K05754M94367P49420P91981J018528
$$ 4293832 4684105 5147109 5684992 6104865 6310619 6804986 7554406 8346387 9364915
2289I364915P88041q48731j572584j076804q31336p00878p17875m81083m10122
$$ 9364915 10152956 9304225 7731641 6654837 5823501 5122623 4404748 3923665 3513543
2280C513543l11352j87455l33289j83385k03454j6420k79746q5441j36457j17727
$$ 3513543 3202191 3014736 2681447 2498062 2294608 2278188 1998442 1913001 1776544 1658817
2270A658817n2439j87048j13054j44230j45594o985P6962j61737l0230j17816
$$ 1658817 1606378 1419330 1306276 1162046 1016452 1009467 1086429 924692 894462 776646
2260G76646j56432O8041q6757n8106L4076P4273N2006o2864K4818r4786j4003
$$ 776646 620214 688255 601498 543392 577468 651741 703747 640883 665701 570915 556912
2249E56912K631k3598q3517l1074j10581M0798K2680k2307L0233j37490n1366
$$ 556912 559543 535945 452428 421354 310773 351571 374251 351944 382177 244687 193321
2238A93321N2458m7741K8862Q8109o637j25726J6123R7611m6713K3760q9108N4860
$$ 193321 245779 198038 226900 315009 308372 182646 198769 296380 249667 273427 184319 239179
2226B39179l5388j1542M8389P0018j12814o3387j5131k8729Q5169L9903k1458
$$ 239179 203791 192249 240638 310656 197842 134455 119324 90595 175764 215667 194209
2215A94209N4311Q4219m7705j17586L3248p5166r7832n975Q8042J4336n7623m8423
$$ 194209 248520 332739 285034 167448 200696 125530 27698 21723 109765 124101 66478 18055
2203A8055J1318P2474P0554j4040K473Q6665j15954m3625j7781M9009O9787J7730
$$ 18055 29373 101847 172401 158361 160834 247499 131545 87920 70139 119148 188935 206665
2191B06665k2810L5099j54389M2254J16984m3439r4694j26108k192q9419l6046
$$ 206665 183855 218954 64565 106819 223803 180364 85670 -40438 -42630 -132049 -168095
2180a68095P9771N141J20732M4265R5878m7441r4309m4679P7424r5134o8835k72
$$ -168095 -88324 -83183 37549 81814 177692 130251 35942 -8737 68687 -26447 -95282 -95554
2168i5554j3243Q2419j1106j11773o1164Q0684j138N1633J10949j05575J8889
$$ -95554 -108797 -26378 -37484 -149257 -210421 -129737 -130875 -79242 31707 -73868 -54979
2157e4979L4488n8796P9870j43146J62615J24680q1808r2050N5727m7953k1237
$$ -54979 -20491 -79287 583 -142563 20052 144732 62924 -29126 26601 -21352 -42589
2146d2589M8900j03477N2291J86425p0219k0650J5743p7910j30914J22808Q0758
$$ -42589 6311 -97166 -44875 141550 71331 50681 66424 -11486 -142400 -19592 61166
2135F1166r7267k2635J13657J23300n050p1498r3414k0825L7374K0077N2824K1445
$$ 61166 -36101 -58736 54921 178221 173171 101673 8259 -12566 24808 44885 97709 119154
2123A19154M4922J2526j60532m1529M4964L4404L1936n9448n6426J2066r4736
$$ 119154 164076 176602 16070 -25459 19505 53909 85845 26397 -30029 -17963 -112699
2112a12699J00340P8926Q463p3970o393k0084L4665j05135Q1340j3390j18251
$$ -112699 -12359 66567 75030 1060 -5333 -25417 9248 -95887 -14547 -27937 -146188
2101a46188J47523M0703l540r9385J0654L9870r112J08439j04923P8874j1668
$$ -146188 1335 42038 38498 -60887 -50233 -10363 -19475 88964 -15959 62915 51247
2090E1247p8384N8657M5415p7453M170m0909M1660N4194j10833k5527m1440P0515
$$ 51247 -27137 31520 76935 -518 3652 -37257 4403 58597 -52236 -77763 -119203 -48688
2078d8688P7671K2523J4825l2585o4830R761M3250O5638L0069j18530j71915J56528
$$ -48688 28983 51506 66331 33746 -31084 -21323 21927 87565 117634 -896 -172811 -16283
2066a6283J29658j08693k6811M7632r5129P4096J25578p5773n2885M9342j29860
$$ -16283 113375 4682 -22129 25503 -69626 4470 130048 54275 1390 50732 -79128
2055g9128q311J6967k9861K3729p4695N7306R1620O3423L412j0087J29477j4109
$$ -79128 -87439 -70472 -100333 -76604 -151299 -93993 -2373 61050 64462 54375 183852 169743
2043A69743L0279q0781l7248O6094J4050n0505R366j10477q1972r780N011K1365
$$ 169743 200022 119241 81993 148087 162137 111632 120998 10521 -71451 -81231 -76220 -54855
2031e4855m0252N3306J07548L8912p6349k8628L432M7539J17698m5312l2515J08788
$$ -54855 -95107 -41801 65747 104659 28310 -318 3114 50653 168351 123039 90524 199312
2019A99312q845J1461l7906k6020n9013m2302m4575R8574j41986l2233R3781m6040
$$ 199312 190467 201928 164022 138002 78989 36687 -7888 90686 -51300 -83533 10248 -35792
2007c5792n0360K8513m3149N1371J77831q2968O1603j06726m1226Q5558K4330
$$ -35792 -86152 -57639 -100788 -49417 128414 45446 107049 323 -40903 44655 68985
1996F8985l1886m2424J2361J09136N1181O264m0731j24220j18445N1930N4130
$$ 68985 37099 -5325 7036 116172 167353 173617 132886 8666 -109779 -57849 -3719
1985c719N3861m6516r780j04507p3559M2244k7782J61594p523m2415N237J02672
$$ -3719 50142 3626 -6154 -110661 -184220 -141976 -169758 -8164 -15687 -58102 -52865 49807
1973D9807Q8304M0898j09381M449K6783j79781m5087j1057o2451P7579J44128
$$ 49807 138111 179009 69628 74077 100860 -78921 -124008 -135065 -197516 -119937 24191
1962B4191k4229n1723k2956m2158P7146k6255n7804R0480j42888M1356k4691K9389
$$ 24191 -38 -51761 -74717 -116875 -39729 -65984 -123788 -33308 -176196 -134840 -159531 -130142
1950a30142J42505j3470j0922J15576o8950r0621M8235J31973l7101L0393J4802
$$ -130142 12363 -1107 -12029 103547 34597 -56024 -7789 124184 87083 117476 132278
1939A32278q4357r3013l5116k9402P4511K12564j29336L6214k372j5872M6730
$$ 132278 47921 -45092 -80208 -109610 -35099 177465 48129 84343 81971 66099 112829
1928A12829r2263j30986Q1072j9260j11107Q2505J26925j35813M9435L811K7795
$$ 112829 20566 -110420 -29348 -48608 -159715 -77210 49715 -86098 -36663 -32852 -5057
1917e057M144J09608Q562j28437R4324O3323j96338M6252J45861j33407m6990
$$ -5057 -913 108695 117257 -11180 83144 146467 -49871 -3619 142242 8835 -38155
1906c8155O7187j11353K3293l3758M0708K4444N7029n0456r7968q594J448O0627
$$ -38155 29032 -82321 -59028 -92786 -52078 -27634 29395 -21061 -119029 -127623 -126175 -65548
1894f5548J01230q1700M4789O0180n1092l9441K1825k3697K5111l7323r6102J29475
$$ -65548 35682 -46018 -1229 58951 7859 -31582 -9757 -33454 -8343 -45666 -141768 -12293
1882a2293L2095k166j56881P8745j22984J05480J34555n177m0348K8569k3294
$$ -12293 19802 17636 -139245 -60500 -183484 -78004 56551 51374 11026 39595 16301
1871A6301M3533L6086O0932m2395j14484M4046m2486Q4294q906O3144L6743k3649
$$ 16301 59834 95920 156852 114457 -27 44019 1533 85827 76921 140065 176808 153159
1859A53159j02381r3017j5244j1997K1436J4116n7508O5981K3967j8853J01636
$$ 153159 50778 -42239 -57483 -69480 -48044 -33928 -91436 -25455 -1488 -20341 81295
1848H1295j0779K7977M2976q4213j73451P4355M4516L4740j8880P8168o3187j20396
$$ 81295 70516 98493 141469 57256 -116195 -41840 2676 37416 18536 96704 33517 -86879
1836h6879l3868K7786M8469n1566r2354Q8397J24701P0462k16597L7570J9072
$$ -86879 -120747 -92961 -44492 -96058 -188412 -100015 24686 95148 -121449 -83879 -64807
1825f4807m3906J04619m8715l6119O4257o1103l2865j3641L5492K8471K4071Q919
$$ -64807 -108713 -4094 -52809 -88928 -24671 -85774 -118639 -132280 -96788 -68317 -44246 -35327
1813c5327O967K7308K5647M5862j28269J6992O8957j86460M7458J19245J2298
$$ -35327 -28360 -1052 24595 70457 -57812 -40820 28137 -158323 -110865 8380 20678
1802B0678L641j01711R5170m9215n8164J2703l0871J07337J95006j24916k2670
$$ 20678 24319 -77392 17778 -31437 -89601 -76898 -107769 -432 194574 69658 46988
1791D6988p9703M2521r447l4049P4120Q3638j25445L37J1343j22127N092m0366
$$ 46988 -32715 9806 359 -33690 40430 124068 -1377 -1040 10303 -111824 -106732 -147098
1779a47098Q6286K2436j6118M0074l7823j0729J1015q671l465L0897l873r9368
$$ -147098 -60812 -38376 -54494 -14420 -52243 -62972 -51957 -60628 -64093 -33196 -37069 -136437
1767a36437l5580j7988R4406J26150j00511K6372Q4275P327j60052r0625J97625
$$ -136437 -172017 -190005 -95599 30551 -69960 -43588 40687 48014 -112038 -202663 -5038
1756e038R1672q8096o011N7215m6671L0899o9537L8751R1494j08895r5163M7799
$$ -5038 86634 -1462 -7473 49742 3071 33970 -35567 3184 94678 -14217 -109380 -61581
1744f1581M7202p2667N5426r497M5873Q5017j6645j01927J62899j225p0373O3180
$$ -61581 -14379 -87046 -31620 -41117 4756 89773 73128 -28799 134100 132875 62502 125682
1732A25682L433j37192N5089R6789m3508p4694l4863J14816K2245l4867j5294
$$ 125682 129115 -8077 47012 143801 100293 25599 -9264 105552 127797 92930 77636
1721G7636q5540o7695k8205j15280K25118j17455k1866L244K4409Q3570L83O2887
$$ 77636 -7904 -75599 -103804 -219084 6034 -111421 -133287 -130043 -105634 -22064 -21681 41206
1709D1206j18746m0803J05845n6601l1712L8702N036k5555M6549o3460m1098l929
$$ 41206 -77540 -118343 -12498 -69099 -100811 -62109 -57073 -82628 -36079 -99539 -140637 -144566
1697a44566n8910J15079Q3722R7041r973j53307O730J18808j1033n25n1589m8534
$$ -144566 -203476 -88397 -4675 92366 82393 -70914 -64184 54624 43591 43066 -8523 -57057
1685e7057J2128P7238P1014K1866l2009j12146r6145o6166K6039p7152J47988
$$ -57057 -44929 32309 103323 125189 93180 -18966 -115111 -181277 -155238 -232390 -84402
1674h4402K04554P0943j22762j32076q869r3332M8697K9137Q6891p2412l5663
$$ -84402 120152 191095 68333 -63743 -72612 -165944 -117247 -88110 -1219 -73631 -109294
1663a09294Q0864L176O2599Q7370j03503l4258K6359N8137m2531K0321o8613J429
$$ -109294 -28430 -25254 37345 124715 21212 -13046 13313 71450 28919 49240 -19373 -17944
1651a7944K0267M7499P3609k15684q1313J54679P5485j18107m1288l2020j12086
$$ -17944 2323 49822 123431 -92253 -173566 -18887 56598 -61509 -102797 -134817 -246903
1640b46903J27188R4053L9749n1856l7760M9692r1352J33903O1676Q0640Q5934
$$ -246903 -119715 -25662 14087 -37769 -75529 -25837 -117189 16714 78390 159030 244964
1629B44964n8211r6966J1373j48250k5594J68015k0976M1044m3839l3297j4546
$$ 244964 186753 89787 101160 -47090 -72684 95331 74355 115399 71560 38263 23717
1618B3717j48206j4082j7684J24262Q7886p177l5266K6532j5585j00072J64143
$$ 23717 -124489 -138571 -156255 -31993 55893 48716 13450 39982 24397 -75675 88468
1607H8468M4183L4177R6904j25944R8940J4349j36785o467o8975j3480L0783m7916
$$ 88468 132651 166828 263732 137788 236728 251077 114292 107825 38850 25370 56153 8237
1595H237R489k5629k0372J5460K1593q9297L6772P0970L958O8499l4613j26028
$$ 8237 17726 -7903 -28275 -12815 8778 -80519 -43747 27223 31181 99680 65067 -60961
1583f0961l1260O7907j05913P6467L8990l1611O4100J6301j10092p9641J21772
$$ -60961 -92221 -24314 -130227 -53760 -14770 -46381 17719 34020 -76072 -155713 -33941
1572c3941J16556j95637L704J3569O1356J27677M1518m1508j45103P8654j11839
$$ -33941 82615 -113022 -109318 -95749 -34393 93284 134802 93294 -51809 26845 -84994
1561h4994m4007J119j8531N0454K52980m3672j91195N0601J22821p4571m1864
$$ -84994 -129001 -127882 -146413 -95959 157021 113349 -77846 -27245 95576 21005 -20859
1550b0859j4795p126q8093m7804J10279J5572m2833M8142L0388l1565R7273n8801
$$ -20859 -35654 -42780 -130873 -178677 -68398 -52826 -95659 -47517 -17129 -48694 48579 -10222
1538a0222K5819l8775O0065J19396j31963q5320J50526l7584k2089N8958j77876
$$ -10222 15597 -23178 36887 156283 24320 -61000 89526 51942 29853 88811 -89065
1527h9065m3643R433J74808m191j17315R5175r4676O670N0953L8173k5277K1964
$$ -89065 -132708 -123275 51533 47342 -69973 25202 -69474 -62804 -11851 26322 1045 23009
1515B3009L6345J06568m9494p2963o4688K5505L9625J9387m32J7334j34187N8828
$$ 23009 59354 165922 116428 43465 -21223 4282 43907 63294 62862 80196 -53991 4837
1503D837Q6197j53732k2215l9801L1557K2833Q0375J2606L939M7041L135J4927
$$ 4837 91034 -62698 -84913 -124714 -93157 -70324 10051 22657 26596 73637 76772 91699
1491I1699k5061j8481n234k1463M570M8353j7556P3369J5786j55912o065o7128
$$ 91699 66638 48157 42923 21460 26030 74383 56827 130196 145982 -9930 -15995 -83123
1479h3123Q4290m5776M8772J09201q4965K4425K8142N8273k2560j8469K4695j37346
$$ -83123 1167 -44609 4163 113364 28399 52824 80966 139239 116679 98210 122905 -14441
1467a4441N4565J01524q1715K5170k2928K5781n8911J3132J5905l2675J21967
$$ -14441 40124 141648 59933 85103 62175 87956 29045 42177 58082 25407 147374
1456A47374j40705j09279J02727r1718L6527Q3459K5257j28004q5621R9352Q4218
$$ 147374 6669 -102610 117 -91601 -55074 28385 53642 -74362 -159983 -60631 23587
1445B3587K6702o0813n2026J9248l4453Q6629n6411l7488N8120m2522M0898p9027
$$ 23587 50289 -10524 -62550 -43302 -77755 8874 -47537 -85025 -26905 -69427 -28529 -107556
1433a07556P3200m3673R4216p6144M6691L9443o113l5278K2626m2794n0201O8404
$$ -107556 -34356 -78029 16187 -59957 -13266 26177 20064 -15214 7412 -35382 -85583 -17179
1421a7179m7627o2527J02867j2815N874J88339k9843j57272p4140L9510J59827
$$ -17179 -64806 -127333 -24466 -37281 -31407 156932 127089 -30183 -104323 -64813 95014
1410I5014q1027j51323L5705J73976k9317r8950J31920J0709q7375j04788n4500
$$ 95014 13987 -137336 -101631 72345 43028 -55922 75998 86707 -668 -105456 -159956
1399a59956O0992l342p7429L4868J67549R2478j27955N413P937j4063J9367P0446
$$ -159956 -98964 -102306 -179735 -144867 22682 115160 -12795 -7382 555 -13508 5859 76305
1387G6305l9478K6476N677j06363j66237m6476O7457M6599M9844J18043J6678
$$ 76305 36827 63303 68980 -37383 -203620 -250096 -182639 -136040 -86196 31847 48525
1376D8525k5677m3463L3017j04834Q6189k7015J2070P4188j0164j03961J445J09533
$$ 48525 22848 -20615 12402 -92432 -6243 -33258 -21188 53000 42836 -61125 -59680 49853
1364D9853J0065j79133q7679J25269L5961P4569M5350o904k8764l0729J29874
$$ 49853 59918 -119215 -206894 -81625 -45664 28905 74255 67351 38587 7858 137732
1353A37732N6557k1741j4809R5643j37424j78779J5773n354K6232L6537J9583
$$ 137732 194289 172548 157739 253382 115958 -62821 -47048 -52402 -26170 10367 29950
1342B9950o5523P288J7715M8560j7611R4759M635l8935J0395K4362j18656J06827
$$ 29950 -35573 -28285 -10570 37990 20379 115138 119773 80838 91233 115595 -3061 103766
1330A03766j04094J1033j828k0074J0606r66M0985r4536J1227J19159l4378m5724
$$ 103766 -328 10705 8877 -11197 -591 -1557 39428 -55108 -43881 75278 40900 -4824
1318d824M8533J6358k2088j71904R4455P2016J3892O8456k3050n7842M3918r4477
$$ -4824 43709 60067 37979 -133925 -39470 32546 46438 114894 91844 34002 77920 -16557
1306a6557O8283L3664j48300J4674K1078J39466K2833q0509q682n643j45614O2114
$$ -16557 51726 85390 -62910 -48236 -27158 112308 135141 54632 45950 40307 -105307 -43193
1294d3193J04697j2226n5059J335K9047Q4056n8222n7971L9793J1345N585P8108
$$ -43193 61504 49278 -5781 -4446 24601 108657 50435 -7536 32257 43602 49187 127295
1282A27295j32218n2419P5007q3702L2250J33257p8539k9993J1098o3763q9240
$$ 127295 -4923 -57342 17665 -66037 -33787 99470 20931 -9062 2036 -61727 -150967
1271a50967K1468J35074K2017N2897r077J5130j30895Q6401J08715k18882k4845
$$ -150967 -129499 5575 27592 80489 71412 86542 -44353 42048 150763 -68119 -92964
1260i2964P1436Q3J915M1938P6239j26154M1726j696p4898L1441L2108m4716N8097
$$ -92964 -21528 -21445 -19530 22408 98647 -27507 14219 12523 -62375 -30934 1174 -43542 14555
1247A4555j730K6286m9390O0119P2092Q9884j08374j85667k2135K3832m925M4908
$$ 14555 12825 39111 -10279 49840 121932 211816 103442 -82225 -104360 -80528 -85453 -40545
1235d0545M2790J58982K0713L394j6871r1969P5231j53182R3698K3394o9200q2707
$$ -40545 2245 161227 181940 185334 168463 76494 151725 -1457 92241 115635 46435 -36272
1223c6272L2168M2869k0460n8709k6434k6480J217R1988P1711P1295j68296p2492
$$ -36272 -4104 38765 18305 -40404 -66838 -93318 -92101 -113 71598 142893 -25403 -97895
1211i7895J08073n293l2647K2699j21074m1630Q6691L0145M1817n6442o2926m3178
$$ -97895 10178 4885 -27762 -5063 -126137 -167767 -81076 -50931 -9114 -65556 -128482 -171660
1199a71660J45868l346n3082R5650M7344J1617K4537P425j20130J1078j8436R2532
$$ -171660 -25792 -29138 -82220 13430 60774 72391 96928 104353 -15777 -4699 -23135 69397
1187F9397l7997p7609J2111j4541m5489l2953m5788j11835Q2006R7067P8948p6005
$$ 69397 31400 -46209 -34098 -48639 -94128 -127081 -172869 -284704 -202698 -105631 -26683 -102688
1175a02688n2754m376J7829M7773n7922m5919l142Q0986J76628Q7947j0235j36598
$$ -102688 -155442 -159818 -141989 -94216 -152138 -198057 -201199 -120213 56415 144362 134127 -2471
1163b471J4446N5598l6294K9452j45959l9707M6850q497j08794P5499J75596L9824
$$ -2471 11975 67573 31279 60731 -85228 -124935 -78085 -86582 -195376 -119877 55719 95543
1151I5543l3857o3118k5174Q6105L0127k5041k4879l5616j18630M5740J02442
$$ 95543 61686 -1432 -26606 59499 89626 64585 39706 4090 -114540 -68800 33642
1140C3642N7834q6993r9724K6035q5156N8666Q6101M7884j00066Q2525R02k423
$$ 33642 91476 4483 -95241 -69206 -154362 -95696 -9595 38289 -61777 20748 21650 19227
1128A9227K7655J87056j18736j72908N7219Q179k6266L5645M7933N0395j60735
$$ 19227 46882 233938 115202 -57706 -487 7692 -18574 17071 65004 115399 -45336
1117d5336N2649J57409r7182k8477M5061j2320l6129j19315o974R3871k3208R0518
$$ -45336 7313 164722 67540 39063 84124 71804 35675 -83640 -90614 3257 -19951 70567
1105G0567o8058k6399q2859R8009J2462j6869M8611M1431O077P170k03454j8555
$$ 70567 2509 -23890 -106749 -8740 3722 -13147 35464 76895 82972 90142 -113312 -131867
1093a31867J6672m2482J12440J31732o4727j44189j8145J92447J36214j65959
$$ -131867 -115195 -157677 -45237 86495 21768 -122421 -140566 51881 188095 22136
1083B2136m6317p616J6735q4160l203L9562O713J4376n5875k6803J36184J19141
$$ 22136 -24181 -31797 -15062 -99222 -102425 -62863 -56150 -41774 -97649 -124452 11732 130873
1071A30873k4q5277j2182m357M032l1343K0529p6711j8634J29408l3136k59j9102
$$ 130873 130849 45572 33390 29033 33065 1722 22251 -54460 -73094 56314 23178 22919 3817
1058C817j66506L1937Q059J02364M3318k0203l9986L7047o6505J4292J64096n6804
$$ 3817 -162689 -130752 -122693 -20329 22989 2786 -37200 -153 -66658 -52366 111730 54926
1046E4926n4567J695K3745p513n687K8134J25926Q1931j52153o5878R3056J5868
$$ 54926 359 2054 25799 18286 12599 40733 166659 248590 96437 30559 123615 139483
1034A39483j13816j28418K8569J29303P9532m2330o6665M8552o650N4614J8440
$$ 139483 25667 -102751 -74182 55121 134653 92323 25658 74210 67560 122174 140614
1023A40614r6753P7197m7139Q4300o3706j36845o4298Q5799m9608J40561K183
$$ 140614 43861 121058 73919 158219 94513 -42332 -106630 -20831 -70439 70122 72305
1012G2305n3216N6784K583l7891o0918j09637J16700k9179j7333Q8795j3679j80163
$$ 72305 19089 75873 78456 40565 -20353 -129990 -13290 -42469 -59802 28993 15314 -164849
1000a64849J67885l157j09694J46671N3231K3218k1865K4031j28817j29121Q8427
$$ -164849 3036 -121 -109815 36856 90087 113305 91440 115471 -13346 -142467 -54040
989e4040R8153Q3104m338o9874K1636j41946J12156P9708j48095k94492O9918
$$ -54040 44113 127217 122879 53005 74641 -67305 44851 124559 -23536 -318028 -248110
978b48110P9667R2232j3679M5206J9457j9754R3844Q0193j61705n2916M42l1392
$$ -248110 -168443 -76211 -89890 -44684 -25227 -44981 48863 129056 -32649 -85565 -85123 -116515
966a16515M4676Q2755O0220j27585K1068P7206M0423K1649J9752P0462m8619m4197
$$ -116515 -71839 10916 71136 -56449 -35381 41825 82248 103897 123649 194111 145492 101295
954A01295n9379r7947Q4755M6219l0176n7922r6863J91899m9015J7319M6565n9773
$$ 101295 41916 -56031 28724 74943 44767 -13155 -110018 81881 32866 50185 96750 36977
942C6977n8449k0738K2171l4162m2319n5462J58326J22312l1326N2961n6829j12174
$$ 36977 -21472 -42210 -20039 -54201 -96520 -151982 6344 128656 97330 150291 93462 -18712
930a8712r6945Q5525R9938k34695K4352J46425J26498k4248j78576M6025L3525
$$ -18712 -115657 -30132 69806 -164889 -140537 5888 132386 108138 -70438 -24413 9112
919I112J4512o4821k9531N5362o5973k7063M4704J61091J8200m4282O936Q9949
$$ 9112 23624 -41197 -70728 -15366 -81339 -108402 -63698 97393 115593 71311 78247 168196
907A68196j23266k1427R878Q5264o9626J00579j9266J3987m2903l319K0315n7381
$$ 168196 44930 23503 33381 118645 49019 149598 130332 144319 101416 98097 118412 61031
895F1031P5750j2850j94712R518k4775J69248o724j32678P6203O00N8576j21190
$$ 61031 136781 123931 -70781 -61263 -86038 83210 76486 -56192 20011 20611 79187 -42003
883d2003n8667M102P1638k1545N8447o185P8045r9388L0417K1856Q1690L700N0409
$$ -42003 -100670 -96568 -24930 -46475 11972 5787 83832 -15556 14861 36717 118407 122107 172516
870A72516k04276j01973J39652J26873O723q654n1532p7993L737J01803J2915
$$ 172516 -31760 -133733 5919 132792 139515 130861 79329 1336 5073 106876 119791
859A19791o7038l2357N9525l6234n4504K5608L5146l5825p4427O508n9536J49367
$$ 119791 52753 20396 79921 43687 -10817 14791 49937 14112 -60315 -53807 -113343 36024
847C6024J27883j09317j24974Q2359K301k9748P1091Q4103O0379K7997j06537
$$ 36024 163907 54590 -70384 11975 14276 -15472 55619 139722 200101 228098 121561
836A21561n8175j2776J8091n0122j24566R8612R5760j55390J11031O4893r4311
$$ 121561 63386 50610 68701 18579 -105987 -7375 88385 -67005 44026 108919 14608
825A4608O5079J3581p4294j04989O3205J6015m5215O7916K2802m3463P521k5618
$$ 14608 79687 93268 18974 -86015 -22810 -6795 -52010 15906 38708 -4755 2766 -22852
813b2852j1607J58087J9487n9853j71061J27429P3001j17650p3322m0067O7990
$$ -22852 -34459 123628 143115 83262 -87799 39630 112631 -5019 -78341 -118408 -50418
802e0418L6170R619N9182P3880j25858l6421R4870j12690l6593K3664M7371k7995
$$ -50418 -14248 -4629 54553 128433 2575 -33846 61024 -51666 -88259 -64595 -17224 -45219
790d5219l4278P0661l4073L6202Q2199P0171j86218j42884P5761J0508R3417R8663
$$ -45219 -79497 -8836 -42909 -6707 75492 145663 -40555 -183439 -107678 -97170 -3753 94910
778I4910j50357j44852Q1318J73883N5584q9993p4675N570M4657L2738P9483j16513
$$ 94910 -55447 -200299 -118981 54902 110486 20493 -54182 -48612 -3955 28783 108266 -8247
766h247K453j4900L4705L6953p0397j22213l8317Q9766P521K6989L9890K503j03261
$$ -8247 -5794 -20694 14011 50964 -19433 -141646 -179963 -90197 -82676 -55687 -15797 -13294 -116555
753a16555O3354K1448M0413l9598j4057J14756l1640j0842J25615L169j14106
$$ -116555 -53201 -31753 8660 -30938 -44995 69761 38121 27279 152894 156063 41957
742D1957j8724p6639j17565Q4201j828o6114J26403J5223j12322J12576P6149
$$ 41957 23233 -53406 -170971 -86770 -88598 -154712 -28309 -13086 -125408 -12832 63317
731F3317R3310j31937L125J3576l8159l1469J714J3263m4586L5413M8780L395
$$ 63317 156627 24690 27815 41391 3232 -28237 -26523 -13260 -57846 -22433 26347 29742
719B9742r4713J05394K2290R477n5938j6315l0070n9876j830p104N553R8112N8218
$$ 29742 -64971 40423 62713 72190 16252 -63 -30133 -90009 -91839 -98943 -93390 4722 62940
706F2940K8973L4374K1617k1227J2774l7242K0883m2079o7450m8730K9517J9924
$$ 62940 91913 126287 147904 126677 139451 102209 123092 81013 13563 -35167 -5650 14274
694A4274k4381n2965q9336K765R1573J98473m4322o3843j72555l6976J04154K8305
$$ 14274 -10107 -63072 -152408 -149643 -58070 140403 96081 32238 -140317 -177293 -73139 -44834
682d4834L6820M5235R1401L0745j07959O2594q1363l8920j9138n634J5312r1482
$$ -44834 -8014 37221 128622 159367 51408 114002 32639 -6281 -25419 -31053 -15741 -107223
670a07223j5436O2663K1866m2586M0846R150N8356n0336r0983j9987J12227K0182
$$ -107223 -122659 -59996 -38130 -80716 -39870 -30720 27636 -22700 -113683 -133670 -21443 -1261
658a261J28369j3807n2142p1221n7089o698J05212K7663j6136q9458k3673O3134
$$ -1261 127108 113301 61159 -10062 -67151 -73849 31363 59026 42890 -46568 -70241 -7107
646g107O3628J00680j41677L147o069r6371M1878J63509M0495q6052N3296J673
$$ -7107 56521 157201 15524 18671 12602 -83769 -41891 121618 162113 76061 129357 131030
634A31030j36608j5514P4566m0582l311M6264R3920n9499J5996L1256o3247K3971
$$ 131030 -5578 -21092 53474 12892 9581 55845 149765 90266 106262 137518 74271 98242
622I8242l0205M246j96308n85J12521M9642J9490L0763r6191j8105k957O7369
$$ 98242 68037 72283 -124025 -124610 -12089 37553 57043 87806 -8385 -26490 -29447 37922
610C7922l4338L9440J62183n8527j59767j13078K1159n93o5024L3238N4019K6139
$$ 37922 3584 43024 205207 146680 -13087 -126165 -105006 -105599 -170623 -137385 -83366 -57227
598e7227n7678R4854k5078J99m7554J8902l9429L7964j6922o5305R8281M382K3244
$$ -57227 -114905 -20051 -45129 -44930 -92484 -73582 -113011 -75047 -91969 -157274 -58993 -54611 -31367
585c1367L0568l6400q7404R5706m0265k6335K073J5726P5879o478n7219K4337
$$ -31367 -799 -37199 -124603 -28897 -69162 -95497 -93424 -77698 -1819 -8297 -65516 -41179
573d1179J943K0143l3132j21913R469N6832J58174j2426j06455Q1968k4843M0923
$$ -41179 -39236 -19093 -52225 -174138 -164669 -107837 50337 37911 -68544 13424 -11419 29504
561B9504r990M030p5442K6458p6924L3282P1437M215j4588j04937k4074L1791
$$ 29504 19514 23544 -51898 -25440 -102364 -69082 2355 6570 -8018 -112955 -137029 -105238
549a05238P8266r0318J28120N2898K5445q8646j16133M6447k8884J64420P5620
$$ -105238 -26972 -117290 10830 63728 89173 527 -115606 -69159 -98043 66377 141997
538A41997p5685j16576J14458K1263p7614L6367j547Q161o6921k2022j2382m8914
$$ 141997 66312 -50264 64194 85457 7843 44210 42663 50824 -16097 -38119 -50501 -99415
526i9415k1166N7482N6546o8167m2949N5305L444Q5446M8638j70951J5568P621
$$ -99415 -120581 -63099 -6553 -74720 -117669 -62364 -58920 26526 75164 -95787 -80219 -72598
514g2598J31959m2800p6286l1458J62116o3996l4474j6723o353m6539n6586k0887
$$ -72598 59361 16561 -59725 -91183 70933 6937 -27537 -44260 -50613 -97152 -153738 -174625
502a74625K08029N2228m8373m4924J9145m3736r873l7191k3693J49947q2023j0975
$$ -174625 33404 85632 37259 -7665 11480 -32256 -42129 -79320 -103013 46934 -35089 -46064
490d6064M3231L6204K2963n3339O003M6155l167r4184j36928J07243L9144Q8633
$$ -46064 -2833 33371 56334 2995 8998 55153 51986 -42198 -179126 -71883 -32739 55894
478E5894q39P8756n1393J2718l7844o484r2917N7165M845K9645M5097K8388j23495
$$ 55894 55055 133811 82418 95136 57292 50808 -42109 15056 19901 49546 94643 123031 -464
465d64M8126L4007j2811j48050P0465J25120L2791j33041J07173j5539p7346n2503
$$ -464 47662 81669 68858 -79192 -8727 116393 149184 16143 123316 107777 30431 -22072
453b2072K5277Q4067j03735q4524L1129J18967p6213M9912P0753k4142k868L9777
$$ -22072 3205 87272 -16463 -100987 -69858 49109 -27104 22808 93561 69419 66551 106328
441A06328n8110r9977j1699R3895N405n2996R2637n555o1375K6462L2613q3232
$$ 106328 48218 -51759 -63458 30437 35842 -17154 75483 69928 8553 35015 67628 -15604
429a5604j39700J37691M3337p1201j09970l8547M529J47300n4209J78957J12886
$$ -15604 -155304 -17613 25724 -45477 -155447 -193994 -189465 -42165 -96374 82583 195469
418A95469j27453P6572p7546j36988R1069o1716j009J11936M4826j31968j47718
$$ 195469 68016 144588 67042 -69946 21123 -40593 -41602 70334 115160 -16808 -164526
407a64526J9727R6838N2742j8824l2511L8460j5647m0385P4429j8028n6464j8822
$$ -164526 -144799 -47961 4781 -14043 -46554 -8094 -23741 -64126 10303 -7725 -64189 -83011
395h3011P554P0258r9189r3110J78355J63082j09377j18766P5321j362j56442
$$ -83011 -75457 -5199 -104388 -197498 -19143 143939 34562 -84204 -8883 -10245 -166687
384a66687J12895r3201j5645j9986J38959J3167r8835K6714M9408J31279k29272
$$ -166687 -53792 -146993 -162638 -182624 -43665 -30498 -129333 -102619 -53211 78068 -151204
373a51204K0273m2026J1092o706K8834N6379P821r37L2360K1979k9562l2095o5225
$$ -151204 -130931 -172957 -161865 -168571 -139737 -83358 -75537 -76474 -44114 -22135 -51697 -83792 -149017
360a49017J4870J21942n5684N0925J24710k9368k6464o5870l4453N8943n7802
$$ -149017 -134147 -12205 -67889 -16964 107746 78378 51914 -13956 -48409 10534 -47268
349d7268m3725M1598o1679R6024L5347o91r0131l5788j3772J07684k881k7213
$$ -47268 -90993 -49395 -111074 -15050 20297 19606 -70525 -106313 -120085 -12401 -15282 -42495
337d2495l1516K3875J47032o4175k4711R056P118O832N482p5973P5925l0729K8794
$$ -42495 -74011 -50136 96896 32721 8010 17066 24184 31016 36498 -39475 36450 5721 34515
324C4515k7923j9634O0905m6558l7740m7010j5333K809k7381n9551L4960L2563
$$ 34515 6592 -13042 47863 1305 -36435 -83445 -98778 -95969 -123350 -182901 -147941 -115378
312a15378J3515J1122J4514P5672j1270r6742O239o7959Q5464J73077N7511j83848
$$ -115378 -101863 -90741 -76227 -555 -11825 -108567 -102328 -170287 -84823 88254 145765 -38083
300c8083j13750p9566o975R2983K6142J4357J23975q2065o4660J30902J33267
$$ -38083 -151833 -231399 -238374 -145391 -119249 -104892 19083 -62982 -127642 3260 136527
289A36527R3830j70413k29804p9612K16151Q3761p407j50386r8899J35193P9399
$$ 136527 230357 59944 -169860 -249472 -33321 50440 43033 -107353 -206252 -71059 8340
278H340M2073Q7042j20496k04281Q061M8659M5921K107q566N2413m3069J23661
$$ 8340 50413 137455 16959 -187322 -179261 -130602 -84681 -82574 -91140 -38727 -81796 41865
266D1865P0859k5836j28278k2247K0418j1469J01021n8651Q9269p4049j69426
$$ 41865 112724 86888 -41390 -63637 -43219 -54688 46333 -12318 76951 2902 -166524
255a66524N7074L1801J5818j1193p8426J42377O230L71o0857k1685L3445K0779
$$ -166524 -109450 -77649 -61831 -73024 -151450 -9073 -2843 -2472 -63329 -85014 -51569 -30790
243c0790N1338j25535M1768j22410P4690j00855O9218J6898r4026J34647R2612
$$ -30790 20548 -104987 -63219 -185629 -110939 -211794 -142576 -125678 -219704 -85057 7555
232G555o4604r8458K4731m8157M333n0392L0907R9375K9819l707M8803j50549
$$ 7555 -57049 -155507 -130776 -178933 -174600 -224992 -194085 -94710 -64891 -68598 -19795 -170344
220a70344k444J7861N0486L3769O4150p4793o5116J0654P3807l1955K583J74497
$$ -170344 -172788 -154927 -104441 -70672 -6522 -81315 -146431 -135777 -61970 -93925 -91342 83155
208H3155K3527n9272j06040M5807k4977J5446r4859n7954j6299Q9557J31704q9033
$$ 83155 106682 47410 -58630 -12823 -37800 -22354 -117213 -175167 -191466 -101909 29795 -59238
196e9238r765P9236q2350k5773O7241N1178m853k4149J0805q2655l1851P7091
$$ -59238 -69003 10233 -72117 -97890 -30649 20529 15676 -8473 2332 -80323 -112174 -35083
184c5083Q2470m1404j57529J00902l7201m4946N4129P7549Q2041j46065K4565
$$ -35083 47387 5983 -151546 -50644 -87845 -132791 -78662 -1113 80928 -65137 -40572
173d0572Q2674R381p9686N8115n0152J959L0065j26023L2863k0748J5962J82560
$$ -40572 42102 51483 -28203 29912 -20240 -18281 11784 -114239 -81376 -102124 -86162 96398
161I6398l2527j18109q9320p1043J94768L3279n2786L0215r4737N4402Q0626K8616
$$ 96398 63871 -54238 -143558 -214601 -19833 13446 -39340 -9125 -103862 -49460 31166 59782
149E9782o962j61287K9794J28313j92408K8419j5327P9181J4793k1119N5698j2367
$$ 59782 52820 -108467 -78673 49640 -142768 -114349 -129676 -50495 -35702 -56821 -1123 -13490
137a3490N8102o0180K6798M5180n2640o1175K1993M9456M28j38981Q8602l3384
$$ -13490 44612 -15568 11230 56410 3770 -57405 -35412 14044 14472 -124509 -35907 -69291
125f9291o969Q2332j7395r8189P5249R0735L6737k4811p6790M8176m2878r1614
$$ -69291 -76260 6072 -11323 -109512 -34263 56472 93209 68398 -8392 39784 -3094 -94708
113i4708O1067p051J1547l1317R5099p1178j27381K8243K1506N608L5090o5546
$$ -94708 -33641 -40692 -29145 -60462 34637 -36541 -163922 -135679 -114173 -108565 -73475 -139021
101a39021j1975J53263n4366m484j094O1881O952j37154o8946P548Q5489Q3316
$$ -139021 -150996 2267 -52099 -56583 -57677 4204 11156 -125998 -194944 -187396 -101907 -18591
89a8591N8348L9896j02530p7213o4005J17179P2765m1220j11044K6223J6211m6714
$$ -18591 39757 79653 -22877 -100090 -164095 -46916 25849 -15371 -126415 -100192 -83981 -130695
77a30695K1775P8704k9124O2075k8251n011J9926l0959o7651n2336J40577L982
$$ -130695 -108920 -30216 -59340 2735 -25516 -30527 -10601 -41560 -109211 -161547 -20970 -16988
65a6988q7689N3593J12985j32874l0739n4848M1049J21167L6003p0009k7807J6797
$$ -16988 -104677 -51084 61901 -70973 -101712 -156560 -115511 5656 41659 -28350 -56157 -39360
53c9360q9226L7618j5975K5328m0552J19922k1542r6615P7196l4068K2744k3936
$$ -39360 -128586 -90968 -106943 -81615 -122167 -2245 -23787 -120402 -43206 -77274 -54530 -78466
41g8466q346J0707q915K8043l0624j04505N3626K0715m2335J15087P7574l357
$$ -78466 -86812 -76105 -85020 -56977 -87601 -192106 -138480 -117765 -160100 -45013 32561 29204
29B9204q2163J9987q9357J7148P9962O0452m2003L4005m7845p8332J0789m3986
$$ 29204 -52959 -32972 -122329 -105181 -25219 35233 -6770 27235 -20610 -98942 -88153 -132139
17a32139k0108L8179J00894j6346m584P748K6310J6148p2013Q672J3139K3498
$$ -132139 -152247 -114068 -13174 -29520 -34104 -26356 -46 16102 -55911 -47239 -34100 -10602
5a0602J1749J4454k4936q697J0275
$$ -10602 1147 15601 -9335 -18032 -7757
0g757
$$ -7757
$$ Imaginary data points
##PAGE= N=2
##DATA TABLE= (X++(I..I)), XYDATA
16383b939434k2578k8423J7063m0130M5068J25994M9933O1867M0648K883K3416
$$ -2939434 -2962012 -2990435 -2973372 -3013502 -2968434 -2842440 -2792507 -2730640 -2689992 -2687109 -2663693
16372b663693J7756N5458J39628Q329j039j6600n057K4897J10440K7228J10073
$$ -2663693 -2645937 -2590479 -2450851 -2442522 -2443561 -2460161 -2465218 -2440321 -2329881 -2302653 -2192580
16361b192580J3269m3917L1012Q822J02354M8638Q4002O5893P3394j9883J7204
$$ -2192580 -2179311 -2223228 -2192216 -2183394 -2081040 -2032402 -1948400 -1882507 -1809113 -1828996 -1811792
16350a811792m2525N0865K8387Q8770J43587l1063n3076L2495M7182J13007J4248
$$ -1811792 -1854317 -1803452 -1775065 -1686295 -1542708 -1573771 -1626847 -1594352 -1547170 -1434163 -1419915
16339a419915J8175J01941o369q203L5624J4546K5965K6134Q3680Q7708q1082
$$ -1419915 -1401740 -1299799 -1306168 -1314371 -1278747 -1264201 -1238236 -1212102 -1128422 -1040714 -1121796
16328a121796M9054O2186Q1244j2898K6072J34052N7862N5650j143j0009n2657
$$ -1121796 -1072742 -1010556 -929312 -942210 -916138 -782086 -724224 -668574 -669717 -679726 -732383
16317g32383K2964K6888R5916m1893J13591m0983o0385L1624J57260K3205Q1215
$$ -732383 -709419 -682531 -586615 -628508 -514917 -555900 -616285 -584661 -427401 -404196 -322981
16306c22981J37489L5133l5461K28N0793N0859K7866K0757J28662J6283L9489
$$ -322981 -185492 -150359 -185820 -185592 -134799 -83940 -56074 -35317 93345 109628 149117
16295A49117P2115p0762n7275M0986L779J7156j0593J22623P582J7524n3596N4834
$$ 149117 221232 150470 93195 134181 137960 155116 144523 267146 274728 292252 238656 293490
16283B93490K01294L4950K7264n0483k5725p3594J72386Q6404J7689O7800m0147
$$ 293490 494784 529734 556998 506515 480790 407196 579582 665986 683675 751475 711328
16272G11328j657j8376n2548O0707P8847J10274o800n5516K0381M6623k6214J7757
$$ 711328 709671 691295 638747 699454 778301 888575 881775 826259 846640 893263 867049 884806
16260H84806q716L4326p4785P4090J34734Q3023n5757q6022J9172J18494Q7468
$$ 884806 876090 910416 835631 909721 1044455 1127478 1071721 985699 1004871 1123365 1210833
16249A210833j03691k5262J1971J35795j1742L6399M9474Q9626j21943p919J06607
$$ 1210833 1107142 1081880 1093851 1229646 1217904 1254303 1303777 1393403 1271460 1263541 1370148
16238A370148J61497M9678p5017P4839k3995L933m3536J5754N3833M052m896k4443
$$ 1370148 1531645 1581323 1506306 1581145 1557150 1561083 1517547 1533301 1587134 1591186 1586290 1561847
16226A561847M7887q2932R3905J14161m4960M7561j563j1763J12473l3171J01842
$$ 1561847 1609734 1526802 1620707 1734868 1689908 1737469 1735906 1724143 1836616 1803445 1905287
16215A905287m992j9115j5757q7221O5277J12994l4741j08578J59328M9668p6830
$$ 1905287 1900295 1881180 1865423 1778202 1843479 1956473 1921732 1813154 1972482 2022150 1945320
$$ [...]
##END NTUPLES=NMR SPECTRUM
##END=
