##TITLE=1H_CG-1042-G
 200.13MHz, CDCl3,
 8 sc
 
 15.8.2025
##JCAMPDX= 6.0         $$ Bruker NMR JCAMP-DX V2.0
##DATA TYPE= NMR SPECTRUM
##DATA CLASS= NTUPLES
##ORIGIN= UXNMR, Bruker Analytische Messtechnik GmbH
##OWNER= pz
$$ XWIN-NMR		Version 3.5
$$ Fri Aug 15 14:40:23 2025 Russian Standard Time (UT+4h)  she@DPX200
##.OBSERVE FREQUENCY= 200.1313
##.OBSERVE NUCLEUS= ^1H
##.ACQUISITION MODE= SIMULTANEOUS
##.ACQUISITION SCHEME= undefined
##.AVERAGES= 8
##.DIGITISER RES= 18
##SPECTROMETER/DATA SYSTEM= spect
##.PULSE SEQUENCE= zg30
##.SOLVENT NAME= CDCl3
##.SHIFT REFERENCE= (INTERNAL, CDCl3, 0, 15.5893)
##AUDIT TRAIL= $$ (NUMBER, WHEN, WHO, WHERE, WHAT)
$$ ##TITLE= Audit trail, XWIN-NMR		Version 3.5
$$ ##JCAMPDX= 5.01
$$ ##ORIGIN= Bruker BioSpin GmbH
$$ ##OWNER= she
$$ F:/spectra/data/she/nmr/H-C/1/pdata/1/auditp.txt
$$ ##AUDIT TRAIL=  $$ (NUMBER, WHEN, WHO, WHERE, WHAT)
(   1,<2025-08-15 14:38:56.31 +0400>,<she>,<DPX200>,
      <created by zg, POWCHK disabled, PULCHK disabled
       configuration hash MD5:
       00 E9 B6 7A A2 85 ED C7 34 08 36 98 17 FE 4E 26
       data hash MD5: 16K
       63 EA 1A B0 2B A3 96 8B 02 FC CF 98 4C A3 39 50>)
(   2,<2025-08-15 14:38:58.75 +0400>,<she>,<DPX200>,
      <Start of raw data processing
       efp BC_mod = 2 LB = 0.25 FT_mod = 6 PKNL = 1 PHC0 = -1723.582 PHC1 = 16.39228 SI = 16K 
       data hash MD5: 16K
       83 D1 1E 49 E1 02 AB 25 F6 03 5C A8 D5 EA 39 05>)
(   3,<2025-08-15 14:39:17.84 +0400>,<she>,<DPX200>,
      <pk PHC0 = 4.878046 PHC1 = -4.6 
       data hash MD5: 16K
       30 B7 CA 00 58 2D E3 F1 E5 6B 14 48 12 AB 7F 15>)
(   4,<2025-08-15 14:39:21.75 +0400>,<she>,<DPX200>,
      <abs ABSG = 5 
       data hash MD5: 16K
       70 CA 05 81 60 68 3E 03 B2 EB 7E 52 C8 D2 FA D2>)
$$ ##END=
$$ 
$$ hash MD5
$$ 36 17 D5 E9 B4 AA 61 A4 F9 DF 7F 95 2F F0 78 7A
##$RELAX= 
##$RELAX= 
##$RELAX= 
##$RELAX= 
##$RELAX= 
##$RELAX= 
$$ Bruker specific parameters
$$ --------------------------
##$DU= <F:/spectra>
##$EXPNO= 1
##$NAME= <H-C>
##$PROCNO= 1
##$TYPE= <nmr>
##$USER= <she>
##$AMP= (0..31)
100 100 100 100 100 100 100 100 100 100 100 100 100 100 100 100 100 100 
100 100 100 100 100 100 100 100 100 100 100 100 100 100 
##$AQSEQ= 0
##$AQ_mod= 1
##$AUNM= <au_zg>
##$AUTOPOS= <>
##$BF1= 200.13
##$BF2= 200.13
##$BF3= 200.13
##$BF4= 200.13
##$BF5= 200.13
##$BF6= 200.13
##$BF7= 200.13
##$BF8= 200.13
##$BYTORDA= 1
##$CFDGTYP= 0
##$CFRGTYP= 5
##$CHEMSTR= <none>
##$CNST= (0..31)
1 1 145 1 1 1 1 1 1 1 1 1 1 1 1 1 1 1 1 1 1 1 1 1 1 1 1 1 1 1 1 1 
##$CPDPRG= <>
##$CPDPRG1= <>
##$CPDPRG2= <>
##$CPDPRG3= <>
##$CPDPRG4= <mlev>
##$CPDPRG5= <mlev>
##$CPDPRG6= <mlev>
##$CPDPRG7= <mlev>
##$CPDPRG8= <mlev>
##$CPDPRGB= <>
##$CPDPRGT= <>
##$D= (0..31)
0 0.7 0 0 0 0 0 0 0 0 0 0.03 0 0 0 0 0 0 0 0 0 0 0 0 0 0 0 0 0 0 0 0 
##$DATE= 1755254335
##$DBL= (0..7)
120 120 120 120 120 120 120 120 
##$DBP= (0..7)
150 150 150 150 150 150 150 150 
##$DBP07= 0
##$DBPNAM0= <>
##$DBPNAM1= <>
##$DBPNAM2= <>
##$DBPNAM3= <>
##$DBPNAM4= <>
$$ [...]
##$SUBNAM3= <"">
##$SUBNAM4= <"">
##$SUBNAM5= <"">
##$SUBNAM6= <"">
##$SUBNAM7= <"">
##$SUBNAM8= <"">
##$SUBNAM9= <"">
##$SW= 18.0517328524113
##$SWIBOX= (0..15)
0 0 2 0 0 0 0 0 0 0 0 0 0 0 0 0 
##$SW_h= 3612.71676300578
##$TD= 16384
##$TD0= 1
##$TE= 0
##$TE2= 300
##$TE3= 300
##$TEG= 300
##$TL= (0..7)
0 120 120 120 120 120 120 120 
##$TP= (0..7)
150 150 150 150 150 150 150 150 
##$TP07= 0
##$TPNAME0= <>
##$TPNAME1= <>
##$TPNAME2= <>
##$TPNAME3= <>
##$TPNAME4= <>
##$TPNAME5= <>
##$TPNAME6= <>
##$TPNAME7= <>
##$TPOAL= (0..7)
0.5 0.5 0.5 0.5 0.5 0.5 0.5 0.5 
##$TPOFFS= (0..7)
0 0 0 0 0 0 0 0 
##$TUNHIN= 0
##$TUNHOUT= 0
##$TUNXOUT= 0
##$USERA1= <user>
##$USERA2= <user>
##$USERA3= <user>
##$USERA4= <user>
##$USERA5= <user>
##$V9= 5
##$VALIST= <valist>
##$VCLIST= <CCCCCCCCCCCCCCC>
##$VD= 0
##$VDLIST= <DDDDDDDDDDDDDDD>
##$VPLIST= <PPPPPPPPPPPPPPP>
##$VTLIST= <TTTTTTTTTTTTTTT>
##$WBST= 1024
##$WBSW= 4
##$XGAIN= (0..3)
0 0 0 0 
##$XL= 0
##$YL= 0
##$YMAX_a= 579949
##$YMIN_a= -552320
##$ZGOPTNS= <>
##$ZL1= 120
##$ZL2= 120
##$ZL3= 120
##$ZL4= 120
##$ABSF1= 15.42517
##$ABSF2= -2.626678
##$ABSG= 5
##$ABSL= 3
##$ALPHA= 0
##$AQORDER= 0
##$ASSFAC= 0
##$ASSFACI= 0
##$ASSFACX= 0
##$ASSWID= 0
##$AUNMP= <proc_1d>
##$AZFE= 0.1
##$AZFW= 0.1
##$BCFW= 0
##$BC_mod= 2
##$BYTORDP= 0
##$COROFFS= 0
##$CY= -3
##$DATMOD= 1
##$DC= 0
##$DFILT= <>
##$DTYPP= 0
##$F1P= 0
##$F2P= 0
##$FCOR= 1
##$FTSIZE= 16384
##$FT_mod= 6
##$GAMMA= 0
##$GB= 0
##$INTBC= 1
##$INTSCL= 3.241238e-09
##$ISEN= 128
##$LB= 0.25
##$LEV0= 0
##$LPBIN= 0
##$MAXI= 10000
##$MC2= 0
##$MEAN= 0
##$ME_mod= 0
##$MI= 1.114404
##$NCOEF= 0
##$NC_proc= -5
##$NLEV= 6
##$NOISF1= 3.799351
##$NOISF2= 2.8
##$NSP= 0
##$NTH_PI= 0
##$NZP= 0
##$OFFSET= 15.58933
##$PC= 1
##$PHC0= -1718.704
##$PHC1= 11.79228
##$PH_mod= 1
##$PKNL= yes
##$PPARMOD= 0
##$PSCAL= 0
##$PSIGN= 0
##$REVERSE= no
##$SF= 200.129986465945
##$SI= 16384
##$SIGF1= 3
##$SIGF2= 2
##$SINO= 0.751879
##$SIOLD= 32768
##$SREGLST= <19F.Aceton>
##$SSB= 0
##$STSI= 16384
##$STSR= 0
##$SW_p= 3612.71676300578
##$SYMM= 0
##$S_DEV= 0
##$TDeff= 16384
##$TDoff= 0
##$TI= <>
##$TILT= no
##$TM1= 0
##$TM2= 0
##$TOPLEV= 0
##$USERP1= <user>
##$USERP2= <user>
##$USERP3= <user>
##$USERP4= <user>
##$USERP5= <user>
##$WDW= 1
##$XDIM= 16384
##$YMAX_p= 279772773
##$YMIN_p= -134642
$$ End of Bruker specific parameters
$$ ---------------------------------
##NTUPLES= NMR SPECTRUM
##VAR_NAME=  FREQUENCY,     SPECTRUM/REAL,   SPECTRUM/IMAG
##SYMBOL=    X,             R,               I
##VAR_TYPE=  INDEPENDENT,   DEPENDENT,       DEPENDENT
##VAR_FORM=  AFFN,          ASDF,            ASDF
##VAR_DIM=   16384,         16384,           16384
##UNITS=     HZ,            ARBITRARY UNITS, ARBITRARY UNITS
##FACTOR=    0.220516191357247, 1,           1
##FIRST=     3119.89234578539, 0,            0
##LAST=      -492.824417220394, 0,           0
##MIN=       -492.824417220394, -134642,     0
##MAX=       3119.89234578539, 279772773,    0
$$ Real data points
##PAGE= N=1
##DATA TABLE= (X++(R..R)), XYDATA
$$ [...]
$$ plain form
6167 57522 53211 38776 25793 22829 12570 19819 16637 -1038 28525 20746 30991 25003 19400
6154 19400 18991 31865 42264 25038 18147 247 4045 22792 26105 30655 36736 30786 19936
6141 19936 20098 28439 18097 32821 26510 27520 21681 37470 39061 37765 36180 28165 20520 16475
6127 16475 17063 11465 32493 17554 15741 26646 31106 30545 27322 19222 14475 -4835 11619 20981
6113 20981 23424 27557 4377 30871 44606 39032 39382 25603 16374 23182 27811 36949 51490 41848
6099 41848 35175 31138 46950 41421 26586 39082 34356 23109 20857 47826 38621 29922 40530
6086 40530 37485 44309 32884 36418 45738 42314 24572 18499 21591 34420 31059 37210 42290 36819
6072 36819 18939 19580 35052 20503 42820 33781 36047 43239 26076 48180 45190 49326 36497
$$ packed form
6167E7522m311j4435j2983k964j0259P249l182j7675K9563p779J0245n988n603
6154A9400m09J2874J0399j7226o891j7900L798J8747L313M550O081n950j0850
6141A9936J62Q341j0342J4724o311J010n839J5789J591j296j585q015p645m045
6127A6475N88n598K1028j4939j813J0905M460n61l223q100m747j9310J6454R362
6113B0981K443M133k3180K6494J3735n574L50j3779r229O808M629R138J4541r642
6099D1848o673m037J5812n529j4835J2496m726j1247k252K6969r205q699J0608
6086D0530l045O824j1425L534R320l424j7742o073L092J2829l361O151N080n471
6072C6819j7880O41J5472j4549K2317r039K266P192j7163K2104k990M136j2829
$$ plain form
6059 36497 38396 40285 48652 35474 28574 39012 53092 37383 21695 28657 27597 37480 41914
6046 41914 54299 58065 38148 45121 54462 53946 52846 59377 65662 68159 55913 48533 47799 44789
6032 44789 40786 36073 37234 42675 44012 42712 34956 32652 52368 44551 56560 69312 77682 75924
6018 75924 64185 63553 63255 75947 74457 64935 50554 56348 68338 87346 89230 85804 79297 94430
6004 94430 91093 91334 94265 85088 96358 79804 82317 98313 105512 112541 115355 111444 103148 95384
5990 95384 103916 111935 116207 126013 120119 106333 114367 124469 128119 119156 130936 121303 119881 132037
5976 132037 137268 119572 129044 126511 120280 125358 136233 142199 147481 144326 152196 141431 149616 164049
5962 164049 159663 161732 165870 172128 176047 167200 182711 195039 188834 190090 200219 208269 210450 211899
$$ packed form
6059C6497J899J889Q367j3178o900J0438J4080j5709j5688O962j060R883M434
6046D1914J2385L766j9917O973R341n16j100O531O285K497j2246p380p34l010
6032D4789m003m713J161N441J337j300p756k304J9716p817J2009J2752Q370j758
6018G5924j1739o32k98J2692j490r522j4381N794J1990J9008J884l426o507J5133
6004I4430l337K41K931r177J1270j6554K513J5996P199P029K814l911q296p764
5990I5384Q532Q019M272R806n894j3786Q034J0102L650q963J1780r633j422J2156
5976A32037N231j7696R472k533o231N078J0875N966N282l155P870j0765Q185J4433
5962A64049m386K069M138O258L919q847J5511J2328o205J256J0129Q050K181J449
$$ plain form
5948 211899 208101 224408 239053 228878 228154 240817 253879 254555 263376 277340 279458 302538 299889
5935 299889 308839 312190 292923 293310 308939 327044 333083 340896 345487 368178 383633 397322 407750
5922 407750 404933 413653 421683 429749 439722 457767 478811 483374 479003 501953 535157 567752 584439
5909 584439 609039 604927 622267 650450 675266 688273 699741 727397 744723 763938 772685 786746
5897 786746 808685 822767 834559 843468 883005 892647 894397 930663 966616 992426 1010945 1040046
5885 1040046 1053003 1070427 1083104 1119809 1156093 1207442 1250063 1264025 1286536 1319253 1354341
5874 1354341 1384397 1425091 1468481 1498656 1522890 1528813 1532455 1535855 1526389 1496478 1480497 1467971
5862 1467971 1438740 1422015 1417038 1416968 1422141 1427970 1431719 1454653 1478041 1497818 1533090 1572569 1603313
$$ packed form
5948B11899l798J6307J4645j0175p24J2663J3062O76Q821J3964K118K3080k649
5935B99889Q950L351j9267L87J5629J8105O039P813M591K2691J5455J3689J0428
5922D07750k817Q720Q030Q066R973J8045K1044M563m371K2950L3204L2595J6687
5909E84439K4600m112J7340K8183K4816J3007J1468K7656J7326J9215Q747J4061
5897G86746K1939J4082J1792Q909L9537R642J750L6266L5953K5810J8519K9101
5885A040046J2957J7424J2677L6705L6284N1349M2621J3962K2511L2717L5088
5874A354341L0056M0694M3390L0175K4234N923L642L400r466k9911j5981j2526
5862A467971k9231j6725m977p0N173N829L749K2934K3388J9777L5272L9479L0744
$$ plain form
5849 1603313 1623385 1623779 1619450 1625803 1643549 1645761 1625171 1580432 1553309 1514208 1508214 1465049 1424980
5836 1424980 1411849 1381999 1339184 1326973 1329202 1329389 1309149 1319351 1321246 1329353 1323888 1328389 1337690
5823 1337690 1348510 1351651 1338251 1337975 1323639 1329780 1313430 1289260 1269131 1238662 1221222 1198991
5811 1198991 1155232 1130307 1102403 1065749 1039162 1023817 994938 984113 984410 973183 956631 957019
5799 957019 928955 924313 923516 909885 893544 871027 843742 832271 824069 820898 795106 770383 766985
5786 766985 754701 727337 705012 680254 666678 632380 615190 610543 615529 603569 572107 562359
5774 562359 564277 542555 515677 505104 466437 474268 494205 487568 486709 475103 445675 423829 422401
5761 422401 408509 403329 403012 399646 386237 373223 373181 362948 336649 325202 332643 331696 319866 313978
$$ packed form
5849A603313K0072L94m329O353J7746K212k0590m4739k7123l9101n994m3165m0069
5836A424980j3131k9850m2815j2211K229J87k0240J0202J895Q107n465M501R301
5823A337690J0820L141j3400k76j4336O141j6350k4170k0129l0469j7440k2231
5811A198991m3759k4925k7904l6654k6587j5345k8879j0825K97j1227j6552L88
5799I57019k8064m642p97j3631j6341k2517k7285j1471q202l171k5792k4723l398
5786G66985j2284k7364k2325k4758j3576l4298j7190m647M986j1960l1462r748
5774E62359J918k1722k6878j0573l8667P831J9937o637q59j1606k9428k1846j428
5761D22401j3892n180l17l366j3409j3014m2j0233k6299j1447P441r47j1830n888
$$ plain form
5747 313978 317095 297257 290674 281926 298382 304230 295748 294339 281136 255280 259425 255808 249035
5734 249035 250702 240633 246156 239209 241817 245585 236933 237141 227718 218513 219465 211042 209545 222054
5720 222054 216173 212118 204146 200012 205611 207483 200009 190665 205152 205097 208184 201488 183101 186222
5706 186222 184943 193866 195225 178087 186957 188890 196951 192586 200695 186713 185101 195606 188153 190593
5692 190593 176881 165626 178846 173304 159680 163525 178280 168702 163718 172313 171641 185150 192837
5679 192837 181709 170417 151972 158611 170962 171329 168919 162524 160855 157464 167295 169075 168499 174140
5665 174140 162795 154399 170484 185083 175243 153203 162179 161728 147208 145860 139242 143844 158512
5652 158512 165525 152689 135776 143969 152454 148377 162710 176741 170952 161280 153366 167747 160915
$$ packed form
5747C13978L117j9838o583q748J6456N848q482j409j3203k5856M145l617o773
5734B49035J667j0069N523o947K608L768q652K08r423r205R52q423j497J2509
5720B22054n881m055p972m134N599J872p474r344J4487n5L087o696j8387L121
5706A86222j279Q923J359j7138Q870J933Q061m365Q109j3982j612J0505p453K440
5692A90593j3712j1255J3220n542j3624L845J4755r578m984Q595o72J3509P687
5679A92837j1128j1292j8445O639J2351L67k410o395j669l391R831J780n76N641
5665A74140j1345q396J6085J4599r840k2040Q976m51j4520j348o618M602J4668
5652A58512P013j2836j6913Q193Q485m077J4333J4031n789r672p914J4381o832
$$ plain form
5639 160915 163246 160435 146192 133226 147047 157608 163959 163016 176864 164860 157690 160379 167049
5626 167049 163534 161377 164465 148468 149940 167545 162398 165289 169437 158995 165625 180468 178531
5613 178531 163358 170536 171441 167386 162273 161379 142604 154837 159541 182570 177298 166251 184961
5600 184961 176514 175009 163701 153903 157902 167065 165829 171591 162249 173600 189754 188420 195031 202043
5586 202043 198077 186313 179726 168228 162432 168414 175194 194676 178810 157454 162686 178401 177900
5573 177900 190002 187221 182349 181566 182734 197268 189609 186149 198766 201063 201565 215135 225809 209084
5559 209084 178703 174681 174117 189699 197367 203686 202280 198026 189642 202758 213773 211050 221374
5546 221374 217889 203417 194608 194543 190071 193723 191312 191532 209518 203268 206509 222123 207382 194177
$$ packed form
5639A60915K331k811j4243j2966J3821J0561O351r43J3848j2004p170K689O670
5626A67049l515k157L088j5997J472J7605n147K891M148j0442O630J4843j937
5613A78531j5173P178R05m055n113q94j8775J2233M704K3029n272j1047J8710
5600A84961q447j505j1308r798L999R163j236N762r342J1351J6154j334O611P012
5586B02043l966j1764o587j1498n796N982O780J9482j5866k1356N232J5715n01
5573A77900J2102k781m872p83J168J4534p659l460J2617K297N02J3570J0674j6725
5559B09084l0381m022n64J5582P668O319j406m254q384J3116J1015k723J0324
5546B21374l485j4472q809o5m472L652k411K20J7986o250L241J5614j4741j3205
$$ plain form
5532 194177 228878 243537 243745 234703 223808 229252 235374 229445 225826 229583 233654 224614 220703 232935
5518 232935 245298 250262 252668 250144 247243 252051 255568 243836 253479 262139 261394 260023 242010 248678
5504 248678 254860 242224 248702 265799 265519 261858 262128 259164 266315 263538 272174 273631 258298 255309
5490 255309 265056 269412 263110 268270 294321 290665 282628 267089 279519 288570 301273 306564 322375
5477 322375 307892 311276 321894 313895 330723 343296 326097 326248 346086 345510 330738 337893 347527
5464 347527 324468 327408 334518 352791 359458 374896 369102 389238 383948 373321 376277 395226 391972
5451 391972 395903 393805 414522 413627 404225 409795 420136 419665 425213 432562 431679 459370 452305 439725
5437 439725 465542 471252 479226 481690 486056 508302 500736 508324 541963 549807 537015 538342 551125
$$ packed form
5532A94177L4701J4659K08r042j0895N444O122n929l619L757M071r040l911J2232
5518B32935J2363M964K406k524k901M808L517j1732R643Q660p45j371j8013O668
5504B48678O182j2636O478J7097k80l661K70k964P151k777Q636J457j5333k989
5490B55309R747M356o302N160K6051l656q037j5539J2430R051J2703N291J5811
5477C22375j4483L384J0618p999J6828J2573j7199J51J9838n76j4772P155R634
5464C47527k3059K940P110J8273O667J5438n794K0136n290j0627K956J8949l254
5451C91972L931k098K0717q95r402N570J0341m71N548P349q83K7691p065j2580
5437D39725K5817N710P974K464M366K2246p566P588L3639P844j2792J327J2783
$$ plain form
5424 551125 558601 564177 551520 548437 574876 591461 615603 609536 623773 645552 650273 643295 656711
5411 656711 683100 692547 691886 687795 719232 740748 759333 782991 800287 806966 828500 844861 858629
5398 858629 864417 884722 897480 924657 951891 968577 1000815 1024249 1045001 1060047 1067273 1089028
5386 1089028 1120093 1143024 1190035 1224599 1244504 1286410 1320330 1363423 1393336 1413413 1439089
5375 1439089 1459437 1480552 1482161 1507898 1555381 1565438 1583738 1619413 1642548 1666719 1688609 1719088
5363 1719088 1744698 1747574 1777130 1789643 1821835 1856410 1880910 1906648 1890314 1898712 1906149 1906244 1904654
5350 1904654 1909246 1903139 1921579 1935199 1921449 1893289 1893173 1881880 1893739 1867374 1821557 1801557
5338 1801557 1789098 1741065 1693998 1655761 1621496 1603601 1575789 1545777 1527428 1508922 1471921
$$ packed form
5424E51125P476N576j2657l083K6439J6585K4142o067J4237K1779M721o978J3416
5411F56711K6389R447o61m091L1437K1516J8585K3658J7296O679K1534J6361J3768
5398H58629N788K0305J2758K7177K7234J6686L2238K3434K0752J5046P226K1755
5386A089028L1065K2931M7011L4564J9905M1906L3920M3093K9913K0077K5676
5375A439089K0348K1115J609K5737M7483J0057J8300L5675K3135K4171K1890L0479
5363A719088K5610K876K9556J2513L2192L4575K4500K5738j6334Q398P437R5j590
5350A904654M592o107J8440J3620j3750k8160j16j1293J1859k6365m5817k0000
5338A801557j2459m8033m7067l8237l4265j7895k7812l0012j8349j8506l7001
$$ plain form
5327 1471921 1436213 1436941 1431123 1411624 1381184 1335671 1330393 1304458 1291875 1280501 1255039 1224400
5315 1224400 1200787 1194870 1178684 1156262 1122357 1101596 1101059 1089610 1067830 1038867 1025707 1019771
5303 1019771 997334 985076 988499 986884 980695 950244 925402 912641 913448 918671 903414 916991 912470
5290 912470 898461 879481 851846 842716 844457 835725 816904 818174 827112 823980 809644 801983 798642
5277 798642 788134 789269 791510 769169 773610 781753 778939 773553 763727 752089 753236 737921 712069
5264 712069 731516 745046 719855 707115 703916 692341 697851 708872 715067 699550 681462 687910
5252 687910 677082 656521 656346 688028 687673 660739 655386 663327 673092 675606 683681 664247 663316 676779
5238 676779 665737 648557 649149 658788 658688 672343 648461 655291 682750 673049 671590 665793 671476 667970
$$ packed form
5327A471921l5708P28n818j9499l0440m5513n278k5935j2583j1374k5462l0639
5315A224400k3613n917j6186k2422l3905k0761n37j1449k1780k8963j3160n936
5303A019771k2437j2258L423j615o189l0451k4842j2761Q07N223j5257J3577m521
5290I12470j4009j8980k7635r130J741q732j8821J270Q938l132j4336p661l341
5277G98642j0508J135K241k2341M441Q143k814n386r826j1638J147j5315k5852
5264G12069J9447J3530k5191j2740l199j1575N510J1021O195j5517j8088O448
5252F87910j0828k0561j75L1682l55k6934n353P941R765K514Q075j9434r31J3463
5238F76779j1042j7180N92R639j00J3655k3882O830K7459r701j459n797N683l506
$$ plain form
5224 667970 659468 655472 670731 663224 655254 657506 671537 662801 659117 681374 671755 675611 677811 660186
5210 660186 655514 669070 681145 691527 694573 702143 718487 716305 715192 713662 713842 729213 725717
5197 725717 715756 707379 717525 724625 733773 751826 769234 757701 757682 756153 763771 762853 762151 758014
5183 758014 754353 768943 771107 774334 768172 780801 800547 807992 807045 811998 822992 830996 848575
5170 848575 865803 853492 860990 872140 875989 883834 885236 904076 912694 929665 937258 945421 948632
5157 948632 956090 961733 971932 987566 1005620 1007029 1019706 1030875 1035061 1051955 1049391 1045996 1076613
5144 1076613 1094758 1103606 1140052 1160444 1178688 1200409 1216927 1229654 1252557 1279146 1278735 1323512
5132 1323512 1331450 1332632 1362239 1414497 1429201 1443038 1487415 1512331 1526608 1553742 1580570 1602430
$$ packed form
5224F67970q502l996J5259p507p970K252J4031q736l684K2257r619L856K200j7625
5210F60186m672J3556J2075J0382L046P570J6344k182j113j530J80J5371l496
5197G25717r961q377J0146P100R148J8053J7408j1533j9j529P618r18p02m137
5183G58014l661J4590K164L227o162J2629J9746P445r47M953J0994Q004J7579
5170H48575J7228j2311P498J1150L849P845J402J8840Q618J6971P593Q163L211
5157I48632P458N643J0199J5634J8054J409J2677J1169M186J6894k564l395L0617
5144A076613J8145Q848L6446K0392J8244K1721J6518J2727K2903K6589m11M4777
5132A323512P938J182K9607N2258J4704J3837M4377K4916J4277K7134K6828K1860
$$ plain form
5120 1602430 1643594 1646386 1663868 1713496 1772001 1818055 1853314 1873035 1925904 1980922 2057389 2102725
5108 2102725 2156023 2229552 2300297 2388083 2440268 2491762 2556410 2597456 2618277 2662706 2734052
5097 2734052 2801025 2891982 2973071 3070683 3168550 3266553 3396694 3520845 3656996 3780660 3916541
5086 3916541 4114691 4289987 4515381 4770571 5052080 5328979 5628990 5965494 6372577 6838372
5076 6838372 7359604 7957435 8644180 9435082 10416404 11673240 13100930 14382109 15576177
5067 15576177 16721745 17749479 18644936 19288610 19262382 18564006 17796412 17158893 16442613
5058 16442613 15872217 15554672 15315659 15286084 15407830 15699453 16216022 16956123 17930235 19172213
5048 19172213 20520238 21984525 23717390 25488042 27349570 29276382 31153973 33042729
$$ packed form
5120A602430M1164K792J7482M9628N8505M6054L5259J9721N2869N5018P6467M5336
5108B102725N3298P3529P0745Q7786N2185N1494O4648M1046K0821M4429P1346
5097B734052O6973R0957Q1089R7612R7867R8003J30141J24151J36151J23664J35881
5086C916541J98150J75296K25394K55190K81509K76899L00011L36504M07083M65795
5076F838372N21232N97831O86745P90902R81322J256836J427690J281179J194068
5067A5576177J145568J027734Q95457O43674k6228o98376p67594o37519p16280
5058A6442613n70396l17545k39013k9575J21746K91623N16569P40101R74112J241978
5048A9172213J348025J464287J732865J770652J861528J926812J877591J888756
$$ plain form
5040 33042729 34907055 36352815 37319889 38434096 39806737 41505638 43796729 46147123
5032 46147123 48170559 50142700 51332113 51562692 51382816 50526281 48006039 44815892 41851988
5023 41851988 38589691 35288886 32556748 30107656 27973064 26201010 24568988 23322211
5015 23322211 22304404 21326873 20617941 19934830 18766999 17419402 16083327 14823503 13709080
5006 13709080 12640958 11532481 10565445 9770836 9096814 8525632 8024899 7580954 7200971
4997 7200971 6859846 6522039 6237438 5972458 5727977 5506791 5299713 5113014 4919715 4745740
4987 4745740 4604316 4477351 4342162 4214943 4101680 3991638 3893356 3790230 3681781 3602567
4977 3602567 3545230 3502346 3458804 3432127 3430871 3423792 3434237 3462487 3502599 3587186 3703759 3824584
$$ packed form
5040C3042729J864326J445760R67074J114207J372641J698901K291091K350394
5032D6147123K023436J972141J189413K30579j79876q56535k520242l190147k963904
5023D1851988l262297l300805k732138k449092k134592j772054j632022j246777
5015B3322211j017807r77531p08932o83111j167831j347597j336075j259824j114423
5006A3709080j068122j108477r67036p94609o74022n71182n00733m43945l79983
4997G200971l41125l37807k84601k64980k44481k21186k07078j86699j93299j73975
4987D745740j41424j26965j35189j27219j13263j10042r8282j03126j08449p9214
4977C602567n7337m2884m3542k6677j256p079J0445K8250M0112Q4587J16573J20825
$$ plain form
4965 3824584 3986419 4240738 4564684 4821111 5070029 5336771 5559807 5729053 5844720 5767182
4955 5767182 5484695 5165695 4848940 4525398 4236298 3995490 3766522 3567581 3393770 3229333
4945 3229333 3103965 3023639 2971976 2960301 2899197 2758861 2626373 2500666 2372054 2246144
4935 2246144 2133779 2025515 1915044 1836365 1738592 1677106 1616455 1569688 1529438 1502089 1418231
4924 1418231 1379605 1352651 1314632 1292543 1282216 1239200 1194467 1176055 1145907 1139211 1135820 1122198
4912 1122198 1093449 1061903 1052141 1030187 1013566 987189 963229 958465 965047 955715 912011 888751
4900 888751 877195 878241 858292 848930 834509 824749 810804 798056 773571 767793 757209 738071
4888 738071 730315 721512 722822 706077 688614 686209 685295 685596 646008 627008 644754 643330 631409
$$ packed form
4965C824584J61835K54319L23946K56427K48918K66742K23036J69246J15667p7538
4955E767182k82487l19000l16755l23542k89100k40808k28968j98941j73811j64437
4945C229333j25368q0326n1663j1675o1104j40336j32488j25707j28612j25910
4935B246144j12365j08264j10471p8679r7773o1486o0651m6767m0250k7349q3858
4924A418231l8626k6954l8019k2089j0327m3016m4733j8412l0148o696l391j3622
4912A122198k8749l1546r762k1954j6621k6377k3960m764O582r332m3704k3260
4900H88751j1556J046j9949r362j4421r760j3945j2748k4485n778j0584j9138
4888G38071p756q803J310j6745j7463k405r14L01l9588j9000J7746j424j1921
$$ plain form
4875 631409 632318 615670 593557 599667 598298 596900 590468 565457 555802 561017 560726 549796 546891 516748
4861 516748 510608 513543 520106 515401 498246 495677 490720 488479 491038 492368 485319 484947 467972 472417
4847 472417 472480 482626 489307 473857 456166 460904 459899 446251 444779 448710 433107 412908 423017
4834 423017 433115 413030 404390 401681 393887 405936 404469 400149 401728 404972 391170 380866 372354
4821 372354 377920 383105 374871 362667 367601 375038 386047 379881 385438 381107 375318 358197 354410 359669
4807 359669 384624 399866 388586 381442 370315 363739 356879 356800 346006 346486 343920 340054 344348 337427
4793 337427 316455 312427 308552 331636 323139 335915 333237 330640 327316 324490 326678 333575 331868 315570
4779 315570 315292 307825 296690 290894 298212 294099 295360 319339 324286 325202 323894 314449 309574 309081 321821
$$ packed form
4875F31409R09j6648k2113O110j369j398o432k5011r655N215k91j0930k905l0143
4861E16748o140K935O563m705j7155k569m957k241K559J330p049l72j6975M445
4847D72417O3J0146O681j5450j7691M738j005j3648j472L931j5603k0199J0109
4834D23017J0098k0085q640k709p794J2049j467m320J579L244j3802j0304q512
4821C72354N566N185q234j2204M934P437J1009o166N557m331n789j7121l787N259
4807C59669K4955J5242j1280p144j1127o576o860p9j0794M80k566l866M294o921
4793C37427k0972m028l875K3084q497J2776k678k597l324k826K188O897j707j6298
4779C15570k78p467j1135n796P318m113J261K3979M947R16j308r445m875m93J2740
$$ plain form
4764 321821 328648 328258 321711 321428 303145 299173 306746 324238 333828 317243 314111 323117 311975 322799
4750 322799 335699 339816 360867 372778 357165 342845 345904 344018 336634 341982 335111 337718 341718
4737 341718 341496 343525 347291 363868 382831 365575 369645 376520 371255 379639 405206 395532 403736 416230
4723 416230 428110 442219 445489 453222 451588 445695 451663 466437 464388 510622 518246 514633 508436
4710 508436 501991 493676 472612 452149 447433 429965 412761 394178 374587 373188 369979 361093 349768
4697 349768 347865 344681 341256 336303 329884 321728 318329 314197 301483 293164 298752 294329 272662 269447
4683 269447 281066 309182 294225 270915 266578 271272 275371 258394 267291 268042 267069 266315 244152 246838
4669 246838 262720 261942 249285 240539 232462 247179 249841 251896 245572 259054 275059 266312 264123
$$ packed form
4764C21821O827l90o547k83j8283l972P573J7492R590j6585l132R006j1142J0824
4750C22799J2900M117K1051J1911j5613j4320L059j886p384N348o871K607M000
4737C41718k22K029L766J6577J8963j7256M070O875n265Q384K5567r674Q204J2494
4723D16230J1880J4109L270P733j634n893N968J4774k049M6234P624l613o197
4710E08436o445q315k1064k0463m716j7468j7204j8583j9591j399l209q886j1325
4697C49768j903l184l425m953o419q156l399m132j2714q319N588m423k1667l215
4683B69447J1619K8116j4957k3310m337M694M099j6977Q897P51r73p54k2163K686
4669B46838J5882p78j2657q746q077J4717K662K055o324J3482J6005q747k189
$$ plain form
4656 264123 256907 240669 243914 244295 252346 276705 268718 265820 268634 261616 277445 287221 274863 270372
4642 270372 270731 276598 286508 277844 268890 247310 239810 268472 273253 283605 297794 290621 280320
4629 280320 298252 288638 271978 262703 264915 274437 284626 285846 272971 264623 264710 267433 269690 277987
4615 277987 264395 255642 263985 277135 286281 259737 259758 268793 258211 264175 267595 269927 275176 277833
4601 277833 274339 276393 280907 285795 292708 302252 291946 282898 265635 253728 248520 267101 282555
4588 282555 264574 268860 278620 281053 289865 279284 271663 269491 279401 291435 292162 295362 299818 280589
4574 280589 276229 292986 291336 309022 288016 286438 284321 299200 303184 309520 305584 308612 293304
4561 293304 296088 291295 282047 285862 281827 295408 302536 294212 286638 286188 285678 283856 292720 282471
$$ packed form
4656B64123p216j6238L245L81Q051K4359p987k898K814p018J5829R776j2358m491
4642B70372L59N867R910q664q954k1580p500K8662M781J0352J4189p173j0301
4629B80320J7932r614j6660r275K212R522J0189J220j2875q348Q7K723K257Q297
4615B77987j3592q753Q343J3150R146k6544K1R035j0582N964L420K332N249K657
4601B77833l494K054M514M888O913R544j0306r048j7263j1907n208J8581J5454
4588B82555j7981M286R760K433Q812j0581p621k172R910J2034P27L200M456j9229
4574B80589m360J6757j650J7686k1006j578k117J4879L984O336l936L028j5308
4561B93304K784m793r248L815m035J3581P128q324p574m50n10j822Q864j0249
$$ plain form
4547 282471 300024 315837 312230 307459 299633 288781 295922 313533 316633 324221 321125 328288 321211
4534 321211 313135 298131 314251 315508 326003 325409 313886 312637 324393 323053 317050 301838 300027
4521 300027 314128 336286 329735 313300 310879 325445 347782 328002 336396 357998 351209 351919 363100
4508 363100 356698 351839 374245 365876 367167 376834 365772 364772 379134 393444 393079 390701 403612
4495 403612 395102 371418 398558 416751 391468 394042 389567 397324 403464 407815 413140 407937 433170
4482 433170 448437 440395 442804 430961 441805 445242 454294 453990 446656 441119 456109 463660 460837 479773
4468 479773 473256 468234 471371 475774 471013 467885 470228 466327 486188 489542 484047 499174 522831 514568
4454 514568 509656 510116 505891 508608 497042 516926 521955 525936 529040 538644 519861 511812 513435 511931
$$ packed form
4547B82471J7553J5813l607m771p826j0852P141J7611L100P588l096P163p077
4534C21211q076j5004J6120J257J0495n94j1523j249J1756j340o003j5212j811
4521C00027J4101K2158o551j6435k421J4566K2337j9780Q394K1602o789P10J1181
4508C63100o402m859K2406q369J291R667j1062j000J4362J4310l65k378J2911
4495D03612q510k3684K7140J8193k5283K574m475P757O140M351N325n203K5233
4482D33170J5267q042K409j1843J0844L437R052l04p334n537J4990P551k823J8936
4468D79773o517n022L137M403m761l128K343l901J9861L354n495J5127K3657q263
4454E14568m912M60m225K717j1566J9884N029L981L104R604j8783q049J623j504
$$ plain form
4440 511931 500347 508780 515674 506386 509026 506334 512034 493410 495325 500963 487226 498377 492087
4427 492087 506043 502658 491090 500984 502578 499111 493492 499787 494170 480508 494432 483451 476711
4414 476711 478841 491717 482781 472430 481255 483086 471971 483384 482053 493357 504921 492934 497109
4401 497109 492722 504810 489824 483188 494225 502397 504157 500248 511357 523808 527225 523842 551354
4388 551354 534767 516875 525342 539218 555974 541377 550248 553407 549067 546009 558134 567213 592750
4375 592750 598994 586191 581576 572721 606337 611173 591285 586412 584775 583139 574671 582828 586528 595182
4361 595182 602048 604102 610482 602924 600273 609429 627458 646523 663712 666862 647197 630754 650968
4348 650968 672187 665620 689861 699085 719541 732461 748394 756630 763357 777610 770205 763528 770205
$$ packed form
4440E11931j1584Q433O894r288K640k692N700j8624J915N638j3737J1151o290
4427D92087J3956l385j1568R894J594l467n619O295n617j3662J3924j0981o740
4414D76711K130J2876q936j0351Q825J831j1115J1413j331J1304J1564j1987M175
4401D97109m387J2088j4986o636J1037Q172J760l909J1109J2451L417l383K7512
4388E51354j6587j7892Q467J3876J6756j4597Q871L159m340l058J2125R079K5537
4375E92750O244j2803m615q855L3616M836j9888m873j637j636q468Q157L700Q654
4361E95182O866K054O380p558k651R156J8029J9065J7189L150j9665j6443K0214
4348F50968K1219o567K4241R224K0456J2920J5933Q236O727J4253p405o677O677
$$ plain form
4335 770205 775662 778069 785548 799078 803357 806109 799307 811645 812188 807044 800542 796428 802959 804718
4321 804718 802724 800898 794511 788854 806683 796073 805483 794295 794255 792298 788879 785645 810871 812483
4307 812483 816846 847211 847156 834642 827201 841057 847828 860444 861916 865233 866710 871740 865974 867277
4293 867277 873907 908733 902061 886750 908764 909187 891060 905275 930407 929283 916768 918330 939380
4280 939380 958373 974495 986600 982215 999270 1012426 1001694 1013644 1015083 1020713 1033962 1056923
4268 1056923 1060054 1057309 1081601 1086307 1092162 1097125 1099263 1125678 1135545 1155399 1165798 1181741 1190971
4255 1190971 1204297 1204205 1227506 1251900 1274380 1294785 1303585 1325158 1332593 1349241 1372985 1404455
4243 1404455 1427591 1455868 1471594 1488377 1508431 1527536 1543366 1579454 1621000 1655991 1671434
$$ packed form
4335G70205N457K407P479J3530M279K752o802J2338N43n144o502m114O531J759
4321H04718j994j826o387n657J7829j0610R410j1188m0j957l419l234K5226J612
4307H12483M363L0365n5j2514p441J3856O771J2616J472L317J477N030n766J303
4293H67277O630L4826o672j5311K2014M23j8127J4215K5132j124j2515J562K1050
4280I39380J8993J6122J2105m385J7055J3156j0732J1950J439N630J3249K2961
4268A056923L131k745K4292M706N855M963K138K6415R867J9854J0399J5943R230
4255A190971J3326r2K3301K4394K2480K0405Q800K1573P435J6648K3744L1470
4243A404455K3136K8277J5726J6783K0054J9105J5830L6088M1546L4991J5443
$$ plain form
4232 1671434 1689353 1714714 1743974 1779622 1824259 1872413 1900699 1946066 1978804 2029236 2064779
4221 2064779 2112376 2180896 2229339 2283391 2336338 2394906 2473313 2544443 2623592 2720324 2803462
4210 2803462 2921322 3015162 3115969 3242059 3366096 3492901 3638321 3795359 3950476 4138508
4200 4138508 4334625 4522604 4737121 4967331 5200908 5447878 5713690 6030561 6390721 6723421
4190 6723421 7096926 7519564 7921361 8332266 8750453 9166474 9569369 9960143 10352790 10790236
4180 10790236 11251881 11754870 12290639 12884485 13532911 14215153 14890812 15530992 16122552
4171 16122552 16656170 17108677 17486951 17768571 18020943 18285443 18605484 19005267 19457383
4162 19457383 19978233 20511905 21060870 21603152 22072128 22443932 22645620 22664111 22561021 22326525
$$ packed form
4232A671434J7919K5361K9260L5648M4637M8154K8286M5367L2738N0432L5543
4221B064779M7597O8520M8443N4052N2947N8568P8407P1130P9149R6732Q3138
4210B803462J17860R3840J00807J26090J24037J26805J45420J57038J55117J88032
4200D138508J96117J87979K14517K30210K33577K46970K65812L16871L60160L32700
4190F723421L73505M22638M01797M10905M18187M16021M02895L90774L92647M37446
4180A0790236M61645N02989N35769N93846O48426O82242O75659O40180N91560
4171A6122552N33618M52507L78274K81620K52372K64500L20041L99783M52116
4162A9457383N20850N33672N48965N42282M68976L71804K01688J8491j03090k34496
$$ plain form
4152 22326525 22019489 21721445 21493503 21322449 21221186 21196841 21217741 21270775 21311919 21266586
4142 21266586 21128862 20834332 20414822 19852181 19184720 18492676 17809229 17177051 16612573
4133 16612573 16136913 15731817 15380248 15079273 14796176 14501038 14157987 13748513 13268239
4124 13268239 12735979 12184518 11634512 11104621 10617849 10187145 9797147 9467091 9182221
4115 9182221 8946806 8762643 8577019 8425566 8276977 8109299 7968311 7866827 7799141 7732330
4105 7732330 7743283 7810141 7932103 8094221 8280082 8540979 8879296 9241491 9591443 9980444
4095 9980444 10376957 10806763 11276679 11707424 12092005 12387992 12633184 12897295 13141596 13353943
4085 13353943 13480787 13471785 13368956 13185327 13021351 12881769 12692984 12428081 12116915 11786558
$$ packed form
4152B2326525l07036k98044k27942j71054j01263k4345K0900N3034M1144m5333
4142B1266586j37724k94530m19510n62641o67461o92044o83447o32178n64478
4133A6612573m75660m05096l51569l00975k83097k95138l43051m09474m80274
4124A3268239n32260n51461n50006n29891m86772m30704l89998l30056k84870
4115I182221k35415j84163j85624j51453j48589j67678j40988j01484o7686o6811
4105G732330J0953O6858J21962J62118J85861K60897L38317L62195L49952L89001
4095I980444L96513M29806M69916M30745L84581K95987K45192K64111K44301K12347
4085A3353943J26844r002j02829j83629j63976j39582j88785k64903l11166l30357
$$ plain form
4075 11786558 11416080 11091492 10830414 10610799 10389673 10151847 9977796 9805223 9669706
4066 9669706 9623306 9659840 9761816 9909434 10140558 10432953 10803874 11265939 11864171 12601894
4056 12601894 13487624 14445203 15390068 16383067 17471692 18689959 19909469 20933340 21710080
4047 21710080 22322901 22923692 23546062 23916831 23898154 23527658 23035790 22580311 22002187 21220121
4037 21220121 20248109 19244546 18330344 17450692 16512259 15577533 14688632 13908165 13274089
4028 13274089 12637048 11889558 11166833 10531490 10021662 9550888 9003371 8407164 7861109
4019 7861109 7399548 6994372 6601792 6192284 5805904 5458564 5175128 4910707 4674679 4446031
4009 4446031 4252200 4078507 3950354 3804030 3663733 3540156 3427310 3338273 3249460 3166025
$$ packed form
4075A1786558l70478l24588k61078k19615k21126k37826j74051j72573j35517
4066I669706m6400L6534J01976J47618K31124K92395L70921M62065N98232P37723
4056A2601894Q85730R57579R44865R92999J088625J218267J219510J023871P76740
4047B1710080O12821O00791O22370L70769j8677l70496m91868m55479n78124p82066
4037B1220121r72012j003563r14202q79652r38433r34726q88901p80467o34076
4028A3274089o37041p47490p22725o35343n09828m70774n47517n96207n46055
4019G861109m61561m05176l92580m09508l86380l47340k83436k64421k36028k28648
4009D446031j93831j73693j28153j46324j40297j23577j12846q9037q8813q3435
$$ plain form
3999 3166025 3071617 2995895 2921282 2821431 2745698 2706063 2651230 2600306 2542603 2502441 2464455
3988 2464455 2415148 2371047 2333089 2293397 2255387 2218995 2195642 2155379 2123565 2083391 2049747
3977 2049747 2036840 2020700 1986346 1963535 1948809 1928400 1905363 1882360 1870392 1847019 1830240
3966 1830240 1832964 1809695 1799287 1786559 1768297 1757119 1727097 1712382 1693781 1687729 1675435 1670014
3954 1670014 1681477 1681900 1669843 1647496 1638325 1640018 1626425 1632770 1609334 1613406 1619800 1600194 1595903
3941 1595903 1604246 1591095 1590576 1600369 1595350 1589885 1585333 1567911 1582515 1588340 1583632 1580476 1557298
3928 1557298 1553467 1565905 1554762 1560090 1558393 1549987 1551763 1543994 1550863 1549973 1560238 1552684 1550110 1538926
3914 1538926 1557800 1545339 1534274 1531734 1529008 1545158 1548361 1538922 1548659 1557538 1559489 1572399 1584387
$$ packed form
3999C166025r4408p5722p4613r9851p5733l9635n4833n0924n7703m0162l7986
3988B464455m9307m4101l7958l9692l8010l6392k3353m0263l1814m0174l3644
3977B049747j2907j6140l4354k2811j4726k0409k3037k3003j1968k3373j6779
3966A830240K724k3269j0408j2728j8262j1178l0022j4715j8601o052j2294n421
3954A670014J1463M23j2057k2347r171J693j3593O345k3436M072O394j9606m291
3941A595903Q343j3151n19R793n019n465m552j7422J4604N825m708l156k3178
3928A557298l831J2438j1143N328j697q406J776p769O869q90J0265p554k574j1184
3914A538926J8874j2461j1065k540k726J6150L203r439R737Q879J951J2910J1988
$$ plain form
3901 1584387 1590781 1593511 1590234 1593063 1596155 1610848 1613252 1615003 1613277 1608804 1622839 1638973 1640412
3888 1640412 1637603 1653970 1655280 1660895 1663810 1661452 1666378 1677086 1693154 1707136 1714340 1724525 1734113
3875 1734113 1743064 1770715 1799653 1795765 1804194 1817597 1852504 1862942 1851752 1866826 1878418 1883428
3863 1883428 1895354 1900070 1924185 1937880 1949253 1964149 1986415 1997238 2019737 2014848 2014221 2046450
3851 2046450 2066749 2089689 2106581 2111691 2122509 2153923 2164823 2203616 2225460 2227114 2254159 2275073
3839 2275073 2276065 2304379 2326540 2337145 2338383 2379738 2405255 2432937 2450721 2473054 2516787 2524983
3827 2524983 2547446 2595220 2637112 2673868 2725183 2772469 2831588 2870287 2910483 2964909 3030191
3816 3030191 3089288 3151813 3225963 3282081 3360475 3422270 3487337 3542720 3601979 3669132 3726702
$$ packed form
3901A584387O394K730l277K829L092J4693K404J751j726m473J4035J6134J439
3888A640412k809J6367J310N615K915k358M926J0708J6068J3982P204J0185R588
3875A734113Q951K7651K8938l888Q429J3403L4907J0438j1190J5074J1592N010
3863A883428J1926M716K4115J3695J1373J4896K2266J0823K2499m889o27L2229
3851B046450K0299K2940J6892N110J0818L1414J0900L8793K1844J654K7045K0914
3839B275073R92K8314K2161J0605J238M1355K5517K7682J7784K2333M3733Q196
3827B524983K2463M7774M1892L6756N1315M7286N9119L8699M0196N4426O5282
3816C030191N9097O2525P4150N6118P8394O1795O5067N5383N9259O7153N7570
$$ plain form
3805 3726702 3786996 3863340 3930395 4011204 4094912 4185957 4293251 4391386 4512557 4629229 4735277
3794 4735277 4882377 5041032 5216111 5435699 5675367 5950562 6263956 6611075 6986552 7393977
3784 7393977 7841651 8361287 8919588 9523338 10168185 10876735 11607174 12363653 13197128 14128623
3774 14128623 15001785 15762320 16454471 17107253 17748650 18437342 19052747 19349861 19337067 19244434
3764 19244434 19151865 19026295 18843616 18499626 18019794 17572468 17139215 16684517 16299833 15990639
3754 15990639 15761476 15671440 15604489 15519501 15489911 15548561 15754839 16048573 16303094 16578887
3744 16578887 16929028 17288173 17697408 18139431 18479398 18744069 19057421 19428544 19737708
3735 19737708 19798090 19605982 19278167 18945898 18630412 18273094 17773399 17029423 16254380 15540505
$$ packed form
3805C726702O0294P6344O7055Q0809Q3708R1045J07294R8135J21171J16672J06048
3794D735277J47100J58655J75079K19588K39668K75195L13394L47119L75477M07425
3784G393977M47674N19636N58301O03750O44847P08550P30439P56479Q33475R31495
3774A4128623Q73162P60535O92151O52782O41397O88692O15405K97114j2794r2633
3764A9244434r2569j25570j82679l43990m79832m47326m33253m54698l84684l09194
3754A5990639k29163r0036o6951q4988k9590N8650K06278K93734K54521K75793
3744A6578887L50141L59145M09235M42023L39967K64671L13352L71123L09164
3735A9737708O0382j92108l27815l32269l15486l57318m99695p43976p75043p13875
$$ plain form
3725 15540505 14795052 14083281 13421935 12798908 12226983 11694562 11102242 10533943 10030835
3716 10030835 9623111 9281118 8917844 8465161 8048782 7680615 7347215 7041129 6750160
3707 6750160 6449970 6183113 5949449 5743961 5546239 5385771 5227571 5080958 4987662 4907688
3697 4907688 4829497 4770219 4711370 4669254 4629310 4570306 4566944 4553821 4542398 4527749 4518089 4509489
3685 4509489 4509676 4478184 4490419 4475352 4480181 4473051 4454593 4451657 4461551 4451337 4447483 4432077 4418479
3672 4418479 4418817 4405644 4419942 4397174 4387457 4400158 4395068 4384959 4367019 4338513 4324044 4299677
3660 4299677 4269334 4262556 4230954 4221541 4213486 4200568 4210509 4212993 4207130 4193549 4181921 4189748 4214161
3647 4214161 4226625 4228016 4242924 4270301 4289055 4312941 4357255 4384152 4410390 4458428 4504927 4548948
$$ packed form
3725A5540505p45453p11771o61346o23027n71925n32421n92320n68299n03108
3716A0030835m07724l41993l63274m52683m16379l68167l33400l06086k90969
3707F750160l00190k66857k33664k05488j97722j60468j58200j46613r3296p9974
3697D907688p8191n9278n8849m2116l9944n9004l362j3123j1423j4649r660q600
3685D509489J87l1492J2235j5067M829p130j8458k936R894j0214l854j5406j3598
3672D418479L38j3173J4298k2768r717J2701n090j0109j7940k8506j4469k4367
3660D299677l0343o778l1602r413q055j2918R941K484n863j3581j1628P827K4413
3647D214161J2464J391J4908K7377J8754K3886M4314K6897K6238M8038M6499M4021
$$ plain form
3635 4548948 4587815 4645647 4696762 4738720 4790218 4855060 4911190 4970101 5015126 5073484 5135740
3624 5135740 5194648 5255335 5311280 5372196 5435567 5516893 5575811 5636654 5717893 5802850 5880832
3613 5880832 5933315 6020950 6090702 6159900 6240303 6307691 6380482 6471059 6574848 6678383 6782288
3602 6782288 6911061 7023678 7153852 7290378 7430559 7589204 7753615 7921666 8087117 8265350
3592 8265350 8476369 8687770 8926742 9213683 9521823 9858475 10255523 10708507 11237105 11819870
3582 11819870 12403976 12995150 13585915 14148808 14691147 15173398 15515571 15745846 15912780
3573 15912780 16080391 16219636 16380758 16566377 16783615 17024656 17283713 17602809 18016538
3564 18016538 18521212 19132594 19846642 20631131 21474087 22401414 23454466 24542982 25653782
$$ packed form
3635D548948L8867N7832N1115M1958N1498O4842N6130N8911M5025N8358O2256
3624E135740N8908O0687N5945O0916O3371Q1326N8918O0843Q1239Q4957P7982
3613E880832N2483Q7635O9752O9198Q0403O7388P2791R0577J03789J03535J03905
3602F782288J28773J12617J30174J36526J40181J58645J64411J68051J65451J78233
3592H265350K11019K11401K38972K86941L08140L36652L97048M52984N28598N82765
3582A1819870N84106N91174N90765N62893N42339M82251L42173K30275J66934
3573A5912780J67611J39245J61122J85619K17238K41041K59057L19096M13729
3564A8016538N04674O11382P14048P84489Q42956R27327J053052J088516J110800
$$ plain form
3555 25653782 26792550 27891582 28951090 29932309 30782477 31438619 31949205 32451199 32933719
3546 32933719 33330958 33807743 34445243 35245104 36274825 37537995 38959239 40502214 42248952
3537 42248952 44367280 46777404 49351042 52142741 55039596 57886323 60631828 63188175
3529 63188175 65480140 67533376 69297741 70745193 71892439 72725103 73359290 73896991 74335049
3520 74335049 74696154 75035762 75355565 75603756 75719000 75571410 75087650 74193839 72842193
3511 72842193 70927043 68464063 65675629 62678060 59559181 56440402 53376581 50383747
3503 50383747 47578246 44969362 42596584 40454923 38464972 36667671 35008288 33383979
3495 33383979 31802279 30267271 28782750 27368977 26017331 24740104 23541533 22452561
$$ packed form
3555B5653782J138768J099032J059508R81219Q50168O56142N10586N01994M82520
3546C2933719L97239M76785O37500P99861J029721J263170J421244J542975J746738
3537D2248952K118328K410124K573638K791699K896855K846727K745505K556347
3529F3188175K291965K053236J764365J447452J147246Q32664O34187N37701M38058
3520G4335049L61105L39608L19803K48191J15244j47590m83760q93811j351646
3511G2842193j915150k462980k788434k997569l118879l118779l063821k992834
3503E0383747k805501k608884k372778k141661j989951j797301j659383j624309
3495C3383979j581700j535008j484521j413773j351646j277227j198571j088972
$$ plain form
3487 22452561 21460609 20577368 19783576 19084533 18457860 17902894 17425412 16991453 16628565
3478 16628565 16299812 16026308 15780886 15564030 15387215 15227265 15063712 14945396 14856570 14794495
3468 14794495 14740733 14699296 14694462 14712221 14743264 14797791 14879521 14972652 15068610 15158948 15269790
3457 15269790 15374989 15515126 15637310 15758761 15887574 16020192 16174013 16325066 16497035
3448 16497035 16683111 16871696 17094694 17341355 17588738 17837789 18108911 18390853 18665554
3439 18665554 18928283 19188463 19451156 19735607 20017029 20301359 20612398 20963550 21358367
3430 21358367 21771170 22234833 22758649 23309577 23928139 24614384 25351381 26163388 27066720
3421 27066720 28049476 29125658 30350582 31731884 33282851 35042116 37036027 39313263
$$ packed form
3487B2452561r91952q83241p93792o99043o26673n54966m77482m33959l62888
3478A6628565l28753k73504k45422k16856j76815j59950j63553j18316q8826o2075
3468A4794495n3762m1437m834J7759L1043N4527Q1730R3131R5958R0338J10842
3457A5269790J05199J40137J22184J21451J28813J32618J53821J51053J71969
3448A6497035J86076J88585K22998K46661K47383K49051K71122K81942K74701
3439A8665554K62729K60180K62693K84451K81422K84330L11039L51152L94817
3430B1358367M12803M63663N23816N50928O18562O86245P36997Q12007R03332
3421B7066720R82756J076182J224924J381302J550967J759265J993911K277236
$$ plain form
3413 39313263 41903223 44853929 48188639 51970320 56207128 60922211 66093458 71664785
3405 71664785 77572069 83695392 89884246 95941188 101683523 106949938 111635622 115671909
3397 115671909 119024231 121737781 123908203 125641229 127064401 128326481 129530198 130745962
3389 130745962 131996575 133191839 134232750 134965043 135244359 134968419 134033595 132372376 129930173
3380 129930173 126746392 122923833 118571363 113873870 109034667 104203111 99475442 94978148
3372 94978148 90782333 86937169 83432538 80302393 77521853 75043865 72871401 70952744
3364 70952744 69274075 67898371 66826082 66109638 65764624 65815767 66330799 67359688 68878306
3355 68878306 70870878 73339205 76223975 79472298 83006436 86693146 90434575 94107873
$$ packed form
3413C9313263K589960K950706L334710L781681M236808M715083N171247N571327
3405G1664785N907284O123323O188854O056942N742335N266415M685684M036287
3397A15671909L352322K713550K170422J733026J423172J262080J203717J215764
3389A30745962J250613J195264J040911P32293K79316k75940r34824j661219k442203
3380A29930173l183781l822559m352470m697493m839203m831556m727669m497294
3372I4978148m195815l845164l504631l130145k780540k477988k172464j918657
3364G0952744j678669j375704j072289p16444l45014N1143N15032J028889J518618
3355F8878306J992572K468327K884770L248323L534138L686710L741429L673298
$$ plain form
3347 94107873 97599983 100864668 103889279 106611123 108963270 110915812 112448417 113582373
3339 113582373 114382027 114937192 115320257 115585069 115761812 115871451 115924392 115902113 115790381 115583687
3329 115583687 115242041 114745595 114011650 112910745 111334152 109345221 107002288 104253546
3321 104253546 101175950 97776456 94077285 90180947 86197263 82263854 78436725 74776372
3313 74776372 71332989 68102184 65112696 62354888 59786961 57461649 55348877 53455750
3305 53455750 51794536 50351796 49041528 47820591 46806993 45995755 45375709 44825493 44331656
3296 44331656 43929033 43590946 43276915 42932082 42508405 41969542 41366019 40773273 40232669
3287 40232669 39730141 39309822 38970189 38760818 38654035 38654812 38731866 38891517 39135918 39456434
$$ packed form
3347I4107873L492110L264685L024611K721844K352147J952542J532605J133956
3339A13582373P99654N55165L83065K64812J76743J09639N2941k2279j11732k06694
3329A15583687l41646m96446p33945j100905j576593j988931k342933k748742
3321A04253546l077596l399494l699171l896338l983684l933409l827129l660353
3313G4776372l443383l230805k989488k757808k567927k325312k112772j893127
3305E3455750j661214j442740j310268j220937j013598q11238o20046n50216m93837
3296D4331656m02623l38087l14031l44833m23677n38863o03523n92746n40604
3287D0232669n02528m20319l39633k09371j06783P77P7054J59651K44401L20516
$$ plain form
3277 39456434 39744107 39998340 40113827 40061568 39925357 39693171 39435369 39116136 38746949 38373805
3267 38373805 38021996 37693107 37434597 37214975 37057644 36941039 36883331 36905255 36984734 37116467
3257 37116467 37314855 37571379 37896924 38310935 38816983 39404152 40085309 40891114 41841547
3248 41841547 42927751 44154299 45555357 47145669 48971281 51023493 53311701 55829684
3240 55829684 58606715 61570466 64727332 68049990 71442594 74886390 78284499 81569648
3232 81569648 84680708 87594303 90217243 92447980 94237853 95481503 96143097 96219704 95741353
3223 95741353 94746501 93279621 91366992 89056613 86419360 83517184 80473661 77350861
3215 77350861 74255860 71198113 68211298 65298433 62472134 59750284 57166905 54702104
$$ packed form
3277C9456434K87673K54233J15487n2259j36211k32186k57802l19233l69187l73144
3267C8373805l51809l28889k58510k19622j57331j16605n7708K1924P9479J31733
3257C7116467J98388K56524L25545M14011N06048N87169O81157Q05805R50433
3248D1841547J086204J226548J401058J590312J825612K052212K288208K517983
3240E5829684K777031K963751L156866L322658L392604L443796L398109L285149
3232H1569648L111060K913595K622940K230737J789873J243650O61594P6607m78351
3223I5741353r94852j466880j912629k310379k637253k902176l043523l122800
3215G7350861l095001l057747k986815k912865k826299k721850k583379k464801
$$ plain form
3207 54702104 52301139 49988852 47760228 45615290 43545862 41559618 39679094 37897916
3199 37897916 36192700 34593006 33121649 31758429 30465681 29279214 28182419 27172140
3191 27172140 26225687 25355750 24526800 23761835 23038134 22367741 21768159 21197101 20676763
3182 20676763 20177167 19718766 19308177 18927542 18580583 18249553 17952405 17698744 17460775
3173 17460775 17245564 17034380 16831806 16640747 16450988 16251426 16041389 15818340 15578595
3164 15578595 15317264 15067685 14781248 14486233 14190507 13868982 13575805 13296113 13018106
3155 13018106 12742757 12457348 12206616 11974478 11739306 11528838 11329375 11119304 10919784
3146 10919784 10739252 10570735 10401427 10219616 10068651 9945860 9807671 9693634 9588241
$$ packed form
3207E4702104k400965k312287k228624k144938k069428j986244j880524j781178
3199C7897916j705216j599694j471357j363220j292748j186467j096795j010279
3191B7172140r46453q69937q28950p64965p23701o70393n99582n71058n20338
3182B0676763m99596m58401m10589l80635l46959l31030k97148k53661k37969
3173A7460775k15211k11184k02574j91059j89759j99562k10037k23049k39745
3164A5578595k61331k49579k86437k95015k95726l21525k93177k79692k78007
3155A3018106k75349k85409k50732k32138k35172k10468j99463k10071j99520
3146A0919784j80532j68517j69308j81811j50965j22791j38189j14037j05393
$$ plain form
3137 9588241 9465956 9380747 9280996 9175632 9072943 8983678 8890168 8822292 8743645 8668287 8591557
3126 8591557 8546143 8505298 8467981 8433965 8397868 8380850 8360277 8350740 8343499 8336781 8337159 8339387 8345457
3113 8345457 8350899 8357093 8364144 8367745 8365967 8362885 8375714 8369753 8366469 8352572 8365602 8371732 8382015
3100 8382015 8371730 8400306 8428592 8452407 8456982 8474358 8496680 8530772 8555478 8553989 8574118 8577163
3088 8577163 8571926 8550308 8536590 8522294 8517201 8519051 8529040 8557089 8598902 8636433 8688155 8755875
3076 8755875 8822783 8894288 8969070 9055230 9142635 9230673 9316810 9430672 9564902 9697365 9820039
3065 9820039 9959906 10095259 10233233 10394942 10554726 10713185 10898189 11081195 11245897 11448638
3055 11448638 11643666 11866238 12111669 12360678 12668241 13007251 13353457 13730420 14132471
$$ packed form
3137I588241j22285q5209r9751j05364j02689q9265r3510o7876p8647p5358p6730
3126H591557m5414m0845l7317l4016l6097j7018k0573r537p241o718L78K228O070
3113H345457N442O194P051L601j778l082J2829n961l284j3897J3030O130J0283
3100H382015j0285K8576K8286K3815M575J7376K2322L4092K4706j489K0129L045
3088H577163n237k1618j3718j4296n093J850R989K8049M1813L7531N1722O7720
3076H755875O6908P1505P4782Q6160Q7405Q8038Q6137J13862J34230J32463J22674
3065I820039J39867J35353J37974J61709J59784J58459J85004J83006J64702K02741
3055A1448638J95028K22572K45431K49009L07563L39010L46206L76963M02051
$$ plain form
3046 14132471 14559507 15022342 15498019 16000027 16546927 17138133 17830214 18612299 19516043
3037 19516043 20415538 21168338 21733930 22142924 22494821 22835625 23191663 23623632 24120796
3028 24120796 24707555 25409743 26208836 27100683 28111901 29251346 30494987 31888841 33436055
3019 33436055 35139720 37039082 39169618 41517307 44196576 47256812 50763486 54868262
3011 54868262 59647169 65185913 71598829 79035661 87640347 97478755 108690507 121600127
3003 121600127 136950703 155464509 176590481 198302822 218986066 238103102 255078558
2996 255078558 269105129 278406908 279772773 271702386 257151455 240113869 222372843
2989 222372843 205107937 189563920 175851535 163848461 153368689 144296767 136916226
$$ packed form
3046A4132471M27036M62835M75677N02008N46900N91206O92081P82085R03744
3037A9516043Q99495P52800N65592M08994L51897L40804L56038M31969M97164
3028B4120796N86759P02188P99093Q91847J011218J139445J243641J393854J547214
3019C3436055J703665J899362K130536K347689K679269L060236L506674M104776
3011E4868262M778907N538744O412916P436832Q604686R838408J1211752J2909620
3003A21600127J5350576J8513806K1125972K1712341K0683244J9117036J6975456
2996B55078558J4026571R301779J365865q070387j4550931j7037586j7741026
2989B22372843j7264906j5544017j3712385j2003074j0479772r071922p380541
$$ plain form
2982 136916226 131479822 127865438 125182182 121520286 115673192 108275238 100523448 93082342
2974 93082342 85916416 78789429 71832089 65473165 59987552 55318612 51296255 47748393
2966 47748393 44619509 41848547 39375113 37147239 35089992 33242397 31560062 30042022
2958 30042022 28671358 27426332 26292857 25263856 24316470 23427968 22598834 21843223 21121856
2949 21121856 20423219 19700618 18954825 18247881 17601506 17002341 16477032 15991463 15538577
2940 15538577 15104346 14683433 14266024 13852407 13457464 13087582 12720617 12344074 11999623
2931 11999623 11654619 11339926 11046996 10747945 10451670 10206231 9965073 9702420 9483613
2922 9483613 9262344 9038141 8837766 8624763 8440205 8272261 8093712 7944237 7772240 7608721
$$ packed form
2982A36916226n436404l614384k683256l661896n847094p397954p751790p441106
2974I3082342p165926p126987o957340o358924n485613m668940m022357l547862
2966D7748393l128884k770962k473434k227874k057247j847595j682335j518040
2958C0042022j370664j245026j133475j029001r47386q88502q29134p55611p21367
2949B1121856o98637p22601p45793p06944o46375n99165n25309m85569m52886
2940A5538577m34231m20913m17409m13617l94943l69882l66965l76543l44451
2931A1999623l45004l14693k92930k99051k96275k45439k41158k62653k18807
2922I483613k21269k24203k00375k13003j84558j67944j78549j49475j71997j63519
$$ plain form
2912 7608721 7446115 7303269 7169363 7033878 6899947 6765317 6628762 6495699 6353951 6248604
2902 6248604 6115999 5995753 5901296 5811826 5713405 5642861 5572995 5503527 5411042 5335860 5256762
2891 5256762 5175524 5097183 5009826 4948196 4867764 4799022 4726759 4651773 4587932 4523045 4454638
2880 4454638 4411274 4343249 4289503 4246773 4208563 4140250 4078250 4028073 3967141 3915213 3880173
2869 3880173 3832523 3782635 3712000 3661587 3613427 3573673 3525556 3477888 3424370 3364396 3311847
2858 3311847 3261707 3211471 3166627 3122466 3085249 3041748 3020640 3005487 2968525 2943396 2919489
2847 2919489 2889464 2848732 2817891 2784440 2745876 2703851 2651082 2601250 2545423 2494074 2461096
2836 2461096 2424974 2375186 2351299 2315350 2290220 2273938 2238941 2195407 2164312 2142194 2112945
$$ packed form
2912G608721j62606j42846j33906j35485j33931j34630j36555j33063j41748j05347
2902F248604j32605j20246r4457q9470r8421p0544o9866o9468r2485p5182p9098
2891E256762q1238p8341q7357o1630q0432o8742p2263p4986o3841o4887o8407
2880D454638m3364o8025n3746m2730l8210o8313o2000n0177o0932n1928l5040
2869C880173m7650m9888p0635n0413m8160l9754m8117m7668n3518n9974n2549
2858C311847n0140n0236m4844m4161l7217m3501k1108j5153l6962k5129k3907
2847B919489l0025m0732l0841l3451l8564m2025n2769m9832n5827n1349l2978
2836B461096l6122m9788k3887l5949k5130j6282l4997m3534l1095k2118k9249
$$ plain form
2825 2112945 2076556 2044995 2013825 2010349 1983872 1949286 1950465 1936530 1934382 1928766 1936389 1910081
2813 1910081 1893282 1881306 1853656 1848340 1836585 1804047 1789807 1785314 1771277 1739403 1698302 1664621
2801 1664621 1646996 1630302 1617056 1593137 1561155 1549591 1524110 1530880 1526729 1494285 1499224 1494469
2789 1494469 1488590 1473403 1455863 1444741 1436964 1417949 1408600 1402466 1394467 1368662 1351571 1350876 1348709
2776 1348709 1352505 1336725 1327845 1323044 1321133 1321284 1313645 1283877 1279268 1279966 1259925 1259957 1244769 1234872
2762 1234872 1207752 1189915 1179934 1166570 1171027 1157387 1143525 1137246 1132693 1116316 1100265 1085347
2750 1085347 1075447 1070553 1081729 1068092 1062194 1067558 1046545 1045339 1030596 1036421 1036857 1019710 1025625
2737 1025625 1028967 1027106 1029153 1042428 1042857 1027782 1045065 1058358 1075707 1114093 1129882 1163698
$$ packed form
2825B112945l6389l1561l1170l476k6477l4586J179j3935k148n616P623k6308
2813A910081j6799j1976k7650n316j1755l2538j4240m493j4037l1874m1101l3681
2801A664621j7625j6694j3246k3919l1982j1564k5481O770m151l2444M939m755
2789A494469n879j5187j7540j1122p777j9015r349o134p999k5805j7091o95k167
2776A348709L796j5780q880m801j911J51p639k9768m609O98k0041L2j5188r897
2762A234872k7120j7837r981j3364M457j3640j3862o279m553j6377j6051j4918
2750A085347r900m894J1176j3637n898N364k1013j206j4743N825M36j7147N915
2737A025625L342j861K047J3275M29j5075J7283J3293J7349L8386J5789L3816
$$ plain form
2725 1163698 1192287 1233182 1265010 1316471 1372632 1449844 1544409 1646378 1757602 1866889 1983817
2714 1983817 2074584 2135512 2190212 2198725 2161267 2087558 1997238 1882342 1782100 1693609 1613573
2703 1613573 1541471 1480398 1429820 1375285 1336121 1321020 1309414 1270021 1240094 1195474 1142485
2692 1142485 1093935 1051918 996569 965736 915757 884666 854446 829859 790413 785288 763188 752941
2680 752941 742723 731700 716591 688408 679838 678081 684177 682643 670363 648536 634313 633643 641751
2667 641751 622064 588694 586965 588744 580332 572799 558199 547046 534058 529347 519561 510600 514128
2654 514128 512460 510337 499892 494551 506208 496926 490491 485979 487508 464188 450888 454596 451120
2641 451120 437306 427491 424512 400105 384763 387243 395923 389920 382146 375081 374989 365169 343605 351438
$$ packed form
2725A163698K8589M0895L1828N1461N6161P7212R4565J01969J11224J09287J16928
2714A983817R0767O0928N4700Q513l7458p3709r0320j14896j00242q8491q0036
2703A613573p2102o1073n0578n4535l9164j5101j1606l9393k9927m4620n2989
2692A142485m8550m2017n5349l0833m9979l1091l0220k4587l9446n125k2100j0247
2680G52941j0218j1023j5109k8183q570j757O096j534j2280k1827j4223o70Q108
2667F41751j9687l3370j729J779q412p533j4600j1153j2988m711r786q961L528
2654E14128j668k123j0445n341J1657r282o435m512J529k3320j3300L708l476
2641D51120j3814r815k979k4407j5342K480Q680o003p774p065r2r820k1564P833
$$ plain form
2627 351438 335102 329644 331948 336720 331619 323396 330418 313819 303455 305485 295775 305822 295750
2614 295750 306113 305510 298830 301587 307480 302940 301979 306869 310183 290653 283496 288926 299490 318635
2600 318635 316211 306149 298601 294358 289922 287199 290891 295779 289138 295402 294500 278640 278327 282184
2586 282184 287357 286244 277261 268260 254871 241652 237146 233674 242762 250520 231866 230368 241088
2573 241088 256674 221208 229116 247215 236128 233902 214463 225299 218484 196547 189931 200261
2561 200261 199647 202817 201306 199367 205148 191670 188255 198010 201617 194639 189030 187980 197914 207309
2547 207309 202516 188583 201376 184746 194214 201377 203789 204796 184857 190997 174463 169306 167944
2534 167944 163227 166528 160173 158700 145900 153211 143086 150622 155260 171111 160626 139051 141396
$$ packed form
2627C51438j6336n458K304M772n101q223P022j6599j0364K030r710J0047j0072
2614B95750J0363o03o680K757N893m540r61M890L314j9530p157N430J0564J9145
2600C18635k424j0062p548m243m436k723L692M888o641O264r02j5860l13L857
2586B82184N173j113q983r001j3389j3219m506l472R088P758j8654j498J0720
2573B41088J5586l5466P908J8099j1087k226j9439J0836o815k1937o616J0330
2561B00261o14L170j511j939N781j3478l415R755L607o978n609j050R934R395
2547B07309m793j3933J2793j6630R468P163K412J007j9939O140j6534n157j362
2534A67944m717L301o355j473j2800P311j0125P536M638J5851j0485k1575K345
$$ plain form
2521 141396 145906 142543 140519 136348 147245 151223 158533 158159 158110 158521 165454 161477 152896 155973 146761
2506 146761 149104 145159 144697 149043 148812 146326 154009 153621 146762 121845 119790 127376 136572 138252 131578
2491 131578 132392 136474 111112 130959 135966 135345 135423 122128 125838 145688 138990 154294 137333 118652
2477 118652 115524 113448 110056 124920 129294 119289 114558 116804 106516 112915 113948 103376 111193
2464 111193 100413 103741 116985 111814 110827 107542 93351 95954 90671 94073 78948 95716 61992
2451 61992 58519 75567 68975 69983 84609 90368 76741 78837 77770 78295 87030 70564 82563 84436
2437 84436 86857 96280 82125 83510 85617 74160 66428 68267 76854 73147 76032 81829 60252 59984
2423 59984 62725 78654 93491 77951 60441 86266 92106 76520 79339 75693 92425 90108 73392
$$ packed form
2521A41396M510l363k024m171J0897L978P310l74m9M11O933l977q581L077r212
2506A46761K343l945m62M346k31k486P683l88o859k4917k055P586R196J680o674
2491A31578Q14M082k5362J9847N007o21P8j3295L710J9850o698J5304j6961j8681
2477A18652l128k076l392J4864M374j0005m731K246j0288O399J033j0572P817
2464A11193j0780L328J3244n171r87l285j4191K603n283L402j5125J6768l3724
2451F1992l473J7048o592J008J4626N759j3627K096j067N25Q735j6466J1999J873
2437H4436K421R423j4155J385K107j1457p732J839Q587l707K885N797k1577k68
2423E9984K741J5929J4837j5540j7510K5825N840j5586K819l646J6732k317j6716
$$ plain form
2410 73392 84361 89748 77966 70486 82238 68736 74793 84663 85329 88166 76226 65577 75085
2397 75085 84550 85707 74061 76496 89992 80140 76917 88774 85058 90820 83219 84416 85211 72103
2383 72103 75264 54435 59439 57734 69673 79186 84501 85978 81738 65819 63058 70994 89658 73105
2369 73105 52695 51996 67827 74451 66389 68988 67890 62271 61496 61766 65310 49140 52108 74984
2355 74984 80883 86913 66615 68177 59199 70194 74457 67258 61891 65462 61254 66776 60741 79969
2341 79969 83252 74241 67525 78328 75709 42038 48172 68022 61404 53062 68528 62600 56983 64899
2327 64899 72383 79288 90266 95248 89547 71349 74731 67605 73714 76209 77067 97916 94425 93854
2313 93854 88776 78075 63439 69634 84111 80753 86299 82355 83670 84367 89031 86878 83059 110706
$$ packed form
2410G3392J0969N387j1782p480J1752j3502O057R870O66K837j1940j0649R508
2397G5085R465J157j1646K435J3496r852l223J1857l716N762p601J197P95j3108
2383G2103L161k0829N004j705J1939R513N315J477m240j5919k761P936J8664j6553
2369G3105k0410o99J5831O624q062K599j098n619p75K70L544j6170K968K2876
2355G4984N899O030k0298J562q978J0995M263p199n367L571m208N522o035J9228
2341G9969L283r011o716J0803k619l3671O134J9850o618q342J5466n928n617P916
2327F4899P484O905J0978M982n701j8198L382p126O109K495Q58K0849l491n71
2313I3854n078j0701j4636O195J4477l358N546l944J315O97M664k153l819K7647
$$ plain form
2299 110706 115057 103798 90865 96956 102716 107781 121482 114779 124669 115994 97396 110995 119033
2286 119033 126677 128974 122973 137856 127347 145243 149124 163773 160311 165391 191595 190135 177060
2273 177060 171125 189520 203697 214391 219027 225668 238036 251413 255989 255440 269480 288894 306937
2260 306937 333540 352002 390361 403521 423335 461580 504043 539517 599856 647598 705367 761391
2248 761391 843150 948626 1057759 1178536 1342330 1583285 1851331 2062410 2277259 2488163
2238 2488163 2675496 2817027 2922515 2848334 2637519 2425393 2214924 2001428 1836191 1701797
2228 1701797 1567133 1461178 1345032 1282413 1227207 1210259 1209276 1218070 1139952 1055605 969869
2217 969869 887156 813517 751591 673242 613625 557118 507255 466794 443880 411954 376241 341058
$$ packed form
2299A10706M351j1259j2933O091N760N065J3701o703R890q675j8598J3599Q038
2286A19033P644K297o001J4883j0509J7896L881J4649l462N080K6204j460j3075
2273A77060n935J8395J4177J0694M636O641J2368J3377M576n49J4040J9414J8043
2260C06937K6603J8462L8359J3160J9814L8245M2463L5474O0339M7742N7769N6024
2248G61391Q1759J05476J09133J20777J63794K40955K68046K11079K14849K10904
2238B488163J87333J41531J05488p4181k10815k12126k10469k13496j65237j34394
2228A701797j34664j05955j16146o2619n5206j6948r83Q794p8118q4347q5736
2217I69869q2713p3639o1926p8349n9617n6507m9863m0461k2914l1926l5713l5183
$$ plain form
2205 341058 342525 338473 334200 323843 298590 283770 266155 252990 236690 229297 220580 209379 197128
2192 197128 204028 206490 187477 166942 156836 146888 145596 148171 147130 138643 123445 135836 148148
2179 148148 114317 97727 108936 128964 125467 99687 105130 108726 104831 106470 78294 86633 88061
2166 88061 90398 94848 88791 59441 70459 84514 80135 84512 66426 62138 70059 59046 50922
2153 50922 58155 59028 72495 75653 60420 53960 43733 46548 56620 51400 37969 41694 40295 41091
2139 41091 40260 45416 41530 39375 34913 35908 44969 50323 32716 27994 36244 39865 29404 41438
2125 41438 33590 30209 34042 28326 41906 32203 31459 14981 20196 38497 37017 14379 21247 32890
2111 32890 33715 33434 21709 12120 16491 27070 30437 27591 19728 26152 26868 22158 34360 43848 28582
$$ packed form
2205C41058J467m052m273j0357k5253j4820j7615j3165j6300p393q717j1201j2251
2192A97128O900K462j9013k0535j0106r948j292K575j041q487j5198J2391J2312
2179A48148l3831j6590J1209K0028l497k5780N443L596l895J639k8176Q339J428
2166H8061K337M450o057k9350J1018J4055m379M377j8086m288P921j1013q124
2153E0922P233Q73J3467L158j5233o460j0227K815J0072n220j3431L725j399P96
2139D1091q31N156l886k155m462R95R061N354j7607m722Q250L621j0461J2034
2125D1438p848l381L833n716J3580r703p44j6478N215J8301j480k2638O868J1643
2111C2890Q25k81j1725r589M371J0579L367k846p863O424P16m710J2202R488j5266
$$ plain form
2096 28582 19211 8187 1829 5405 13673 29207 19742 19361 20055 27682 16693 15501 17664 7291
2082 7291 18533 7240 1076 -782 19380 23460 -5010 1944 25509 6765 7936 10593 -2014
2069 -2014 -4968 -1725 8236 6356 6623 13908 11012 16109 16385 2758 -9788 -10352 3834 -12519 -5501
2054 -5501 -1364 -7553 -11606 843 -2976 -20160 -6752 -7310 -4750 7441 11719 10581 1992 772
2040 772 5764 10256 81 -2602 11756 17759 24798 22912 10662 9232 5875 16657 2646 8310
2026 8310 9656 7334 -6226 190 4702 8791 8269 16114 13629 904 13527 14847 18099 10313
2012 10313 2987 2309 18459 11233 3191 11613 10125 6095 -17310 -13165 -5216 -9959 -15412 -3647
1998 -3647 139 -549 -8258 -27693 -28379 -4907 -3249 -17601 -9784 -12584 -9544 -10798 -6309 -13899 -13075
$$ packed form
2096B8582r371j1024o358L576Q268J5534r465l81O94P627j0989j192K163j0373
2082G291J1242j1293o164j858K0162M080k8470O954K3565j8744J171K657j2607
2069b014k954L243R961j880K67P285k896N097K76j3627j2546n64J4186j6353P018
2054e501M137o189m053J2449l819j7184J3408n58K560J2191M278j138q589j220
2040G72M992M492j0175k683J4358O003P039j886j2250j430l357J0782j4011N664
2026H310J346k322j3560O416M512M089n22P845k485j2725J2623J320L252p786
2012A0313p326o78J6150p226q042Q422j488m030k3405M145P949m743n453J1765
1998c647L786o88p709j9435o86K3472J658j4352P817k800L040j254M489p590Q24
$$ plain form
1983 -13075 -12783 5926 5960 -6355 -13505 -9760 -2285 722 1584 1025 -3423 -11370 -9743 -5396 4764
1968 4764 11493 7052 -810 -3844 -3963 1772 -17479 -14983 -4460 5343 839 -6468 -4409 1637 11713
1953 11713 2658 5073 9472 16769 6439 13939 7791 -10758 -10924 -16719 -4653 967 -15839 8418
1939 8418 -5069 -8644 -11830 -1019 2851 -13281 -21922 -12260 -5538 -11406 -25118 -21740 -7074 -10226
1925 -10226 -4696 721 -14656 -5221 -17659 -21820 -6570 -15514 -10464 -11495 -7569 -20047 -16748 -17538
1911 -17538 -24059 -17280 -22615 -12 14969 9080 -3005 -6483 -8249 -20121 -10057 -7908 3930
1898 3930 4541 2635 7732 13950 9971 -3616 -6441 -14346 -15556 -5204 -11815 -27743 -26682 -25168
1884 -25168 -19518 -24227 -13069 -7926 -15613 -3965 -12599 -16370 -27495 -40523 -39543 -28407 -17598
$$ packed form
1983a3075K92J8709L4j2315p150L745P475L007Q62n59m448p947J627M347J0160
1968D764O729m441p862l034j19N735j9251K496J0523R803m504p307K059O046J0076
1953A1713r055K415M399P297j0330P500o148j8549j66n795J2066N620j6806K4257
1939H418j3487l575l186J0811L870j6132q641R662O722n868j3712L378J4666l152
1925a0226N530N417j5377R435j2438m161J5250q944N050j031L926j2478L299p90
1911a7538o521O779n335K2603J4981n889j2085l478j766j1872J0064K149J1838
1898C930O11j906N097O218l979j3587k825p905j210J0352o611j5928J061J514
1884b5168N650m709J1158N143p687J1648q634l771j1125j3028R80J1136J0809
$$ plain form
1871 -17598 -18370 -23843 -31713 -21302 -11450 -22701 -13127 -22773 -33470 -31125 -22208 -17352 -21906 -18024
1857 -18024 -8702 -6055 -15684 -24830 -23411 -22642 -7224 -4306 -6583 -16536 -14309 -15647 -16997 -22303 -21132
1842 -21132 -23309 -97 -9849 -13866 -18685 -39790 -35254 -30940 -31987 -27582 -3254 3788 -10683 -30229
1828 -30229 -25046 -2430 -11520 -14755 -27047 -27220 -19008 -37979 -26616 -24197 -19908 -13822 -27107 -39992
1814 -39992 -39216 -26023 -27336 -26405 -38164 -37504 -34004 -12624 -10853 -5863 -993 -7937 -24108 -49149
1800 -49149 -33162 -20703 -7515 -76 3897 -7933 -15112 -33685 -32981 -25980 -37810 -34527 -35991
1787 -35991 -28155 -8274 -14360 -11956 -27906 -8817 -7187 -6572 -9226 -5594 -21025 -26639 -42165 -39684
1773 -39684 -26463 -20417 -5045 6499 -9767 -15693 -4765 12189 -4912 -20403 -18723 -5400
$$ packed form
1871a7598p72n473p870J0411R852j1251R574r646j0697K345Q917M856m554L882
1857a8024R322K647r629r146J419P69J5418K918k277r953K227j338j350n306J171
1842b1132k177K3212r752m017m819k1105M536M314j047M405K4328P042j4471j9546
1828c0229N183K2616r090l235j2292j73Q212j8971J1363K419M289O086j3285j2885
1814c9992P76J3193j313R31j1759O60L500K1380J771M990M870o944j6171k5041
1800d9149J5987J2459J3188P439L973j1830p179j8573P04P001j1830L283j464
1787c5991P836J9881o086K404j5950J9089J630O15k654L632j5431n614j5526K481
1773c9684J3221O046J5372J1544j6266n926J0928J6954j7101j5491J680J3323
$$ plain form
1761 -5400 -18117 -42796 -25649 -13807 -12381 -19860 -22796 -31081 -26090 -20194 -29002 -27268 -5893 -22124
1747 -22124 -31524 -42660 -26738 -10528 -166 -9741 -5026 -22116 -20791 -13621 -23566 -15371 -8780
1734 -8780 -7623 -19794 -13051 -8928 -10550 -14549 -14287 -8652 -15646 -26901 -25051 -5864 -15383 -31095
1720 -31095 -25622 -11579 -15241 -17584 -24544 -14425 -8036 -15952 -9711 -9305 -14492 -29383 -32826 -45454
1706 -45454 -23351 -21647 -27820 -20425 -20008 -8396 6293 -9689 -23309 -16798 -19253 -15236 -27175
1693 -27175 -35383 -29970 -27259 -23959 -23252 -16679 -27927 -37121 -35273 -33339 -26761 -14671 -30608 -34217
1679 -34217 -17859 -10687 -33086 -32832 -11187 -19963 -14204 -17447 -14220 -23908 -18750 -5847 -9385 -4185
1665 -4185 -18909 -17922 -12553 -27669 -24063 -13921 -18831 -26220 -24693 -21815 -32046 -18697 -5972 -17225
$$ packed form
1761e400j2717k4679J7147J1842J426p479k936q285M991N896q808J734K1375j6231
1747b2124r400j1136J5922J6210J0362r575M715j7090J325P170r945Q195O591
1734h780J157j2171O743M123j622l999K62N635o994j1255J850J9187r519j5712
1720c1095N473J4043l662k343o960J0119O389p916O241M06n187j4891l443j2628
1706d5454K2103J704o173P395M17J1612J4689j5982j3620O511k455M017j1939
1693b7175q208N413K711L300P07O573j1248r194J848J934O578J2090j5937l609
1679c4217J6358P172k2399K54K1645q776N759l243L227r688N158J2903l538N200
1665d185j4724R87N369j5116L606J0142m910p389J527K878j0231J3349J2725j1253
$$ plain form
1651 -17225 -8628 -16577 -13610 -21699 -22537 -37425 -60219 -51096 -16551 -25985 -27427 -28713 -21181 -16991
1637 -16991 -12785 -16286 -26634 -26454 -33589 -11178 -8347 -12304 -17581 -23004 -33241 -27218 -32347 -24509
1623 -24509 -9218 -11527 -20070 -10834 -23791 -12689 -12179 -16090 -18744 -24825 -8502 -18859 -2585
1610 -2585 3639 -20984 -24192 -25170 -2572 5495 -4177 -4011 -19970 -9049 -16133 -14582 -683 -12141
1596 -12141 -28648 -32488 -33223 -21586 -30208 -22674 -27186 -28047 -31487 -28348 -18335 -15258 -1779 -15424
1582 -15424 -18767 -24947 -23478 -9452 -10301 -4240 -5978 -17113 -24493 -36210 -23936 -10011 -3338 -15800
1568 -15800 -716 -7700 -17905 -27268 -31155 -30344 -20304 -21492 -23527 -8620 -9692 -14565 -19267 -29109
1554 -29109 -36882 -38302 -32513 -40082 -41134 -29316 -13916 -16738 -19789 -14558 -26036 -21570 -8236 -5177
$$ packed form
1651a7225Q597p949K967q089q38j4888k2794R123L4545r434j442j286P532M190
1637a6991M206l501j0348J80p135K2411K831l957n277n423j0237O023n129P838
1623b4509J5291k309q543R236j2957J1102N10l911k654o081J6323j0357J6274
1610b585O224k4623l208r78K2598Q067r672J66j5959J0921p084J551J3899j1458
1596a2141j6507l840p35J1637q622P534m512q61l440L139J0013L077J3479j3645
1582a5424l343o180J469J4026q49O061j738j1135p380j1717J2274J3925O673j2462
1568a5800J5084o984j0205r363l887Q11J0040j188k035J4907j072m873m702r842
1554b9109p773j420N789p569j052J1818J5400k822l051N231j1478M466J3334L059
$$ plain form
1540 -5177 -15985 -9390 -26682 -42693 -27110 -22281 -23501 -29855 -36473 -6763 -13664 -22594 -13020 -14656
1526 -14656 -20217 -15913 -4970 -11667 -20750 -5487 -3310 -5020 -24513 -32954 -30379 -32042 -19926 -28805
1512 -28805 -41143 -33759 -16818 -12565 -24298 -31760 -9374 5864 -4000 -10869 -34954 -39212 -13869
1499 -13869 -13607 -13449 -6521 -13111 -7840 -14708 -27466 -24440 -35340 -16237 -17664 -27292 -18642 -13838
1485 -13838 -12637 -3854 -7950 2311 4474 -10309 -12168 -14033 -22841 -26505 -29927 -15952 -4411 -770
1471 -770 -15130 -13579 -11789 -23262 -27873 -25169 -26402 -32077 -32674 -24820 -27967 -25037 -20270 -30056 -28015
1456 -28015 -12305 -24308 -31527 -12884 -18367 -30150 -19337 -16488 -11616 -4547 -12697 1591 6383
1443 6383 -7388 8693 18011 10414 -7271 -24759 -9945 -15354 -21913 -20425 -16859 -32256 -22223
$$ packed form
1540e177j0808O595j7292j6011J5583M829j220o354o618K9710o901q930R574j636
1526a4656n561M304J0943o697r083J5263K177j710j9493q441K575j663J2116q879
1512b8805j2338P384J6941M253j1733p462K2386J5238r864o869k4085m258K5343
1499a3869K62J58O928o590N271o868j2758L026j0900J9103j427r628Q650M804
1485a3838J201Q783m096J0261K163j4783j859j865q808l664l422J3975J1541L641
1471g70j4360J551J790j1473m611K704j233n675n97P854l147K930M767r786K041
1456b8015J5710j2003p219J8643n483j1783J0813K849M872P069q150J4288M792
1443F383j3771J6081R318p597j7685j7488J4814n409o559J488L566j5397J0033
$$ plain form
1430 -22223 -18373 -29375 -31454 -14599 -11213 -3937 -17180 -25682 -43618 -25891 -18961 -21041 -18840
1417 -18840 -22030 -31866 -28365 -26324 -28025 -25107 -23284 -20091 -15062 -14518 -18812 -12027 -13291 -22270 -31106
1402 -31106 -46706 -34352 -26068 -25133 -16469 -18359 -14935 -15413 -6580 -2531 7584 -155 5605 973
1388 973 -5721 3434 325 -7003 -8471 -41933 -27238 -11125 -10534 -25126 -27802 -14192 -16427 -12378
1374 -12378 1180 -2400 -2062 -18585 -34568 -44467 -34073 -17467 -17265 -8107 -2733 -11655 -12863 -7256
1360 -7256 -1201 -6672 -13902 -6060 -1731 -10893 -33037 -41279 -41981 -24101 -22186 -24699 -33811 -28466 -2845
1345 -2845 -4838 -17641 -12830 -15196 -17437 -14563 -11216 -14061 -29834 -29317 -27261 -13525 -6490 -11945
1331 -11945 -28000 -16824 -13009 -6153 -2585 -1759 2694 -904 1062 -16195 -10912 -14050 -13415 -12020
$$ packed form
1430b2223L850j1002k079J6855L386P276j3243q502j7936J7727O930k080K201
1417a8840l190r836L501K041j701K918J823L193N029N44m294O785j264q979q836
1402c1106j5600J2354Q284R35Q664j890L424m78Q833M049J0115p739N760m632
1388I73o694R155l109p328j468l3462J4695J6113N91j4592k676J3610k235M049
1374a2378J3558l580L38j6523j5983r899J0394J6606K02R158N374q922j208N607
1360g256O055n471p230P842M329r162k2144q242p02J7880J915k513r112N345K5621
1345b845j993j2803M811k366k241K874L347k845j5773N17K056J3736P035n455
1331a1945j6055J1176L815O856L568Q26M453l598J966j7257N283l138O35J395
$$ plain form
1317 -12020 2134 -12820 -21461 -24203 -25524 -9575 -10048 -4560 -15918 -17043 -5082 -6912 -8350 -2058
1303 -2058 -10976 -2109 8999 -2199 6830 -1493 -11156 -26915 -32064 -19222 -19887 -13484 -17129 -18207
1289 -18207 -6242 -8327 11820 -5456 -3428 -9390 -51031 -46652 -16557 -12159 -21921 -21324 -18293 -13196
1275 -13196 -11193 -23119 -36226 -33093 -10973 -1845 -15234 -6560 -7590 2812 -1082 -5342 -11063
1262 -11063 -27435 -18205 -23735 -17654 -6398 -12982 -4347 -14499 -21182 -12183 -17780 -17827 -8581 -13378
1248 -13378 -16868 -28015 -3747 13758 3268 -6468 -9660 -30419 -32083 -26545 -15178 1616 -6445
1235 -6445 -13240 -21192 -9670 -19975 -19149 -12963 -29416 -22919 -17569 -1339 4329 -8509 -17907 -12801
1221 -12801 -12774 -7466 -13843 -4402 -6834 -22688 -24455 -14746 1037 10767 -5666 -28202 -14632 -7088
$$ packed form
1317a2020J4154j4954q641k742j321J5949m73N488j1358j125J1961j830j438O292
1303b058q918Q867J1108j1198R029q323r663j5759n149J2842o65O403l645j078
1289a8207J1965k085K0147j7276K028n962m1641M379L0095M398r762N97L031N097
1275a3196K003j1926j3107L133K2120R128j3389Q674j030J0402l894m260n721
1262a1063j6372R230n530O081J1256o584Q635j0152o683Q999n597m7R246m797
1248a3378l490j1147K4268J7505j0490r736l192k0759j664N538J1367J6794q061
1235f445o795p952J1522j0305Q26O186j6453O497N350J6230N668j2838r398N106
1221a2801K7N308o377R441k432j5854j767R709J5783R730j6433k2536J3570P544
$$ plain form
1207 -7088 -12080 -20291 -13694 -2063 -6166 -31537 -19862 -5149 8594 1076 -6686 -2834 -8228 1694
1193 1694 21953 5470 -12188 5814 -2444 -3539 2515 1152 -4044 -4517 -8082 -453 1053 -24037
1179 -24037 -18163 -18821 -18633 -15211 -9083 -8590 5908 4957 -9426 -13590 -5476 -16182 -25275 -14640 -6355
1164 -6355 -3146 7541 -2142 -17579 -17578 -21801 -9572 1965 -11134 -9030 -16107 -7827 -9326 -35414
1150 -35414 -19957 -15003 -13005 -4659 -1750 11961 26046 9782 -2293 -9010 1574 7093 -8659
1137 -8659 -11902 7483 -612 -14469 -9846 -29449 -30860 -25214 -15794 -2223 -11839 -12347 -4857 9151
1123 9151 22075 -623 -11436 -12111 -10650 -6129 -13027 -12614 -19113 -15664 -24519 -13558 -9312 -6601
1109 -6601 -598 -16741 -13301 -7026 -12312 -10246 -3711 -8939 -15775 7712 12449 -2866 -10074 1679
$$ packed form
1207g088m992q211O597J1631m103k5371J1675J4713J3743p518p762L852n394R922
1193A694K0259j6483j7658J8002q258j095O054j363n196m73l565P629J506k5090
1179b4037N874o58J88L422O128M93J4498r51j4383m164Q114j0706r093J0635Q285
1164f355L209J0687r683j5437Jm223J2229J1537j3099K104p077Q280j499k6088
1150c5414J5457M954J998Q346K909J3711J4085j6264j2075o717J0584N519j5752
1137h659l243J9385q095j3857M623j9603j411N646R420J3571r616n08P490J4008
1123I151J2924k2698j0813o75J461M521o898M13o499L449q855J0961M246K711
1109f601O003j6143L440O275n286K066O535n228o836K3487M737j5315p208J1753
$$ plain form
1095 1679 -6368 -8869 8618 12025 -12218 -23663 -10933 -22518 -14230 7548 8443 -1780 1629
1082 1629 2978 -13099 -1303 -3606 -13761 -6589 -7468 -779 2649 -18161 -22236 -15939 -15885 -9580 -9426
1067 -9426 -13291 -16799 6372 -5103 -4037 -12177 -12946 -10009 -4613 -10925 -5243 -2890 -1477 6361 3022
1052 3022 12195 -14187 -7483 14158 16265 8959 -14166 6251 27634 7269 9359 1695 -11537
1039 -11537 -18314 -8524 -10076 -7899 5225 13368 6332 -5495 -3498 23546 11475 6181 8064 1279
1025 1279 2610 -8067 -6992 -5414 -3359 -1298 11139 5241 2281 -4759 -4406 9243 -2070 -3234
1011 -3234 -1308 -7581 -5433 -5236 -11254 -5018 4494 -12298 13 14087 15941 -274 -3681 -2872
997 -2872 -9953 -16117 -7996 -353 -14081 -7924 -3908 -9000 -5707 4992 20872 22410 638 -17822
$$ packed form
1095A679q047k501J7487L407k4243j1445J2730j1585Q288K1778Q95j0223L409
1082A629J349j6077J1796k303j0155P172q79O689L428k0810m075O297N4O305J54
1067i426l865l508K3171j1475J066q140p69K937N396o312N682K353J413P838l339
1052C022R173k6382O704K1641K107p306k3125K0417K1383k0365K090p664j3232
1039a1537o777R790j552K177J3124Q143p036j1827J997K7044j2071n294J883o785
1025A279J331j0677J075J578K055K061J2437n898k960p040L53J3649j1313j164
1011c234J926o273K148J97o018O236R512j6792J2311J4074J854j6215l407Q09
997b872p081o164Q121P643j3728O157M016n092L293J0699J5880J538k1772j8460
$$ plain form
983 -17822 -27945 -32192 -32148 -17284 5968 313 -17241 -31532 -41777 -28675 -20641 -18609 -8840 619
969 619 10001 23457 9979 -2493 10571 17216 14102 8604 17940 22201 21204 15296 3780 14264
955 14264 28380 22251 10342 7046 7473 1112 -5661 4325 3026 -3016 -4475 -2597 -6486 -2937 2290
940 2290 4135 7520 10049 -4571 -12262 -16291 2562 5630 2462 4774 -4976 4684 4211 7662 -3320
925 -3320 4424 5321 5696 -4784 -11547 -2021 5570 -6397 -12795 8967 1021 610 14590 -3087 -13962
910 -13962 -24666 -20289 -6182 9774 19736 10195 5522 7698 9805 1920 -2920 -2602 -5900 -11232
896 -11232 -15834 -4829 2538 3948 16035 2820 7686 8498 3975 1067 -4327 -6137 -11072 -6985
882 -6985 -19661 5049 17413 5492 -8847 -9790 12091 20913 9007 -3087 -12861 -4601 3510
$$ packed form
983a7822j0123m247M4J4864K3252n655j7554j4291j0245J3102Q034K032R769R459
969F19R382J3456j3478j2472J3064O645l114n498R336M261r97n908j1516J0484
955A4264J4116o129j1909l296M27o361o773R986j299o042j459J878l889L549N227
940B290J845L385K529j4620p691m029J8853L068l168K312r750R660m73L451j0982
925c320P744Q97L75j0480o763R526P591j1967o398K1762p946m11J3980j7677j0875
910a3962j0704M377J4107J5956R962r541m673K176K107p885m840L18l298n332
896a1232m602J1005P367J410J2087j3215M866Q12m523k908n394j810m935M087
882f985j2676K4710J2364j1921j4339r43K1881Q822j1906j2094r774Q260Q111
$$ plain form
869 3510 -6115 -5091 -2908 1060 2788 1530 -24121 -28686 -1330 14722 3307 -2924 2332 9204
855 9204 15321 11850 15556 15629 -2605 -4281 3384 4296 -13428 -2452 -8569 117 -2988 -11997 -10961
840 -10961 -4009 -18614 -16640 202 -13491 5739 16478 14563 490 -577 -16570 -12971 -5044
827 -5044 5406 -3080 -16735 -23842 -15105 -3457 8292 7611 -13502 -9158 8018 1529 10863 23931
813 23931 29958 18047 8649 21365 18525 21323 9827 11369 18064 7238 7715 16738 23429 10774
799 10774 -3492 1585 -13727 -13618 11550 8300 3497 10330 -4120 641 -1833 1156 5282 2005
785 2005 -4100 -7451 -2130 -3982 -10580 195 15137 4272 -5125 5351 3686 -6088 -11676 -3226
771 -3226 -3050 -480 -1109 7618 10548 2013 7929 -615 -16874 4754 2378 6371 6043 -4382 19851
$$ packed form
869C510r625J024K183L968J728j258k5651m565K7356J6052j1415o231N256O872
855I204O117l471L706P3j8234j676P665R12j7724J0976o117Q686l105r009J036
840a0961O952j4605J974J6842j3693J9230J0739j915j4073j067j5993L599P927
827e044J0450q486j3655p107Q737J1648J1749o81k1113M344J7176o489R334J3068
813B3931O027j1911r398J2716k840K798j1496J542O695j0826M77R023O691j2655
799A0774j4266N077j5312J09K5168l250m803O833j4450M761k474K989M126l277
785B005o105l351N321j852o598J0775J4942j0865r397J0476j665r774n588Q450
771c226J76K570o29Q727K930q535N916q544j6259K1628k376L993l28j0425K4233
$$ plain form
756 19851 7251 4305 8122 13117 2764 11781 20391 18156 16511 23372 -5766 -17536 -1551 -374
742 -374 7605 12427 25544 24112 10974 10409 6291 -9234 -14110 -272 12900 21265 30535 25456
728 25456 8178 11762 17991 20372 6203 -5208 -2990 -12386 5265 14884 -3386 7416 33586
715 33586 36881 28619 10339 17174 18508 12573 17715 15892 17590 3922 9439 15609 20088 11608
701 11608 30426 23949 19924 24631 21451 34211 21333 8107 18311 22556 5822 4379 -3251
688 -3251 7284 4321 2955 12203 25791 9656 -2612 -6720 17 -7419 -12112 4014 16934 21151
674 21151 18993 12879 13933 12469 5449 4291 -6263 -9880 15288 12405 8256 7846 -23980 -9120
660 -9120 439 -2812 3396 11301 1605 11794 14679 5404 5929 11240 7267 4422 3478 11458 4192
$$ packed form
756A9851j2600k946L817M995j0353R017Q610k235j645O861k9138j1770J5985J177
742c74P979M822J3117j432j3138n65m118j5525m876J3838J3172Q365R270n079
728B5456j7278L584O229K381j4169j1411K218r396J7651R619j8270J0802K6170
715C3586L295q262j8280O835J334n935N142j823J698j3668N517O170M479q480
701A1608J8818o477m025M707l180J2760j2878j3226J0204M245j6734j443p630
688c251J0535k963j366R248J3588j6135j2268m108O737p436m693J6126J2920M217
674B1151k158o114J054j464p020j158j0554l617K5168k883m149m10l1826J4860
660i120R559l251O208P905r696J0189K885r275N25N311l973k845r44P980p266
$$ plain form
645 4192 -1492 20917 23555 20573 11261 10090 3151 -1700 13248 -651 704 -1297 -1266 2527 -8708
630 -8708 -9901 -3738 7045 7170 12538 234 10188 37091 26554 20228 9802 7815 8468 -2442
616 -2442 5049 -3193 -14224 -4556 19580 11034 -1562 -4029 1952 4936 21475 17312 14965 -9461
602 -9461 -1634 6320 -13130 -10768 -7976 6348 753 2335 -9635 16876 34244 36247 19315 26211
588 26211 37282 20786 16513 14116 11537 23465 22077 3713 10383 23182 18956 -3829 17341
575 17341 46525 40082 14265 8039 13687 6234 8515 32370 20203 13158 4516 1067 -4200 -20481
561 -20481 4232 2493 -7310 122 17405 22155 29367 24367 7718 9652 11311 10888 9381 6569
547 6569 380 7483 7028 -975 -1425 -4598 10060 12371 23166 34582 16792 16712 22664 22176 130
$$ packed form
645D192n684K2409K638k982r312j171o939m851J4948j3899J355k001L1L793j1235
630h708j193O163J0783J25N368j2304R954K6903j0537o326j0426j987O53j0910
616b442P491q242j1031R668K4136q546j2596k467N981K984J6539m163k347k4426
602i461P827P954j9450K362K792J4324n595J582j1970K6511J7368K003j6932O896
588B6211J1071j6496m273k397k579J1928j388j8364O670J2799m226k2785K1170
575A7341K9184o443k5817o226N648p453K281K3855j2167p045q642l449n267j6281
561b0481K4713j739r803P432J7283M750P212n000j6649J934J659m23j507k812
547F569o189P103m55q003m50l173J4658K311J0795J1416j7790q0N952m88k2046
$$ plain form
532 130 -1695 8134 8301 3887 13586 12211 20144 24236 28157 23529 15277 485 -4391 16874 15641
517 15641 4881 -8567 -3323 7811 22839 27729 5654 -4029 89 15865 25619 14680 687
504 687 -541 9040 1972 14201 2843 9941 14122 8995 3159 5889 10507 17704 21688 13287 -10274
489 -10274 -27625 6834 32897 30996 24732 12003 13933 8719 6392 18972 31067 29106 34334
476 34334 32126 40303 38264 24145 21994 16914 29705 22582 2623 19627 25410 17322 7701 14418
462 14418 15231 3816 24950 32151 18093 17345 11558 18552 26048 21464 12231 7212 28497 28081 29101
447 29101 117 2534 10883 7031 1618 8967 10288 6497 8542 11280 19744 23553 30187 32122 29426
432 29426 32035 38531 23152 21249 27055 20735 24000 20738 21798 15884 15055 18988 6835 3833 18468
$$ packed form
532A30j825R829J67m414R699j375P933M092L921m628q252j4792m876K1265j233
517A5641j0760j3448N244J1134J5028M890k2075r683M118J5776R754j0939j3993
504F87j228R581p068J2229j1358P098M181n127n836K730M618P197L984q401k3561
489a0274j7351L4459K6063j901o264j2729J930n214k327J2580J2095j961N228
476C4334k208Q177k039j4119k151n080J2791p123j9959J7004N783q088r621O717
462A4418Q13j1415K1134P201j4058p48n787O994P496m584r233n019K1285m16J020
447B9101k8984K417Q349l852n413P349J321l791K045K738Q464L809O634J935k696
432B9426K609O496j5379j903N806o320L265l262J060n914q29L933j2153l002J4635
$$ plain form
417 18468 22581 28589 17476 7446 19202 19909 28544 24611 17469 15043 28125 26026 8934 19955
403 19955 17689 8927 26246 33170 37578 16673 8703 10282 15920 18486 9341 15200 6352 5125
389 5125 6296 12157 14849 24280 33061 33851 31377 28879 19319 16320 12298 -5439 -3910 2960 12560
374 12560 17128 23886 27431 31520 16718 15848 20343 20139 6646 4687 22654 5963 4053 3133 7588
359 7588 9652 16431 35329 23912 28124 33432 13369 2573 3913 -7769 -14491 4083 14673
346 14673 19220 9199 4203 1081 17925 17332 10274 8109 20768 26723 23334 41031 36092 37552
332 37552 36084 25771 19322 41875 44071 38277 33013 20973 17818 17327 23816 14180 2979 8958
318 8958 14748 9709 13141 19779 23036 15264 16210 17467 29451 23236 20609 25802 31619 21532 9383
$$ packed form
417A8468M113O008j1113j0030J1756P07Q635l933p142k426J3082k099j7092J1021
403A9955k266q762J7319O924M408k0905p970J579N638K566r145N859q848j227
389E125J171N861K692R431Q781P90k474k498r560k999m022j7737J529O870R600
374A2560M568O758L545M089j4802q70M495k04j3493j959J7967j6691j910r20M455
359G588K064O779J8898j1417M212N308k0063j0796J340j1682o722J8574J0590
346A4673M547j0021m996l122J6844n93p058k165J2659N955l389J7697m939J460
332C7552j468j0313o449K2553K196n794n264j2040l155m91O489r636j1201N979
318H958N790n039L432O638L257p772R46J257J1984o215k627N193N817j0087j2149
$$ plain form
303 9383 -1009 -2118 10880 28256 30882 21760 11747 6354 11953 22254 23310 5540 9770 32552
289 32552 42344 27703 24427 15132 11346 16210 19837 26495 4297 1961 23118 22874 32482 29795
275 29795 34760 36844 36653 33477 26876 18822 23732 7521 11799 24224 10880 14410 14922 20098 21762
260 21762 26576 29387 19536 16021 17951 15239 13457 34462 37542 35827 8108 19857 22927 18507
246 18507 30512 30855 11174 18899 25917 29180 24431 11714 21505 19345 27884 35033 32399 6427
232 6427 4812 8276 10894 7445 9893 21535 12215 6138 25232 23149 24087 13701 16300 16924 9728
217 9728 6123 23661 6241 -5080 11179 8031 1371 -13305 -21120 -17127 -1939 -762 14969
204 14969 22756 8379 5517 3228 6654 7063 -8329 1860 13386 9098 1224 -2248 -2892 9037
$$ packed form
303I383j0392j109J2998J7376K626r122j0013n393N599J0301J056j7770M230K2782
289C2552R792j4641l276r295l786M864L627O658k2198k336K1157k44R608k687
275B9795M965K084j91l176o601q054M910j6211M278J2425j3344L530N12N176J664
260B1762M814K811r851l515J930k712j782K1005L080j715k7719J1749L070m420
246A8507J2005L43j9681P725P018L263m749j2717R791k160Q539P149k634k5972
232F427j615L464K618l449K448J1642r320o077J9094k083R38j0386K599O24p196
217I728l605J7538j7420j1321J6259l148o660j4676p815L993J5188J177J5731
204A4969P787j4377k862k289L426M09j5392J0189J1526m288p874l472o44J1929
$$ plain form
190 9037 20724 5031 1262 9075 4494 4377 1339 1683 9224 19485 14659 7462 1009 2254 17972
175 17972 6680 7649 3336 3175 1679 -8397 -5006 4939 -10302 -2234 -155 -417 1240 2365 6713
160 6713 -1256 -4496 -2810 -72 -6859 -17521 -17762 -10036 -10166 -8054 -9533 -9675 -13204 -13497 -10614 -17254
144 -17254 -20501 -33663 -35253 -21632 -20831 -31778 -34626 -25515 -24323 -18099 -18979 -28839 -31424 -28156 -23644
129 -23644 -19695 -19139 -19524 -15418 2073 -8067 -14638 -7548 -12195 -21648 -17166 -20027 -23735 -18335 -27202
114 -27202 -40292 -26251 -23035 -18494 -19317 -24203 -21554 -36367 -45667 -38143 -45614 -49778 -38015 -39712
100 -39712 -41940 -47829 -45640 -46743 -42908 -36972 -46400 -53096 -41962 -36122 -30565 -43104 -45970 -46211 -46043
85 -46043 -54785 -62776 -57054 -36559 -44239 -52414 -52214 -61114 -57782 -63421 -53192 -64051 -62392 -71071 -75838
$$ packed form
190I037J1687j5693l769P813m581j17l038L44P541J0261m826p197o453J245J5718
175A7972j1292R69m313j61j496j0076L391R945j5241Q068K079k62J657J125M348
160F713p969l240J686K738o787j0662k41P726j30K112j479j42l529k93K883o640
144a7254l247j3162j590J3621Q01j0947k848R111J192O224q80r860k585L268M512
129b3644L949N56l85M106J7491j0140o571P090m647r453M482k861l708N400q867
114b7202j3090J4041L216M541q23m886K649j4813r300P524p471m164J1763j697
100c9712k228n889K189j103L835N936r428o696J1134N840N557j2539k866k41J68
85d6043q742p991N722K0495p680q175K00q900L332n639J0229j0859J659q679m767
$$ plain form
70 -75838 -74084 -71242 -64803 -65500 -63254 -65789 -71446 -79617 -84560 -70822 -78206 -83042 -87972 -86231 -72447
55 -72447 -73524 -80084 -76682 -76960 -80962 -85610 -79778 -67411 -70265 -80164 -82831 -78572 -85153 -94737 -93882
40 -93882 -84227 -86796 -90869 -88923 -96603 -95695 -90070 -98766 -112096 -109529 -115577 -115889 -99718 -104001 -108680
25 -108680 -102779 -109694 -124936 -117328 -112938 -115623 -115667 -109592 -114848 -108576 -102243 -99224 -100823 -110097 -126245
10 -126245 -132247 -129317 -125074 -120052 -121798 -122468 -130441 -134642 -134263 -128646
0 -128646
$$ packed form
70g5838J754K842O439o97K246k535n657q171m943J3738p384m836m930J741J3784
55g2447j077o560L402k78m002m648N832J2367k854r899k667M259o581r584Q55
40i3882R655k569m073J946p680R08N625q696j3330K567o048l12J6171m283m679
25a08680N901o915j5242P608M390k685m4O075n256O272O333L019j599r274j6148
10a26245o002K930M243N022j746o70p973m201L79N617
0a28646
$$ Imaginary data points
##PAGE= N=2
##DATA TABLE= (X++(I..I)), XYDATA
$$ plain form
16383 -1304816 -1287087 -1268888 -1244162 -1239188 -1230087 -1210247 -1193357 -1169182 -1156339 -1137073 -1119009 -1116524
16371 -1116524 -1097201 -1075959 -1058600 -1043401 -1038537 -1026331 -1009952 -999501 -981422 -957833 -926533
16360 -926533 -909290 -905900 -901832 -883890 -874762 -872571 -851109 -831480 -807305 -795070 -783758 -768809
16348 -768809 -749111 -737015 -729931 -708222 -688681 -675682 -665938 -661641 -641155 -621098 -602828 -603506
16336 -603506 -589989 -577187 -566727 -542298 -530058 -522073 -503023 -497599 -482862 -463397 -441207 -442377
16324 -442377 -419647 -395411 -382125 -365043 -353040 -344399 -322953 -317187 -320893 -304255 -291394 -267324
16312 -267324 -258689 -246499 -239203 -223268 -202596 -193459 -176298 -165212 -158970 -140932 -127155 -103772
16300 -103772 -100643 -92806 -83852 -62702 -55756 -39586 -33963 -18764 -10634 -2281 3427 5795 32431
$$ packed form
16383a304816J7729J8199K4726M974R101J9840J6890K4175J2843J9266J8064K485
16371a116524J9323K1242J7359J5199M864J2206J6379J0451J8079K3589L1300
16360i26533J7243L390M068J7942R128K191K1462J9629K4175J2235J1312J4949
16348g68809J9698J2096P084K1709J9541J2999R744M297K0486K0057J8270o78
16336f03506J3517J2802J0460K4429J2240P985J9050N424J4737J9465K2190j170
16324d42377K2730K4236J3286J7082J2003Q641K1446N766l706J6638J2861K4070
16312b67324Q635J2190P296J5935K0672R137J7161J1086O242J8038J3777K3383
16300a03772L129P837Q954K1150O946J6170N623J5199Q130Q353N708K368K6636
$$ plain form
16287 32431 55118 62665 78834 91603 111094 117987 129520 123132 136113 150434 147670 167933
16275 167933 197144 213845 198050 210038 218196 230731 221196 242608 274810 281671 291155 297797
16263 297797 309214 309672 326336 338082 337001 354720 364027 384179 379884 382685 374797 398311 407097
16250 407097 414354 418970 430559 439447 444529 465858 472166 483072 486154 507515 514280 514057 525544
16237 525544 536418 525744 531038 545849 551808 561580 568452 583502 598762 608611 613724 629312 623403
16224 623403 635109 652580 650203 630661 647148 655096 650323 667716 670776 677420 696048 719860
16212 719860 720300 722204 725018 741251 737451 725203 732571 745124 745576 753925 751795 771043 767696 776090
16198 776090 807292 803871 812682 825835 831867 822315 839575 842926 832450 816264 805557 817321
$$ packed form
16287C2431K2687P547J6169J2769J9491O893J1533o388J2981J4321k764K0263
16275A67933K9211J6701j5795J1988Q158J2535r535K1412L2202O861R484O642
16263B97797J1417M58J6664J1746j081J7719R307K0152m295K801p888K3514Q786
16250D07097P257M616J1589Q888N082K1329O308J0906L082K1361O765k23J1487
16237E25544J0874j0674N294J4811N959R772O872J5050J5260R849N113J5588n909
16224F23403J1706J7471k377j9542J6487P948m773J7393L060O644J8628K3812
16212G19860M40J904K814J6233l800j2248P368J2553M52Q349k130J9248l347Q394
16198G76090L1202l421Q811J3153O032r552J7260L351j0476j6186j0707J1764
$$ plain form
16186 817321 822683 843350 845192 864051 859167 864735 875685 877084 887159 903177 897784 890588 894354
16173 894354 911195 914676 906262 898502 890632 907014 899915 916068 926770 935889 941768 934674 925900
16160 925900 940322 945633 942126 952678 946178 948090 947920 947715 969240 968617 970550 981812 974588 975198
16146 975198 973911 982536 985567 976512 979435 985389 995388 987264 990772 975719 986711 1012736 1008885
16133 1008885 1024946 1043998 1046470 1025898 1011551 1013253 1029407 1032557 1048400 1049271 1047792 1049231 1040641
16120 1040641 1039059 1036978 1034514 1037320 1047933 1059705 1048298 1037527 1037622 1052305 1040052 1040292 1061871
16107 1061871 1066088 1054202 1051940 1055694 1067408 1081363 1080054 1081450 1090644 1083537 1068693 1067765 1070759
16094 1070759 1076021 1075343 1087009 1088796 1075962 1068671 1086507 1084684 1080850 1075993 1066947 1061995 1067290
$$ packed form
16186H17321N362K0667J842J8859m884N568J0950J399J0075J6018n393p196L766
16173H94354J6841L481q414p760p870J6382p099J6153J0702R119N879p094q774
16160I25900J4422N311l507J0552o500J912j70k05K1525o23J933J1262p224O10
16146I75198j287Q625L031r055K923N954R999q124L508j5053J0992K6025l851
16133A008885J6061J9052K472k0572j4347J702J6154L150J5843Q71j479J439q590
16120A040641j582k081k464K806J0613J1772j1407j0771R5J4683j2253K40K1579
16107A061871M217j1886k262L754J1714J3955j309J396R194p107j4844r28K994
16094A070759N262o78J1666J787j2834p291J7836j823l834m857r046m952N295
$$ plain form
16081 1067290 1059867 1073509 1088022 1099790 1086173 1094598 1099190 1102108 1101756 1091875 1094571 1088165 1086662
16068 1086662 1071837 1080346 1086862 1091321 1096022 1079794 1066694 1089870 1101615 1100910 1107171 1107938 1111353
16055 1111353 1094358 1092267 1105477 1103385 1089145 1093740 1109677 1110161 1093467 1099749 1105712 1088832 1096638
16042 1096638 1091441 1091032 1093166 1105783 1119696 1117283 1101718 1102652 1100109 1116580 1132837 1119980 1120526
16029 1120526 1115609 1112971 1098384 1101125 1107023 1123474 1114643 1096457 1110544 1107414 1097338 1107326 1119243
16016 1119243 1105063 1105289 1120883 1122492 1120771 1118180 1110114 1120389 1137161 1127471 1107967 1093555 1115754
16003 1115754 1138474 1139623 1134998 1118562 1100229 1101805 1100553 1109605 1102106 1101992 1100479 1080453 1101249
15990 1101249 1113170 1127179 1113606 1124791 1127949 1102108 1102442 1109634 1096153 1100877 1122708 1116112
$$ packed form
16081A067290p423J3642J4513J1768j3617Q425M592K918l52r881K696o406j503
16068A086662j4825Q509O516M459M701j6228j3100K3176J1745p05O261P67L415
16055A111353j6995k091J3210k092j4240M595J5937M84j6694O282N963j6880P806
16042A096638n197m09K134J2617J3913k413j5565R34k543J6471J6257j2857N46
16029A120526m917k638j4587K741N898J6451q831j8186J4087l130j0076R988J1917
16016A119243j4180K26J5594J609j721k591q066J0275J6772r690j9504j4412K2199
16003A115754K2720J149m625j6436j8333J576j252R052p499j14j513k0026K0796
15990A101249J1921J4009j3573J1185L158k5841L34P192j3481M724K1831o596
$$ plain form
15978 1116112 1124556 1118646 1112758 1119230 1102233 1100218 1113806 1124458 1113996 1108809 1108446 1118717 1117150
15965 1117150 1130427 1133379 1127625 1122464 1114346 1112592 1128845 1131284 1120513 1124831 1115949 1110130 1114975
15952 1114975 1127458 1126073 1115279 1117055 1103124 1100197 1113127 1105517 1105981 1116975 1121177 1115531 1137682
15939 1137682 1112697 1108162 1113521 1123488 1130804 1129689 1145244 1129690 1131437 1118687 1115228 1140213 1135531
15926 1135531 1126214 1122034 1113524 1127947 1121197 1106312 1104178 1120107 1111306 1118925 1106143 1107202 1125405
15913 1125405 1132908 1127587 1126922 1129562 1113945 1111473 1100170 1104849 1117471 1115473 1106754 1117239 1134670
15900 1134670 1120458 1118436 1136798 1122439 1132249 1135259 1125465 1116739 1126270 1113423 1120315 1122615 1113767
15887 1113767 1104052 1126932 1123946 1129524 1146770 1139390 1123364 1128468 1124687 1115333 1106248 1107135 1127251
$$ packed form
15978A116112Q444n910n888O472j6997k015J3588J0652j0462n187l63J0271j567
15965A117150J3277K952n754n161q118j754J6253K439j0771M318q882n819M845
15952A114975J2483j385j0794J776j3931k927J2930p610M64J0994M202n646K2151
15939A137682k4985m535N359R967P316j115J5555j5554J747j2750l459K4985m682
15926A135531r317m180q510J4423o750j4885k134J5929q801P619j2782J059J8203
15913A125405P503n321o65K640j5617k472j1303M679J2622j998q719J0485J7431
15900A134670j4212k022J8362j4359R810L010r794q726R531j2847O892K300q848
15887A113767r715K2880k986N578J7246p380j6026N104l781r354r085Q87K0116
$$ plain form
15874 1127251 1121640 1141485 1136198 1125699 1120495 1128113 1128097 1120827 1119364 1120071 1129014 1123729 1129709 1139855
15860 1139855 1154213 1142128 1133751 1142330 1133208 1122703 1130835 1133740 1116692 1123129 1143314 1143664 1127964
15847 1127964 1120318 1121373 1134668 1129692 1137734 1140934 1136970 1125843 1117237 1123294 1130561 1124525 1120480
15834 1120480 1123022 1115936 1115341 1113703 1130411 1134759 1127822 1141005 1141739 1141651 1124433 1101649 1130269 1144662
15820 1144662 1142806 1138698 1131402 1136907 1141312 1135319 1141847 1145515 1132094 1134552 1149579 1132565 1126379
15807 1126379 1149490 1154592 1143342 1126971 1129946 1127028 1134192 1133808 1140430 1145801 1131211 1119946 1133878
15794 1133878 1133675 1145421 1156944 1151923 1143094 1154318 1150045 1126616 1118667 1130472 1120956 1139097 1134365
15781 1134365 1126446 1131327 1129863 1123693 1118996 1137554 1128116 1130296 1137388 1122524 1135768 1140332 1124501
$$ packed form
15874A127251n611J9845n287j0499n204P618j6p270j463P07Q943n285N980J0146
15860A139855J4358j2085q377Q579r122j0505Q132K905j7048O437K0185L50j5700
15847A127964p646J055J3295m976Q042L200l964j1127q606O057P267o036m045
15834A120480K542p086n95j638J6708M348o937J3183P34q8j7218k2784K8620J4393
15820A144662j856m108p296N505M405n993O528L668j3421K458J5027j7014o186
15807A126379K3111N102j1250j6371K975k918P164l84O622N371j4590j1265J3932
15794A133878k03J1746J1523n021q829J1224m273k3429p949J1805r516J8141m732
15781A134365p919M881j464o170m697J8558r438K180P092j4864J3244M564j5831
$$ plain form
15768 1124501 1133224 1150759 1151895 1129830 1111352 1125432 1134065 1139239 1147626 1128155 1116364 1115779 1134346
15755 1134346 1127825 1121779 1126399 1124394 1128381 1133064 1123050 1121025 1116812 1140567 1146592 1126723 1133136
15742 1133136 1147380 1141642 1147970 1152679 1162468 1161736 1146027 1133575 1144002 1151204 1144132 1132026 1139308
15729 1139308 1141074 1135485 1142066 1145087 1134380 1123200 1129055 1136445 1141978 1148241 1159353 1159290 1140360
$$ packed form
15768A124501Q723J7535J136k2065j8478J4080Q633N174Q387j9471j1791n85J8567
15755A134346o521o046M620k005L987M683j0014k025m213K3755O025j9869O413
15742A133136J4244n738O328M709R789p32j5709j2452J0427P202p072j2106P282
15729A139308J766n589O581L021j0707j1180N855P390N533O263J1112o3j8930
$$ [...]
##END NTUPLES=NMR SPECTRUM
##END=
