##TITLE=1H_CG-1042-F1
 200.13MHz, DMSO,
 8 sc
 
 14.8.2025
##JCAMPDX= 6.0         $$ Bruker NMR JCAMP-DX V2.0
##DATA TYPE= NMR SPECTRUM
##DATA CLASS= NTUPLES
##ORIGIN= UXNMR, Bruker Analytische Messtechnik GmbH
##OWNER= pz
$$ XWIN-NMR		Version 3.5
$$ Thu Aug 14 13:47:31 2025 Russian Standard Time (UT+4h)  she@DPX200
##.OBSERVE FREQUENCY= 200.1313
##.OBSERVE NUCLEUS= ^1H
##.ACQUISITION MODE= SIMULTANEOUS
##.ACQUISITION SCHEME= undefined
##.AVERAGES= 8
##.DIGITISER RES= 18
##SPECTROMETER/DATA SYSTEM= spect
##.PULSE SEQUENCE= zg30
##.SOLVENT NAME= DMSO
##.SHIFT REFERENCE= (INTERNAL, DMSO, 0, 15.5056)
##AUDIT TRAIL= $$ (NUMBER, WHEN, WHO, WHERE, WHAT)
$$ ##TITLE= Audit trail, XWIN-NMR		Version 3.5
$$ ##JCAMPDX= 5.01
$$ ##ORIGIN= Bruker BioSpin GmbH
$$ ##OWNER= she
$$ F:/spectra/data/she/nmr/H-C/1/pdata/1/auditp.txt
$$ ##AUDIT TRAIL=  $$ (NUMBER, WHEN, WHO, WHERE, WHAT)
(   1,<2025-08-14 13:46:14.50 +0400>,<she>,<DPX200>,
      <created by zg, POWCHK disabled, PULCHK disabled
       configuration hash MD5:
       00 E9 B6 7A A2 85 ED C7 34 08 36 98 17 FE 4E 26
       data hash MD5: 16K
       B1 4F 1B BA 30 C9 43 F3 59 CD E5 12 EC D9 67 16>)
(   2,<2025-08-14 13:46:16.92 +0400>,<she>,<DPX200>,
      <Start of raw data processing
       efp BC_mod = 2 LB = 0.25 FT_mod = 6 PKNL = 1 PHC0 = -1556.572 PHC1 = 4.99228 SI = 16K 
       data hash MD5: 16K
       26 2E 82 2C E2 6D E7 F0 BA C5 3C F5 A9 88 7F 7A>)
(   3,<2025-08-14 13:46:37.64 +0400>,<she>,<DPX200>,
      <pk PHC0 = -16.93302 PHC1 = 21.8 
       data hash MD5: 16K
       19 FB 88 08 C1 0E 40 47 0F BB D7 E9 A6 DF D9 2A>)
(   4,<2025-08-14 13:46:40.93 +0400>,<she>,<DPX200>,
      <abs ABSG = 5 
       data hash MD5: 16K
       EF 13 0B 88 92 E1 B7 8C 06 91 B0 2E 3B 5D 2B 7E>)
$$ ##END=
$$ 
$$ hash MD5
$$ 0B 3F 18 6F A0 59 90 D7 AF E3 42 15 B4 78 A7 C6
##$RELAX= 
##$RELAX= 
##$RELAX= 
##$RELAX= 
##$RELAX= 
##$RELAX= 
$$ Bruker specific parameters
$$ --------------------------
##$DU= <F:/spectra>
##$EXPNO= 1
##$NAME= <H-C>
##$PROCNO= 1
##$TYPE= <nmr>
##$USER= <she>
##$AMP= (0..31)
100 100 100 100 100 100 100 100 100 100 100 100 100 100 100 100 100 100 
100 100 100 100 100 100 100 100 100 100 100 100 100 100 
##$AQSEQ= 0
##$AQ_mod= 1
##$AUNM= <au_zg>
##$AUTOPOS= <>
##$BF1= 200.13
##$BF2= 200.13
##$BF3= 200.13
##$BF4= 200.13
##$BF5= 200.13
##$BF6= 200.13
##$BF7= 200.13
##$BF8= 200.13
##$BYTORDA= 1
##$CFDGTYP= 0
##$CFRGTYP= 5
##$CHEMSTR= <none>
##$CNST= (0..31)
1 1 145 1 1 1 1 1 1 1 1 1 1 1 1 1 1 1 1 1 1 1 1 1 1 1 1 1 1 1 1 1 
##$CPDPRG= <>
##$CPDPRG1= <>
##$CPDPRG2= <>
##$CPDPRG3= <>
##$CPDPRG4= <mlev>
##$CPDPRG5= <mlev>
##$CPDPRG6= <mlev>
##$CPDPRG7= <mlev>
##$CPDPRG8= <mlev>
##$CPDPRGB= <>
##$CPDPRGT= <>
##$D= (0..31)
0 0.7 0 0 0 0 0 0 0 0 0 0.03 0 0 0 0 0 0 0 0 0 0 0 0 0 0 0 0 0 0 0 0 
##$DATE= 1755164773
##$DBL= (0..7)
120 120 120 120 120 120 120 120 
##$DBP= (0..7)
150 150 150 150 150 150 150 150 
##$DBP07= 0
##$DBPNAM0= <>
##$DBPNAM1= <>
##$DBPNAM2= <>
##$DBPNAM3= <>
##$DBPNAM4= <>
$$ [...]
##$SUBNAM3= <"">
##$SUBNAM4= <"">
##$SUBNAM5= <"">
##$SUBNAM6= <"">
##$SUBNAM7= <"">
##$SUBNAM8= <"">
##$SUBNAM9= <"">
##$SW= 18.0517328524113
##$SWIBOX= (0..15)
0 0 2 0 0 0 0 0 0 0 0 0 0 0 0 0 
##$SW_h= 3612.71676300578
##$TD= 16384
##$TD0= 1
##$TE= 0
##$TE2= 300
##$TE3= 300
##$TEG= 300
##$TL= (0..7)
0 120 120 120 120 120 120 120 
##$TP= (0..7)
150 150 150 150 150 150 150 150 
##$TP07= 0
##$TPNAME0= <>
##$TPNAME1= <>
##$TPNAME2= <>
##$TPNAME3= <>
##$TPNAME4= <>
##$TPNAME5= <>
##$TPNAME6= <>
##$TPNAME7= <>
##$TPOAL= (0..7)
0.5 0.5 0.5 0.5 0.5 0.5 0.5 0.5 
##$TPOFFS= (0..7)
0 0 0 0 0 0 0 0 
##$TUNHIN= 0
##$TUNHOUT= 0
##$TUNXOUT= 0
##$USERA1= <user>
##$USERA2= <user>
##$USERA3= <user>
##$USERA4= <user>
##$USERA5= <user>
##$V9= 5
##$VALIST= <valist>
##$VCLIST= <CCCCCCCCCCCCCCC>
##$VD= 0
##$VDLIST= <DDDDDDDDDDDDDDD>
##$VPLIST= <PPPPPPPPPPPPPPP>
##$VTLIST= <TTTTTTTTTTTTTTT>
##$WBST= 1024
##$WBSW= 4
##$XGAIN= (0..3)
0 0 0 0 
##$XL= 0
##$YL= 0
##$YMAX_a= 254115
##$YMIN_a= -297595
##$ZGOPTNS= <>
##$ZL1= 120
##$ZL2= 120
##$ZL3= 120
##$ZL4= 120
##$ABSF1= 15.46593
##$ABSF2= -2.585919
##$ABSG= 5
##$ABSL= 3
##$ALPHA= 0
##$AQORDER= 0
##$ASSFAC= 0
##$ASSFACI= 0
##$ASSFACX= 0
##$ASSWID= 0
##$AUNMP= <proc_1d>
##$AZFE= 0.1
##$AZFW= 0.1
##$BCFW= 0
##$BC_mod= 2
##$BYTORDP= 0
##$COROFFS= 0
##$CY= -3
##$DATMOD= 1
##$DC= 0
##$DFILT= <>
##$DTYPP= 0
##$F1P= 0
##$F2P= 0
##$FCOR= 1
##$FTSIZE= 16384
##$FT_mod= 6
##$GAMMA= 0
##$GB= 0
##$INTBC= 1
##$INTSCL= 3.241238e-09
##$ISEN= 128
##$LB= 0.25
##$LEV0= 0
##$LPBIN= 0
##$MAXI= 10000
##$MC2= 0
##$MEAN= 0
##$ME_mod= 0
##$MI= 1.114404
##$NCOEF= 0
##$NC_proc= -5
##$NLEV= 6
##$NOISF1= 3.799351
##$NOISF2= 2.8
##$NSP= 0
##$NTH_PI= 0
##$NZP= 0
##$OFFSET= 15.5056
##$PC= 1
##$PHC0= -1573.505
##$PHC1= 26.79228
##$PH_mod= 1
##$PKNL= yes
##$PPARMOD= 0
##$PSCAL= 0
##$PSIGN= 0
##$REVERSE= no
##$SF= 200.130003224285
##$SI= 16384
##$SIGF1= 3
##$SIGF2= 2
##$SINO= 0.751879
##$SIOLD= 32768
##$SREGLST= <19F.Aceton>
##$SSB= 0
##$STSI= 16384
##$STSR= 0
##$SW_p= 3612.71676300578
##$SYMM= 0
##$S_DEV= 0
##$TDeff= 16384
##$TDoff= 0
##$TI= <>
##$TILT= no
##$TM1= 0
##$TM2= 0
##$TOPLEV= 0
##$USERP1= <user>
##$USERP2= <user>
##$USERP3= <user>
##$USERP4= <user>
##$USERP5= <user>
##$WDW= 1
##$XDIM= 16384
##$YMAX_p= 326094028
##$YMIN_p= -885174
$$ End of Bruker specific parameters
$$ ---------------------------------
##NTUPLES= NMR SPECTRUM
##VAR_NAME=  FREQUENCY,     SPECTRUM/REAL,   SPECTRUM/IMAG
##SYMBOL=    X,             R,               I
##VAR_TYPE=  INDEPENDENT,   DEPENDENT,       DEPENDENT
##VAR_FORM=  AFFN,          ASDF,            ASDF
##VAR_DIM=   16384,         16384,           16384
##UNITS=     HZ,            ARBITRARY UNITS, ARBITRARY UNITS
##FACTOR=    0.220516191357247, 1,           1
##FIRST=     3103.13577310849, 0,            0
##LAST=      -509.580989897293, 0,           0
##MIN=       -509.580989897293, -885174,     0
##MAX=       3103.13577310849, 326094028,    0
$$ Real data points
##PAGE= N=1
##DATA TABLE= (X++(R..R)), XYDATA
$$ [...]
11497 -9715 52745 44666 35657 -21511 -51332 -73602 -88089 -21317 61661 55471 -13462 -54328
11485 -54328 -5409 -59482 -75992 -43813 -81835 -73617 -25069 70706 13920 -25440 -6085 6056
11473 6056 -14998 18042 3555 49818 -7799 -67805 17299 -14595 -43103 4104 27679 -25646
11461 -25646 -4506 29660 72625 -41408 -35102 -115106 -110860 -99220 -81415 -50000 -8689 -18514
11449 -18514 -30614 -9369 50981 40735 42432 3773 -15666 -12304 -3579 100173 26419 22453
11437 22453 73179 -19009 -43761 -1513 -10430 -28331 -27084 -75410 -85664 -87276 -114676 -117785
11425 -117785 -59828 -88078 -116644 -199790 -136265 8926 46301 42063 29425 72806 40604
11414 40604 14864 15213 54360 58697 84095 101990 149331 125715 114077 107896 43631 88244
11402 88244 127497 101119 54975 119595 81359 82461 171962 180730 120013 106595 164646 107881
11390 107881 20329 825 18489 50265 -25297 -82192 -101158 -86354 3461 -54271 -7694
11379 -7694 21900 -45203 35218 14898 -72294 -66293 -17648 -75756 -75667 -82977 -95043 -60878 -77454
11366 -77454 -35354 -45053 -19934 32198 34197 48506 77224 74045 28412 -46954 -106711 -85816
11354 -85816 2521 58959 67173 50183 -29472 -67149 -109303 -78572 53838 -1527 -59332 -20120
11342 -20120 24230 19279 35156 48516 34481 50954 98899 -26637 -78136 687 -38308 -39925
11330 -39925 -10165 27389 45691 -1911 82273 77389 -5517 -22666 -39997 3236 -1233 38653
11318 38653 87623 -16018 -87109 -46019 53389 -7552 15247 60876 -4504 8029 14969 -35536
11306 -35536 -13855 -30775 -11366 -92115 -90562 -39500 -53957 3338 40534 -13426 -10529 -17747
11294 -17747 -480 10829 -17173 -43799 -36611 12329 -6373 -17615 -49313 -20900 29068 56069
11282 56069 40823 -15199 -80768 -42097 -67107 17368 71162 -38648 -1485 -102149 -41515
11271 -41515 -124169 -123915 -31522 -5467 46561 -12949 10739 -8897 8879 -25328 -26885 -24719
11259 -24719 43592 30374 4534 4333 28486 -31888 -27170 31303 36547 23129 -19149 65443
11247 65443 23312 -3205 24302 -16904 -42839 -5624 -80160 -57341 79939 66022 -60569
11236 -60569 -126783 -95988 -83417 -38861 -49709 -44430 -74307 -17915 -40576 -35205 -33018 -21710
11224 -21710 -27180 -70961 -69298 -63706 -75966 -138323 -88460 -34551 60161 27677 -26124 7981
11212 7981 -35885 -18376 -6412 17248 -32680 -9384 -45753 -3866 -92208 -34674 17086 -71879
11200 -71879 -32472 -11340 -1534 -16280 -11417 -34804 -50697 -30083 -67836 -32953 -43013 -56657
11188 -56657 -48629 -51359 -52461 -52505 2957 60738 -35876 -52065 -10537 15987 -40633 -42250 -47357
11175 -47357 -42962 -4793 -27788 10589 -14779 -1456 23405 18757 5089 69380 80491 128952
11163 128952 3538 -77898 -35538 -26005 -18148 -22533 -17279 -73022 -106308 -83704 -64227 3824
11151 3824 -5608 -25077 -34660 -28053 -17607 8432 -6325 -21945 -45971 -16163 17523 12096 25962
11138 25962 95424 63352 -68557 -26910 7460 -20665 -12840 -68404 22156 64631 -72226
11127 -72226 -125936 -21147 8355 416 -40519 -5802 -113984 -54228 11955 7782 -23015 -8371
11115 -8371 40666 5920 9854 -5274 -36708 -25264 1401 31509 31584 -56211 -6585 71090 6527
11102 6527 -80030 -28910 -88184 -138133 -43327 94655 84309 69686 28916 24314 -44640 -42930
11090 -42930 -10331 -5856 -95534 -71430 10279 -636 46265 50303 -16503 -80034 -57244 -11485
11078 -11485 46200 -2065 -51235 -28008 -7775 28441 4365 -5131 -50769 -105144 -9963 -7080
11066 -7080 35248 68561 42150 42993 5159 -90181 -71119 -78186 -110145 -63121 3046 -74227
11054 -74227 -24489 -92078 -98428 -56238 33872 40827 -15201 24537 599 38048 -16004 -32032
11042 -32032 19738 -16786 -36283 -54814 -10853 92808 65664 24902 71998 20259 -36189
11031 -36189 -12015 27696 17731 -48571 -22584 -46711 -20423 -24736 -34260 -67876 -11068 -106450
11019 -106450 -54415 -92593 -90349 16608 102727 135695 66033 7646 91458 98630 64402 41155
11007 41155 63063 7276 6957 31249 -31457 -62146 -96325 -114122 -124912 -78468 -71663 -72228 -68116
10994 -68116 -39435 -41873 -29666 22422 58253 51375 7518 48188 4434 -83285 -152046 -90260
10982 -90260 -54141 -87457 3329 -8934 -1635 -64728 -88270 -55655 4945 -33095 24163 85
10970 85 39344 41798 27516 53399 -25265 -12578 -34899 -39162 37102 80121 49133 69734 21466
10957 21466 -16151 -16094 -20107 -46738 -19599 12170 -35834 -61227 -33599 -24078 61765 57759 23963
10944 23963 -21672 -5548 39510 -11864 -49824 -105057 -94480 -103814 20826 14278 -117658 -66056
10932 -66056 32145 46097 29933 15312 9216 41326 97563 25682 17881 52209 -66650 -8638
10920 -8638 33012 57562 50830 25400 -42084 -102054 -56308 -33902 -23378 -12470 -25657 -53567
10908 -53567 -65557 -14485 -18472 3196 29447 -58191 -64187 -17922 53423 47610 23674 -44632
10896 -44632 9626 6562 -14535 -19518 59471 32461 -28268 -5527 -136197 -90344 5817 38462
10884 38462 85304 51320 36078 59924 38053 29877 16088 17926 -35947 21193 88169 28558
10872 28558 46779 125471 64714 37151 -22003 -18717 46799 -4789 28788 4343 15061 31334
10860 31334 127909 50634 21302 -23459 -7342 -4477 -33574 -27106 33972 32746 45838 10116
10848 10116 -40910 15425 -10877 12910 -28401 -45150 -37176 33626 119838 29687 -31027 -56890
10836 -56890 -90497 -88489 -2616 33181 29011 2585 -86012 -7878 14983 -38985 -144354 -180504
10824 -180504 -178490 -159959 -55728 -18663 31606 -41058 -21599 -37551 -106081 -137330 -147752
10813 -147752 -94965 -58617 2099 22921 44245 -1816 22975 81685 99834 7553 -18338
10802 -18338 -56825 -107762 -66965 -86377 -74411 -4589 -14193 -21595 -60121 25558 43215 22498
10790 22498 -3865 -92039 -147605 -26979 7130 -1900 -22546 -35335 -41804 -60803 -15201 32740
10778 32740 21800 3768 -67254 -70277 -55168 -38514 13255 -23375 -52269 -36583 -85470 -32968
10766 -32968 -93453 -47759 -108803 -116560 -67039 -36172 -29360 -83278 8311 -8520 -35534 9540
10754 9540 -12965 -98925 -15554 -71876 -38228 -60458 -123224 -101242 -47422 1292 -44012 -7776
10742 -7776 -12045 21029 30534 -35702 -8849 -3879 -28023 -94548 -106818 -180156 -90007 19023
10730 19023 27072 -35603 -59540 -56171 -64298 -29602 -35750 -45846 -54988 -55270 5544 49682 100356
10717 100356 47791 15003 24502 -91370 -75060 453 43981 -21219 -92012 -72158 24710
10706 24710 -3828 11787 27645 29602 -43934 -24101 -2319 -22437 15690 -37238 -19698 -2603
10694 -2603 -23500 -100837 -89315 -83767 -108742 -84967 -24415 -21790 -14520 -19262 -93683 -59935 -3756
10681 -3756 -30143 -80379 -83464 -62061 1226 26828 -74580 -34290 47209 3097 30506 9640
10669 9640 -52460 -47680 -48377 -84333 -69821 41853 20876 34907 -24778 -22729 -30216 -36038 -74522
10656 -74522 -75397 -493 83018 35534 -27761 -26563 -46798 -85225 -23851 1369 101320 71929
10644 71929 -21472 -20896 10400 -57712 -69754 -82240 -43267 -53463 -105091 -27542 86577 88962
10632 88962 34535 48011 24718 -3086 -44616 18172 -2951 -40028 -39134 -8140 28512 19117
10620 19117 21050 59216 -10372 -26666 18869 12405 -28875 -88600 -54343 -102859 -123587 -90199
10608 -90199 -56301 -5157 12098 -35681 -37777 -3850 -79081 -205 -91300 -30979 27276 -76907
10596 -76907 -25900 35124 -46176 -91842 -44865 -51505 -42996 -27735 -26357 5720 -34777 28325
10584 28325 -3046 -3556 -33070 -781 -42643 -27761 -8255 -21890 -9242 15966 -29054 -28417
10572 -28417 24811 26453 -26283 -33044 -50574 -71875 -12958 57828 7070 -87684 -24979 -52640
10560 -52640 -59315 -48955 -53532 -20378 -55327 -15950 -28551 -58884 -54848 25763 66814 59158
10548 59158 2623 55019 114117 5006 -53618 -46105 -69510 -110044 -122844 -76874 3009 -8888
10536 -8888 -19398 -38699 -15097 20952 -11054 -76358 -33347 16639 73356 -13110 -1639 -5047
10524 -5047 -6339 14542 4934 20964 17830 7322 24752 -35062 4693 53881 -1731 -33818
10512 -33818 -18522 -13159 -73540 -82960 -29837 -23195 -36856 4922 -38983 35844 74366 -24510
10500 -24510 -12172 -18886 64480 117083 47612 32532 118611 481 -77989 -46953 -92179 -17875
10488 -17875 74768 66469 32193 -14763 -101152 -83174 -11023 -7661 63263 -12567 -35136 77918
10476 77918 92086 15522 -7851 2404 -14310 -62825 -81583 -65573 -82582 -92383 -16245 68766
10464 68766 41995 -61930 -36836 -82140 7909 51573 18805 66799 -41307 -95320 -7557
10453 -7557 54912 38306 78573 21624 -89028 -89763 -76493 4918 59591 17355 30049 70158
10441 70158 58373 28968 -28810 3221 62958 -11334 54625 41235 27483 20619 -11840 17222
10429 17222 48023 14433 22996 -19180 37539 -15336 -107066 -91195 -43149 46356 -4121 -36322
10417 -36322 22903 -40915 -50566 39151 46930 83485 102387 11966 -28039 -30414 -72063 -49082
10405 -49082 -84857 -58085 -20971 3205 -1826 75361 78734 53067 43600 -3998 -23537 -87802
10393 -87802 -59998 -76478 -89845 -8571 37503 -45479 -149637 -126921 -43447 -5257 -17687
10382 -17687 10966 3889 -64374 25130 2170 -9893 -16833 82 -43506 -105193 -119093 -84803
10370 -84803 21187 -32207 -35692 780 47855 31286 -28578 -12260 48039 -2262 -68646 -37823
10358 -37823 -8736 -20137 -8945 52439 -5067 -52641 -82608 -72579 -100526 -55340 6631 -28422
10346 -28422 -40608 -78228 -57350 11634 -10621 -47239 -28504 5525 -53199 -44013 -33877 -33221
10334 -33221 -64906 -74357 -45380 -14129 68395 -18754 40636 87636 76196 -51034 -22087 39231
10322 39231 -65926 -131566 -61931 -60178 -77466 -28130 -63773 -10327 -13204 -5009 -50891 45067
10310 45067 42893 -49881 -39397 -54877 -61731 -72732 -24856 26572 -11241 4767 -7557 -24874
10298 -24874 7617 -29693 -57554 -27098 19692 17445 -21464 -82539 -49937 -72951 -93754 2733
10286 2733 107043 -49349 -30559 32476 9877 25597 6485 25027 29753 28071 52305 95360
10274 95360 58454 45218 -27187 -43448 -94070 1518 56588 -5533 36936 79050 -3261 -93987
10262 -93987 -64582 -2753 6778 -46022 -4899 -33553 -20129 7147 -1996 -33605 22461 88557
10250 88557 77113 23073 -26610 -5230 14329 -4291 31041 -1256 -78993 -42019 -134879 -88351
10238 -88351 -54843 -58881 -30750 -69744 -72123 -2598 89497 16136 46978 117573 73720 77284
10226 77284 48355 30507 39231 -886 -1150 36769 55018 17740 -44217 -111767 -50117 -20228
10214 -20228 5999 -17436 143 18789 70365 55628 34907 64220 57416 83677 83806 69070
10202 69070 90144 76270 9123 -9990 -18511 -10358 -12643 51419 -1329 -27459 -59236 -8515
10190 -8515 -49603 -72354 -70436 -152640 -176473 -90226 8045 -5663 22320 -63222 -71975 -45237
10178 -45237 -8534 23914 57840 -80823 14633 101154 64773 19564 -79285 -59878 -100360
10167 -100360 -84915 -166390 -146221 -47762 38385 44129 -35836 -41641 23452 -5157 -30790 47455
10155 47455 53815 -35280 -81377 -36099 3918 4951 14549 -45647 7392 29022 -23865 -103510
10143 -103510 -72446 35739 5698 27256 -2604 -43855 25316 41158 63366 -41481 -72224
10132 -72224 14763 36624 -41071 1872 -11663 -5627 -20150 -158136 -151540 -66705 -20685 37547
10120 37547 94313 26484 75255 73163 80769 -9305 -67924 -79550 -19344 21143 -100979 -170364
10108 -170364 -172585 -67026 11368 56752 1201 24376 62932 57514 109751 -8984 -148526
10097 -148526 -129579 -110996 -121722 -126827 -94083 -36889 -91835 -40671 -285 -10686 36243 -3523
10085 -3523 -30163 53729 118690 114880 2821 8149 95277 52212 48463 22433 -58648 204
10073 204 50340 -4887 -23750 -25969 34462 75804 8217 -25658 -22080 -23319 18269 -2186 -23853
10060 -23853 14041 47701 58486 15447 -47446 -32251 -7706 -21119 26355 878 -49684 -70376
10048 -70376 -51820 -64546 -29805 15903 -14598 -17507 -123411 -92097 -16085 41776 72747 46781
10036 46781 57145 62742 44367 82158 -8813 -33778 24594 -6248 8191 -3049 -8189 -63977
10024 -63977 -10362 66907 2772 12500 -2288 2062 64866 60135 -2206 -31800 29502 55217
10012 55217 83016 79240 28725 7892 72460 39638 28754 32766 -21348 -22441 16196 -24000
10000 -24000 -38632 -77065 -28125 -36218 -18855 6437 -28909 -18288 30047 10654 53905 6324
9988 6324 10864 4920 -55883 -3811 23461 50728 52218 65280 113354 89750 -27482 -19070 25281
9975 25281 38900 30297 17672 -5420 12266 25791 60212 80030 67219 88534 114167 -11632
9963 -11632 -14821 -76312 -80249 -31489 82003 127695 99893 114570 122904 72098 59873 33676
9951 33676 30313 11347 59612 39075 377 5814 88756 47359 -31729 26848 -4005 40317
9939 40317 -31709 -105408 -89561 -53924 -6897 -353 7387 32874 44954 22470 -6879 -16262
9927 -16262 -31809 11373 62862 4252 -3789 51742 39331 3355 -90289 -45565 -18896 25535
9915 25535 50331 4866 65953 50343 57287 63830 -97081 -83323 -54264 -22318 -68138 19921
9903 19921 125510 134150 26381 2959 -2921 926 -13892 -1104 75494 66362 72704 107070
9891 107070 77201 86034 16299 -78143 -1880 38276 34072 77051 121118 104321 63141 91757
9879 91757 55180 50616 41742 -30495 3065 19852 65898 30377 18089 -14019 -15428 -32279
9867 -32279 69961 124396 114873 52851 51866 61936 122506 126867 80488 1884 -90 1057 -66843
9854 -66843 24802 76859 103715 69998 18337 30406 -18471 -12369 68299 63989 18880 -9622
9842 -9622 -22083 52524 65373 112200 49492 -37548 -87551 -81083 17549 35595 -20879 -32636
9830 -32636 62340 89522 8272 -10538 71844 122953 101722 -4557 -66740 -41863 38397 3664
9818 3664 -16884 9867 -17734 54654 33131 -30490 -40158 -25097 32694 18746 29195 27616
9806 27616 -11352 16601 8395 -11348 6191 37715 38082 20980 131102 124116 84966 79795 102648
9793 102648 139931 87551 75300 44144 27090 27877 -8948 18743 58611 155403 115521 88592
9781 88592 152846 118494 -31818 5302 77113 57717 9223 8619 56189 86501 63704 122711
9769 122711 171637 113517 144320 139321 98899 -6361 -433 17200 27978 9967 45986 85688
9757 85688 63752 8250 53699 88182 151931 178863 142649 71687 -21036 56707 77549 70088
9745 70088 12399 158521 117112 95780 113860 50612 72563 123800 139243 107760 61722 55652
9733 55652 87371 98952 46278 107489 128133 104788 80063 87289 185161 148296 113798 105355
9721 105355 159762 189882 213898 167108 230643 240258 283430 241320 217863 260501 266223 261734
9709 261734 339177 437761 450613 396073 510380 591282 495512 519485 512581 507951 472668 438696
9697 438696 355601 332161 226101 115162 133430 233937 236865 180711 150794 200578 297383
9686 297383 275296 250921 226249 186679 164249 162930 211578 204122 189720 206981 227262 264810
9674 264810 215071 186137 188417 154558 100518 141955 150789 149688 125799 155366 203715 189091
9662 189091 150159 204030 275328 171397 145302 127273 124484 226456 186209 178120 164601 134428
9650 134428 129459 135906 129579 167206 166183 158905 181647 204802 167012 153310 93315 81002 140970
9637 140970 127271 129692 156927 173563 193417 196420 177317 189584 160360 194818 130270 172096
9625 172096 236557 266048 254438 253846 168831 274826 312655 251459 162126 187323 257481 228837
9613 228837 258324 297699 298384 299261 201582 136024 235425 213667 212417 279451 259885 232480 258268
9600 258268 213244 234794 242675 226354 162194 218240 234241 262597 231518 227918 266773 319797
9588 319797 368919 436709 464928 429034 457680 462779 370803 390563 377084 405382 451251 425136
9576 425136 367113 433221 536442 551296 446162 412177 472777 428365 440911 461389 512206
9565 512206 544075 502642 502927 581104 613612 581169 550209 533308 565678 614612 606943 736876
9553 736876 701300 689533 668492 637597 686636 748014 811260 764211 802940 922449 982196
9542 982196 922648 909478 879866 913129 1044922 1106992 1133941 1150724 1176600 1243206 1243260 1227156
9530 1227156 1295277 1358247 1401735 1397549 1420498 1359042 1458026 1462876 1442172 1421972 1397308 1405945
9518 1405945 1433024 1402565 1414181 1338961 1334143 1314344 1428709 1558032 1527499 1563920 1531265
9507 1531265 1519729 1460375 1534976 1590016 1586854 1602183 1608800 1543628 1513187 1605098 1644458 1650565
9495 1650565 1718593 1739811 1809247 1795829 1824597 1800699 1712326 1797590 1867087 1859650 1856028 1779036
9483 1779036 1835111 1809613 1768495 1802000 1804439 1803199 1698438 1634045 1599825 1572521 1560321 1621105
9471 1621105 1563044 1527889 1500487 1435304 1391964 1397046 1395286 1374361 1346212 1323810 1327358 1259572
9459 1259572 1250541 1273088 1222720 1157047 1168453 1171619 1061058 1058586 1060371 1046633 1030222 1082223
9447 1082223 1111954 1023066 950698 985070 956422 926691 869433 764262 831820 738579 761524
9436 761524 751865 747048 715596 683798 711744 660998 567566 616591 620545 656082 682503 699982
9424 699982 751814 740603 696606 621134 576053 577202 596013 587109 605649 594229 573356 572627
9412 572627 512813 560944 552232 525029 653837 621441 442871 422233 488880 455877 379604
9401 379604 309082 342070 389714 394820 410339 382041 319919 352841 390470 414008 456026 401562
9389 401562 362237 380818 434199 393817 338461 291627 290199 327066 247339 207994 251030 293492
9377 293492 262977 321616 311457 309451 350333 299549 285935 280202 317058 351826 357248 362319
9365 362319 310802 314344 278396 254744 249884 153564 205322 236191 191970 179379 252847 223801
9353 223801 177500 151892 179290 222956 275282 333321 303576 253663 207653 201848 130087 158036
9341 158036 124416 120039 115179 197988 194803 225306 214789 199070 227486 273876 290510 297011
9329 297011 274878 206117 182716 215393 235255 189051 135583 129744 168203 136298 125926 206711
9317 206711 194113 176196 182118 173911 111863 156006 242797 271564 272755 163486 159426 123494
9305 123494 149505 170314 157622 60276 95959 166839 158904 191233 165132 186957 211067 138715
9293 138715 136056 142432 130353 87089 135735 176958 111845 93925 41081 34914 6919 29782
9281 29782 36230 92557 173785 108823 115084 101921 82308 73139 122822 129937 77980 118436 153355
9268 153355 192499 249102 179785 147673 177174 142020 68432 171930 225445 103746 95191
9257 95191 119309 150339 162112 99384 92658 153763 131612 94564 103198 -21915 -53303 52862
9245 52862 64432 82530 74240 109988 54061 2655 16432 35087 2864 89904 173931 226909
9233 226909 226738 189828 166006 111922 110989 19733 16510 141854 177566 161975 110370 109411 138288
9220 138288 78615 26118 47490 3673 56202 49634 8880 -42117 -78809 38281 46932 65804
9208 65804 67848 105089 77302 21045 19315 -38619 -88683 -22226 -2351 28542 39569 6120
9196 6120 -1765 23601 32272 67683 91974 70508 -30591 -281 -3269 22018 69344 29182
9184 29182 56930 45344 8946 14202 38453 66799 71270 92056 38973 50370 -31971 -74390
9172 -74390 -25281 -82656 -86662 -40953 38445 79095 68184 -3985 84517 119192 90932 68993
9160 68993 134381 137304 70408 -11620 -51774 30271 95653 104880 -29071 10511 131714 52930
9148 52930 58156 124420 59623 28778 105288 142500 81238 14144 84175 101120 99780 103603
9136 103603 43551 19885 -41262 -33581 -34716 18384 -36636 -51467 -59465 -29265 27199 -8997
9124 -8997 -18918 -11484 114166 62146 88735 129203 9898 -18177 851 10512 -51204 -111846
9112 -111846 -21125 28558 37658 13363 -7993 64754 96919 5257 4161 -8417 -41363 27095
9100 27095 74893 13416 -62987 -94231 -5613 38110 -12524 21151 99744 46694 12928 6067
9088 6067 -31761 35064 76569 62973 65420 7087 -48202 10387 -21919 -33244 -24531 -24120 841
9075 841 41048 104073 61298 -11232 8465 27119 66516 7596 8878 -685 -22351 -32264 -37447
9062 -37447 -70083 -89062 -77988 -1964 31116 -942 36372 82991 80568 5628 45417 71476
9050 71476 50135 15231 2036 -39715 -6297 12964 2922 -29390 -9014 -23034 63975 11974
9038 11974 -51786 46550 3640 -56943 -40544 17405 123840 15840 23071 37200 -9889 -102339
9026 -102339 -91447 -83920 -53076 -30487 -40522 -15884 787 11957 -33452 7956 52263 114768
9014 114768 92067 73939 80590 13058 -1876 51456 58484 -10700 -91502 -50340 -37854 -74037
9002 -74037 -106606 -33532 9369 35159 -9321 -37726 35422 52278 -36096 -67910 -39155 13366
8990 13366 -28564 -57373 -26632 65834 -17314 18778 84876 -43693 -13917 74134 46355 23349
8978 23349 -7749 6519 -33385 -7357 -63781 -100778 -68098 -53736 10990 -72154 -28511 -49577
8966 -49577 -39014 -58888 -122370 -94116 -96282 -38296 -68897 95079 71116 53314 46901 33837
8954 33837 -7616 25034 -12663 62123 24325 -86423 -129780 -84185 45728 -2830 -3474 -30085
8942 -30085 -74287 -56715 44061 35462 -66861 -29042 15875 4842 15331 -19427 -51340 -78132
8930 -78132 501 -38487 -39550 -9327 10185 -20960 28299 26258 1785 43425 83127 20749
8918 20749 -65879 -104166 -101416 -62959 31883 -10307 -7094 -51870 -41162 3953 476 73414
8906 73414 61200 54874 16954 -12777 49620 86396 3431 -29501 -43008 -39283 -32199 47587
8894 47587 53930 -68780 -26540 -102730 -110108 -99478 -81338 -79426 20996 -8070 -10189 14154
8882 14154 -52060 -111564 -117537 -33612 -39723 29962 11556 -5609 -35019 -65796 -56883 -12594
8870 -12594 96189 73120 99040 -10859 -69539 -74104 -2570 -6394 -14844 -55048 -20931 23677
8858 23677 22877 54831 36833 79065 -624 26276 -16065 -34450 -74754 -69598 -54453 -26969
8846 -26969 -1008 -18615 50751 -8483 -29616 22094 -64081 -113115 -81991 -83585 -64026 -11899
8834 -11899 -60285 -22199 34670 -55821 550 14508 -7034 25733 -71814 -55944 -35921 18489
8822 18489 7507 -21373 11499 -76975 -50927 -71133 -87912 -23970 -16944 646 -21054 36255
8810 36255 36691 -28405 -23547 27072 -49254 -39619 -76393 -8567 -38388 -131901 -105702 5195
8798 5195 52063 55021 -23897 13935 44016 85954 122664 106992 80476 23278 -60521 -93584
8786 -93584 -32654 -11941 29852 -50045 -30702 -37835 9873 7211 24247 -11491 -78682 -24266
8774 -24266 -24588 -46286 -6765 -5645 11697 68 -27841 -19191 39670 57728 -9824 6305 -2669
8761 -2669 -46196 -43972 -28042 -23449 -93586 -127559 -192877 -147500 -62963 -91893 -104230 -65096
8749 -65096 -74260 -55409 -23836 -13694 60047 76606 51287 43189 52663 79949 25248 23966 -10834
8736 -10834 -84255 -49973 -93208 -22334 18173 -73986 -68653 11524 -4690 -34326 -67112 -56755
8724 -56755 48612 97326 6272 -5291 18546 54120 3479 13194 17398 17200 -17914 -6576
8712 -6576 -308 -47228 -3714 -42808 -16853 35773 -23238 -41722 -46346 -55575 -6481 -25520 -61268
8699 -61268 -46293 197 -44905 -8148 -36682 -71916 -79962 -106086 -101466 -60881 -30773 36493
8687 36493 17882 -46191 -46371 -40825 -72421 -75010 -79913 -86295 -124084 -92810 -60375 -91583 -40888
8674 -40888 -19827 12874 -50582 -86150 -92036 -57997 -17918 -41066 -32955 -43820 2357 31783
8662 31783 -16276 -50332 3047 85784 129908 74768 -44208 -40675 28260 14942 11536 -2435
8650 -2435 -51004 -10753 7161 5898 17925 17150 3345 -7726 29159 -47172 -92449 -9019 102355
8637 102355 4893 9759 21754 -5848 -18203 44724 45793 -56767 -104720 -25283 29680 -2643
8625 -2643 14969 29496 25599 2963 -59698 -114519 -105228 -152656 -180968 -140021 -78627 -34863
8613 -34863 7972 -36059 -37530 -28389 -96166 -87688 -18707 34469 15208 2113 44375 -31352
8601 -31352 -39358 -13842 -14608 -86708 -21690 50414 -37626 -33674 57945 57292 -34305 -73851 -22399
8588 -22399 -25988 -26250 -15447 -8950 14765 -60 -13167 -37556 -75011 -72930 -80542 -118182 -142651
8575 -142651 -122136 -53930 -36148 -131510 -125620 -91370 -48186 -51189 -80855 -10793 9256 -34876
8563 -34876 13595 32664 22301 -71366 -56231 31087 35122 68241 8893 -18046 27674 18093
8551 18093 52655 26429 33878 81770 13862 10525 -26655 -13748 53247 16522 124 22515
8539 22515 20230 -56127 -141744 -49866 -44154 -60268 -90335 -93503 -56032 -123605 -89443 -37209
8527 -37209 -1869 6952 -33454 -53470 -3882 -49865 -94201 -174906 -158026 -72313 -32411 -70698
8515 -70698 -28554 -74192 -135472 -40103 -15278 -31183 -51482 -9155 -82428 -44925 -84041 -26054
8503 -26054 -31967 -43563 46566 -18455 -5171 -8433 -86639 -122015 -29907 45799 24005 -42149
8491 -42149 -57404 -38495 48672 61193 17625 -72977 -123457 -133918 -85160 -3515 -6532 -43813
8479 -43813 2859 82409 58214 72565 -25220 -44299 -37180 -12314 -35403 14215 -13237 -32735
8467 -32735 -17213 -40659 -66157 24899 52763 14856 -5353 15959 18600 -80775 -147112 -110320
8455 -110320 -40190 9598 -3651 -15172 -68331 -38883 49847 -23489 -3155 46098 45243 102325
8443 102325 29990 -20540 1925 -275 -42831 -96268 -74729 -8730 33930 -42351 -24941 -970
8431 -970 23408 -5579 -50625 -107769 -94209 -34670 -45453 3625 44882 -106079 -120397 -158394
8419 -158394 -78794 17655 4418 -45621 -64332 -78914 -41998 -87161 -107055 -93875 -37822 -53801
8407 -53801 -114274 -67287 -85636 -17565 -52765 -38333 -15923 -80865 -88103 -42729 11954 61290
8395 61290 -47810 -66403 -17937 -32471 41967 72627 -43110 -62091 -61927 -35796 25697 -33524
8383 -33524 -62024 -67045 17155 26971 22565 49694 31129 23744 -44616 34563 30364 -29588 -86707
8370 -86707 -101559 -107909 -39645 -50876 -69191 -60740 9662 -30734 2456 -7394 -61950 3107
8358 3107 31994 -18933 -88246 -62860 -80195 -61546 -92339 -3994 -12844 -18246 -4928 84960
8346 84960 109187 97794 -10611 -44865 -22238 9084 32699 6443 -20543 8422 44958 46883
8334 46883 9731 -100799 -134719 -100706 -50924 -81580 -46052 4325 -24135 16976 -37222 -58514
8322 -58514 -66890 -70276 -24424 -20656 -90056 -38416 -73481 -99647 -52782 -33329 -27099 -146700
8310 -146700 -114599 -59826 -27632 8070 4564 -12368 40488 -21581 -77757 -57776 -90879 -98727
8298 -98727 -122182 -71945 -44331 -13398 -51711 -55321 -55472 -38119 37759 53340 32132 -30053
8286 -30053 15260 28986 -38663 -46853 41844 91188 -43633 -107612 -15231 63318 38024 -41843
8274 -41843 -17412 -72969 -5427 9602 -23414 3423 20991 6218 -66515 -96590 -56995 -104962
8262 -104962 -22601 34912 -8180 38524 96432 68067 14276 -53508 -49519 -77049 -9641 44400
8250 44400 24710 65521 48364 84978 123072 73575 34566 2859 -6850 -91211 -86950 -60407
8238 -60407 7082 32950 6554 18562 25998 34073 -36343 -34386 -68726 -67289 -6401 -24377 2257
8225 2257 -72 43645 -48389 -47737 -6638 131522 33142 -77436 -1706 -1899 21041 -5744 -96398
8212 -96398 -105697 22900 -4918 33244 61643 57623 3485 88491 -19560 -24209 8094 48763
8200 48763 35864 74679 71481 143671 81507 171228 186199 434964 -609757 -885174 -339659
8189 -339659 -316002 -198821 -264764 -116185 -168467 -143778 -223362 -166764 -207786 -130071 -143555
8178 -143555 -99894 -116161 -116348 -144726 -96293 -111749 -21042 -23771 2739 37990 77456 51057
8166 51057 4953 -27160 -34105 -37229 22124 25960 5280 -97958 -94670 -61488 -36596 -25976
8154 -25976 -10254 -41344 18965 105575 64090 -8178 7309 26395 -3116 32320 870 1559
8142 1559 -86373 -8270 24385 -94737 -71631 -63698 -27936 7006 19025 67441 -36943 -65485
8130 -65485 -97046 -52848 -17417 -52201 13493 74597 32476 -55252 -3762 53796 -29405 -8947
8118 -8947 -17228 14371 -52299 -78800 -34999 -25640 -40965 -82236 -154858 -48246 -48644 -6452 -96481
8105 -96481 -106568 -78350 -51377 -28491 -8268 21225 69741 33165 -43621 -104443 -88937 -68983
8093 -68983 63347 47339 -14953 -59477 -76701 -44206 -124303 -80873 -104432 -128640 -128518 -48806
8081 -48806 -75768 -21179 -69901 -111792 -94645 -98413 -116078 -88969 20928 48060 36828 8865
8069 8865 -49024 -420 -55345 -61193 -51901 -65541 -84562 -52703 -43302 -10955 -21641 -6709 -44202
8056 -44202 -27886 -31634 -58337 -38053 19608 -78191 -111576 -128996 -96066 -13640 -7573 22659
8044 22659 -28459 -61515 -95195 -48953 23065 -81815 -80464 -95570 -52112 -69304 -23018 24349
8032 24349 -19197 -98413 -75699 14730 -16386 -38241 -54151 -101012 -70965 32216 -43121 -98835
8020 -98835 -70289 -98460 -176660 -146146 -22370 -18486 -107694 -90436 -80395 -44921 -38444 -26018
8008 -26018 -67009 -39907 -43203 -30611 15126 -41843 -64526 -67549 -106286 -146453 -40587 -14587
7996 -14587 -30538 -23498 -30282 -19357 -6589 51033 -15935 -43850 18564 -42261 -123675 -47471
7984 -47471 -29276 -41353 -153394 -57449 16508 -88784 -59191 -2821 -22007 13531 -53968
7973 -53968 -44913 -77253 -73684 -61198 -52490 -68389 -56472 -6116 21403 -9633 -63041 -79710
7961 -79710 -62899 -99984 -95656 -165470 -21091 67198 -9582 -1370 -24301 -35793 -68253 48857
7949 48857 100988 91580 92530 63393 62770 42894 36942 131278 45213 -34024 -63304 -73765 -54234
7936 -54234 -18236 -80782 -153645 -87759 -88684 -107543 -44737 -21811 -99994 -72028 -45883 -87398
7924 -87398 -22322 -34944 -8093 -46429 -2260 3213 -41368 -32230 -42350 -65886 -33426 -49529
7912 -49529 -50842 -26852 15551 10270 -16713 33932 -4501 -27947 -47082 54315 10996 -12474
7900 -12474 16269 -54718 -31176 -40252 21518 49066 -9503 -46347 -66924 -59426 -22523 -27189
7888 -27189 -76995 -100796 -65662 -5679 -1795 -23394 9710 -18242 2498 87277 81175 59532
7876 59532 76930 40947 29677 29629 118298 88707 -14466 15651 -12551 -73849 -100124 -26744
7864 -26744 -88784 -116659 -67670 -101906 -97251 -128800 -62459 5720 -109291 -97230 -18936 -79330
7852 -79330 -62295 -15813 -67737 -115458 -27263 -85669 -81410 -53529 -43172 -5141 -8150 -52941
7840 -52941 -81588 -32910 -3388 -43322 2720 2830 -76661 -30158 4116 9257 -32396 -104980
7828 -104980 -79706 -45948 -53848 -80495 2051 14443 4713 -9013 -12151 21194 41489 40746 56782
7815 56782 1824 27569 70749 53797 66215 16950 40680 22152 29111 -1364 -1169 75322
7803 75322 14056 -13729 -41536 -33134 -31556 -48232 1254 -89701 -74436 -3289 31861 -3448
7791 -3448 41036 -32089 -62662 -30741 -8351 -3405 55291 7061 -31330 -89252 -73294 -25499
7779 -25499 17149 -3869 15133 -90399 -76379 -8926 -40914 -34361 -67268 -59884 902 54174
7767 54174 -45485 -86479 8562 1291 -69908 -65402 21001 -32042 29437 39313 -2682 -55009
7755 -55009 -84228 -87750 -12304 4598 44254 -6198 -53515 -10373 -106836 -111613 -44274 -43205
7743 -43205 -70108 -30654 35305 47189 -2530 -46898 -114387 -6260 -22061 6234 -28657 -51005
7731 -51005 -66845 -7694 -59971 -82333 -116414 -62816 -38489 -5622 -31821 -47970 9046 -64643
7719 -64643 -57244 -65725 -13725 -174 -48681 17596 40776 -33605 -72536 -15259 39574 3616
7707 3616 8355 16748 -12330 -199 51294 92237 66865 111333 79364 -36762 -24685 11113
7695 11113 -50704 -11435 -59394 -117554 -65226 -122759 -176002 -118468 -153793 -51620 -21708 8810
7683 8810 57563 7646 -15139 -12844 22611 -3560 -4741 26261 24279 70563 6448 -51957 -25530
7670 -25530 28653 20745 43148 113668 26501 -8107 110139 62128 8068 37072 47840 66383
7658 66383 61337 63325 31282 -57727 -11985 63020 85519 65568 7921 23017 109367 98721
7646 98721 -46311 -21591 -9489 41795 33611 -59774 -112570 -115820 -57277 3883 36582 40863
7634 40863 31352 47974 -39266 -49684 -42241 -36734 -9500 52303 35382 75304 75219 87574 58694
7621 58694 22432 -10892 19293 -16398 -56581 -53744 -66769 -37263 64001 41167 89666 53462
7609 53462 -41982 -6658 -33570 10139 38157 51497 11627 -9856 20766 -2212 3176 7240
7597 7240 -6262 59508 93036 99042 74252 -3914 18845 93941 20740 37575 52401 75075
7585 75075 119219 73933 30984 -14725 12212 33091 38334 75500 64706 64792 42259 16582 -44693
7572 -44693 -7158 109727 103085 113739 59494 21066 37840 27439 2595 18110 20676 -17762
7560 -17762 -52232 -51583 86476 129340 64816 88273 102650 135251 74582 143506 286698 352677
7548 352677 311424 329816 374067 417021 565462 627227 706052 673760 737082 796326 698555
7537 698555 590767 501593 414460 380611 356565 369162 334004 274508 233436 235436 230576 187335
7525 187335 154208 164054 131189 138189 85124 113521 113257 95154 71905 93103 81718 103710
7513 103710 146984 110308 25923 -28305 69430 57372 80867 43215 -20142 -35825 -17108 -2635
7501 -2635 5822 -33506 -69255 -25165 -25954 -42963 -20460 29544 10368 1560 13893 36663 49613
7488 49613 31943 47509 43719 -8108 -56758 -75136 -30911 -33888 -83386 2587 12783 77775
7476 77775 96377 14322 13234 62812 55999 21836 27462 66600 32011 -92428 -83280 -60446
7464 -60446 -47269 -69157 -126892 -109393 -25601 192 -31640 -21450 -3985 -49492 -48783 -64701
7452 -64701 -12525 -29694 -24369 75276 40797 77533 103675 40660 7088 66173 -25497 -92655
7440 -92655 -4747 20832 -7123 -14681 -45973 -10155 60361 23339 -56519 -17094 4277 -26066
7428 -26066 13515 69351 56142 8195 18827 -20431 21010 52395 42687 70639 72614 3490
7416 3490 -25340 4025 55640 35704 19061 -10721 -65051 -65904 -26883 48754 57106 -37841 -81123
7403 -81123 -163442 -65913 67639 -58072 -79518 -5660 -20020 -7462 -66612 -67340 -48009 895
7391 895 32650 39165 61512 -36607 12169 -10288 -63715 -73304 -40258 -43782 -73315 -91145 8690
7378 8690 -43029 -16170 26415 33446 8482 -58164 -84359 -82887 -82085 -17216 -64801 -76994 -139050
7365 -139050 -140046 -47540 -30121 523 42224 20433 47569 106989 81472 -24306 -20786 -15604
7353 -15604 -6296 17834 -69150 -47143 -36416 12255 -40004 42830 78062 2474 -42535 -24333
7341 -24333 -15884 -50433 -7885 -222 -56382 -8154 23622 -21319 -66130 -59627 -4471 12683
7329 12683 -7521 42123 47400 -71440 -118190 -96089 -117176 -41276 -44081 -37572 -9523 22381
7317 22381 -43815 26222 -47432 -113946 -71798 -45504 -93690 -67794 26191 22610 -278 24642
7305 24642 8546 1787 -22223 -70698 -49584 -78031 -79264 -12242 54596 8063 -5877 -72130
7293 -72130 -72920 7270 -18408 -8796 2011 -57063 -101566 -127979 -18950 8312 20046 -45430
7281 -45430 -29413 -28143 -1097 -27083 -37869 -33391 -57647 -72696 -12151 23292 -15796 51364
7269 51364 39644 15870 41564 8654 55981 41307 84314 18204 53514 14930 -7208 11923
7257 11923 -27411 5765 -22431 -35706 -79031 -74258 -35504 -59094 -42250 5165 -4780 66774
7245 66774 737 76269 61672 60279 6275 45571 86730 55718 8694 -6723 -5135 -41985
7233 -41985 -639 32962 -8424 20912 -44451 -70037 -796 -3066 -2719 -1617 -4745 20811 34614
7220 34614 -7171 -131 29769 29477 100865 22147 17456 90399 -9697 -49864 -17090 12394
7208 12394 -16650 -13889 -1845 63514 -13743 -22214 -45863 -19139 -45685 -53201 40927 45870 39188
7195 39188 -34863 -27212 2254 3752 8312 -89048 -54819 -24988 -128301 -81308 -85850 -69331
7183 -69331 -42720 -79437 -121776 -28856 69824 54111 57086 -899 -27255 -74534 -47490 -12095
7171 -12095 -74899 -87639 -115406 -63916 4 -76046 -56748 -106225 -48285 -22805 -28913 23347
7159 23347 6981 -22873 -8381 12076 -1897 -69870 -67600 -95587 -83553 -8769 -34957 -27234
7147 -27234 -84571 -72949 -49611 -13863 47480 47072 -21472 10834 20180 -11682 -45296 -37770 -42924
7134 -42924 -63054 -90659 -77152 -56491 -46302 10343 67215 23589 -15954 -19994 -19611 29098
7122 29098 31842 42832 61725 44516 22531 -32354 6921 45667 29122 45505 56815 61211
7110 61211 -27251 -8812 37180 67284 83628 97434 131684 70380 -2890 6342 42079 21735
7098 21735 14475 -27814 -12789 77412 137529 76402 -38922 8908 -8024 -14102 -33668 -10599
7086 -10599 -6705 75257 126256 54690 40052 30716 -10404 -36414 -11494 71663 32140 54185
7074 54185 52102 12412 89948 70811 -66365 -36227 60462 -14234 -43931 -39845 -28997 -10667
7062 -10667 63815 19656 11003 25786 -72444 -81605 -33909 -42210 26166 45477 -2608 889 -52887
7049 -52887 -35112 -24897 3898 79475 67773 862 -34572 -38449 40159 107450 43518 65113
7037 65113 61646 16447 29945 16874 23982 73913 57982 74732 116662 105632 64661 74868
7025 74868 75159 76149 55915 78156 118423 128290 144079 123679 56116 32023 252 81403 143560
7012 143560 67212 71125 92741 51203 97771 54133 46232 81096 91463 133183 48684 -53876
7000 -53876 -41962 32188 134422 145651 179276 145084 37066 28932 40410 41661 91298 91477
6988 91477 52367 89386 90072 67614 101377 128364 108826 15787 25554 49000 3574 9300 15037
6975 15037 25324 61356 37622 47577 102468 39104 6821 54688 125579 76694 55524 -5680
6963 -5680 20827 29323 58162 109051 51383 -26432 -66408 -21874 86238 89062 67721 10721
6951 10721 24544 41702 54852 80404 55733 35703 10947 65201 47833 72266 30513 8514
6939 8514 9532 412 34467 50751 77276 93546 103019 69396 45608 25725 -23386 -12386 34800
6926 34800 24860 106382 62438 -81142 -35814 33150 21043 -44343 -5697 -4380 53839 115484
6914 115484 58962 105704 89376 141599 150047 116005 173216 182758 131169 45198 34533 105251
6902 105251 58609 41474 35525 86956 30958 -9949 -2401 40838 140492 227234 168812 128715
6890 128715 81543 82174 101706 101829 75269 -5439 50986 90738 87638 47882 68143 49046 2789
6877 2789 -33183 35391 79091 89298 88785 81566 103229 73477 110134 96674 -1790 45228 107498
6864 107498 99996 28728 26775 96916 76738 47827 130877 130875 69339 93652 128691 110652 138978
6851 138978 120482 97274 139260 127078 93752 70289 134393 50884 -43740 12160 14661 68896
6839 68896 78187 104994 135236 135245 108629 129008 147615 176450 168020 136812 153949 215933 216766
6826 216766 221993 110605 169308 132130 96828 72663 86765 189395 204149 203012 120473 236772
6814 236772 308906 273538 221810 217786 281689 256443 259574 297966 253625 213268 158503 144197
6802 144197 220605 274473 302347 294902 296942 329953 352116 391928 368335 381107 393661 446443
6790 446443 517047 590314 609504 595382 617317 694450 579551 655460 802778 767049 734171
6779 734171 755814 841392 868223 915296 920836 881426 865480 888042 923980 993519 954974 927943
6767 927943 947126 1059648 1093623 1167039 1200366 1245487 1411774 1451818 1539822 1632978 1692203
6756 1692203 1809746 1842529 1899767 2040460 2033593 2070533 2118978 2122291 2111353 2106158 1980410
6745 1980410 1886229 1931411 1826421 1705454 1650441 1549338 1551893 1558388 1512553 1538192 1594731
6734 1594731 1670434 1704690 1739993 1894018 1962037 1975227 2045726 2193517 2260613 2282039 2285622
6723 2285622 2295015 2243270 2173722 2134021 2120559 2076171 2005806 1946787 1904479 1808695 1782975 1701774
6711 1701774 1633478 1561318 1488940 1421608 1319455 1302943 1418886 1384653 1342478 1359692 1321974
6700 1321974 1351966 1324944 1363913 1366248 1223784 1201180 1203375 1230463 1280387 1239227 1245084 1291085
6688 1291085 1228987 1179789 1186199 1170634 1238156 1262304 1129098 1056730 1099764 1090159 1179519 1203727
6676 1203727 1212408 1189444 1128279 1059803 1066697 1019274 963847 1014903 1179909 1193207 1142513 1046742
6664 1046742 1074775 1140305 1230828 1295994 1272016 1182499 1126046 1154979 1284026 1259508 1300382
6653 1300382 1328310 1313107 1279194 1205115 1163124 1148747 1169958 1135921 1157410 1194483 1211127
6642 1211127 1224105 1246221 1226308 1213639 1228242 1216939 1281726 1219376 1152012 1238943 1199642
6631 1199642 1234697 1222185 1155367 1085439 1011751 963637 970396 931208 965028 931946 879889 798950
6619 798950 850736 914793 926360 955875 893470 871538 815927 759118 693315 725655 785479 818011
6607 818011 765793 733752 679806 635627 667270 641722 625840 583743 546002 518173 500860 473568
6595 473568 566901 511000 437327 396952 375548 391622 389234 401190 403038 370652 407199 431595
6583 431595 433846 426214 394324 371269 346370 351414 366981 393426 373981 306877 302831 319003
6571 319003 283942 265918 267592 186129 170674 274305 264656 175058 174532 193879 224090 260385
6559 260385 273151 188936 158291 147863 176219 155320 206144 245619 240287 217562 246466 248346
6547 248346 204447 223486 187807 234058 172762 126645 157611 173095 197447 225135 209565 153396
6535 153396 173573 85884 68960 123744 164012 224575 96867 173846 165449 170670 154794 161340
6523 161340 173388 226733 190822 169745 154673 207454 178751 148494 163366 121288 121494 101163
6511 101163 1728 23337 11785 17959 28600 23260 75587 81553 125731 79050 -34760 -153744
6499 -153744 -58706 32769 15996 126834 147034 49903 39930 88966 129112 112512 134779 179145
6487 179145 116054 174597 167847 184857 153913 -33102 12046 63104 70528 54371 100764 106625
6475 106625 150357 111416 26598 24341 38179 -10450 79747 116050 104657 154134 110693 110761
6463 110761 116868 115677 113990 159060 120619 108763 95547 70101 110121 22005 75581 86540
6451 86540 118147 113198 93550 50995 66430 45145 68110 70934 131724 53731 49505 6454
6439 6454 16434 16749 -74746 12526 43792 98436 73869 -976 -14928 7435 10141 36204 -12545
6426 -12545 -12089 25262 27669 -4617 53826 110333 123826 133560 182370 141635 51005 67745 102800
6413 102800 113355 158980 106356 188186 198779 197321 161711 78803 76293 126572 72797 55977
6401 55977 124602 10491 -52418 49290 96127 33733 27704 62844 77804 60622 21614 -34647
6389 -34647 47914 133553 59785 122128 133963 116940 30753 98591 167825 167375 100487 56435
6377 56435 31712 38503 144651 106616 69303 74426 146286 94543 78650 45948 78136 64673
6365 64673 35105 23385 35678 73630 126036 130357 70202 92995 158538 168980 85072 32061
6353 32061 46642 131994 85819 66223 57309 73964 67434 8746 33722 53811 157062 55179
6341 55179 24264 36878 131756 118895 94747 34313 14024 36875 42031 109741 16647 25771
6329 25771 21199 48995 110398 36055 40135 106590 97843 33270 2241 87597 115811 84667
6317 84667 67987 70724 -28207 -39034 -1202 10139 10567 29484 10729 60491 87723 61663
6305 61663 38852 7334 -13629 135086 137663 22915 -21060 -1867 15586 -53581 662 70652
6293 70652 134139 138561 73079 92963 78394 23161 24074 66389 86574 95649 124054 128311 88928
6280 88928 84916 68969 65354 22611 -43943 -5361 78285 138502 109921 110191 107383 152192 151043
6267 151043 172117 180952 79937 115747 101541 107592 76240 43130 33645 34710 98625 183363
6255 183363 131048 28563 36066 59631 80711 -13147 47844 149849 144809 104975 38425 13433
6243 13433 79000 60497 107158 186429 151002 64522 53163 33600 78538 121578 84566 63646
6231 63646 85292 23806 -39672 -31400 54360 102343 92335 145566 115651 -9855 -15882 3113
6219 3113 14303 -8274 47872 32464 -34189 -3515 -17095 5846 95059 139586 71474 5936
6207 5936 64816 32926 73058 132745 34134 -91298 63024 134172 26979 61256 124925
6196 124925 84655 81445 90783 -31812 -11001 17639 13293 -52068 22295 27216 45878 18851
6184 18851 -762 47253 4022 41823 103877 80110 127924 60672 44429 67973 59138 63576
6172 63576 55003 83831 55644 31653 27992 83856 54203 23219 61003 129660 110229 169651
6160 169651 127236 77283 154435 84866 -35131 -55132 -25506 -18349 30756 3740 68772 15607
6148 15607 19478 57651 45730 116921 184009 181268 140164 64935 87235 99909 147206 73431
6136 73431 24283 26944 35849 79780 67286 116447 103705 36364 2365 75359 93071 21216
6124 21216 18970 44327 129909 142332 92600 93185 37137 -4791 55105 132906 125325 35293 -27965
6111 -27965 -11317 11766 43708 85925 80049 87471 105066 129407 154505 69147 80771 29495
6099 29495 96105 74838 83850 72852 127967 167479 123106 122457 108404 44567 71698 35342
6087 35342 77744 202723 142252 125950 74660 45007 92481 176197 118907 73230 22646 -12395
6075 -12395 -21279 38662 106904 106791 28619 102714 135504 154331 109854 34991 54989 102211
6063 102211 82875 112804 156942 48452 54998 102689 131727 136831 196223 174814 103174 48738
6051 48738 77233 56195 114295 156860 105589 160679 113136 94008 145500 144415 98277 76085
6039 76085 117037 61862 63712 115638 113198 83160 95230 80192 69203 25588 101412 137407
6027 137407 81857 -16655 29204 128807 69210 140322 129221 101355 124805 171384 95580 70901
6015 70901 144971 168166 172116 124122 117290 192951 242363 162376 93251 136519 141289 143762 201419
6002 201419 276902 227070 183183 184846 205171 177902 157135 160876 188026 176218 171863 269130
5990 269130 300464 184096 210782 248351 132850 155791 185675 170830 190655 208805 234827
5979 234827 323924 318239 224428 176180 271212 252420 294800 341725 318874 272856 226194 175222
5967 175222 206921 268474 304860 257856 238199 183402 192593 236639 220351 270887 204738 200161
5955 200161 280344 283734 229967 247011 165287 126846 113757 211772 129979 88787 226338 231728
5943 231728 171928 163660 107441 172171 63426 65607 99048 108229 177221 228580 213752 105969
5931 105969 110868 138905 284412 254389 200528 190670 227472 268113 222348 232944 225748 187602
5919 187602 217839 229749 217311 206218 207561 142266 143539 173754 274753 284163 223773 187042
5907 187042 268701 278658 233198 250498 267571 276032 289748 299602 277025 269379 188219 147908
5895 147908 189510 171997 204709 297931 265915 272277 276903 215635 229326 180828 182017 257404
5883 257404 207221 180389 164582 182873 242531 234171 238694 168687 106794 168339 208131 206929
5871 206929 179102 165631 168499 131421 178364 201247 269872 256926 147410 199941 206200 169697
5859 169697 167636 154316 158413 183268 198103 258241 233510 189833 221078 214434 153184 189937
5847 189937 271919 233675 213389 280308 304850 247798 168776 240945 231740 259499 283896 215841
5835 215841 224470 189390 189830 196610 154305 184747 160600 274413 303967 290457 221937 190274
5823 190274 261932 300793 371202 373093 286611 257128 229506 243095 220916 219804 266498 268778
5811 268778 243295 273715 295955 173189 230049 225382 275598 280408 193443 269317 296337 222513
5799 222513 238484 216381 221475 254568 246199 230525 310823 269040 204985 203321 266861 217863
5787 217863 203522 186618 223500 299997 363588 364621 344528 309313 285534 327264 270451 314542
5775 314542 373692 318210 268104 227336 275193 295460 308130 394908 417635 370037 365096 381806
5763 381806 363139 294599 270556 339864 299202 336257 308251 437239 480207 416828 398888
5752 398888 416941 550146 502496 460219 415870 410259 423818 455022 510782 533868 463365 499536
5740 499536 488368 433581 404204 445971 513587 503156 538563 424909 457328 537528 575315
5729 575315 626520 590451 542370 565933 536026 574894 542394 461018 487183 521308 482295 552117
5717 552117 543810 542578 569394 559572 555536 514374 525308 569071 562925 590436 622887 641808 630823
5704 630823 648716 726338 709856 702316 776623 729550 633349 693206 741463 800666 692569 586463
5692 586463 617132 600277 616337 564682 671402 732513 686516 687588 723138 802425 834316 790850
5680 790850 770149 783729 783523 779151 778032 786498 785904 774926 783492 813406 860498 881607 886800
5667 886800 977999 970431 964288 975789 958692 1017253 1042325 1082308 1090112 1029684 1051038 1024639
5655 1024639 976212 981826 1090156 1114918 1134094 1088906 1098929 994540 1054682 1123575 1120970
5644 1120970 1125876 1109560 1109353 1085993 1136436 1191029 1143084 1085124 1211763 1190256 1318695 1349452
5632 1349452 1257767 1233338 1279263 1307336 1273365 1335568 1321477 1321066 1411971 1422814 1405242 1401513
5620 1401513 1396468 1435991 1493575 1523075 1479476 1478242 1526185 1579777 1629929 1634002 1538448 1533174
5608 1533174 1501333 1553299 1584924 1646866 1690978 1664344 1670366 1708820 1712799 1707147 1744773 1764704
5596 1764704 1782093 1810815 1863620 1812612 1760703 1753785 1843758 1891002 1969600 1918924 1925410 1946532
5584 1946532 1932332 1959874 2055436 2157496 2153791 2145460 2101767 2211087 2282650 2302539 2348662
5573 2348662 2324734 2380269 2465459 2493793 2548221 2602801 2596889 2624713 2601266 2524736 2603601 2616235
5561 2616235 2625992 2620714 2688651 2817262 2804389 2826144 2855463 2896867 2859540 2901324 2897646 2872463
5549 2872463 2916241 2995746 3009133 3049134 3121459 3098993 3190181 3255332 3253663 3285144 3330931 3348751
5537 3348751 3396729 3429632 3439507 3591929 3604141 3623567 3628224 3690002 3751201 3802729 3772883 3917774
5525 3917774 4000440 3985308 4119518 4215307 4354561 4374920 4447296 4546806 4601283 4629746 4710542
5514 4710542 4779097 4879383 5006941 5165827 5181442 5394507 5456022 5529865 5783561 5869899
5504 5869899 5905356 5947705 6068974 6305339 6484630 6599129 6736459 6915460 6983305 7083384
5494 7083384 7235959 7412092 7673591 7847505 7957127 8152818 8368149 8555725 8806620 9057996
5484 9057996 9247127 9471131 9745556 10014660 10230036 10521906 10847488 11140820 11440833 11758738
5474 11758738 12125563 12382948 12702594 12985557 13382650 13859638 14458948 14866971 15352424
5465 15352424 15919501 16387880 16974921 17608934 18208533 18840019 19589730 20446001 21337303
5456 21337303 22174929 23090569 24085930 25148429 26383515 27585900 28851260 30366734 31981339
5447 31981339 33686812 35452028 37272089 39391478 41716137 44077881 46711124 49513624
5439 49513624 52650103 56151448 59719410 63776359 68255998 73037109 78448356 84384134
5431 84384134 90852051 98036939 105869768 114539424 124053843 134386111 145803293 158188943
5423 158188943 171770906 186539870 202508322 219558026 237509639 256053436 274257475
5416 274257475 291369061 306230236 317603070 324526153 326094028 322097420 313061829 300199810
5408 300199810 284810295 268216725 251317289 234983909 219383770 204752727 190971951
5401 190971951 177943531 165805367 154426787 143795743 133866841 124751939 116419967
5394 116419967 108748575 101718149 95361688 89662375 84400000 79581547 75227091 71214930
5386 71214930 67495316 64095491 60916216 58019507 55301615 52816462 50501566 48252820
5378 48252820 46237523 44309975 42443720 40666848 38951850 37449229 36028324 34566340
5370 34566340 33161099 31789945 30569883 29448655 28336992 27278924 26289885 25278695
5362 25278695 24498647 23709711 22935646 22229737 21532904 20813579 20166668 19577243 19109386
5353 19109386 18570939 18032827 17418386 16933399 16575482 16044024 15542473 15204550 14842962
5344 14842962 14425536 14107300 13805425 13490685 13146952 12848347 12609468 12326928 12071230
5335 12071230 11789655 11477529 11203511 10978592 10778419 10519203 10288789 10094512 9837471
5326 9837471 9814618 9671096 9389830 9191576 8975976 8939306 8806583 8688378 8545421 8334493
5316 8334493 8253171 8193586 8046484 7982359 7931974 7802293 7664664 7553016 7531031 7430405
5306 7430405 7332375 7309733 7201571 7037016 6903719 6810431 6752784 6699942 6633444 6557875 6511370
5295 6511370 6460188 6388230 6299805 6250379 6224810 6125610 6130715 6072556 6077540 5991398 6066231 5997632
5283 5997632 5975247 5958946 5890110 5917729 5871371 5923974 5867239 5845513 5873236 5897951 5995269
5272 5995269 6079212 6104202 6203982 6331750 6392144 6481703 6654160 6819565 7050446 7285190
5262 7285190 7533959 7785780 8063267 8505404 8963939 9464941 10123439 10734018 11459222 12323295
5252 12323295 13288438 14455097 15770417 17350239 19242603 21417458 23778054 25953242
5244 25953242 27672286 28623864 28697254 27761605 25764153 23366661 21272879 19436278 17891193
5235 17891193 16644861 15576704 14630112 13734214 12938775 12100023 11340618 10624223 10067532
5226 10067532 9472782 8899478 8520510 8183181 7902480 7608728 7312392 6970794 6872772 6674867
5216 6674867 6390593 6166645 5989998 5888859 5764651 5618956 5418494 5249240 5175927 5055865
5206 5055865 4937609 4872562 4701952 4563184 4521163 4404064 4306170 4215740 4105035 3946362
5196 3946362 3793478 3725817 3700538 3636875 3605860 3490286 3411151 3381394 3284241 3283960 3259700
5185 3259700 3309030 3246497 3070118 2981742 2930930 2818361 2767617 2676064 2658175 2649603 2670073
5174 2670073 2627827 2560844 2593452 2528236 2498638 2481598 2393565 2307840 2372057 2383486 2320283
5163 2320283 2287573 2234016 2195979 2219572 2191082 2058088 2060041 2120379 2237556 2149820 2117365
5152 2117365 2035617 1920918 1927868 1985180 2029930 2014390 1921604 1785342 1811610 1804393 1802315 1790238
5140 1790238 1785261 1862734 1820933 1681195 1614409 1531519 1618403 1727635 1639139 1605042 1602132
5129 1602132 1593891 1640934 1595426 1539918 1529403 1522535 1552558 1523101 1494159 1465835 1485003 1462813
5117 1462813 1406036 1437381 1387073 1368198 1403765 1395804 1397375 1364112 1302632 1294828 1322669 1247423
5105 1247423 1190044 1256276 1212910 1165710 1212631 1215119 1170220 1217235 1224487 1243495 1198131 1176167
5093 1176167 1163671 1129364 1088898 1066862 1080119 1058158 992739 960889 1076671 1124789 1087079
5082 1087079 1042562 916544 939077 936574 890446 831354 816293 806027 878661 892976 915872
5071 915872 888085 872253 878024 872704 855303 805440 867136 805133 843671 894928 844858 833777
5059 833777 805116 811865 784886 739020 728886 808935 862633 790465 791307 627421 606518 745272
5047 745272 718083 666839 700066 717904 720721 762945 719814 654596 665175 687762 722943 723812
5035 723812 797135 795575 723887 761762 712325 717428 707315 672759 715425 631626 601742 575855
5023 575855 627316 601366 511751 525975 564245 620316 680764 684842 616776 565652 614623 629309
5011 629309 584548 577294 595864 628236 628694 589250 501441 459526 499764 478456 521800 519985
4999 519985 467706 486800 501287 565677 561731 457025 485530 532799 468368 396473 440693 453887
4987 453887 409970 429098 452738 451107 482321 397314 440696 528903 560071 500307 454529 469404
4975 469404 472794 440188 433594 457096 435122 480886 451995 453224 437544 498637 416875 400062
4963 400062 490679 502444 492895 434773 464861 541523 570490 595636 571803 538378 572593 616013
4951 616013 647504 671460 751505 751823 764776 854311 1019458 1091597 1163194 1204608 1339114 1641477
4939 1641477 1794003 1899519 2065452 2140863 2096178 1992759 1876797 1713715 1577917 1385489
4929 1385489 1301957 1195560 1152020 1005971 986705 962846 911293 895125 799320 795897 664126
4918 664126 685974 612559 620205 638790 664296 568862 475034 504318 516856 543304 579928 537276
4906 537276 508403 516961 601524 548897 556471 554150 622570 570415 588237 556900 506330 511199
4894 511199 610841 506231 386022 419078 487312 440554 367132 394028 461127 500097 485782
4883 485782 503035 429992 364213 490573 511050 463728 373145 287351 323925 272462 314226
4872 314226 345768 369335 305537 272739 363382 389316 318366 300498 306574 262482 216852 220796
4860 220796 218716 310907 270877 233277 195933 238517 268446 241949 222828 274681 288261 179489
4848 179489 168398 231006 285684 262250 212105 248565 183271 240256 246224 213777 183949 290700
4836 290700 267790 250477 247990 185597 139697 148946 221009 200759 242581 302437 282910 265744
4824 265744 190927 276089 282937 267141 286671 264578 272852 360394 373354 274758 284930 307862
4812 307862 321624 367666 501436 585571 499411 467515 546306 503916 570331 589880 604540
4801 604540 658048 729278 845525 936157 1004069 1189580 1330379 1509217 1601784 1794617 1930829
4790 1930829 1885044 1885847 1742851 1641351 1481516 1378068 1244881 1089911 998138 948382 960751
4779 960751 856169 834047 807829 726045 687944 597561 507716 473784 569899 591223 539329
4768 539329 574144 566021 506685 440534 536895 625599 629992 644056 634688 528173 535995 571706
4756 571706 546217 570777 477460 464307 473488 514153 503215 468614 466818 453843 408526 398936
4744 398936 416036 420689 414793 429824 423677 398738 330319 263230 246829 331497 372052 275494
4732 275494 311421 369267 462250 474532 416490 399457 416926 416220 420619 404319 439869 474122
4720 474122 472282 430771 501478 526123 411685 421246 396238 380014 420657 330420 353265 334731
4708 334731 365813 355403 337785 385480 367909 395127 426771 483905 468982 468068 479177 606655
4696 606655 540693 479868 499687 475654 506484 563279 533528 519658 603553 562848 577381 570424
4684 570424 618017 621445 675300 802798 794013 678607 701275 812964 782856 751640 749180 730068
4672 730068 775303 853434 919441 932766 928116 950713 964134 924814 981377 1054521 973432 1047971
4660 1047971 1147622 1244949 1352648 1381542 1403312 1374083 1417722 1517076 1583691 1581253 1727365
4649 1727365 1859931 1934521 2016141 2165626 2256020 2383341 2569033 2687471 2807310 3062860
4639 3062860 3242058 3484823 3814403 4130041 4448257 4874510 5326731 5844235 6445900 7110910
4629 7110910 7858538 8719293 9857358 11113564 12464893 13823290 14875058 15405000 15636904
4620 15636904 14984346 13781980 13023763 12582978 12315235 12320161 12391011 12641849 13023376 13463292
4610 13463292 14053403 14875895 15866816 16979385 18126862 19368826 20611097 21927080 23240029
4601 23240029 24553558 25866622 27361494 28976465 30568154 32202476 33668296 34873966
4593 34873966 35794539 36466866 37203096 38236121 39269229 40096624 40691381 40880341 40585512
4584 40585512 39806014 38840403 37834758 37086185 36381875 35601744 34626711 33344183 31799923
4575 31799923 30215284 28553582 26910360 25510788 24165249 22839475 21472293 20005501
4567 20005501 18491785 16997190 15646185 14439412 13350088 12373120 11569657 10760628 10015414
4558 10015414 9406899 8812667 8324841 7842758 7382762 7026832 6702491 6386752 6069319
4549 6069319 5722345 5439979 5258677 5008755 4784343 4526871 4333040 4203797 4094218 4011403
4539 4011403 3834723 3668274 3450872 3226845 3117209 3052510 3003608 2908845 2783655 2764726
4529 2764726 2681873 2577549 2492865 2386296 2359860 2330833 2257254 2187485 2088171 2038883 2005085
4518 2005085 1929042 1922513 1921376 1835844 1784152 1721113 1773796 1867152 1764780 1597942 1561889
4507 1561889 1584703 1648254 1606615 1551825 1447839 1481019 1394504 1416590 1352493 1300973 1248242
4496 1248242 1271271 1264776 1259260 1301552 1276812 1219237 1195190 1265102 1273630 1167740 1136861 1200778
4484 1200778 1259046 1293141 1286325 1246892 1189397 1123932 1163381 1121730 1068970 1132862 1138241 1071576
4472 1071576 1135095 1126721 1181224 1143399 1093395 1123712 1096990 1108297 1143926 1176382 1178928 1282181
4460 1282181 1274668 1268469 1269983 1292143 1274943 1277074 1357695 1406928 1406381 1474987 1603038 1662426
4448 1662426 1620388 1592143 1740369 1858157 1845899 1878285 2084395 2296842 2487376 2642603
4438 2642603 2748511 2961904 3108332 3348521 3603666 4007494 4368738 4757199 5225307 5837715
4428 5837715 6440055 7020316 7602692 8143521 8590732 8838163 8624692 8208373 7527442 6701078
4418 6701078 6035249 5489995 5036462 4577839 4208763 3941855 3751367 3605039 3332141 3032469
4408 3032469 2815309 2719229 2603360 2465196 2278851 2064643 1978537 1930025 1865448 1834946
4398 1834946 1822648 1766806 1648695 1618002 1491636 1476740 1496245 1433134 1422175 1335756 1202348
4387 1202348 1220414 1195142 1166330 1128455 1030997 1004525 1038553 989843 893879 908158 890881
4376 890881 873543 878304 837993 803254 834699 840605 860370 851687 856845 856724 829307 737679 667087
4363 667087 643830 631560 624490 649872 723220 671771 558498 569279 592936 559263 620315 645344
4351 645344 683794 609619 552636 538065 469544 540856 531121 550491 611795 576761 521665 563955
4339 563955 615461 603606 572894 576052 507770 516744 574333 487522 559786 617239 524880 495942
4327 495942 422449 486835 547961 621543 640030 602160 581922 621514 617941 518618 495695 591683
4315 591683 591346 615380 560152 554582 598734 607379 647220 687800 688380 695429 710250 730684 765268
4302 765268 745848 809143 867936 825534 888053 844560 918614 1021730 1096584 1022682 1051449
4291 1051449 1123448 1083086 1099047 1090025 1095181 1087439 1142455 1253688 1300232 1347857 1345568 1409126
4279 1409126 1355546 1338613 1455605 1514677 1473454 1473963 1480717 1448251 1528681 1530821 1581057 1567207
4267 1567207 1522691 1527725 1539638 1595423 1608237 1509609 1490019 1477401 1511589 1505984 1455449 1335334
4255 1335334 1398368 1333365 1363856 1390289 1299525 1338378 1301083 1195996 1180158 1179739 1128190 1047516
4243 1047516 1007179 1013312 985606 960975 946834 921873 1000634 842144 703772 716443 626075
4232 626075 587208 614210 580696 541019 591652 627628 658205 694135 644894 551424 545911 560648
4220 560648 562550 614145 635953 546383 515205 525067 470496 457198 467467 537540 522449 504093
4208 504093 434675 379444 417823 481501 476227 459695 436150 445448 444563 444535 412881 383418 356176
4195 356176 307530 274591 340093 299665 242518 227594 175353 218785 241502 227275 218400 246053
4183 246053 252437 197102 157756 245482 209259 192026 181443 208966 242406 252054 195003 257068
4171 257068 258706 139363 151875 235376 256450 227489 266520 319309 292961 323478 274777 239442
4159 239442 256812 289779 313998 343816 396698 337989 244119 273963 143072 277567 283015
4148 283015 291671 362076 282731 234316 241816 185230 242408 242371 244960 265497 198229 178743 188615
4135 188615 183080 159236 222764 219971 217928 170657 273301 218962 216771 161628 164142 146741
4123 146741 195377 227442 191638 185771 188148 208360 270332 228861 181865 171029 202749 183281
4111 183281 183931 172993 171222 246899 235611 169480 184062 188280 93288 101881 163349 167407 181050
4098 181050 216363 258088 248119 202549 212367 241332 264957 241663 257385 210047 213435 198894
4086 198894 137453 269794 360343 345124 371704 393887 410552 394601 426271 543299 456304
4075 456304 493657 476549 467801 555980 650432 686034 805548 847525 868910 938783 994238 1067370
4063 1067370 1166079 1361064 1502395 1608081 1764169 1993283 2158611 2344158 2603086 2986240
4053 2986240 3441197 3959131 4467536 5185314 5936779 6659489 7171332 7600303 7656099 7334245
4043 7334245 6575895 5807568 5260108 4758926 4403296 4186295 3921967 3684174 3495421 3318695
4033 3318695 3074262 2889990 2690792 2524926 2413094 2262441 2148009 2079924 2039909 1973462
4023 1973462 1851913 1767580 1690648 1497089 1301169 1218545 1211266 1135541 1123746 1105326 1016071
4012 1016071 974608 949804 1032609 981528 853361 762222 700630 707646 709677 720943 614741
4001 614741 582055 508339 527441 643709 556086 486123 449437 498086 535317 548212 474308
3990 474308 372483 452878 425220 420783 361494 383625 372038 351514 399205 390289 350940 339943
3978 339943 318896 324858 335417 289101 229051 278446 329712 301224 219223 256736 267947 288967
3966 288967 326364 288407 202793 267600 187168 136778 199686 201516 213498 277082 190366 143706
3954 143706 201580 231913 175708 188094 218370 211777 254323 200509 239843 344040 295631 221306
3942 221306 266580 222743 187697 190693 167115 83235 134829 209124 187571 129948 155304 127519
3930 127519 120556 165745 172403 173155 127296 198140 197302 155390 175323 170309 167750 141380 241311
3917 241311 221755 227779 181669 123306 125996 131551 186675 159923 113688 171981 153580 206030
3905 206030 183734 144980 209189 171313 182133 157507 210496 215511 204389 220374 187865 180332
3893 180332 169585 102528 46868 37393 9124 85684 135954 191955 143567 116725 143543 199391
3881 199391 238268 219780 115181 58470 126646 87578 88362 118367 133963 124177 190665 198199
3869 198199 213270 246879 228434 211385 196872 141602 136601 65076 52867 159587 183852 158987
3857 158987 151790 108930 174470 240054 273867 183096 177200 190149 132823 208096 94333 95437
3845 95437 141027 232928 193090 219292 189574 196769 300594 195492 192335 224231 259203 236695
3833 236695 119729 108422 152926 113989 198780 282560 244147 218397 324015 245518 259120
3822 259120 326764 292497 337327 323870 277233 309827 422182 457680 360643 291771 299033 291194
3810 291194 347283 417079 406101 513365 549941 504689 458305 454714 560142 620566 664411
3799 664411 699146 709650 716202 829018 805603 904268 1014208 1085395 1156689 1170467 1202333
3788 1202333 1317589 1329056 1491823 1669100 1828594 1961076 2086524 2225331 2296902 2404972
3778 2404972 2531450 2590656 2736228 2809432 2847337 2868959 2882348 2953456 2988657 2970469 2923767
3767 2923767 2978998 3000905 3003399 3023891 2992595 3026637 2953788 2864421 2837598 2716638 2647717
3756 2647717 2516395 2456183 2324137 2223027 2135762 2006068 1916928 1864831 1781344 1631902
3746 1631902 1490321 1488781 1457200 1452121 1342615 1252410 1170724 1167332 1117951 1088269 1010104 969365
3734 969365 969377 930665 918319 938931 991102 902126 784372 835645 798073 844204 860918 828363
3722 828363 768448 757520 742986 683352 698790 772481 726522 697957 777494 748267 663203 672164
3710 672164 716837 657522 610034 558206 583537 723997 743595 618650 642342 624863 692293
3699 692293 619918 585941 626437 574072 636582 696023 624502 574829 563447 559886 570389 588649
3687 588649 508405 502221 510326 489952 486988 523032 604336 581725 620058 698141 653455 680662
3675 680662 643048 629548 580320 548803 587486 621141 622827 713192 685914 639965 714220 623835
3663 623835 628359 686966 790653 795738 725384 755891 891414 987646 1016841 1107282 1052152 1020695
3651 1020695 1055224 1086663 1050831 1086327 1174414 1154598 1109594 1227778 1223737 1242291 1223098
3640 1223098 1200656 1215352 1106868 1097320 1098069 1058181 1052807 1110462 1051428 1125589 1184417 1200413
3628 1200413 1142545 1135661 1187233 1257006 1292291 1300465 1394186 1479899 1453750 1448330 1538282 1669868
3616 1669868 1751215 1740348 1715062 1760192 1905451 2129560 2245985 2351580 2422345 2603677
3606 2603677 2817693 2986484 3137696 3328309 3506169 3813661 4082039 4251241 4435389 4628094
3596 4628094 4848200 5053021 5247840 5367142 5420257 5551702 5690638 5718285 5837242 5980336
3586 5980336 6011759 6157677 6276028 6473608 6546706 6590888 6785747 6900583 7031905 7015876
3576 7015876 7096744 7154357 7219849 7282867 7527560 7732069 7787156 7926318 7967215 8064435 8034251
3565 8034251 7752185 7599877 7413138 7206561 7005861 6950211 6783498 6713870 6612526 6592250
3555 6592250 6475400 6346967 6348301 6419909 6554447 6686746 6826822 7059762 7263670 7546311
3545 7546311 7828554 8262060 8669723 9036958 9435178 9787724 10207337 10507057 10835221 11133107
3535 11133107 11430644 11745337 11996665 12295602 12489218 12527785 12589837 12367228 11942701 11480149
3525 11480149 11082621 10740641 10372901 10013789 9662197 9427250 9195723 9043590 8981836 8851587
3515 8851587 8862649 8941200 9075184 9172496 9323178 9645588 10027380 10338369 10749447 11220939
3505 11220939 11752464 12289765 12725507 12893508 13082088 13139174 13015392 12705858 12513726 12331845
3495 12331845 12173373 12096797 12007990 11759429 11560661 11345024 11176158 10981159 10812388 10684737
3485 10684737 10493451 10310525 10181858 10019315 9892292 9710932 9540063 9421538 9228352
3476 9228352 9021903 8811748 8640377 8416568 8174927 7865728 7532898 7133373 6942470 6697762
3466 6697762 6389990 6193505 5990650 5666222 5428076 5303642 5146922 5020559 4852124 4650211
3456 4650211 4443699 4330145 4204459 4088600 3934773 3954509 3859245 3732968 3603996 3431133
3446 3431133 3485166 3439899 3344764 3297616 3290118 3285849 3270669 3169587 3086107 3003819 2956786 2942672
3434 2942672 2918601 2933408 2940629 2881974 2830196 2713767 2710303 2638080 2588580 2602638 2628235 2531489
3422 2531489 2445405 2459723 2473440 2434697 2442477 2389213 2358234 2357297 2259467 2254709 2275306 2248112
3410 2248112 2260380 2222192 2206640 2223490 2165514 2152189 2178866 2125315 2122108 2177273 2117189 2105118
3398 2105118 2038486 1991184 2017228 1960080 1917716 1860249 1895211 1913936 1841494 1732056 1739167
3387 1739167 1791004 1744003 1729089 1652326 1657138 1689222 1626009 1648750 1703389 1740833 1660940 1626631
3375 1626631 1648664 1682308 1584523 1581838 1508145 1576537 1607369 1718403 1728005 1693815 1792242 1808473
3363 1808473 1854402 1870382 1846374 1922660 2028215 2015109 2070900 2114589 2196705 2325961 2426339
3352 2426339 2503990 2593964 2698888 2790617 2789092 2799462 2829017 2784073 2670424 2640663 2752241
3341 2752241 2762972 2654674 2632754 2516520 2554990 2539333 2463230 2311801 2405316 2432472 2375104
3330 2375104 2350742 2315859 2308735 2274880 2293410 2386774 2374759 2421754 2467416 2570651 2510769
3319 2510769 2554162 2686014 2696993 2695868 2694515 2574891 2553115 2547324 2510017 2451215 2320026
3308 2320026 2283586 2154294 2011084 1977578 1827626 1898116 1876778 1801386 1792596 1627967 1653922
3297 1653922 1648331 1579759 1474563 1356634 1307618 1273343 1263467 1329010 1275626 1243445 1153849
3286 1153849 1102141 1087938 1122580 1085596 1120245 1034915 975938 939574 993902 1002265 1059132 1125673
3274 1125673 1053226 1029481 1079458 1093597 1126067 1134325 1150383 1154444 1173792 1143243 1062810 1030800
3262 1030800 1026683 1133147 1050052 996663 1038778 1114900 1144955 1090029 989713 1015975 980370
3251 980370 988163 970093 822898 858740 863458 886342 853492 825732 744141 714907 747080 742648
3239 742648 797441 808880 761977 685161 779953 741919 688148 685658 720879 673374 615758 644613
3227 644613 685955 688863 714905 689496 599356 585330 575162 677636 652658 614866 590872 585609
3215 585609 569032 598834 637734 596709 557759 519093 588337 616625 588530 607535 662522 645586
3203 645586 563307 581039 644159 634222 626756 555630 496861 479030 532146 552832 527411 498527
3191 498527 509255 553488 458168 494764 500843 471968 504661 501524 550727 531716 488207 529225
3179 529225 459907 453628 422338 410485 456846 486627 422713 494870 550702 459812 478094 519156
3167 519156 485275 485750 517819 571004 527311 524561 536129 521046 504126 476141 491854 482826
3155 482826 524896 521076 505681 578101 567320 521572 520660 510447 456699 461986 499937 588300
3143 588300 666295 666215 659516 619367 635161 649969 657878 717076 783741 742957 711349 746891 728925
3130 728925 787287 827433 795411 844370 874858 927179 944501 942632 960285 1028458 1101295 1158474
3118 1158474 1191500 1254192 1272555 1370926 1427990 1477563 1560919 1734083 1764822 1798453 1940884
3107 1940884 2066108 2151963 2305387 2498625 2666659 2828995 3060544 3297757 3559820 3846265
3097 3846265 4228573 4598076 5047816 5442615 5989234 6584817 7137411 7767025 8507815 9407010
3087 9407010 10359106 11248412 12103381 12845661 13299487 13490086 13359248 12967907 12263143 11508980
3077 11508980 10697849 10017066 9402865 8768672 8254153 7755688 7282892 6878482 6409290
3068 6409290 6062316 5727616 5435994 5051974 4746074 4509412 4309614 4119378 3987412 3832984
3058 3832984 3597457 3419285 3316848 3196041 3127174 3066269 2928104 2880817 2735570 2610544
3048 2610544 2540972 2534566 2542545 2434262 2308931 2206918 2128797 2136776 2140087 2058017 1964790 1792664
3036 1792664 1778321 1758474 1682530 1602311 1532068 1612545 1553263 1493461 1527916 1498134 1448628
3025 1448628 1423855 1421583 1401680 1386769 1289706 1243197 1191869 1105780 1105333 1135746 1187849 1186261
3013 1186261 1088456 1081299 1146313 1071384 1078395 1110256 1008791 1031974 1013556 984035 1001359 929527
3001 929527 950622 970960 843874 869225 954111 904423 873068 852326 861180 883874 830916 752017
2989 752017 833081 839151 738033 797534 812268 739867 721375 667295 680420 612754 618134 656410
2977 656410 649587 679061 712568 705615 671482 646949 678262 644051 591365 605174 640163 688328
2965 688328 546734 522409 482067 524957 568785 537971 597676 497873 436115 524598 527339 539253
2953 539253 582801 546157 500268 561400 568228 489967 511361 455130 442948 418781 429502 437321
2941 437321 476167 469471 432385 481343 508662 464296 406825 372420 402111 422734 446441 411439
2929 411439 332467 378385 394074 384031 461810 466586 379070 397975 364920 369118 451663 350786
2917 350786 294443 348175 351032 336661 283684 302583 364593 392821 336595 337338 318865 323006
2905 323006 286704 227200 236246 298482 235720 181100 231855 189549 256579 346308 296459 299811
2893 299811 235624 267894 213478 211862 275899 263081 236201 225286 342208 309527 251053 203358
2881 203358 258701 229643 247605 178198 125577 152191 143537 151187 175984 219064 177808 105100
2869 105100 154245 138582 157551 117473 255432 249901 177417 205058 171956 207426 161340 246700
2857 246700 196775 277863 279177 244155 224441 96832 83326 154057 202408 239685 214292 179946
2845 179946 145354 64975 84456 103885 207491 269262 225898 232427 181921 118850 89646 133425
2833 133425 242942 206227 74933 106524 141339 102955 124602 124353 147312 206791 186646 141807
2821 141807 109897 68269 97123 106387 85192 99892 165811 199811 172669 127090 102197 152626
2809 152626 136854 204526 178445 221292 149861 67999 184373 248247 291407 234812 221258
2798 221258 216497 216057 210170 221996 193574 172053 161847 157296 167124 186819 151585 170961 200157
2785 200157 155888 102464 130793 109203 97424 137248 48720 54846 101387 60208 58101 59484
2773 59484 96726 165708 144073 129735 200536 210462 118004 152788 81431 38013 33657 63029
2761 63029 44609 91805 168428 140139 112247 77546 99727 102257 124388 61898 98802 170438
2749 170438 99478 79374 79387 93415 72558 128487 189294 173646 174392 128451 115429 81306 67945
2736 67945 84503 53522 56351 121831 103973 80223 20724 412 34985 68135 42580 -23032
2724 -23032 1085 22334 90435 77544 25181 43860 23278 10105 -9063 -14572 -36647 45028
2712 45028 42477 12063 25548 40545 56352 93421 125653 -3848 2507 -42455 -39676 34912
2700 34912 38889 41835 -5159 -24940 -61038 28026 27478 34536 37432 -91619 -71168 13554 56730
2687 56730 56844 27152 -23464 -76909 -51730 17018 99224 53126 -14910 38716 73460 85190
2675 85190 101388 100662 74532 33462 48766 90041 75159 26516 -40692 -73652 -18771 4489
2663 4489 94071 107724 47349 97251 83722 70809 11044 36616 52973 20963 -20817 -74448
2651 -74448 -6263 8232 32687 84640 70642 -11138 -5798 36508 -28757 -61657 12097 75552
2639 75552 42513 53041 57219 37180 -15267 -63000 -48571 -14228 2308 9005 1897 -9709
2627 -9709 -8114 558 -44089 1321 26016 -5299 35367 1449 240 16124 -39065 72451
2615 72451 37093 -6446 66577 49780 75307 48525 -66146 6319 16032 760 -21818 -82151
2603 -82151 -31806 -23265 -31449 -48233 -29272 -159 -24730 -67485 -32099 -52468 -83007 -117301
2591 -117301 -44693 8896 17488 -51393 -59653 -26556 -43711 -8268 -17917 -9563 11758 -5178
2579 -5178 -59380 13813 69063 10889 -49146 759 31626 17507 39482 35223 11052 75185
2567 75185 43191 -35330 38465 6814 -10537 97957 49134 -34672 -61126 -48940 -8897 -51080
2555 -51080 29826 5464 54615 16709 -3115 72537 147 -161 -9043 -75770 -56484 -138838
2543 -138838 -111741 -53412 -108272 -41713 11228 51585 38959 -38335 -15849 51335 32478 4315
2531 4315 5849 37934 27520 15961 4675 -38691 -15969 -33795 -96957 -15124 35361 61373
2519 61373 49743 -22202 -91111 -75374 -102385 -62490 -38242 -27466 16950 42287 6834 3078
2507 3078 18715 13400 46609 13241 -42408 -36367 -21385 25732 -4112 -36122 -65360 -61801 -65495
2494 -65495 -66150 10008 4171 28659 25383 42800 34903 29750 16241 -28372 -34724 44664 -630
2481 -630 12855 23856 19282 62769 40775 -68637 -54292 8659 14697 -15240 -61572 -26735
2469 -26735 -36705 -33869 77096 77242 34941 -43612 -37654 -7018 -11972 -17919 54173 104097 60685
2456 60685 -21244 -34478 -13192 -31484 -4776 -8337 -20743 -12815 -28588 -29918 -48462 -107476
2444 -107476 -128325 -88414 34222 64766 20222 -77102 -20812 -21646 -32210 -120364 -61038 -17816
2432 -17816 -14495 -40319 -54464 29116 10842 -3748 32669 -8054 -101962 -77306 -14467 -10800
2420 -10800 23661 -31604 -98532 -48124 -41687 -38977 37399 3028 -34311 60340 64294 41801
2408 41801 93558 103998 64331 -4967 -32990 -68836 -111568 -95934 -23012 -19704 -17705 27342
2396 27342 67133 78568 36040 5217 31455 6332 -47523 -74384 -59349 -33953 -27539 33159
2384 33159 59013 85075 68595 39570 87241 9749 -111932 -24724 -20605 -57791 -59517 -77346
2372 -77346 -44473 -53121 -69514 -21977 8046 33585 29093 30089 -19981 -11824 -46837 -24617 54792
2359 54792 44793 164 51236 87733 30897 -33529 -6073 -54454 -60080 -55580 -45478 16082
2347 16082 -51789 35602 -5729 -64988 -6254 -46800 -7413 14396 38331 37635 66334 49474
2335 49474 45548 99873 44231 -6322 51415 270 68104 124644 107275 77596 113615 189467
2323 189467 236627 327309 290501 257816 315696 311553 291985 343360 418722 573258 725482
2312 725482 837221 838443 906647 838306 747773 663273 530359 479733 473046 440920 342220 405762
2300 405762 323686 174090 230824 214074 198650 180101 196604 189514 181487 130711 143990 132606
2288 132606 77890 62127 29148 36942 50439 103827 147165 83331 168767 215117 105313 14363
2276 14363 5398 14694 26781 37321 -6354 25107 82511 161272 104623 49309 21733 11724
2264 11724 32172 52161 27785 10721 21221 -22221 28051 56511 40622 114679 72260 14483
2252 14483 97765 35360 45677 65515 67736 56567 -11670 -29638 -11266 -12896 -27846 -6987
2240 -6987 36093 77216 167693 130027 79797 37104 57157 46139 -51268 -98527 11787 33585
2228 33585 13064 1081 -13339 89655 67723 86207 -1732 22458 -51803 -59286 -86013 -26902
2216 -26902 -1695 35845 -25048 -45720 47866 -55488 -70936 -48633 -23194 25208 56597 33845
2204 33845 34284 -42300 -8063 -61086 8608 41862 47026 36927 102578 90104 -24653 -13516
2192 -13516 -64589 1495 -38903 -58439 -69905 29569 5298 6394 34510 39516 -46008 -158614
2180 -158614 -23525 59723 38290 5170 -26098 44399 91923 40082 67083 24310 -40371
2169 -40371 -75561 25813 81794 12522 -4096 3484 29071 43577 34304 133250 95372 60939
2157 60939 28937 6876 88051 120878 160213 32205 22692 -41375 -41635 -14617 -39435 69844
2145 69844 72509 39568 33817 58632 19888 44821 22791 -53152 -84172 3747 -7109 -73176
2133 -73176 -46515 -4331 -29402 -8339 -40038 -62401 -32985 -47868 -863 31236 23952 -20181
2121 -20181 -5795 -59064 -76455 19437 77369 496 -50499 -79725 -13596 -3993 22361 47483
2109 47483 14337 -54245 -4984 19043 -30984 -15627 -68919 -18261 64628 65810 19328 40078
2097 40078 -30539 -87569 -31530 -16286 -94764 -28160 4732 22811 91940 131463 51647 -12622
2085 -12622 -46978 -4318 3367 1582 -19865 -59798 -8036 -14091 -23688 5484 -18911 -55631 -44464
2072 -44464 -50849 -111583 -90579 8231 -44979 40216 47943 32002 -27606 22338 42081 29896
2060 29896 39178 45111 -15329 -70173 -64174 36943 90677 33674 -45919 27172 47350 -32709
2048 -32709 -9704 -27050 -55666 -91976 4066 -19774 -39450 -20763 22960 51276 61186 -47988
2036 -47988 -64806 14185 39125 104398 63387 -8178 -86574 -44689 16900 -33078 -31870 67747
2024 67747 63663 22691 39757 -5571 -4111 70774 32126 -23234 -58866 -34701 6639 30246
2012 30246 -3126 12400 52277 -8426 35079 11872 57985 16948 -61238 -81980 13171 -21911
2000 -21911 49017 30532 16311 35518 4758 38002 22760 12281 -7477 -18129 -15297 17990
1988 17990 -3742 22770 -43666 -6937 29169 65065 78901 103332 -15891 -100988 -30736 -72004
1976 -72004 -6061 42060 62068 15590 26498 -24418 -44764 -135025 -129301 -30676 1290 -10305
1964 -10305 -60615 9953 80666 49103 -38002 -76545 -26090 11676 -9312 -14559 -16986 -27175
1952 -27175 -201757 -141406 -52842 39661 15642 -16555 80840 49839 13327 17701 30386 83417
1940 83417 -19396 -31487 28545 -27214 6638 94533 92145 71918 -98 -39379 -65672 -111331
1928 -111331 -24211 -109169 -70071 -70658 -84927 -7445 -85811 -71418 -51181 -35801 -55038 -44231
1916 -44231 -53218 3055 -81421 -111289 17225 28060 -42559 -13557 -46668 37577 38508 -4151
1904 -4151 4679 -19030 -55252 -122745 35885 73951 17804 118042 30693 -83380 -83540 -31479
1892 -31479 -9308 380 52184 10312 -77819 -114034 -69926 -45792 9636 33995 54755 59101
1880 59101 54739 -29452 -8094 7471 28984 -23736 2323 74906 95580 42490 3729 14186
1868 14186 34200 67038 130555 38990 11430 -11163 -33134 -23850 -4776 12522 122553 44320
1856 44320 25228 59155 -9872 -7212 9622 65175 -28926 -50704 -2375 -16089 22334 -59354
1844 -59354 -92977 1319 501 -47277 -37402 -3826 -40909 3136 -15140 -19377 -76712 -76033 2792
1831 2792 -49137 -73292 -31180 -39979 -64788 -83914 -85150 -109768 -109054 -51815 -62822 -44397 25850
1818 25850 87318 58054 54265 99542 -14179 49080 7837 -11360 3751 72603 17187 -28249
1806 -28249 18346 -53927 -20048 29192 -6821 -103564 -80591 -48913 -9974 23417 805 37782
1794 37782 35031 -29468 21951 19137 -75738 -83617 -2188 -48444 -87568 -45475 3079 55549
1782 55549 23227 42661 -26255 -29465 -38478 -81405 -56902 23087 30249 -107877 -97223 -80208
1770 -80208 -34192 -25050 -32754 62023 42078 24340 13180 37146 27988 80104 105553 87146
1758 87146 105863 48635 36492 26250 -9641 -58093 -98829 -75434 -32852 -14597 15661 -71469
1746 -71469 -110745 -59578 -1923 -63726 -84560 -81589 -49042 -27396 -47337 -68326 -79027 -52483
1734 -52483 -71240 75462 67593 52351 34639 9543 -37095 -32697 26746 66220 99207 26530
1722 26530 10993 46947 35593 -35913 -6834 11251 -1025 -37803 -16328 6360 55153 17595
1710 17595 -100383 -93809 -92125 -81026 75359 62145 -77404 -91416 -45103 -55155 -111966 -96762
1698 -96762 -42503 -25748 -22405 13489 66991 76268 -22131 -2545 -9244 -19774 42870 7664
1686 7664 -45930 -49718 53668 12077 -130396 -165786 -76438 -36782 17670 21290 -24182 -44685
1674 -44685 -38936 -27533 -14382 27925 131319 67864 -27897 12851 -58821 -50555 -19145 32822
1662 32822 51335 -46108 -35688 -35649 -57501 -21427 -1574 499 -23333 1424 -57271 -85791 -81032
1649 -81032 -70195 -71288 -77207 -85332 -120966 -62905 -15438 13505 96042 87370 -21864 -91969
1637 -91969 -106335 -38247 12406 21665 -13881 81191 22584 -29840 36842 66284 -28618 -112744
1625 -112744 -80329 -8306 -2003 -59520 -43363 -95655 -56697 -94795 -68124 -34948 -28532 25631
1613 25631 122487 85891 -9318 -99918 -103916 -76677 -105919 -71170 -76589 -92659 -55222 -25766
1601 -25766 41715 2440 -15926 38840 8888 -58635 -65850 -91136 1253 -25635 11425 19940
1589 19940 6087 21569 -41373 -23719 -45450 -94533 -146736 -20637 77576 6057 -63966 -70970
1577 -70970 -121712 -49899 -75148 -63686 -73381 -22414 5131 12294 10921 -11430 -60028 -86341
1565 -86341 19256 33427 61598 26586 28994 36025 2605 18960 -15370 -62110 -68601 39389
1553 39389 32511 -63081 -46219 86139 53841 -9876 -9356 -27519 25267 5412 79529 43631
1541 43631 9117 -33374 -89674 -64799 -158549 -104573 -73465 27194 71835 -45420 -84411
1530 -84411 -10278 -11927 -31730 -84534 -45729 96143 79074 27484 75004 51221 43277 80825
1518 80825 73400 37367 -14368 42151 -18155 13338 -21760 -14753 36645 27700 -2618 10403
1506 10403 -37503 13632 47462 31608 60187 72438 33947 65141 50703 48058 72070 84791
1494 84791 124659 50403 44651 21366 -70030 -78430 -47238 -21388 -20286 -88407 -30106 -4603
1482 -4603 31113 34810 31580 -8156 29058 52715 61366 -7019 14055 7492 -56145 -100870 -101101
1469 -101101 -66223 -62709 -13683 12947 18626 -1857 2374 36290 -520 -73120 12603 61824
1457 61824 44456 -15733 -45994 -17670 -41974 -4036 4528 -91051 -10566 523 -49376 -67777
1445 -67777 -38887 -13898 -31261 -94518 -30484 -13366 9119 38086 -14536 28673 79628 10992
1433 10992 -61171 -91799 -87630 -67224 -69724 -24597 30907 30410 -35349 -64181 -31470 4046 34656
1420 34656 20424 -36152 -81893 -99643 -39798 28500 8502 -18808 -46823 -53946 -28456 -30001
1408 -30001 -23941 -6833 21454 28886 104940 62759 65674 70722 57123 39721 11761 -1852 -22445
1395 -22445 -40698 20678 -11296 -33981 -98865 -69775 -34718 -75067 -13574 -44127 -87503 -47610
1383 -47610 -99802 -74514 -52959 -64325 -28166 13033 42787 10521 24954 35623 460 -20213
1371 -20213 -82729 -12457 43443 23385 21449 2824 -36131 -44455 28479 45554 -7389 -41153
1359 -41153 -32126 30047 22169 -15172 44077 -2708 22063 30214 45279 25810 21280 21800 -16605
1346 -16605 -8398 -37476 -75810 -10637 20493 2177 -46941 26799 -22170 -9886 -35075 12885
1334 12885 48795 30120 23443 14157 -59241 -34206 2542 21756 26406 6875 -72232 -28503
1322 -28503 49542 16418 27519 17614 -5540 -8007 19242 9364 69412 7313 70 -13741 -64319
1309 -64319 -84065 -79495 -82243 -86373 -51774 55631 -10292 -38462 -87953 -58538 -79192 -58864
1297 -58864 -78244 -52972 12495 57467 106632 124828 59114 -31976 -57586 -159750 -86281 7561
1285 7561 45847 51827 80960 33370 36922 41892 69225 75547 84746 28572 10793 12646 11079
1272 11079 -46035 -11759 -23129 -125691 -123159 -76643 -53317 -53411 10396 -94650 -92246 -152163
1260 -152163 -155467 -98592 -55861 -20738 -27745 -55620 -118935 -91727 -97578 -64926 -4322 -44627
1248 -44627 -72190 -96129 -60550 16192 4619 -1570 90705 53137 26456 64577 88531 119449
1236 119449 97367 133821 102468 44503 -38011 -90282 -95572 -23484 -56148 1584 -19170 -77187
1224 -77187 -31766 -69473 -1565 -15302 46540 64827 26106 -12278 -85757 -19909 67406 22657
1212 22657 -48874 59746 67046 31661 41416 69050 34455 -67005 -22631 -70680 -78678 -71664
1200 -71664 -78340 -111391 -64793 -101082 -88967 -10295 -35907 62369 46228 52055 93474 47705
1188 47705 44588 -53654 -77188 -79420 -6737 -43726 -90621 -70324 -5945 -34501 7770 4007
1176 4007 28154 46867 -24987 -58690 -62948 -94022 -59536 21536 74730 50812 77927 90509
1164 90509 -60434 -37555 -41666 16321 25002 64127 24835 -15086 -12913 -51738 29914 10611
1152 10611 -10270 8987 -84852 -131392 -128205 -44353 -18220 -37530 -32831 25913 20259 46976
1140 46976 66909 -35413 -14881 76694 16139 -40181 -53631 -2065 -34744 42920 61404 28925
1128 28925 24452 69617 56679 37727 5429 -82966 -14799 53755 -54324 -67262 -52440 -645
1116 -645 -57428 -51105 26337 -9752 -35638 -15104 12044 -37512 -87245 -174857 -115967 -16997
1104 -16997 -40988 -78051 -20250 48171 88421 87469 14168 -39173 -18281 -36249 -44476 -5091
1092 -5091 -65297 -64941 -55588 -63538 -88852 -31581 -7684 34571 25325 -56219 -21476 50161 -15856
1079 -15856 -94451 -93810 -50856 -34927 -45128 -89981 -111543 -750 7281 -28906 -104193 -95595
1067 -95595 -67221 -45034 -45017 -25659 -66540 -65204 -31680 66276 52245 -51194 5472 -12581
1055 -12581 -22691 -23456 -35125 9422 36483 52816 -57870 -61441 28574 65369 -40425 -51533
1043 -51533 -102942 -80953 -15316 43089 -26945 -8351 -39297 -21518 36339 46142 70961 63319
1031 63319 -3624 -59498 -28061 -5811 -12529 1922 64771 78329 56166 69387 60333 15698
1019 15698 8808 56695 63545 18385 -21024 49688 45564 76182 54760 -58854 51993 93244
1007 93244 81817 24113 -210 5399 -44595 -26808 29482 76250 63704 12626 -79484 -9133
995 -9133 33641 -64088 -6966 84778 122640 103598 13082 -30196 -26647 -55508 11901 -31968
983 -31968 -81723 -132366 -82804 -9360 4067 -74047 -82885 -24513 -42011 -14324 -87946 -124587
971 -124587 -23824 -90034 -71168 -19533 15050 -30179 -29421 -52681 -37115 -12953 32751 26043
959 26043 -88999 -40464 81842 118395 81662 95151 94080 112837 84795 6700 35177 146
947 146 -11048 19587 1636 10529 -17222 -39197 11084 9568 -4565 9956 8348 -34217 -62805
934 -62805 17159 72190 51207 30069 116369 38532 -22690 60375 21392 15546 37276 61292
922 61292 21176 -37254 43860 -11741 -50288 -25292 -66015 -32115 -8611 -65879 -71086 -27084
910 -27084 43938 82334 23508 38774 39932 51484 -18572 20163 20025 58413 104797 84626 85718
897 85718 89237 176270 153047 46755 67961 30877 -8633 28831 20696 8033 3096 15323
885 15323 15536 58266 9827 45749 82658 53155 38296 -37826 26721 6462 -128851 -32899
873 -32899 36514 -26656 -52095 -64884 -26006 11537 2932 -45209 -90503 -7771 34467 -51518
861 -51518 36776 62944 67408 48195 43525 37891 36953 91092 -2659 2010 76916 57691 5995
848 5995 4584 -13563 -18519 2668 88929 88447 89431 7546 6962 -27397 -44878 -72363 -56754 -11125
834 -11125 15618 50221 5451 -3314 61354 -394 5428 -18683 -17553 12162 643 -29721 20308
821 20308 -34697 85803 6084 -35855 -35837 -18370 -10261 -55692 -17702 -97554 -129228 -78376 -68635
808 -68635 -65991 -1499 -19310 27090 6278 -42006 -27919 24393 34008 42696 -6865 33772 -4601
795 -4601 11002 -32142 -32312 -44883 -82281 -35548 -20534 -24116 -59351 -69673 -11266 36194 -12347
782 -12347 -21475 -13673 -71122 -10691 -4875 32131 17765 18044 54488 39598 65480 94378 66830
769 66830 8214 68715 75084 16667 74339 57489 73310 78732 44394 -4100 -55569 -84510
757 -84510 21592 34058 -3355 -69907 -42261 -32946 5262 -10470 -37623 -33867 28388 -25874
745 -25874 -44388 57433 46216 95377 -480 2566 22240 48106 23982 15449 19722 31350
733 31350 19585 16230 -58765 -32013 47299 59405 39404 -22237 -47395 -98196 -961 27259
721 27259 -50857 -33923 8987 31379 -20866 -8508 -44896 -7623 -46659 -106094 -91763 -26553
709 -26553 -1262 -46194 3697 64515 72210 64861 -7442 37566 102218 54965 6064 21924
697 21924 108828 23883 36041 3616 -2650 35516 7149 30029 -4010 -35923 50486 102514
685 102514 81883 12181 977 -15087 -74049 -42836 45585 65479 32531 -32013 37238 -24307
673 -24307 -5982 -19398 -38194 -334 32004 29178 29298 67101 48884 86690 86947 19406 -27536
660 -27536 -38974 -4220 16793 32477 -2708 -180 -14352 77780 75006 59847 53018 54268 35819
647 35819 -21356 -182 -7837 75882 57656 36335 -70123 -71061 -67757 3055 -10590 40716 16756
634 16756 43241 20992 34109 87246 135674 156473 112184 49965 32315 3523 -30108 -1219
622 -1219 30279 -54291 -38650 5674 40230 27741 -16137 -64092 -55103 -30222 56560 11586
610 11586 17696 52358 30634 63151 67804 131839 122197 65575 56582 89032 131613 99334 47338
597 47338 56212 47257 45202 111181 84193 50431 30708 -21272 -5440 23071 13417 44256 53424
584 53424 67648 109114 72396 18133 971 15713 -41512 10973 9936 -13905 -32388 20296
572 20296 -17156 47292 96991 -19450 -8421 9753 45852 111742 107907 113346 56647 22761
560 22761 -4338 -3191 5353 47088 -5696 49017 51164 14449 -12580 17773 -79651 -13270 -12812
547 -12812 -98719 -83746 -35471 35375 69799 61087 22634 71217 79510 40309 -1774 29006
535 29006 50795 20159 4998 44374 -45995 -108508 -33020 -59121 -59983 -19537 -32391 -31463 -2153
522 -2153 21571 -3865 -88442 -102921 -88926 -70623 -69823 -48818 4438 -37710 -68343 -12983 4996
509 4996 -36787 11671 19269 -8586 -11531 -49009 1771 110860 168804 66839 -50984 -22805
497 -22805 -21717 -4581 -66643 -11483 956 -16338 -30098 1176 5479 17623 29368 53659
485 53659 91375 82484 57569 28246 -56706 -56300 9780 62995 100430 -40051 32989 -58336
473 -58336 -135207 -41517 36060 52947 27258 -13836 25260 -22458 -46804 11742 -26093 -3454
461 -3454 11485 36407 101609 112837 12460 22839 20688 30744 19376 25234 -878 47146
449 47146 49796 3773 25189 39586 23759 29542 40072 66738 51918 51924 34056 104020 176163
436 176163 127526 57639 88723 70808 66679 -4309 32555 53298 39044 130074 40965 22377
424 22377 30853 4372 -49485 6050 -38546 -37220 -3358 -81886 -59094 -23286 -13052 -5610 7591
411 7591 -4748 -48809 -67906 -13281 16182 17737 10152 49196 7913 12127 47227 -41951 -61758
398 -61758 7742 18616 30692 -37936 -66340 -69513 -86142 -12298 64150 18365 2589 4497
386 4497 -60624 -10348 -6060 23803 82914 55622 26825 77989 109403 8612 10573 74215
374 74215 48272 4610 -32720 -41325 -30080 91043 26866 -37417 -147280 -98070 -93598 -61851
362 -61851 -115707 -15529 21605 -33171 34008 44633 77728 32747 7942 8648 21591 -1685
350 -1685 -6842 -14021 -2316 63973 66601 74001 89062 12924 -54672 -72819 -46348 -87705 -25335
337 -25335 1896 68694 39034 5393 -15468 -24990 46758 54026 29834 -3859 -7463 44165 37119
324 37119 -46687 -154251 -84764 -16462 4103 68778 -7475 -26738 -19621 -35162 -3430 78766
312 78766 14932 38864 83548 85017 12614 -36365 49687 42385 -2301 -75111 -40947 29512
300 29512 -12436 7767 -17572 14602 52182 38970 -16463 -123940 -95456 39566 26490 -16204
288 -16204 -22960 9452 2013 -31958 1599 791 -48652 -105898 -116264 -90682 -36034 -20245 51025
275 51025 8529 -15764 -4757 52427 -21584 -40562 3489 -18561 -42842 36116 70701 89690
263 89690 75209 72712 64845 -23988 36062 -85776 -95119 27672 27130 6603 49066 28830 4540
250 4540 26512 -24890 31972 41494 31943 26988 -26756 -10779 -13004 31560 13610 20295 19681 -2701
236 -2701 2449 -39714 -22221 39599 13724 -70892 -20817 23561 56711 13514 63341 102547
224 102547 53526 -55847 39366 62712 50678 17172 3040 -24077 -16997 21114 -40667 -38423
212 -38423 -6336 -3730 -55350 -60998 38602 19275 -44739 -18743 12739 38147 95099 129828
200 129828 94622 67073 -25287 26665 21652 101429 19370 -62941 -47091 -57335 -85013 -120902
188 -120902 -61169 -468 23246 29701 28409 -16331 -95169 -49626 -96583 -90912 -24414 71933
176 71933 -8293 -22421 14711 -77770 87773 80562 48086 69127 62087 53772 9771 -4343
164 -4343 -21753 31849 -5175 6347 -22447 14938 66976 80618 54947 27090 84623 60469
152 60469 -37664 -33255 -59986 -76208 319 -4858 26966 41786 -13039 -671 -24512 4691
140 4691 28569 1517 -18039 25476 -2981 43061 54655 -71381 9523 38140 45114 44683 -13744
127 -13744 -66832 -89782 -56538 38423 -12296 -49442 -41480 37592 75255 39489 -27840 14417
115 14417 25219 50589 31987 -46981 -55589 8117 15578 13374 8545 -17578 1358 22110 104318
102 104318 96584 68791 43129 10793 -5719 -6366 -16838 23979 80082 13017 -56158 -35703
90 -35703 -37573 -30166 18187 -32628 1662 39682 31245 42405 27414 -19515 -47524 10299 28098
77 28098 19575 39646 58558 33361 42632 11011 -18607 1843 536 70905 57816 -20903 -43244
64 -43244 25484 26135 31916 -12030 -31528 -46076 -8332 26490 2612 -23503 -81490 -29603 -41569
51 -41569 6586 60245 108400 81087 -7011 31624 11624 28270 39933 5741 -22336 -9409
39 -9409 52062 3088 -33051 -31735 -38725 -38858 -26028 59456 34271 4690 -16718 1158 30182
26 30182 9948 -13723 -27242 55991 15547 49343 30724 12081 -41515 -1251 54102 44963
14 44963 44571 4064 14125 32381 -16250 -9846 -39741 7280 43629 69407 -463 -20275 42347
1 42347 -14691
0 -14691
$$ Imaginary data points
##PAGE= N=2
##DATA TABLE= (X++(I..I)), XYDATA
16383 -260848 -226575 -276024 -252617 -210496 -227457 -295044 -240959 -222148 -249660 -256264 -282244 -257886
16371 -257886 -275165 -284846 -240121 -212013 -192353 -176981 -278764 -247415 -176222 -188478 -208871
16360 -208871 -203660 -139750 -128802 -171279 -163822 -116390 -154888 -112978 -52877 -122660 -113348 -77969
16348 -77969 -158793 -119177 -106159 -110213 -114807 -121188 -153122 -69522 -12454 -2914 -33158 -123294
16336 -123294 -78776 -69696 -37544 2723 15352 6027 13006 22684 -17306 40782 102427 128596
16324 128596 87908 25962 17949 59921 99875 95596 122076 96626 94522 65532 113207 111630
16312 111630 109567 102509 106924 101377 67478 94948 106666 106563 125200 118508 141502 171773 151860
16299 151860 183607 162158 103299 67435 135377 119579 133312 143711 149918 156377 128680 142908
16287 142908 208520 178448 160505 194728 233421 253295 229275 232093 231752 261864 270498 296725
16275 296725 253362 234747 220629 239135 258467 251291 278598 320004 379692 386854 345075 369528
16263 369528 388657 382768 315588 314104 374197 369271 352757 301742 297666 278045 371868 388149
16251 388149 283647 305363 418837 426343 351154 329705 298736 308056 423236 441347 362947
16240 362947 283679 274987 315566 450219 541665 469641 412402 361814 393674 420785 440218
16229 440218 364923 402902 435264 457111 440265 469968 408170 373256 432052 432133 403839 415657
16217 415657 477925 479929 496899 490411 459786 530805 476214 427240 448264 413245 451846 456887
16205 456887 452873 469461 514664 531519 570416 608641 448157 378362 440395 424920 458913
16194 458913 485048 496267 442102 519367 575862 542591 489474 507266 542537 540903 441091 520543
16182 520543 565619 459632 412403 421119 441049 414525 460131 469811 470598 453890 582340 661714
16170 661714 572637 510443 566904 587033 512679 514332 520221 544790 565343 563982 531660 517582
16158 517582 484519 541175 537427 502185 533790 536033 605590 623234 643338 582860 608628 670784
16146 670784 603385 648095 658384 579032 591901 616081 545074 570478 619095 559710 524673
16135 524673 509743 586634 591861 585578 567402 513296 581357 634653 584427 505383 518073 508018
16123 508018 563403 550949 614336 719330 666235 599680 533918 554791 540598 562074 575161
16112 575161 591902 639850 655213 646725 710788 672923 583896 637576 596709 618854 598921 634354
16100 634354 614810 623713 740466 636797 631343 602663 573065 612352 614532 570810 590129 711254
16088 711254 719118 659951 636152 533953 544313 602330 584747 623982 626225 637732 649607 656575
16076 656575 649215 591060 627751 691069 647877 644201 663381 660132 605960 571324 533348 474367
16064 474367 561476 462714 441822 558150 666247 714540 688057 698229 685561 708304 613563
16053 613563 611271 619811 646307 672211 681358 666717 680689 646860 631408 713207 707310 696681
16041 696681 708870 735389 655980 586747 618015 616987 592856 624396 613042 627189 577277 543911
16029 543911 593234 645315 653304 584034 599143 620742 585324 560967 551680 555902 553800 631215
16017 631215 673197 522587 569153 620781 555099 546527 580528 542994 553723 604259 683180
16006 683180 675377 705314 622459 571720 585163 568351 761151 699226 658308 653263 664795 681456
15994 681456 636747 704879 731019 704827 679041 624669 678976 724187 699372 679544 715595
15983 715595 698633 598888 607038 664724 701901 707969 658307 597170 614104 713668 663529 693564
15971 693564 658280 655569 684211 641731 694927 684223 597790 624635 694851 625536 574480 570496
15959 570496 586345 726282 726056 615483 619598 646077 656027 659955 635077 639972 738173 702751
15947 702751 663232 661199 607658 606521 600376 643422 607664 570542 568986 616673 698712 661974
15935 661974 671867 591357 618570 621611 565225 591375 627144 636151 631384 625573 619418 615181 643278
15922 643278 626162 628698 668896 689592 727923 715278 679490 679210 621653 640043 721553 680877
15910 680877 599004 588974 583170 609131 579175 594608 590066 610087 642199 625836 633107 674652
$$ [...]
##END NTUPLES=NMR SPECTRUM
##END=
