##TITLE=1H_CG-1042-F
 200.13MHz, CDCl3,
 8 sc
 
 32.8.2025
##JCAMPDX= 6.0         $$ Bruker NMR JCAMP-DX V2.0
##DATA TYPE= NMR SPECTRUM
##DATA CLASS= NTUPLES
##ORIGIN= UXNMR, Bruker Analytische Messtechnik GmbH
##OWNER= pz
$$ XWIN-NMR		Version 3.5
$$ Wed Aug 13 14:00:06 2025 Russian Standard Time (UT+4h)  she@DPX200
##.OBSERVE FREQUENCY= 200.1313
##.OBSERVE NUCLEUS= ^1H
##.ACQUISITION MODE= SIMULTANEOUS
##.ACQUISITION SCHEME= undefined
##.AVERAGES= 8
##.DIGITISER RES= 18
##SPECTROMETER/DATA SYSTEM= spect
##.PULSE SEQUENCE= zg30
##.SOLVENT NAME= CDCl3
##.SHIFT REFERENCE= (INTERNAL, CDCl3, 0, 15.5298)
##AUDIT TRAIL= $$ (NUMBER, WHEN, WHO, WHERE, WHAT)
$$ ##TITLE= Audit trail, XWIN-NMR		Version 3.5
$$ ##JCAMPDX= 5.01
$$ ##ORIGIN= Bruker BioSpin GmbH
$$ ##OWNER= she
$$ F:/spectra/data/she/nmr/H-C/1/pdata/1/auditp.txt
$$ ##AUDIT TRAIL=  $$ (NUMBER, WHEN, WHO, WHERE, WHAT)
(   1,<2025-08-13 13:58:43.95 +0400>,<she>,<DPX200>,
      <created by zg, POWCHK disabled, PULCHK disabled
       configuration hash MD5:
       00 E9 B6 7A A2 85 ED C7 34 08 36 98 17 FE 4E 26
       data hash MD5: 16K
       90 1C 12 45 4C 2E E3 3D 6A EE 72 AF D8 6D 45 11>)
(   2,<2025-08-13 13:58:46.45 +0400>,<she>,<DPX200>,
      <Start of raw data processing
       efp BC_mod = 2 LB = 0.25 FT_mod = 6 PKNL = 1 PHC0 = -1711.283 PHC1 = 6.792279 SI = 16K 
       data hash MD5: 16K
       49 0A 3E 70 76 6D F4 4D 36 AA 2D 15 2B 00 8D D8>)
(   3,<2025-08-13 13:59:10.81 +0400>,<she>,<DPX200>,
      <pk PHC0 = -8.239976 PHC1 = 6.799999 
       data hash MD5: 16K
       E9 D0 45 33 B8 41 35 A0 24 C8 2F 31 CF 73 A5 6C>)
(   4,<2025-08-13 13:59:14.43 +0400>,<she>,<DPX200>,
      <abs ABSG = 5 
       data hash MD5: 16K
       37 EB C9 FC 48 09 B1 5A 1A 51 0F 24 FF AA 6D A1>)
$$ ##END=
$$ 
$$ hash MD5
$$ 2B D5 F6 53 93 35 80 6D 97 00 43 6C E0 EE 20 E8
##$RELAX= 
##$RELAX= 
##$RELAX= 
##$RELAX= 
##$RELAX= 
##$RELAX= 
$$ Bruker specific parameters
$$ --------------------------
##$DU= <F:/spectra>
##$EXPNO= 1
##$NAME= <H-C>
##$PROCNO= 1
##$TYPE= <nmr>
##$USER= <she>
##$AMP= (0..31)
100 100 100 100 100 100 100 100 100 100 100 100 100 100 100 100 100 100 
100 100 100 100 100 100 100 100 100 100 100 100 100 100 
##$AQSEQ= 0
##$AQ_mod= 1
##$AUNM= <au_zg>
##$AUTOPOS= <>
##$BF1= 200.13
##$BF2= 200.13
##$BF3= 200.13
##$BF4= 200.13
##$BF5= 200.13
##$BF6= 200.13
##$BF7= 200.13
##$BF8= 200.13
##$BYTORDA= 1
##$CFDGTYP= 0
##$CFRGTYP= 5
##$CHEMSTR= <none>
##$CNST= (0..31)
1 1 145 1 1 1 1 1 1 1 1 1 1 1 1 1 1 1 1 1 1 1 1 1 1 1 1 1 1 1 1 1 
##$CPDPRG= <>
##$CPDPRG1= <>
##$CPDPRG2= <>
##$CPDPRG3= <>
##$CPDPRG4= <mlev>
##$CPDPRG5= <mlev>
##$CPDPRG6= <mlev>
##$CPDPRG7= <mlev>
##$CPDPRG8= <mlev>
##$CPDPRGB= <>
##$CPDPRGT= <>
##$D= (0..31)
0 0.7 0 0 0 0 0 0 0 0 0 0.03 0 0 0 0 0 0 0 0 0 0 0 0 0 0 0 0 0 0 0 0 
##$DATE= 1755079123
##$DBL= (0..7)
120 120 120 120 120 120 120 120 
##$DBP= (0..7)
150 150 150 150 150 150 150 150 
##$DBP07= 0
##$DBPNAM0= <>
##$DBPNAM1= <>
##$DBPNAM2= <>
##$DBPNAM3= <>
##$DBPNAM4= <>
$$ [...]
##$SUBNAM3= <"">
##$SUBNAM4= <"">
##$SUBNAM5= <"">
##$SUBNAM6= <"">
##$SUBNAM7= <"">
##$SUBNAM8= <"">
##$SUBNAM9= <"">
##$SW= 18.0517328524113
##$SWIBOX= (0..15)
0 0 2 0 0 0 0 0 0 0 0 0 0 0 0 0 
##$SW_h= 3612.71676300578
##$TD= 16384
##$TD0= 1
##$TE= 0
##$TE2= 300
##$TE3= 300
##$TEG= 300
##$TL= (0..7)
0 120 120 120 120 120 120 120 
##$TP= (0..7)
150 150 150 150 150 150 150 150 
##$TP07= 0
##$TPNAME0= <>
##$TPNAME1= <>
##$TPNAME2= <>
##$TPNAME3= <>
##$TPNAME4= <>
##$TPNAME5= <>
##$TPNAME6= <>
##$TPNAME7= <>
##$TPOAL= (0..7)
0.5 0.5 0.5 0.5 0.5 0.5 0.5 0.5 
##$TPOFFS= (0..7)
0 0 0 0 0 0 0 0 
##$TUNHIN= 0
##$TUNHOUT= 0
##$TUNXOUT= 0
##$USERA1= <user>
##$USERA2= <user>
##$USERA3= <user>
##$USERA4= <user>
##$USERA5= <user>
##$V9= 5
##$VALIST= <valist>
##$VCLIST= <CCCCCCCCCCCCCCC>
##$VD= 0
##$VDLIST= <DDDDDDDDDDDDDDD>
##$VPLIST= <PPPPPPPPPPPPPPP>
##$VTLIST= <TTTTTTTTTTTTTTT>
##$WBST= 1024
##$WBSW= 4
##$XGAIN= (0..3)
0 0 0 0 
##$XL= 0
##$YL= 0
##$YMAX_a= 294092
##$YMIN_a= -292360
##$ZGOPTNS= <>
##$ZL1= 120
##$ZL2= 120
##$ZL3= 120
##$ZL4= 120
##$ABSF1= 15.40974
##$ABSF2= -2.642107
##$ABSG= 5
##$ABSL= 3
##$ALPHA= 0
##$AQORDER= 0
##$ASSFAC= 0
##$ASSFACI= 0
##$ASSFACX= 0
##$ASSWID= 0
##$AUNMP= <proc_1d>
##$AZFE= 0.1
##$AZFW= 0.1
##$BCFW= 0
##$BC_mod= 2
##$BYTORDP= 0
##$COROFFS= 0
##$CY= -3
##$DATMOD= 1
##$DC= 0
##$DFILT= <>
##$DTYPP= 0
##$F1P= 0
##$F2P= 0
##$FCOR= 1
##$FTSIZE= 16384
##$FT_mod= 6
##$GAMMA= 0
##$GB= 0
##$INTBC= 1
##$INTSCL= 3.241238e-09
##$ISEN= 128
##$LB= 0.25
##$LEV0= 0
##$LPBIN= 0
##$MAXI= 10000
##$MC2= 0
##$MEAN= 0
##$ME_mod= 0
##$MI= 1.114404
##$NCOEF= 0
##$NC_proc= -6
##$NLEV= 6
##$NOISF1= 3.799351
##$NOISF2= 2.8
##$NSP= 0
##$NTH_PI= 0
##$NZP= 0
##$OFFSET= 15.52984
##$PC= 1
##$PHC0= -1719.523
##$PHC1= 13.59228
##$PH_mod= 1
##$PKNL= yes
##$PPARMOD= 0
##$PSCAL= 0
##$PSIGN= 0
##$REVERSE= no
##$SF= 200.129998372347
##$SI= 16384
##$SIGF1= 3
##$SIGF2= 2
##$SINO= 0.751879
##$SIOLD= 32768
##$SREGLST= <19F.Aceton>
##$SSB= 0
##$STSI= 16384
##$STSR= 0
##$SW_p= 3612.71676300578
##$SYMM= 0
##$S_DEV= 0
##$TDeff= 16384
##$TDoff= 0
##$TI= <>
##$TILT= no
##$TM1= 0
##$TM2= 0
##$TOPLEV= 0
##$USERP1= <user>
##$USERP2= <user>
##$USERP3= <user>
##$USERP4= <user>
##$USERP5= <user>
##$WDW= 1
##$XDIM= 16384
##$YMAX_p= 398546050
##$YMIN_p= -243414
$$ End of Bruker specific parameters
$$ ---------------------------------
##NTUPLES= NMR SPECTRUM
##VAR_NAME=  FREQUENCY,     SPECTRUM/REAL,   SPECTRUM/IMAG
##SYMBOL=    X,             R,               I
##VAR_TYPE=  INDEPENDENT,   DEPENDENT,       DEPENDENT
##VAR_FORM=  AFFN,          ASDF,            ASDF
##VAR_DIM=   16384,         16384,           16384
##UNITS=     HZ,            ARBITRARY UNITS, ARBITRARY UNITS
##FACTOR=    0.220516191357247, 1,           1
##FIRST=     3107.9869478559, 0,             0
##LAST=      -504.729815149884, 0,           0
##MIN=       -504.729815149884, -243414,     0
##MAX=       3107.9869478559, 398546050,     0
$$ Real data points
##PAGE= N=1
##DATA TABLE= (X++(R..R)), XYDATA
$$ [...]
6380a0866k506n775J5148J787J4064K690m3519j2357K3203j94M5821l230k3175
$$ -10866 -13372 -19147 -3999 -2212 11852 14542 -28977 -41334 -18131 -18325 27496 24266 1091
6367A091r815J880L436J865k873j6719J2546J0354j396k7107k704Q466l656q504
$$ 1091 -8724 -6844 -3408 -1543 -4416 -21135 -8589 1765 369 -26738 -29442 -20976 -24632 -33136
6353c3136J3728K6452k247k5429j6033L7507Q421l5900k345l668k0091M3878k497
$$ -33136 -19408 7044 4797 -20632 -36665 842 9263 -26637 -28982 -32650 -52741 -8863 -11360
6340a1360R585j3338Q054l689k8521P580j020j0630M340j5738N880K861L9284
$$ -11360 -1775 -15113 -7059 -10748 -39269 -31689 -32709 -43339 -38999 -54737 -48857 -45996 -6712
6327f712K4919l1113j1710r67K5229n523j0152L2522o158k7560Q22J9398P014
$$ -6712 18207 -12906 -24616 -25583 -354 -5877 -16029 16493 10335 -17225 -16403 2995 10009
6314A0009k7725J0967K0222P931k7230J6218j409N882j3047j0026L113l6023L697
$$ 10009 -17716 -6749 13473 21404 -5826 10392 8983 14865 1818 -8208 -5095 -41118 -37421
6301c7421L1444j379J5669l0557J5959r736M979m06j0041j5532j070L1724J0846
$$ -37421 -5977 -7356 8313 -22244 -6285 -16021 -11042 -11448 -21489 -37021 -38091 -6367 4479
6288D479Q558k7106j0108J1848R028j5362L3742k3785j5463l034j639K5296O75
$$ 4479 13037 -14069 -24177 -12329 -3301 -18663 15079 -8706 -24169 -27203 -28842 -3546 -2871
6275b871N840J1249j4672j3454j717l863M196J844k3858k017J1015J286r279J624
$$ -2871 2969 14218 -454 -13908 -15625 -19488 -15292 -13448 -37306 -39323 -28308 -27022 -36301 -34677
6261c4677j5690J8186J0654K5939K6862o932m4132j053n201K4116K9837k4951
$$ -34677 -50367 -32181 -21527 4412 31274 24342 -19790 -20843 -26044 -1928 27909 2958
6249B958L916M594M261j5724P317j2562j0854r300L0865l520j9562K62k7813M151
$$ 2958 6874 11468 15729 5 7322 -5240 -16094 -25394 5471 1951 -17611 -17349 -45162 -41011
6235d1011K5012l184N705K363K0794N47j9753k5820K8927M38o061P932j4370J5324
$$ -41011 -15999 -19183 -13478 -11115 9679 10226 -9527 -35347 -6420 -5982 -12043 -4111 -18481 -3157
6221c157J0214j4618j3655J3373Q521N829K5249q239k3837n662J4963m3846q260
$$ -3157 7057 -7561 -21216 -7843 678 6507 31756 23517 -320 -5982 8981 -34865 -43125
6208d3125n573P394O506P583J5192n026k0831k916J817J8942Q555K785M4853l9686
$$ -43125 -48698 -41304 -34798 -27215 -12023 -17049 -37880 -40796 -38979 -20037 -11482 -8697 36156 -3530
6194c530K0820N253R14j9373n898j3630J5628m424k90J170N2015j4981o651k4984
$$ -3530 17290 22543 23457 4084 -1814 -15444 184 -4240 -4530 -3360 48655 33674 27023 2039
6180B039k1280N428j1870K1343j3323M467j3170N420M2682N730j6908l151k8613
$$ 2039 -19241 -13813 -25683 -4340 -17663 -13196 -26366 -20946 21736 27466 10558 7407 -21206
6167b1206n722Q560J170J8039j4348j5899K9516r081k8837K7998L77m476K923
$$ -21206 -26928 -18368 -17198 841 -13507 -29406 110 -8971 -37808 -9810 -9433 -13909 -10986
6154a0986l4667P462P248K4982j1727k584k689K6689l166j6846j8479k3403K3079
$$ -10986 -45653 -38191 -30943 -5961 -17688 -20272 -22961 3728 562 -16284 -34763 -58166 -35087
6141c5087K2640J9507l2660j8542L0588K8107K5543m9003j802J1370J9132p534
$$ -35087 -12447 7060 -25600 -44142 -13554 14553 40096 -8907 -10709 661 19793 12259
6129A2259l5505j4449J3261L4152l4064p671J1859M4451J8042k5285m962P014
$$ 12259 -23246 -37695 -24434 9718 -24346 -32017 -20158 24293 42335 17050 12088 19102
6117A9102l2442K3584m470l2227m202p712J6006R136J3780k0213j6327J124n84
$$ 19102 -13340 10244 5774 -26453 -30655 -38367 -22361 -13225 555 -19658 -35985 -34861 -35445
6104c5445K0330J9504j304j5186j4545j0010J9295j5539J6623j1310K1249K2090
$$ -35445 -15115 4389 3085 -12101 -26646 -36656 -17361 -32900 -16277 -27587 -6338 15752
6092A5752k8173k0724K4690K6165m3126J9146J3379O688R64j7905q273j5620J1175
$$ 15752 -12421 -33145 -8455 17710 -25416 -6270 7109 13797 14761 -3144 -11417 -27037 -15862
6079a5862K7071O596k2128L538J0689o0553J5182K8715j6526J7220J9679j5727
$$ -15862 11209 17805 -4323 -785 9904 -50649 -35467 -6752 -23278 -6058 13621 -2106
6067b106N601J092Q588M970n674j9123l0173j823K2050J9063Q7J2346J3998P416
$$ -2106 3495 4587 13175 18145 12471 -6652 -36825 -38648 -16598 2465 2552 14898 28896 36312
6053C6312O381k5229j4714j3956k6725L6830R724P062j9278j0869L9676j1920
$$ 36312 42693 17464 2750 -11206 -37931 -1101 8623 15685 -3593 -14462 25214 13294
6041A3294O877k5767O535p18P145J4369k5576j9074J9565K7351J3384l8452q256
$$ 13294 20171 -5596 939 221 7366 21735 -3841 -22915 -3350 24001 37385 -1067 -9323
6028i323K3555k1747k2857J854K6518n870j4593j8367J1321K1641k17M765J913
$$ -9323 14232 -7515 -30372 -28518 -2000 -7870 -22463 -40830 -29509 -7868 -8085 -3320 -1407
6015a407j4835n306k2109J5013R683l48k420M320k0671j7148K2139K346l987K3227
$$ -1407 -16242 -21548 -43657 -28644 -18961 -19309 -21729 -17409 -38080 -55228 -33089 -30743 -34730 -11503
6001a1503N767j5484J3999r33p824L3852K6990K2326n5535l6027J3696k6974J4620
$$ -11503 -5736 -21220 -7221 -8154 -15978 17874 44864 67190 11655 -24372 -10676 -37650 -23030
5988b3030L9189j1099o249J697j6496j6460j4328J7375j818J2930J9645j5581
$$ -23030 16159 5060 -1189 508 -15988 -32448 -46776 -29401 -31219 -18289 1356 -14225
5976a4225K4470j7662j6188O946j6648O969M3313Q013l1232K2826r194k4548O372
$$ -14225 10245 -7417 -23605 -16659 -33307 -26338 16975 24988 -6244 16582 7388 -17160 -10788
5963a0788K9155P253O986n131k9412j0215r144j0689K6314j0171l678L212k2888
$$ -10788 18367 25620 32606 27475 -1937 -12152 -21296 -31985 -5671 -15842 -19520 -16308 -39196
5950c9196J4241L9933J9809m7999m826L3263k9607J1381j4712J2967k500k2817
$$ -39196 -24955 14978 34787 -13212 -18038 15225 -14382 -3001 -17713 -4746 -7246 -30063
5938c0063j0119n319J1422k239K7330m723j0193O536J60r577K2209Q318q896L711
$$ -30063 -40182 -45501 -34079 -36318 -8988 -13711 -23904 -17368 -17208 -26785 -4576 3742 -5154 -1443
5924a443m982K741K2946O81O52R815k8561k73J7710R080J3010l9510M985j8865
$$ -1443 -6425 -3684 19262 19943 20595 30410 1849 1576 19286 28366 41376 1866 6851 -12014
5910a2014R45p182l0416K7868j6243k9736J8900J9655K5755J1841O244j4684K091
$$ -12014 -11069 -18251 -48667 -20799 -37042 -66778 -47878 -28223 -2468 9373 15617 933 3024
5897C024J4594l4127J0854J7900n484J5799o447K744k0594j5332P434j2981j0313
$$ 3024 17618 -16509 -5655 12245 6761 22560 16113 18857 -1737 -17069 -9635 -22616 -32929
5884c2929K3922Q639k0927m175K6243q125K3374M9438l9385m649J2216k8653j0559
$$ -32929 -9007 -368 -21295 -25470 773 -7352 16022 65460 26075 21426 33642 4989 -5570
5871e570J2028K4142r213j4397p411j4267K1953L7909k1287O122J360J0995L2192
$$ -5570 6458 30600 21387 6990 -421 -14688 7265 45174 23887 30009 31369 42364 74556
5858G4556J931l8698P604j7847j6432L1656N046j3755k4787N471l278j5512n234
$$ 74556 76487 37789 45393 27546 11114 42770 47816 34061 9274 14745 11467 -4045 -9279
5845i279L0801o60j2003j2200j5240l3580L1859K6320o76j8371M926j7120J6366
$$ -9279 21522 20862 8859 -3341 -18581 -52161 -20302 6018 5342 -13029 -8103 -25223 -8857
5832h857K9290j2595j6824r631k3146J8480K6921J1163j1720k4249J6563M0045
$$ -8857 20433 7838 -8986 -18617 -41763 -23283 3638 14801 3081 -21168 -4605 35440
5820C5440j2946l4085O716P371N93j55q389O365k1910M024O999J752k191R248
$$ 35440 22494 -11591 -4875 2496 3089 2934 -5455 910 -21000 -16976 -9977 -8225 -10416 -1168
5806a168M008n117k3526j5302K4725K2226k1208J0004J4625q406J9157r353j4650
$$ -1168 2840 -2277 -25803 -41105 -16380 5846 -15362 -5358 9267 861 20018 10665 -3985
5793c985J7828K710q629j0059R739j1999p185M1245M484M112k1060q581J3369
$$ -3985 13843 16553 7924 -2135 7604 -4395 -11580 29665 34149 38261 17201 8620 21989
5780B1989j435L907m612j9090j1183m5922L6277N466l93P57l0809k006M4621M8460
$$ 21989 20554 24461 19849 759 -10424 -56346 -20069 -14603 -14996 -14239 -45048 -47054 -2433 46027
5766D6027j3121k8468k933J0868j775J8712k4679m6179n519M9341P288L2565r511
$$ 46027 32906 4438 1505 12373 10598 29310 4631 -41548 -47067 2274 9562 42127 32616
5753C2616k8056K1934k0636j2825M7922q692l5782J5997k1032q441q622J3652
$$ 32616 4560 26494 5858 -6967 40955 32263 -3519 12478 -8554 -16995 -25617 -11965
5741a1965j9009J8425M488K5772k7989J3142j5356j5200r867K8154J2994K1831
$$ -11965 -30974 -12549 -8061 17711 -10278 2864 -12492 -27692 -37559 -9405 3589 25420
5729B5420R14k714K3908m2403n874L143P140Q701l11J9867k8280J8585p268o965
$$ 25420 26334 23620 47528 5125 -749 2394 9534 18235 17924 37791 9511 28096 20828 13863
5715A3863J9548q115k7881L3847J0542j5386j831j9031o29J7376L3584J0249J0994
$$ 13863 33411 25296 -2585 31262 41804 26418 24587 5556 4927 22303 55887 66136 77130
5702G7130o0747p319j658N623j8117J7474n109K311l271L8109j3407R965J6477
$$ 77130 16383 9064 7406 13029 -5088 12386 7277 9588 6317 44426 31019 40984 57461
5689E7461l0866k1808J5553J4287J9305j464J0717k9897j5218j586J1319J3579
$$ 57461 26595 4787 20340 34627 53932 52468 63185 33288 18070 16484 27803 41382
5677D1382K8451j9422l5564J8941J0369J8885m3375K272J2727l6377L991M8381
$$ 41382 69833 50411 14847 33788 44157 63042 19667 21939 34666 -1711 2280 50661
5665E0661j648j2726r295L0893J3514n162l609J3370J367J445m0646j0581j5996
$$ 50661 49013 36287 26992 57885 71399 66237 62628 75998 77365 78810 38164 27583 11587
5652A1587O172j3466j90J8322N682J5393j3408J7192L9544J6183m1627r182M0047
$$ 11587 17759 4293 4103 22425 28107 43500 30092 47284 86828 103011 61384 52202 92249
5639I2249j0617r759K2385J0761J4103p354P054R957j6560O750L8061P623J1307
$$ 92249 81632 71873 94258 105019 119122 111768 118822 128779 112219 118969 157030 164653 175960
5626A75960m2147P284l4873k6963J9743j0451J4216O104k6396K1968k0073k0409
$$ 175960 133813 141097 106224 79261 99004 88553 102769 108873 82477 104445 84372 63963
5614F3963q033o54K0194j5697R943R95J3483J0279L728J3319J366L0451r57O497
$$ 63963 55930 55276 75470 59773 69716 70711 84194 94473 98201 111520 112886 143337 142380 148877
5600A48877j9327J3082m451K7936K3027m2630q651j7670M08k7564k1615J4627
$$ 148877 129550 142632 138181 166117 189144 146514 137863 120193 120601 93037 71422 86049
5588H6049N006k4275L0560p577J3464Q558k9599j8806q799r722K814P995J6415
$$ 86049 91055 66780 97340 89763 103227 111785 82186 63380 54581 44859 47673 55668 72083
5575G2083m846J3812K2050j6188j8941j9681j5018K0603L8521L217n961K163L1513
$$ 72083 67237 81049 103099 86911 67970 48289 33271 53874 92395 95612 89651 91814 123327
5562A23327K598k3841k6838K0123J9879k2198Q479j5815k6913p459J103N28j9173
$$ 123327 125925 102084 75246 95369 115248 93050 101529 85714 58801 51342 52445 52973 33800
5549C3800m548K9367R674L5446j6279R850j1260l5352m599J5260K696l0105j5760
$$ 33800 29252 58619 68293 103739 87460 97310 86050 50698 46099 61359 64055 33950 18190
5536A8190K9691J8609l768k8419j410J079P389K6658k850J4594r926k0291L3642
$$ 18190 47881 66490 62722 34303 32893 33972 41361 68019 65169 79763 69837 49546 83188
5523H3188r237q016k3748q594J0890J1891j4675k862l545L1886L7808l1029l2248
$$ 83188 73951 65935 42187 33593 44483 56374 41699 38837 35292 67178 104986 73957 41709
5510D1709J7398q008M5718j8326n4713J2632N19q299J4068L248P357K6071k3967
$$ 41709 59107 51099 96817 78491 23778 36410 36929 28630 42698 45946 53303 79374 55407
5497E5407p211j3451R512k632r248q623m787o681J3147q343K5979o690J92n552
$$ 55407 48196 34745 44257 41625 32377 23754 18967 12286 25433 17090 43069 36379 36571 31019
5483C1019P812l1267L4894K4608j5990l751j0106o784L6126K756j0139l2764L0263
$$ 31019 38831 7564 42458 67066 51076 47325 37219 30435 66561 69317 59178 26414 56677
5470E6677L7600K1273l6510j4732J4874p673l9259M0476p123j8786K1212J0148
$$ 56677 94277 115550 79040 64308 79182 71509 32250 72726 65603 46817 68029 78177
5458G8177L6024J606J0129j6208k9718N539k0670p291j651k2767O790L5685L0663
$$ 78177 114201 115807 125936 109728 80010 85549 64879 57588 55937 33170 39960 75645 106308
5445A06308l3531l8106K6763L0346j5322r840J3428L1312j4043l5687j6177M6825
$$ 106308 72777 34671 61434 91780 76458 66618 80046 111358 97315 61628 45451 92276
5433I2276J2574l440r987J8710L1141k1177l6715o05K4571J7373n273k380k4363
$$ 92276 104850 101410 91423 110133 141274 120097 83382 82777 107348 124721 119448 117068 92705
5420I2705M642J6746J2763j6746K7679J0689j4410k4527N668L9137l785j185J244
$$ 92705 97347 114093 126856 110110 137789 148478 134068 109541 115209 154346 150561 149376 150620
5407A50620K6362L2185j908J859k3884K4191J6970j842n290L8980j694j7914q438
$$ 150620 176982 209167 207259 209118 185234 209425 226395 224553 219263 258243 256549 238635 230197
5394B30197J0201Q69p446M5921L3534m98o31K7078M0590j8086J8198N040L4649
$$ 230197 240398 241267 233821 279742 313276 312778 312147 339225 379815 361729 379927 384967 419616
5381D19616N8127J138J8931R9459L4127N0491R0810O4599J15937Q8053P3886N7318
$$ 419616 477743 478881 497812 597271 631398 681889 772699 837298 953235 1041288 1115174 1172492
5369A172492J9154m5089j01055q5139o4797J4484M8093j2395q182M6748L4651
$$ 1172492 1191646 1146557 1045502 960363 895566 910050 958143 945748 937566 984314 1018965
5358A018965L4183L1017l9966n5761j31194j08581r2085k2287k8066l1302L939
$$ 1018965 1053148 1084165 1044199 988438 857244 748663 656578 634291 606225 574923 578862
5347E78862J4024l6111k6108j4638P474j5671o7651j5726k223j0938J1982M1144
$$ 578862 592886 556775 530667 516029 523503 507832 440181 424455 422232 411294 423276 464420
5335D64420k7699o89q43J2192L5596J1491K1481O152N3106M4430M2655N8906Q3490
$$ 464420 436721 436032 435189 447381 482977 494468 515949 522101 575207 619637 662292 721198 804688
5322H04688O2957M5059P9568P7383Q3776K4621o3799j23523j14904r2992j18551
$$ 804688 867645 912704 992272 1069655 1153431 1178052 1114253 990730 875826 782834 664283
5311F64283m6631l3749k9869l3579l8640l9675j9581l0477o2207k3414Q0J103
$$ 664283 617652 583903 554034 520455 481815 442140 422559 392082 329875 306461 306541 307644
5299C07644q648o0071j5849l8442k7401J7266p315o645K1662j4680n922K255R657
$$ 307644 298996 238925 223076 184634 157233 174499 167184 160539 182201 167521 161599 163854 173511
5286A73511l9555k0339P890j8277n890J239j1395k1303q03J4627P191L1819O004
$$ 173511 133956 113617 121507 103230 97340 98579 87184 65881 65078 79705 86896 118715 124719
5273A24719n046l2723m3216P067J4404J1680J2754K908J982J2515J3060j3768
$$ 124719 119673 86950 43734 50801 65205 76885 89639 92547 94529 107044 120104 106336
5261A06336k3884k4116j828K4422m6172J7585K5906R65J8033J5632j6778n594
$$ 106336 82452 58336 56508 80930 34758 52343 78249 79214 97247 112879 96101 90507
5249I0507J5675l189j4886p66j6139o340j1480J5899J3511m1197j0628J508j5920
$$ 90507 106182 102993 88107 87341 71202 64862 53382 69281 82792 41595 30967 32475 16555
5236A6555K0468j2304j144M754J0631J665j0737J7487K8633p521k5711k3101L4097
$$ 16555 37023 24719 23575 28329 38960 40625 29888 47375 76008 68487 42776 19675 53772
5223E3772J0268j6400n251J3152k3266K8094m551j0614K3561L32O539j7201Q163
$$ 53772 64040 47640 42389 55541 32275 60369 55818 45204 68765 69097 75636 58435 66598
5210F6598K5342j9153j3446j5173J1000j8114O069J4505K7865j1801j9623J8499
$$ 66598 91940 72787 59341 44168 55168 37054 43123 57628 85493 73692 54069 72568
5198G2568p581M5372l2387k0127j567L166K3640m941m491o916K5870K0756r633
$$ 72568 64987 110359 77972 57845 56278 59444 83084 78143 73652 66736 92606 113362 103729
5185A03729k1721J410L4025J329n5319k6766p779K3444L2001j7206J3919j6572
$$ 103729 82008 83418 117443 118772 63453 36687 28908 52352 84353 67147 81066 64494
5173F4494N171k0941n197M7012K3651o185j1270o968j5611j494J6640j1931o788
$$ 64494 69665 48724 43527 90539 114190 108005 96735 89767 74156 72662 89302 77371 70583
5160G0583J3700n819J1065l867K7329K0720J7680K6172p971M461o0509L2810K1552
$$ 70583 84283 78464 89529 85662 112991 133711 151391 177563 169592 174053 113544 146354 167906
5147A67906k0829j097K4323M2211J5958k4436P068k3382R581K7038k0421K7482
$$ 167906 147077 145980 170303 212514 228472 204036 211104 187722 197303 224341 203920 231402
5135B31402J914J8521R856l302r705R321L8254L3354M3628J5680L1795J1218L0408
$$ 231402 233316 251837 261693 258391 248686 258007 296261 329615 373243 388923 420718 431936 462344
5122D62344J9026L9579M9062N5593l832L0763k6176o8881l3967J415j2291J1659
$$ 462344 481370 520949 570011 625604 621772 652535 626359 557478 523511 524926 512635 524294
5110E24294n085l3360k94J2807L6685K0260N6408n513J6573N1802M9283K5965
$$ 524294 519209 485849 485555 498362 535047 555307 611715 606202 622775 674577 723860 749825
5098G49825P0086N2792N3080L8066N7756O8392J0524l1088m5688p1517j5419k7334
$$ 749825 819911 872703 925783 963849 1021605 1089997 1100521 1069433 1023745 952228 936809 909475
5086I09475n849L7888J730J6307k2929k8867l2671m2098m0333j8733j092k2618
$$ 909475 903626 941514 943244 959551 936622 907755 875084 832986 792653 773920 772828 750210
5074G50210q358k2169J6295J3312M3100M4836K6688O4542N9524L9268P7258P6158
$$ 750210 741852 719683 735978 749290 792390 837226 863914 928456 987980 1027248 1104506 1180664
5062A180664M5039k043m4649p4066q2759l2018o51K9915K7522R073N6118K6966
$$ 1180664 1225703 1223660 1179011 1104945 1022186 990168 989517 1019432 1046954 1056027 1112145 1139111
5050A139111n0399o3721j53826j39308l3550n9889o0710k1840m0791m1234k0836
$$ 1139111 1088712 1024991 871165 731857 698307 638418 577708 555868 515077 473843 453007
5039D53007m1274k1884j454l9388j1718k1842l275l2170o1301K2323r380l6476
$$ 453007 411733 389849 388395 349007 337289 315447 312172 280002 218701 241024 231644 195168
5027A95168K8455j5158p487k3072j0997J3665J3255j7773l607k665o365J0898
$$ 195168 223623 208465 200978 177906 166909 180574 193829 176056 172449 169784 163419 174317
5015A74317j9111M123j2329m55j9710k5351j1370M153R428J4630q427j4037q691
$$ 174317 155206 159329 147000 146545 126835 101484 90114 94267 103695 118325 109898 95861 87170
5002H7170l4055K7700J7504p146J183j43j700k0077J4735j3788r391O537o879
$$ 87170 53115 80815 98319 91173 92356 92213 90513 70436 85171 71383 61992 68529 61650
4989F1650L638J213O945j7255J8404l0609l2294N4986n814N081j4356j4975N794
$$ 61650 65288 66501 73446 56191 74595 43986 11692 66678 60864 65945 51589 36614 42408
4976D2408K0470n337q571M998J2040j972p04j3367r655p081J518m793L49l933
$$ 42408 62878 57541 48970 53968 66008 64036 63332 49965 40310 33229 34747 29954 30303 26370
4962B6370K3803N463j1781K600K6461l884j2115J497r561l979J0018N5613k3588
$$ 26370 50173 55636 43855 46455 72916 69032 56917 58414 48853 44874 54892 110505 86917
4949H6917k2517J4502o021j147J7157j5332j765K6777M383m2253j7736Q755K9918
$$ 86917 64400 78902 72881 71734 88891 73559 71794 98571 102954 60701 42965 51720 81638
4936H1638J876r99k4041j0845M7540j6358j1103R103R357K8477k2090m0364K2743
$$ 81638 83514 82515 58474 47629 95169 78811 67708 76811 86168 114645 92555 52191 74934
4923G4934L9922j3042k9054m009K4970l473K725J1565O788K0319J499j6588M489
$$ 74934 114856 101814 72760 68751 93721 90248 92973 104538 111326 131645 133144 116556 121045
4910A21045k498K322o04o87L0934j6470l4622J7547J5431k551r30K1700J6655
$$ 121045 118547 120869 120265 119578 150512 134042 99420 116967 132398 129847 128917 150617 167272
4897A67272j6790l3116k9270J0178L7945J5489k8278P984J9678j108J2534k7099
$$ 167272 150482 117366 88096 98274 136219 151708 123430 131414 151092 149984 162518 135419
4885A35419j7550q417L2111J1354J6145Q977N25l8911J7890J6220l2546K202j1162
$$ 135419 117869 109452 141563 152917 169062 178039 178564 139653 157543 173763 141217 143419 132257
4872A32257L623k8017j8260J3554j9226L8196O121j3696m424m162p789j6220j6097
$$ 132257 135880 107863 89603 103157 83931 122127 128248 114552 110128 105966 98177 81957 65860
4859F5860N79K2489L6389j2218m3212k0329L9152O620j0868m404J51J1200k790
$$ 65860 66439 88928 125317 113099 69887 49558 88710 95330 84462 80058 80209 91409 88619
4846H8619J6277k4191j0146Q441m911K445K720j7028j389O99j4197j745L5870
$$ 88619 104896 80705 70559 79000 74089 76534 79254 62226 60837 61536 47339 45594 81464
4833H1464j0271J5900r544k3066j5210m754j9380N005k858K4472K6839l710k3233
$$ 81464 71193 87093 77549 54483 39273 34519 15139 20144 17286 41758 68597 64887 41654
4820D1654O949J2257L816j2957j0085J5657k6916j3179K8133k2403k3327L5184
$$ 41654 48603 60860 64676 51719 41634 57291 30375 17196 45329 22926 -401 34783
4808C4783J2893M466o24j6390K4565J7824j7505K9720R578k6935j874k8649K5905
$$ 34783 47676 52142 51518 35128 59693 77517 60012 89732 99310 72375 70501 41852 67757
4795F7757M195K3744j6395p954n952j7512k1161K3879q364K8064J3960j3626l0891
$$ 67757 71952 95696 79301 71347 65395 47883 26722 50601 42237 70301 84261 70635 39744
4782C9744l063J5319j0424J8939J0724j3503K2490O6416l4571m1398o956J2606
$$ 39744 36681 52000 41576 60515 71239 57736 80226 146642 112071 70673 63717 76323
4770G6323M1649Q275j6767j8785J5290J7567j2610J1407j4238J5142j6360L349
$$ 76323 117972 126247 109480 90695 105985 123552 110942 122349 108111 123253 106893 110242
4758A10242o876J0340L4157L5977j779j4273K6830l899j954J9798J5105N033j7660
$$ 110242 103366 113706 147863 183840 182061 167788 194618 190719 188765 208563 223668 228701 211041
4745B11041j6262p828J8479J7351j635J5847K8763n127k2924J1489M8868k4665
$$ 211041 194779 186951 205430 222781 221146 236993 265756 260629 237705 249194 298062 273397
4733B73397J9453r02M039M998K8348K2179K9655r383j9805L0919J4060k4602l4138
$$ 273397 292850 291948 295987 300985 329333 351512 381167 371784 351979 382898 396958 372356 338218
4720C38218j1350j226j0610K9903k5686n769j3663o923J7193J9459j1761K715
$$ 338218 326868 325642 315032 344935 319249 313480 299817 292894 310087 329546 317785 320500
4708C20500J1162j8627L3580Q923l970P936M321J3823l0620j6690M129M739K024
$$ 320500 331662 313035 346615 355538 351568 359504 363825 377648 347028 330338 334467 339206 341230
4695C41230l923k8630J7685K7087l1904l1549k7853k976k63M645n396L4108l2772
$$ 341230 337307 308677 326362 353449 321545 289996 262143 259167 258904 263549 258153 292261 259489
4682B59489j9287M394L407r117p075j7937J800Q634n084j8237J2540j748j6637
$$ 259489 240202 244596 248003 238886 231811 213874 215674 224308 219224 200987 213527 211779 195142
4669A95142l1902J1725R946k6039k3597P340P152J6095n513k1498P765K384j7521
$$ 195142 163240 174965 184911 158872 135275 142615 149767 165862 160349 138851 146616 149000 131479
4656A31479r534P981k001q672L3456j5118l6661j3152K1939L5548j4203j5390
$$ 131479 121945 129926 127925 119253 152709 137591 100930 87778 109717 145265 131062 115672
4644A15672j4818k0155m994L0418l2366J5814J3584l7456P987P641p915j6400
$$ 115672 100854 80699 75705 106123 73757 89571 103155 65699 73686 81327 73412 57012
4632E7012N162Q856K900k7421K2052K4358j696r211l2445J1536L6159J0680M869
$$ 57012 62174 71030 73930 46509 68561 92919 91223 82012 49567 61103 97262 107942 112811
4619A12811j6715m585J2719K740j8443j668j5019L255k1330K1922J7880p341P77
$$ 112811 96096 91511 104230 106970 88527 86859 71840 75095 53765 75687 93567 86226 87003
4606H7003q854k139l281n138J2358p107J3168O9652R878J9081j4291n426o523
$$ 87003 78149 76010 72729 67591 79949 72842 86010 155662 165540 184621 170330 164904 158381
4593A58381n61j1324J8534K1626m1626N067L9139k1513k1460O511J1460R823m11
$$ 158381 157820 146496 165030 186656 145030 150097 189236 167723 146263 152774 164234 174057 173646
4580A73646L810o269J3560K2429k553K3431p791p856l897K1492k6383J8019M7120
$$ 173646 177456 171187 184747 207176 204623 228054 220263 212407 208510 230002 203619 221638 268758
4567B68758L0818j6104J6245q415J2063K3833m35L1116M868l780L8061N1320N1273
$$ 268758 299576 283472 299717 291302 303365 327198 326763 357879 362747 358967 397028 448348 499621
4554D99621j243K7765K5657l2948J2589j1476J2804J5127K5069K2070j2971K0400
$$ 499621 498378 526143 551800 518852 531441 519965 532769 547896 572965 595035 582064 602464
4542F02464K0864J7638J7370J7728N4754M019J5683J7488O5453K1700M7639p790
$$ 602464 623328 640966 658336 676064 730818 734837 750520 768008 833461 855161 902800 895010
4530H95010L344K3153j681L7319L2893Q645l3541O614L123M042n560K2626K3191
$$ 895010 898354 921507 919826 957145 990038 998683 965142 971756 974879 978921 973361 995987 1019178
4517A019178K3162N84j4100K7720K4189J9687l0076K3706j1486l2309k38k1410
$$ 1019178 1042340 1042924 1028824 1056544 1080733 1100420 1070344 1094050 1082564 1050255 1050017 1028607
4505A028607k7436Q250j2213j3428k1549l9842k0m5444M336P32k9571k1835Q336
$$ 1028607 1001171 1009421 997208 983780 962231 922389 922369 876925 881261 881993 852422 830587 838923
4492H38923k2620k3415k8790k0618n489j2197K4774n240k6369l7805l5458Q91
$$ 838923 816303 792888 764098 743480 737991 725794 750568 745328 718959 681154 645696 646587
4480F46587K054k9438L908j2650o6413n8674K3868k1915j0169j6136m1741J7843
$$ 646587 648641 619203 623111 610461 544048 485374 509242 487327 477158 461022 419281 437124
4468D37124l0171k2292j0033J3915J3124m0935J330M833k2304R852j0677j2395
$$ 437124 406953 384661 374628 388543 401667 360732 362062 366895 344591 354443 343766 331371
4456C31371k6407k460J4427k330j6757J7919j9423J0459J1928j3174j6932m0444
$$ 331371 304964 302504 316931 314601 297844 315763 296340 306799 318727 305553 288621 248177
4444B48177M700J6980L802O194J2620k5697J7252q300j2438j2442k4387J8541
$$ 248177 252877 269857 273659 279853 292473 266776 284028 275728 263290 250848 226461 245002
4432B45002J3973n769J0226J1329J744m10O429j1812j1622o333j8473J0732K4611
$$ 245002 258975 253206 263432 274761 276505 276095 282524 270712 259090 252757 234284 245016 269627
4419B69627J567k7707J3394J7814j610p109q510j2990J6180j1222L4155J7964
$$ 269627 271194 243487 256881 274695 273085 265976 257466 244476 260656 249434 283589 301553
4407C01553k5814J0001l0009l0589K4142M9478q513q38J775m9591J5045J4064
$$ 301553 275739 285740 255731 225142 249284 298762 290249 289411 291186 241595 256640 270704
4395B70704K470M1114K3571m2638k4367J2511q224O984l357L5326J2434o1128
$$ 270704 273174 314288 337859 295221 270854 283365 275141 282125 278768 314094 326528 265400
4383B65400j8885L9086K966j1082K1139J6200k148N292K5989q114k8535j1167
$$ 265400 246515 285601 288567 277485 298624 314824 312676 317968 343957 335843 307308 296141
4371B96141m618m975J8908J3859K7569k0379o502M6345j0377j1659P75l929J7253
$$ 296141 291523 286548 305456 319315 346884 326505 320003 366348 355971 344312 345087 341158 358411
4358C58411K6222k1049Q013Q056P386L0618m902P391m091K6099M927k8176J3260
$$ 358411 384633 363584 371597 379653 387039 417657 412755 420146 416055 442154 447081 418905 432165
4345D32165K3168j33r756j7277L4077L3327m6871M547k053J3318M91K2578j6659
$$ 432165 455333 455200 445444 428167 462244 495571 448700 453247 451194 464512 465003 487581 470922
4332D70922l5998J2723J2242j5813L3793l3546K3441K7749J4716N883j7679n522
$$ 470922 434924 447647 459889 444076 477869 444323 467764 495513 510229 516112 498433 492911
4320D92911K752L7856J611K6524P479q266J1909J1381o69M8743j2208J709K7471
$$ 492911 495663 533519 535130 561654 569133 560867 572776 584157 583488 632231 620023 621732 649203
4307F49203M7p494O933J3192J9720L2498j1652r115K4913L7908n7j4189M8075
$$ 649203 649250 641756 648689 661881 681601 714099 702447 693332 718245 756153 756096 741907 789982
4294G89982L8898L7579M4006p549K8839K9089J6731J2685K8186J2203M8349P0936
$$ 789982 828880 866459 910465 902916 931755 960844 977575 990260 1018446 1030649 1078998 1149934
4282A149934J2765o556M3756N0420K6817M1479M2522R1082M2712P9515O3053J11253
$$ 1149934 1162699 1156143 1199899 1250319 1277136 1318615 1361137 1452219 1494931 1574446 1637499 1748752
4270A748752O5630Q3777J00001Q1604J04954R0551J24571J34592J58979J56434
$$ 1748752 1814382 1898159 1998160 2079764 2184718 2275269 2399840 2534432 2693411 2849845
4260B849845J78483K01360J82535K01792K48109K60316K65180K51841K45362K94569
$$ 2849845 3028328 3229688 3412223 3614015 3862124 4122440 4387620 4639461 4884823 5179392
4250E179392L25468L26073L83003M44105M87874N07844N02607N79479N93631N66500
$$ 5179392 5504860 5830933 6213936 6658041 7145915 7653759 8156366 8735845 9329476 9895976
4240I895976N93524N73647N19030M93443M43334N14890O25373O62909P52662Q33495
$$ 9895976 10489500 11063147 11582177 12075620 12518954 13033844 13659217 14322126 15074788 15908283
4230A5908283Q69586R21843R38613R00666Q51525P18072N28927L90471K55768
$$ 15908283 16777869 17699712 18638325 19538991 20390516 21108588 21637515 22027986 22283754
4221B2283754J84610K50696L32749M66033O06268P07259P78031P46419O87063
$$ 22283754 22468364 22719060 23051809 23517842 24124110 24831369 25609400 26355819 27042882
4212B7042882O49603M31586J50535r2359l84263n76963o12891m91749l74020k70988
$$ 27042882 27692485 28124071 28274606 28182247 27797984 27221021 26608130 26116381 25742361 25471373
4202B5471373j24478K8619R8791R7943O454j34333k74403n77700p86591j000910
$$ 25471373 25346895 25375514 25474305 25572248 25578702 25444369 25169966 24592266 23805675 22804765
4192B2804765j059493j058939r17006p87912o84826n36506m87691m02988m10452
$$ 22804765 21745272 20686333 19769327 18981415 18296589 17760083 17272392 16869404 16458952
4183A6458952m58497n04786n71318o72384p58002q00756p84448p45786o43609
$$ 16458952 16000455 15495669 14924351 14251967 13493965 12693209 11908761 11162975 10519366
4174A0519366n70535n09803m20925m13682l90327l99987l64835l51747l33424
$$ 10519366 9948831 9439028 9018103 8604421 8214094 7814107 7449272 7097525 6764101
4165F764101l38222l71762l32223k83831k76644k81258k21049j93265j54129j99292
$$ 6764101 6425879 6054117 5721894 5438063 5161419 4880161 4659112 4465847 4311718 4112426
4155D112426j51105j27317j66245j25615j27144r8157r7614j01762j07038r0372
$$ 4112426 3961321 3834004 3667759 3542144 3415000 3316843 3219229 3117467 3010429 2920057
4145B920057q2966o0481o7656r4935j18042o3800l4519m6161r6494r8316q3177
$$ 2920057 2837091 2776610 2708954 2614019 2495977 2432177 2397658 2351497 2255003 2156687 2073510
4134B073510m9880k8184o8972l8026k1780m7749o1921m6944m2890l2934k7437
$$ 2073510 2023630 1995446 1926474 1888448 1866668 1818919 1756998 1710054 1667164 1634230 1606793
4123A606793m3764k9287m596o0193l2215l9856n334j6228J6850m4427l9515j8701
$$ 1606793 1563029 1533742 1529146 1468953 1436738 1396882 1391548 1375320 1392170 1347743 1308228 1289527
4111A289527o676K7746k2347r497J4162P671j8851j9782j0803k5983j4774r317
$$ 1289527 1282851 1310597 1288250 1278753 1292915 1300586 1281735 1261953 1251150 1225167 1210393 1201076
4099A201076m5191k459l2522j1538k3015l2971J903l904k9335k0654k1593l8724
$$ 1201076 1155885 1153426 1120904 1109366 1086351 1053380 1055283 1051379 1022044 1001390 979797 941073
4087I41073N565q303j3172m8940k1799k3269j0645K613k1743P166l399K639k8943
$$ 941073 946638 938335 925163 876223 854424 831155 820510 823123 801380 808546 805147 807786 778843
4074G78843K857k1305j5031o863l8891j756l310L3563n933n8727O960K1094j2939
$$ 778843 781700 760395 745364 738501 699610 697854 694544 728107 722174 663447 670407 691501 678562
4061F78562k547j0831j8357k5277K1135j1591j6728l2379J243J7296J3011L3585
$$ 678562 676015 665184 646827 621550 642685 631094 614366 581987 583230 600526 613537 647122
4049F47122m6491k3974o317J8366l931k2566k1270O006j2269K8899j5376j9104
$$ 647122 600631 576657 570340 588706 584775 562209 540939 546945 534676 563575 548199 529095
4037E29095L1782l706J6684Q625o3454k6105L0377J2192p468n4794l680L7397
$$ 529095 560877 557171 573855 582480 519026 492921 523298 535490 528022 473228 469548 506945
4025E06945J775n456Q849J4459J2138l2879l5113O033r95N923q773k4398M466
$$ 506945 508720 503264 512113 526572 538710 505831 470718 476751 475756 481679 472906 448508 452974
4012D52974K6090L048J1667k6376k166r317r075J6867p11j316J894j6957j3892
$$ 452974 479064 482112 493779 467403 465237 455920 446845 463712 463001 461685 463579 446622 432730
3999D32730O330q531J1895J2471j4937k0826J2457o584K1389m552l205j4709M0778
$$ 432730 439060 430529 442424 454895 439958 419132 431589 425005 446394 441842 438637 423928 464706
3986D64706O629m8404J3232o445O588J6516k2491q894J343L3042j5611q066L784
$$ 464706 471335 422931 436163 429718 436306 452822 430331 421437 422780 455822 440211 432145 435929
3973D35929J9122j135K2295R93j9290l1867r069M0295M735j1616j1251M9781l9090
$$ 435929 455051 453916 476211 477204 457914 426047 416978 457273 462008 450392 439141 488922 449832
3960D49832l2173K7061K9775j1315J8426K0311j012j8684j0758j0837M4954N738
$$ 449832 417659 444720 474495 463180 481606 501917 500905 482221 471463 460626 505580 511318
3948E11318n204K1454j9531k8085J762L6672p297Q904K4768j304J3972k1586j5068
$$ 511318 506114 527568 508037 479952 481714 518386 511089 519993 544761 543457 557429 535843 520775
3935E20775j3310J5539K8105r426Q393J6640K3185m467O41p832P173J2652J4683
$$ 520775 507465 523004 551109 541683 550076 566716 589901 585434 586075 578243 585416 598068 612751
3922F12751L0018O7465j7756k2408r434k7028J094J7371J5286K0395J8184n998
$$ 612751 642769 710234 692478 670070 660636 633608 634702 652073 667359 687754 705938 699940
3910F99940q512K5415J4213k2835K590J1551O83l8179j021J6381Q731k518K9631
$$ 699940 691428 716843 731056 708221 710811 722362 723045 684866 683845 700226 708957 706439 736070
3897G36070P772r336J3236K2779J3478k0641k346L2535k0556o555K2819q727j7273
$$ 736070 743842 734506 747742 770521 783999 763358 761012 793547 772991 766436 789255 780528 763255
3884G63255k1073K3589K0452j4379j4702N6010J7450J0960L8908J5184k0790J6170
$$ 763255 742182 765771 786223 771844 757142 813152 830602 841562 880470 895654 874864 891034
3872H91034L4723P145K4362O3733P410J6064p478N715K8469j2084J8664k3594
$$ 891034 925757 932902 957264 1020997 1028407 1044471 1036993 1042708 1071177 1059093 1077757 1054163
3860A054163j5767L2175M2963j5195l8306K4994p626R600J1754j4588j505j9108
$$ 1054163 1038396 1070571 1113534 1098339 1060033 1085027 1077401 1087001 1098755 1084167 1082662 1063554
3848A063554l2359K384J2882j7976K1767j0277j8031r385j879r666J369J7147
$$ 1063554 1031195 1033579 1046461 1028485 1050252 1039975 1021944 1012559 1010680 1001014 1002383 1019530
3836A019530J7684k0185K8533L9441J228j6744k0085r669l483J3719K9690j6253
$$ 1019530 1037214 1017029 1045562 1085003 1086231 1069487 1049402 1039733 1036250 1049969 1079659 1063406
3824A063406L6732J5490K6924M218r022O098J3976r07J2802J7630j5066p7J4024
$$ 1063406 1100138 1115628 1142552 1146770 1137748 1143846 1157822 1156915 1169717 1187347 1172281 1172204 1186228
3811A186228K960M2016j9633m6522q151L6377N8235J651L8128J0907j4785m0201
$$ 1186228 1189188 1231204 1211571 1165049 1156898 1193275 1251510 1253161 1291289 1302196 1287411 1247210
3799A247210K709j954K0749R060K9195J93j3908K0215P18R127J3343K5037m386
$$ 1247210 1249919 1247965 1268714 1277774 1306969 1307162 1293254 1313469 1314187 1323314 1336657 1361694 1357308
3786A357308k4430p933J3567j0708m0750J522R057J6367o143j1746q470k0756
$$ 1357308 1332878 1324945 1338512 1327804 1287054 1288576 1297633 1314000 1307857 1296111 1287641 1266885
3774A266885j7279N3109n8821M7093K8379n2142J3201J021M3794P254n487J6462
$$ 1266885 1249606 1302715 1243894 1290987 1319366 1267224 1280425 1281446 1325240 1332494 1327007 1343469
3762A343469K1823j2763M0455O8708n58m575j9650J9842N0842N4298L3762j995
$$ 1343469 1365292 1352529 1392984 1461692 1461134 1456559 1436909 1456751 1507593 1561891 1595653 1593658
3750A593658P817L1764N7690N2127L3706L8926L7720O4034Q7037L8534N9810O0839
$$ 1593658 1601475 1633239 1690929 1743056 1776762 1815688 1853408 1917442 2004479 2043013 2102823 2163662
3738B163662N9793N4642O7552L8924N0498M502M3538L3501O2076o120j5405K6948
$$ 2163662 2223455 2278097 2345649 2384573 2435071 2439573 2483111 2516612 2578688 2572568 2557163 2584111
3726B584111o871K7120k406K5092n147m921J6732K8709k7911m219j6035k1967
$$ 2584111 2577240 2604360 2601954 2627046 2621899 2616978 2633710 2662419 2634508 2630289 2614254 2592287
3714B592287p25j5343l0739p7212j8852L7705L4920Q931J2563k5074j8087M1687
$$ 2592287 2591562 2576219 2545480 2468268 2449416 2487121 2522041 2530972 2543535 2518461 2500374 2542061
3702B542061r173J0941K987R86M6937K2429M9182L3164O0125L6692K5762O2831
$$ 2542061 2532888 2543829 2546816 2547802 2594739 2617168 2666350 2699514 2759639 2796331 2822093 2884924
3690B884924K4190P6058J09341N3683L4711N5052O7131L7247N4447R2374L3960
$$ 2884924 2909114 2985172 3094513 3148196 3182907 3237959 3305090 3342337 3396784 3489158 3523118
3679C523118L1287M1787N7429N0638N5875P976M0431M5769O0242O6583K2767J4705
$$ 3523118 3554405 3596192 3653621 3704259 3760134 3768110 3808541 3854310 3914552 3981135 4003902 4018607
3667D018607P4950M3509K8031L6127O7744L6202n772K4345J2679N0041M4713M1923
$$ 4018607 4093557 4137066 4165097 4201224 4268968 4305170 4299398 4323743 4336422 4386463 4431176 4473099
3655D473099j1895K9908P3057M6440M3589O7662N7095N8407P3035L2374Q9698
$$ 4473099 4461204 4491112 4564169 4610609 4654198 4721860 4778955 4837362 4910397 4942771 5032469
3644E032469J55606O4029P3358J30569J61623J20111J58665J42224J88721J78745
$$ 5032469 5188075 5252104 5325462 5456031 5617654 5737765 5896430 6038654 6227375 6406120
3634F406120J93917J83789J65346K15234K11387K55898K65506K52245K59807K64546
$$ 6406120 6600037 6783826 6949172 7164406 7375793 7631691 7897197 8149442 8409249 8673795
3624H673795K85627L04490L25905L03761L57449L44351L63932M25984L97867M49329
$$ 8673795 8959422 9263912 9589817 9893578 10251027 10595378 10959310 11385294 11783161 12232490
3614A2232490M86624M61750N20746N13196N47677O25318O28601O12581O89242
$$ 12232490 12719114 13180864 13701610 14214806 14762483 15387801 16016402 16628983 17318225
3605A7318225P29107Q17654Q64828R64032J032872J075810J268731J389324J548757
$$ 17318225 18047332 18864986 19729814 20693846 21726718 22802528 24071259 25460583 27009340
3596B7009340J665254J940983K182037K444095K714985L063054L338725L629711
$$ 27009340 28674594 30615577 32797614 35241709 37956694 41019748 44358473 47988184
3588D7988184L818646L948146L910948L658467L378383K900744K320120J845267
$$ 47988184 51806830 55754976 59665924 63324391 66702774 69603518 71923638 73768905
3580G3768905J319153Q67461M50303K17045J56576J11791J98159L00945L49091
$$ 73768905 75088058 75955519 76405822 76622867 76779443 76891234 77089393 77390338 77739429
3571G7739429K70923J20269j83352o70827j196702j726654k195925k662026l042860
$$ 77739429 78010352 78130621 77947269 77276442 76079740 74353086 72157161 69495135 66452275
3562F6452275l342349l537225l554231l439170l233860l053496k845302k655229
$$ 66452275 63109926 59572701 56018470 52579300 49345440 46291944 43446642 40791413
3554D0791413k456751k265484k087174j921417j788430j645944j510330j375144
$$ 40791413 38334662 36069178 33982004 32060587 30272157 28626213 27115883 25740739
3546B5740739j234639j054802r52282q20615o98644o66363n56173m72022m23056
$$ 25740739 24506100 23451298 22499016 21678401 20979757 20313394 19757221 19285199 18862143
3537A8862143m11306l88087k69843j76947j62484k01027j23116q8263p4971k3941
$$ 18862143 18450837 18062750 17792907 17615960 17453476 17252449 17129333 17041070 16966099 16942158
3527A6942158j0559J3731M033j2785k852M3809M3128N9972K6780M5938J08974
$$ 16942158 16931599 16945330 16949363 16936578 16933726 16977535 17020663 17080635 17107415 17153353 17262327
3516A7262327J69323J51454J79502K10560K39948K30021J79535K25379J99150
$$ 17262327 17431650 17583104 17762606 17973166 18213114 18443135 18622670 18848049 19047199
3507A9047199J92144K16947K05371K32952K41923K19992K28402K57387K66245
$$ 19047199 19239343 19456290 19661661 19894613 20136536 20356528 20584930 20842317 21108562
3498B1108562L11160K85829L11618L61938L42104L88742L95206M18338M33349
$$ 21108562 21419722 21705551 22017169 22379107 22721211 23109953 23505159 23923497 24356846
3489B4356846M99599N06395N74834O07380O55042P33488Q08393R23661J012726
$$ 24356846 24856445 25362840 25937674 26545054 27200096 27933584 28741977 29665638 30678364
3480C0678364J077599J186302J354032J451868J613357J713599J913340K096162
$$ 30678364 31755963 32942265 34296297 35748165 37361522 39075121 40988461 43084623
3472D3084623K316096K547748K767525L019033L335196L658498M005326M433013
$$ 43084623 45400719 47948467 50715992 53735025 57070221 60728719 64734045 69167058
3464F9167058M939252N471182O101220O735319P343908P970414Q411759Q763274
$$ 69167058 74106310 79577492 85678712 92414031 99757939 107728353 116140112 124903386
3456A24903386Q889934Q734559Q280576P458567O430833N379483M309772L262962
$$ 124903386 133793320 142527879 150808455 158267022 164697855 170077338 174387110 177650072
3448A77650072K385395J690223J206620R72064R76182J120004J192630J083841
$$ 177650072 180035467 181725690 182932310 183904374 184880556 186000560 187193190 188277031
3440A88277031P35091K49998l94506j189574k007647k887234l818653m686773
$$ 188277031 189012122 189262120 188867614 187678040 185670393 182783159 178964506 174277733
3432A74277733n373928n833126o027445o021327n833773n570446n205380m813941
$$ 174277733 168903805 163070679 157043234 151021907 145188134 139617688 134412308 129598367
3424A29598367m360367l850578l392318k926674k479936k029787j628045j151048
$$ 129598367 125238000 121387422 117995104 115068430 112588494 110558707 108930662 107779614
3416A07779614o91679k67390K07730P13595J157718J640987K180241K712836L266934
$$ 107779614 107087935 106820545 107028275 107741870 108899588 110540575 112720816 115433652 118700586
3407A18700586L747386M149087M494233M709513M760902M563196M226554L877336
$$ 118700586 122447972 126597059 131091292 135800805 140561707 145124903 149351457 153228793
3399A53228793L516546L158733K676273K180703J516803P80998M4837n24871j021765
$$ 153228793 156745339 159904072 162580345 164761048 166277851 167058849 167103686 166578815 165557050
3390A65557050j328838j456144j583688j664782j796151j858084j992954k141029
$$ 165557050 164228212 162772068 161188380 159523598 157727447 155869363 153876409 151735380
3382A51735380k367931k654640l058043l426090l835138m266820m667609m948575
$$ 151735380 149367449 146712809 143654766 140228676 136393538 132126718 127459109 122510534
3374A22510534n159308n347720n451747n433100n221105n015453m804697m537917
$$ 122510534 117351226 112003506 106551759 101118659 95897554 90882101 86077404 81539487
3366H1539487m303829m064916l754996l446349l177448k916865k631502k415084
$$ 81539487 77235658 73170742 69415746 65969397 62791949 59875084 57243582 54828498
3358E4828498k200786j948520j761680j564283j369327j178177j043853q64029
$$ 54828498 52627712 50679192 48917512 47353229 45983902 44805725 43761872 42897843
3350D2897843p42680o57136n59535m79467l91269l00584k63926k96245l20322
$$ 42897843 42155163 41498027 40938492 40459025 40067756 39767172 39503246 39207001 38886679
3341C8886679k76989k00660j13662J7267M0278J17302J16918J23843J46506J21548
$$ 38886679 38609690 38409030 38295368 38312635 38352913 38470215 38587133 38710976 38857482 38979030
3331C8979030J36889J48044M1126r1579k12611m50847n49927o76440o78320o55304
$$ 38979030 39115919 39263963 39305089 39213510 39000899 38550052 38000125 37323685 36645365 35990061
3321C5990061p40466p38166p07469o68334o52964o09323n60979m99107l68759
$$ 35990061 35249595 34511429 33803960 33135626 32482662 31873339 31312360 30813253 30444494
3312C0444494k60036j81345q5110O8353J87874K89997M03200N12767O65230Q25651
$$ 30444494 30184458 30003113 29918003 29986356 30174230 30464227 30867427 31380194 32045424 32871075
3302C2871075R63256J158804J345487J582279J808074K074267K406756K641524
$$ 32871075 33834331 34993135 36338622 37920901 39728975 41803242 44209998 46851522
3294D6851522K982828L310607L608881L882234M116672M257771M309373M132633
$$ 46851522 49834350 53144957 56753838 60636072 64752744 69010515 73319888 77452521
3286G7452521M028032L835729L628017L420933L024778K408609J638936P21290
$$ 77452521 81480553 85316282 88944299 92365232 95390010 97798619 99437555 100158845
3278A00158845j18562q06940j512058k149950k771772l338257l812748m179052
$$ 100158845 100040283 99233343 97721285 95571335 92799563 89461306 85648558 81469506
3270H1469506m384189m496318m413146m271303m143489l954836l705312l417826
$$ 81469506 77085317 72588999 68175853 63904550 59761061 55806225 52100913 48683087
3262D8683087l201753k897221k699720k458897k221902k051521j861526j621092
$$ 48683087 45481334 42584113 39884393 37425496 35203594 33152073 31290547 29669455
3254B9669455j494258j335870j215125j081176r44451q82973p49406p11448n89800
$$ 29669455 28175197 26839327 25624202 24543026 23598575 22715602 21966196 21254748 20664948
3245B0664948n29562m58818m62366m02000l61673l04145k52025k34997j64387
$$ 20664948 20135386 19676568 19214202 18812202 18450529 18146384 17894359 17659362 17494975
3236A7494975j44602r5127q0767k6000P739j1560j2379k6476j01214j52588j40200
$$ 17494975 17350373 17255246 17174479 17148479 17156218 17144658 17132279 17105803 17004589 16852001 16711801
3225A6711801j34659j32956o3733o8785n6205j44421j26743j45898j78817k00280
$$ 16711801 16577142 16444186 16380453 16311668 16255463 16111042 15984299 15838401 15659584 15459304
3215A5459304j51850j87609k29069j62909j53233j76158j65623j75909j84422
$$ 15459304 15307454 15119845 14890776 14727867 14574634 14398476 14232853 14056944 13872522
3206A3872522j61953j87704j83957k22910k49300k69331k91250l59617l20968
$$ 13872522 13710569 13522865 13338908 13115998 12866698 12597367 12306117 11946500 11625532
3197A1625532k30848k26348k45125j82915j57909j40138j12687q9174q9910o8134
$$ 11625532 11394684 11168336 10923211 10740296 10582387 10442249 10329562 10240388 10150478 10082344
3187A0082344o0800l3877k9109m0956r3574m1210n6149j43386j35423r6864r2534
$$ 10082344 10021544 9987667 9958558 9917602 9824028 9782818 9726669 9583283 9447860 9350996 9258462
3176I258462j18479r9097q6384m9274m4554l0680p2382m4782k7253j6397K985
$$ 9258462 9139983 9040886 8954502 8905228 8860674 8829994 8757612 8712830 8685577 8669180 8672165
3165H672165j4917K4588J5888l6693o22K1856L3432M4339L4303R610q014m4354
$$ 8672165 8657248 8681836 8697724 8661031 8660409 8682265 8715697 8760036 8794339 8803949 8795935 8751581
3153H751581n7817l2973o9292q9230r1526q9518p9675o5215o9958o9632q1971
$$ 8751581 8693764 8660791 8591499 8502269 8410743 8321225 8241550 8176335 8106377 8036745 7954774
3142G954774q6810n9003k4060k7786q9744j6089k0358K9715j520o648M6553M899
$$ 7954774 7867964 7808961 7784901 7757115 7667371 7651282 7630924 7660639 7659119 7652471 7699024 7703923
3130G703923N1002R6356J11133N3610R4618P5469N4916J32921R6542J52402J04503
$$ 7703923 7754925 7851281 7962414 8016024 8110642 8186111 8241027 8373948 8470490 8622892 8727395
3119H727395J69885K17896J56937J47357J55803K08933K06729J87542J73896J76202
$$ 8727395 8897280 9115176 9272113 9419470 9575273 9784206 9990935 10178477 10352373 10528575
3109A0528575J93776K53779K49156K89858L07901L37898L12357L47280L39135
$$ 10528575 10722351 10976130 11225286 11515144 11823045 12160943 12473300 12820580 13159715
3100A3159715L53379L96577L94663M34037M93119M56575N33330N58991N75144
$$ 13159715 13513094 13909671 14304334 14738371 15231490 15688065 16221395 16780386 17355530
3091A7355530O37871O61059P33278P70114Q25179R37486J019636J112499J190248
$$ 17355530 17993401 18654460 19387738 20157852 20983031 21920517 22940153 24052652 25242900
3082B5242900J316153J405212J559900J743183J927604K135055K319023K513651
$$ 25242900 26559053 27964265 29524165 31267348 33194952 35330007 37649030 40162681
3074D0162681K713098K956400L283874L665420M247161N043671N826266O583542
$$ 40162681 42875779 45832179 49116053 52781473 57028634 62072305 67898571 74482113
3066G4482113O919654O753279O684613P218140Q374109R886225J1667573J3591092
$$ 74482113 81401767 88155046 94839659 102057799 110431908 120318133 131985706 145576798
3058A45576798J5755711J8254483K1295440K4760527K7771166K9686061K9229429
$$ 145576798 161332509 179586992 200882432 225642959 253414125 283100186 312329615
3051C12329615K7380890K5672871K2022159J1140515r517178k9954610l7068558
$$ 312329615 339710505 365383376 387405535 398546050 389028872 359074262 322005704
3044C22005704l2409902k4928472j9369958j6470659j5156070j4271708j3706448
$$ 322005704 289595802 264667330 245297372 228826713 213670643 199398935 185692487
3037A85692487j3487665j3421012j3323884j3162722j2484823j1140968r545022
$$ 185692487 172204822 158783810 145459926 132297204 119812381 108671413 99126391
3030I9126391q204874p154147o265500n462121m822970m246557l846629l448981
$$ 99126391 90921517 83767370 77501870 72039749 67216779 62970222 59123593 55674612
3022E5674612l064067k834987k512975k277010k039390j967889j767560j641941
$$ 55674612 52610545 49775558 47262583 44985573 42946183 40978294 39210734 37568793
3014C7568793j487520j456811j314491j171068j169622j087053r47892q75075
$$ 37568793 36081273 34624462 33309971 32138903 30969281 29882228 28934336 28059261
3006B8059261q99188r15173q75701r00003q72518q09424q02492o95165o91672
$$ 28059261 27160073 26244900 25369199 24469196 23596678 22787254 21984762 21289597 20597925
2997B0597925o63074n79915n30527n68259m99154n01776n05878m35237m35407
$$ 20597925 19934851 19354936 18824409 18256150 17756996 17255220 16749342 16314105 15878698
2988A5878698m45644m44554m37114l98803l86101m09508l58573k78762l09673
$$ 15878698 15433054 14988500 14551386 14152583 13766482 13356974 12998401 12719639 12409966
2979A2409966l06022k40709k24358k46929k48726k41208k18513j99353j88506
$$ 12409966 12103944 11863235 11638877 11391948 11143222 10902014 10683501 10484148 10295642
2970A0295642k04778j80447j76182j52506j63551k20805j47846j25605j55015
$$ 10295642 10090864 9910417 9734235 9581729 9418178 9197373 9049527 8923922 8768907
2961H768907j58405j24154j17171j24864j35758j55694j12762j27894j45002j26811
$$ 8768907 8610502 8486348 8369177 8244313 8108555 7952861 7840099 7712205 7567203 7440392
2951G440392j40013r5244j24880j00059q0453r6102p3242j12672j10778k6998
$$ 7440392 7300379 7205135 7080255 6980196 6899743 6803641 6730399 6617727 6506949 6479951
2941F479951q3702q8229p6614r8660n2468r6130p3130j41329j00364m6359n8990
$$ 6479951 6396249 6308020 6231406 6132746 6080278 5984148 5911018 5769689 5669325 5622966 5563976
2930E563976o4642o1478q3392p0891q4484p5957j8268o8070p5529o9355m7065
$$ 5563976 5499334 5437856 5354464 5283573 5199089 5123132 5104864 5036794 4961265 4891910 4844845
2919D844845m0423o0943j28875q4318o7311m9925n5156o6824r3233n5679o7485
$$ 4844845 4804422 4743479 4614604 4530286 4462975 4413050 4357894 4291070 4197837 4142158 4074673
2908D074673o7605k7100m8452k3719m6196n0608n3596j7997m9651p5996k6331
$$ 4074673 4007068 3979968 3931516 3907797 3861601 3810993 3757397 3739400 3689749 3613753 3587422
2897C587422m7158n3171m0542o9176l5037Q46l9658n5048p9802q2376J5644j8162
$$ 3587422 3540264 3487093 3446551 3377375 3342338 3343184 3303526 3248478 3168676 3086300 3101944 3083782
2885C083782j0265j0909k5899k6942l0759k5794k0878j812m0664l3978k3171m195
$$ 3083782 3073517 3062608 3036709 3009767 2979008 2953214 2932336 2930524 2889860 2855882 2832711 2828516
2873B828516j5449K6614R981m7645n173j3243k4217j5819k4378k8119l9548m0795
$$ 2828516 2813067 2839681 2849662 2802017 2796844 2783601 2759384 2743565 2719187 2691068 2651520 2610725
2861B610725l9775q7032n0559j3468m5465o0781m2490J1380k1952m7416L372n6581
$$ 2610725 2570950 2483918 2433359 2419891 2374426 2313645 2271155 2282535 2260583 2213167 2216539 2159958
2849B159958m3926m5671j7328P69k3142k3403n7035n8190l4856r258l7855m7385
$$ 2159958 2116032 2070361 2053033 2053802 2030660 2007257 1950222 1892032 1857176 1847918 1810063 1762678
2837A762678k870J7573j9638l2954j2896J5933k6565j3388k6055m297l2782o438
$$ 1762678 1759808 1777381 1757743 1724789 1711893 1727826 1701261 1687873 1661818 1657521 1624739 1618301
2825A618301k5351l3275l9476j0112j8189L3563N8135j3825l7726j9058k002j8075
$$ 1618301 1592950 1559675 1520199 1510087 1491898 1525461 1583596 1569771 1532045 1512987 1510985 1492910
2813A492910l1998l270j1331r931r149N065l2162j9389K945M2903J9333m9065
$$ 1492910 1460912 1457642 1446311 1436380 1427231 1432296 1400134 1380745 1383690 1426593 1445926 1396861
2801A396861l196J0998L088J3317K0022R997r302k6749p013L3724J896J128J6554
$$ 1396861 1393665 1404663 1407751 1421068 1441090 1451087 1441785 1415036 1408023 1441747 1443643 1444771 1461325
2788A461325r654K2087J3283L7858J1326J3395K6351N8472P354R388N9922R1243
$$ 1461325 1451671 1473758 1487041 1524899 1536225 1549620 1575971 1634443 1641797 1651185 1711107 1802350
2776A802350N0051O4076J00046J47215J33448J43322J38619J64478P9659J23059
$$ 1802350 1852401 1916477 2016523 2163738 2297186 2440508 2579127 2743605 2823264 2946323
2766B946323J23011O4842p902j02179k11108k45079j61175p8780j04536p9109
$$ 2946323 3069334 3134176 3126274 3024095 2812987 2567908 2406733 2327953 2223417 2144308
2756B144308j04724j09495o6142n4315j03434o4882p0629p7908o8050r1231j0355
$$ 2144308 2039584 1930089 1863947 1809632 1706198 1641316 1570687 1492779 1424729 1333498 1323143
2745A323143l5210k4130k7547l9201L635M735l5693l4558j2332k481n3010j8930
$$ 1323143 1287933 1263803 1236256 1197055 1200690 1205425 1169732 1135174 1122842 1120361 1067351 1048421
2733A048421m302k4445p73k2533n9243J3489K1365l8971J223M55j8751J1492J566
$$ 1048421 1044119 1019674 1018901 996368 937125 950614 971979 933008 934231 934686 915935 927427 928993
2720I28993j8223J496J9967m0766J4156j4480l0625k0622J9875R196m045j5422
$$ 928993 910770 912266 932233 891467 905623 891143 860518 839896 859771 868967 864922 849500
2708H49500J2203l9471J1340P013l1665k7393K773J7361K6334k0988n1340K980
$$ 849500 861703 822232 833572 840585 808920 781527 784300 801661 827995 807007 755667 758647
2696G58647L867k4831j5730O741k0182K0257k1478l7148j6890Q485j0369m4304
$$ 758647 762514 737683 721953 728694 708512 728769 707291 670143 653253 661738 651369 607065
2684F07065m6045J548j680N786j628r148M672J0010l436j3602K9822r612Q869
$$ 607065 561020 562568 560888 566674 565046 555898 560570 570580 567144 553542 583364 573752 582621
2671E82621K7253J3519k9834j7401k6051j383J5652n905J8893m491o793J8702
$$ 582621 609874 623393 593559 576158 550107 548724 564376 558471 577364 572873 566080 584782
2659E84782O124O853j6233K4529j4092j1297n007O080Q460k6243Q820m499k0751
$$ 584782 590906 597759 581526 606055 591963 580666 575659 581739 590199 563956 572776 568277 547526
2646E47526q82R90N249N208j7546l5252j3258M710J4803k859l3427l253L893j5089
$$ 547526 546644 547634 552883 558091 540545 505293 492035 496745 511548 508689 475262 472009 475902 460813
2632D60813n679k7336J1006L5733p099n765j7160K7477o21K3966R552r642j482
$$ 460813 455134 427798 438804 474537 467438 461673 444513 471990 471369 495335 504887 495245 493763
2619D93763O738m7727j3683j0225j4875l858K2930P246jk7286j6508j3814O477
$$ 493763 500501 452774 439091 428866 413991 410133 433063 440309 440308 413022 396514 382700 389177
2606C89177M8042l1485J875K089k6202M0609j8008j3578K1196j3729j9123L31
$$ 389177 437219 405734 407609 409698 383496 424105 406097 392519 413715 399986 380863 381194
2594C81194j2798j6899J5933L27k7538J9870K4060m540M006q36k3074j4422N292
$$ 381194 368396 351497 367430 367757 340219 360089 384149 379609 383615 382779 359705 345283 350575
2581C50575N421M09P83j6823K299K7929k2114j1004L1787k7977k2368L7448J480
$$ 350575 355996 356405 357188 340365 342664 370593 348479 337475 369262 341285 318917 356365 357845
2568C57845k7589k3131J8839j6963l279M4150J5723J8148q856r104l285q212j4739
$$ 357845 330256 307125 325964 309001 305722 349872 365595 383743 374887 365783 362498 354286 339547
2555C39547K4240J1266m3570L4041k620l4314o577j9411k4400J0625p014J091
$$ 339547 363787 375053 331483 365524 362904 328590 322013 302602 278202 288827 281813 282904
2543B82904k6760R641K9478K6874K0511R093l4402j3025K6074l8251m8763M0655
$$ 282904 256144 265785 295263 322137 342648 351741 317339 304314 330388 292137 243374 284029
2531B84029M9176m3591k1472K815J8139J8664j6582K4754k270N443K6795l4475
$$ 284029 333205 289614 268142 270957 289096 307760 291178 315932 313662 319105 345900 311425
2519C11425j5867m3209J6271P155j3978m5673K5528M7421J9685m3657l1914q811
$$ 311425 295558 252349 268620 275775 261797 216124 241652 289073 308758 265101 233187 224376
2507B24376K6643K2151L729K5554m9635j8422j251l0517l426M3712k0198p380
$$ 224376 251019 273170 276899 302453 252818 234396 233145 202628 199202 242914 222716 215336
2495B15336P17p937K4569K2343l1541j840j9631L695j617n18K6996q500k971l0015
$$ 215336 216053 208116 232685 255028 223487 221647 202016 205711 204094 203576 230572 222072 219101 189086
2481A89086l1426K5633L1666r688l8533K5672J2256j0954K582M4472j9517k5190
$$ 189086 157660 183293 214959 205271 166738 192410 204666 193712 196294 240766 221249 196059
2469A96059M695J6827M4864j2708j2681J4364m162r388k5769k7812J5396n672
$$ 196059 200754 217581 262445 249737 237056 251420 247258 237870 212101 184289 199685 194013
2457A94013j9910j2158Q526J0234K0301J1135J5125j0060L2472j7377n007k1383
$$ 194013 174103 161945 170471 180705 201006 212141 227266 217206 249678 232301 227294 205911
2445B05911k3270K5391q911K8212m000O537l955k3168j4k258J4835k6451j5271
$$ 205911 182641 208032 199121 227333 223333 229870 225915 202747 202733 200475 215310 188859 173588
2432A73588j460J2677J3367j0148J2530p279J4104k4676j8121R150K7083L1048
$$ 173588 172128 184805 198172 188024 200554 193275 207379 182703 164582 173732 200815 231863
2420B31863k0349k9610K8042J355l394J9316k767k3988p328J7019L2999m0413
$$ 231863 211514 181904 209946 211301 207907 227223 224456 200468 193140 210159 243158 202745
2408B02745k3068J7162L049L2704Q231l1785l035j2510o016J2618q076K0727j8013
$$ 202745 179677 196839 199888 232592 240823 209038 206003 193493 187477 200095 192019 212746 194733
2395A94733M541O145J4785m471K600n345j1594k8618J0725M7925k6381m173k081
$$ 194733 199274 205419 220204 215733 218333 212988 201394 172776 183501 231426 205045 200872 198791
2382A98791p44R686O145j429J7387m1868n887L4369j6774O024J802O167j4898
$$ 198791 198047 207733 213878 212449 229836 187968 182081 216450 199676 205700 207502 213669 198771
2369A98771k7104K2714K7891q018k6921K754Q023q204J5699L5496n276p361N898
$$ 198771 171667 194381 222272 214254 187333 190087 198110 189906 205605 241101 235825 228464 234362
2356B34362J270j2088j9348O4443j1649l2517j470J3043M209j750L6366p524o657
$$ 234362 235632 223544 204196 268639 256990 224473 223003 236046 240255 238505 274871 267347 260690
2343B60690O258m758J4897j3745K1405R703J4957P883K2695q646n372Q037L5478
$$ 260690 266948 262190 277087 263342 284747 294450 309407 317290 339985 331339 325967 334004 369482
2330C69482K5793r75j2764K4712O3539N3200l323N4472L2565n0950K7013J6564
$$ 369482 395275 394300 381536 406248 469787 522987 519664 574136 606701 555751 582764 599328
2318E99328K5041J00682K5936K9191Q1717P3829Q4105O5024R3253J11307J28269
$$ 599328 624369 725051 750987 780178 861895 935724 1019829 1084853 1178106 1289413 1417682
2307A417682J54742J18119J33165J16746J16996J35288J68026K47273L26636L29625
$$ 1417682 1572424 1690543 1823708 1940454 2057450 2192738 2360764 2608037 2934673 3264298
2297C264298L95651N12477N88374O51112N94797M61201M94707N42976M79205k33604
$$ 3264298 3659949 4172426 4760800 5411912 6006709 6467910 6962617 7505593 7984798 7751194
2287G751194j109203r27559o94399m52652l14592k32938k45480k40851k58554
$$ 7751194 6641991 5714432 5020033 4567381 4252789 4019851 3774371 3533520 3274966
2278C274966k52150k07084j96873k47010k24496j73745j50003j45285j39299r6829
$$ 3274966 3022816 2815732 2618859 2371849 2147353 1973608 1823605 1678320 1539021 1442192
2268A442192j12348r4327q5764p0696o0487k8936m9021l4153l4228n6411l4119
$$ 1442192 1329844 1235517 1149753 1079057 1018570 989634 940613 906460 872232 815821 781702
2257G81702k7958k5345m9181L3858k9071k9733m4945K489J6940o1141k0374m0350
$$ 781702 753744 728399 679218 713076 684005 654272 609327 611816 628756 567615 547241 506891
2245E06891J4489j7684j0286j1606M173j411j9069m3000m9396J0872J2476k1389
$$ 506891 521380 503696 493410 481804 485977 484566 465497 422497 373101 383973 396449 375060
2233C75060J3788k148o4025k3104M2596J3968j7167j364l1651k7268L3080l027
$$ 375060 388848 386700 322675 299571 342167 356135 338968 337604 305953 278685 311765 308738
2221C08738J0683m1866k66J8230l8185j4340l2861L0778L3407K2795j0855l218
$$ 308738 319421 277555 277289 295519 257334 242994 210133 240911 274318 297113 286258 283040
2209B83040K75k1710k9499J5516O007m009J842J960n120n3268L621L2584o51j8121
$$ 283040 283315 261605 232106 247622 253629 249620 251462 253422 248302 195034 198655 231239 230588 212467
2195B12467l648k9721K5210J8452j9706K0512j1796q47k5598R777j5J3833j4610
$$ 212467 208819 179098 204308 222760 203054 223566 211770 210923 185325 195102 195087 208920 194310
2182A94310j2493J072j8518J2319q943k8083j069J4914k4625k6517J2130M0349
$$ 194310 181817 182889 164371 176690 167747 139664 138595 153509 128884 102367 114497 154846
2170A54846J1288K2074m425j0314J0464j2522p733K1132j8528j9134o66j4303
$$ 154846 166134 188208 183783 173469 183933 171411 163678 184810 166282 147148 146482 132179
2158A32179N104R826r717L3934j743j4777k3120K1380N67J3056o807J8719o920
$$ 132179 137283 147109 137392 171326 169583 154806 131686 153066 153633 166689 159882 178601 171681
2145A71681m4474q953J0601m59J5400r84J8225J2192m2846r945J2865j4732L2773
$$ 171681 127207 118254 128855 128396 143796 142812 161037 173229 130383 120438 133303 118571 151344
2132A51344j263n04p273l5091J6860J2653l018o504j3747J355K1363l1113K5892
$$ 151344 150081 149577 142304 107213 124073 136726 133708 127204 113457 114812 136175 105062 130954
2119A30954Q920l3291J8145J7406k2425k0463M0662j0893O138l3030K3509K2754
$$ 130954 139874 106583 124728 142134 119709 99246 139908 129015 135153 102123 125632 148386
2107A48386q03m095m6063j6742k2301o943K0888K9307M970q130o127L5326K865
$$ 148386 147583 143488 97425 80683 58382 51439 72327 101634 106604 98474 92347 127673 130538
2094A30538m4833k0829L2718k9842J934j5391L3411m687k19j484J8330j3645o594
$$ 130538 85705 64876 97594 67752 69686 54295 87706 83019 82800 81316 99646 86001 79407
2081G9407n535M8781m839k5156L4754n92J7801k7697j9001k2181N874o753j2324
$$ 79407 73872 122653 117814 92658 127412 126820 144621 116924 97923 75742 81616 74863 62539
2068F2539J6635k7717l065l101K4709j0315l6169Q802J433j7710K0912K6952j5723
$$ 62539 79174 51457 48392 45291 70000 59685 23516 32318 33751 16041 36953 63905 48182
2055D8182L4281J6201l8147j0970m132j155J9403J7449j3252k9241L371K5325
$$ 48182 82463 98664 60517 49547 45415 44260 63663 81112 67860 38619 41990 67315
2043F7315K9714J985j4929m298P464K5846k8015r434j6017L9125N767j1772J3711
$$ 67315 97029 99014 84085 79787 87251 113097 85082 75648 59631 98756 104523 92751 106462
2030A06462p080Q465j4063J8249n473l5086J5350K2953J7103p983m786j3746j5288
$$ 106462 99382 107847 93784 112033 106560 71474 86824 109777 126880 118897 114111 100365 85077
2017H5077K6062J4312J2415l7218Q714l9254l1563K3059K3279j0700q628k0976
$$ 85077 111139 125451 137866 100648 109362 70108 38545 61604 84883 74183 65555 44579
2005D4579K0612j3274m499K054j689J2426O107J0660L1207j2798l6635N745J4466
$$ 44579 65191 51917 47418 49472 47783 60209 66316 76976 108183 95385 58750 64495 78961
1992G8961j7975j053J0669j0941j3652m310J258J3447J3404j7238O583J3504l1
$$ 78961 60986 59933 70602 59661 46009 41699 42957 56404 69808 52570 59153 72657 72626
1979G2626r859L9786J2598n9191r557J1382k4725N099J2888K9711P312J5673m4620
$$ 72626 62767 102553 115151 55960 46403 57785 33060 38159 51047 80758 88070 103743 59123
1966E9123j4296k0267r433L1021K4180j4283p948j7016J5217N897m42l109k2380
$$ 59123 44827 24560 15127 46148 70328 56045 48097 31081 46298 52195 51753 48644 26264
1953B6264k029M045M5261Q964R39k0991r977j976m771k1097K0788J0940j3063
$$ 26264 24235 28280 73541 82505 83444 62453 52476 50500 45729 24632 45420 56360 43297
1940D3297j1639K039o128O089J0512l315j0709k4578k6034K9362N5417m0165j6831
$$ 43297 31658 33697 27569 33658 44170 40855 30146 5568 -20466 8896 64313 24148 7317
1927G317K1321N462N3853k3588l5102Q802J3607j543j370N213M23k5169K2107
$$ 7317 28638 34100 87953 64365 29263 38065 51672 50129 48759 53972 54395 29226 51333
1914E1333l17L367n303K2784R59K770j0132l0414J1084r877J6987k2047K2526
$$ 51333 51016 54383 49080 71864 72823 75593 65461 35047 46131 36254 53241 31194 53720
1901E3720J0893N52J3731j6555l9232N660l58J6367J8452q578q3K447M268J0702
$$ 53720 64613 65165 78896 62341 23109 28769 28411 44778 63230 54652 54569 57016 61284 71986
1887G1986J562j0499Q952r34k3109j6461R074q456K5150k4308J9159n285q257
$$ 71986 73548 63049 72001 71067 47958 31497 40571 32115 57265 32957 52116 46831 38574
1874C8574K0113o159n356l3896p872J1035R972j2348K0936K9591r813o0521N454
$$ 38574 58687 52528 47172 13276 5404 16439 26411 14063 34999 64590 54777 -5744 -290
1861b90K7853j890k2630k2131j2414L3089L2745J7979l0310p042J3337l7974k642
$$ -290 27563 25673 3043 -19088 -31502 1587 34332 52311 22001 14959 28296 -9678 -12320
1848a2320L1631L1815m8134j2569O416J7181L4033l166j2505J4692j1424j3434
$$ -12320 19311 51126 2992 -9577 -3161 14020 48053 44887 32382 47074 35650 22216
1836B2216J0116J2311J002m0313O190J942K6156o999l698o05P724l552R135K1330
$$ 22216 32332 44643 45645 5332 11522 13464 39620 32621 28923 28318 36042 32490 41625 62955
1822F2955j442K3563p142n4741j8573l628R783j5592O622P529k0501J3796J7301
$$ 62955 61513 85076 77934 23193 4620 992 10775 -4817 1805 9334 -11167 2629 19930
1809A9930K284L8368o342j1499p844r38r578r683q363K2221J2236j7039N874J6300
$$ 19930 22214 60582 54240 42741 34897 33959 24381 14698 6335 28556 40792 23753 29627 45927
1795D5927J7266J1828J6140k6804j6765O421k1848j3576L625k272j350L3598J7449
$$ 45927 63193 75021 91161 64357 47592 54013 32165 18589 22214 19942 18592 52190 69639
1782F9639k1790J0080J4896r251k7240j4721M1097j6305k8470J7484j3808j2413
$$ 69639 47849 57929 72825 63574 36334 21613 62710 46405 17935 35419 21611 9198
1770I198J2579Q166k0027J8951N946j6527k2042K166l3598J9477M3129R829P257
$$ 9198 21777 29943 9916 28867 34813 18286 -3756 -1590 -35188 -15711 27418 37247 44504
1757D4504J0280n0492J2142k3248l312J9001j2650Q585J5108m517J705j2517j7990
$$ 44504 54784 4292 16434 -6814 -10126 8875 -3775 4810 19918 15401 17106 4589 -13401
1744a3401N980k553J0228k540K0465K3438j392k0907J3158M551k9026K409j0559
$$ -13401 -7421 -9974 254 -2286 18179 41617 40225 19318 32476 37027 8001 10410 -149
1731a49O793n363j892J8545L4807k32k5239K0107J8275m3529j3966Q844J8610
$$ -149 6644 1281 -611 17934 52741 52509 27270 47377 65652 22123 8157 17001 35611
1718C5611M821M359k4696j1031L2926m737j276l4907J0873q796J413K3975J4938
$$ 35611 40432 44791 20095 9064 41990 37253 35977 1070 11943 3147 4560 28535 43473
1705D3473j5736k5705l0649L2110K5373J0134K0619j8303k2152K48J2649K253
$$ 43473 27737 2032 -28617 3493 28866 39000 59619 41316 19164 19412 32061 34314
1693C4314J1165J3333j0715q444q527k2165n762l723L0636J6004l0458r559K8723
$$ 34314 45479 58812 48097 39653 31126 8961 3199 -524 30112 46116 15658 6099 34822
1680C4822j6403J7070K0099P368l4082M542j5074n902J5329N324K6344k5333k8247
$$ 34822 18419 35489 55588 62956 28874 33416 18342 12440 27769 33093 59437 34104 5857
1667E857J6914J504m978J0212m398K4440l0637o168M0693j8398k9936P629k0742
$$ 5857 22771 24275 19297 29509 25111 49551 18914 12746 53439 35041 5105 12734 -8008
1654h008K1445K570J0201K087j6548P408J5236r909k7902K2583K154q03k4674
$$ -8008 13437 16007 26208 28295 11747 19155 34391 24482 -3420 19163 21317 20514 -4160
1641d160k6356L8842K3806l6278j7633M3112M276K839j6768P229k3802J9450k4828
$$ -4160 -30516 8326 32132 -4146 -21779 21333 25609 28448 11680 18909 -4893 14557 -10271
1628a0271j146L4025M108n300L155j9294l141J7393L2962J1895j5200k7938k4829
$$ -10271 -11417 22608 26716 21416 24571 5277 2136 19529 52491 64386 49186 21248 -3581
1615c581m427K6604J2092n5496O844N4105O125l8714L35q872J4103J1096O776
$$ -3581 -8008 18596 30688 -24808 -17964 36141 42266 3552 3887 -4985 9118 20214 26990
1602B6990l9987K1407J90O766j8688J3506K0949N5364j3520m5669L7350l5681
$$ 26990 -12997 8410 8600 15366 -3322 10184 31133 86497 72977 27308 64658 28977
1590B8977m0055K2404p008L397K4597l3379M205j5084M680j2015J9396j058J1703
$$ 28977 -11078 11326 4318 7715 32312 -1067 3138 -11946 -7266 -19281 115 -943 10760
1577A0760j9963P136k5524p026J4408J2515N2904k4994j5023O393m244k4665J7508
$$ 10760 -9203 -2067 -27591 -34617 -20209 -7694 45210 20216 5193 11586 7342 -17323 185
1564A85j1657j1447K6094N7190j5500l8184l790j0306p313K1508K2887j0276J0629
$$ 185 -11472 -22919 3175 60365 44865 6681 2891 -7415 -14728 6780 29667 19391 30020
1551C0020j6507j9276J3951J9056k8666J534m593Q719J5070j573l273j5142M689
$$ 30020 13513 -5763 8188 27244 -1422 112 -4481 4238 19308 17735 14462 -680 4009
1538D009J4368L792n324j3872J3834k9902n412N1004J8413r949k9382J4879j4378
$$ 4009 18377 22169 16845 2973 16807 -13095 -18507 32497 50910 40961 11579 26458 12080
1525A2080K0364L501J5658m3280k6915L763M7035Q205N0k5456k0969K369J3562
$$ 12080 32444 35945 51603 8323 -18592 -14829 32206 40411 40461 15005 -5964 -3595 9967
1512I967l696j1375J8966M1315j4122j2755j1458P807Q556j8425k8101n084n762
$$ 9967 6271 -5104 13862 55177 41055 28300 16842 24649 33205 14780 -13321 -18405 -24167
1499b4167M211M4689j8779k4752l054J3976k6461Q374k2469N5780J326K423J6664
$$ -24167 -19956 24733 5954 -18798 -21852 -7876 -34337 -25963 -48432 7348 8674 11097 27761
1486B7761j1570j8094k6056R142K3385R375q803J0475m695j574K0152l8842l988
$$ 27761 16191 -1903 -27959 -18817 4568 13943 5140 15615 10920 9346 29498 -9344 -13332
1473a3332j819P268M1675J8070l0384j6541O026l1219j9571K4755K3243j003k7643
$$ -13332 -15151 -7883 33792 51862 21478 4937 10963 -20256 -39827 -15072 8171 7168 -20475
1460b0475K2706J5948K4310K271k7708P847n459M133p638l2964l1250K3369J1251
$$ -20475 2231 18179 42489 44760 17052 24899 19440 23573 15935 -17029 -48279 -24910 -13659
1447a3659J6181L7485l611J204m094p150K6533k6837k4011j4181n591J1400K4803
$$ -13659 2522 40007 36396 37600 33506 26356 52889 26052 2041 -12140 -17731 -6331 18472
1434A8472J0923k1290J3074j2251Q532j0283k9141L0611j2633j3716K3994K5772
$$ 18472 29395 8105 21179 8928 17460 7177 -21964 8647 -3986 -17702 6292 32064
1422C2064L317j5179l4419L157k0497o06K0512K0650k702o452L5784j3233k9037
$$ 32064 35381 20202 -14217 -11060 -31557 -32163 -11651 8999 6297 -155 35629 22396 -6641
1409f641J3708k2638K325J1473M394N928K563k9029j1188K9227r500j3038K5790
$$ -6641 7067 -15571 -13246 -1773 2621 8549 11112 -17917 -29105 122 -9378 -22416 3374
1396C374j6053R40K5094N245k220m1659J6432j900J748J6575n297p001p638K7690
$$ 3374 -12679 -11739 13355 18600 16380 -25279 -8847 -10747 -8999 7576 2279 -4722 -12360 15330
1382A5330K0317j1837j9140m4231J9572K4514O93l538k5523J9133J7866k1116
$$ 15330 35647 23810 4670 -39561 -19989 4525 5218 1680 -23843 -4710 13156 -7960
1370g960k7970J0517J3324K0141J7729L286l2026k8437K5897L1822J6205l8151
$$ -7960 -35930 -25413 -12089 8052 25781 29067 -2959 -31396 -5499 26323 42528 4377
1358D377j245q840M4683R981o643k8217j6529P181J3086M793n893L7784j6045
$$ 4377 3132 -5708 38975 48956 42313 14096 -2433 4748 17834 22627 16734 54518 38473
1345C8473l0737n589P551l5482p602K5790j6195J0194n542K3546m33j1510J3148
$$ 38473 7736 2147 9698 -25784 -33386 -7596 -23791 -13597 -19139 4407 3974 -7536 5612
1332E612K047K9449J2166l5999k6184j3233L9179j2901K935N9454k0594j8062
$$ 5612 7659 37108 49274 13275 -12909 -26142 13037 136 3071 62525 41931 23869
1320B3869N056n3576j7908O644Q222L8930o856p158q152J4559j0872N540p577
$$ 23869 28925 -24651 -42559 -35915 -27693 11237 4381 -2777 -10929 3630 -7242 -1702 -9279
1307i279K7030J766K4944k2294n886M4046O973j3396k6617k5644L149L8212k6089
$$ -9279 17751 19517 44461 22167 16281 60327 67300 53904 27287 1643 4792 43004 16915
1294A6915l2255K6652J0835j2246j8635K7163J6155J6680k066j1998j1633l1212
$$ 16915 -15340 11312 22147 9901 -8734 18429 34584 51264 49198 37200 25567 -5645
1282e645J2901j703K5157j1533n57j7427l1538L4571K139j501J3293K887m8498
$$ -5645 7256 5553 30710 19177 18620 1193 -30345 4226 6365 4864 18157 21044 -27454
1269b7454m842O7842N185J396M897l2387j1247P824K895J5127l0846j1341N3397
$$ -27454 -32296 35546 40731 42127 47024 14637 3390 11214 14109 29236 -1610 -12951 40446
1256D0446P118k7335p775j0330P266M813j3532J9015J3186k0133n573M573j4321
$$ 40446 47564 20229 12454 2124 9390 14203 671 19686 32872 12739 7166 11739 -2582
1243b582J3723Q593j5406O26J6503j7985K4675J1394m592k3165k7332n457J586
$$ -2582 11141 19734 4328 4954 21457 3472 28147 39541 34949 11784 -15548 -21005 -19419
1230a9419L3245K7648k251L40n0010k3911K8888p04l467J8517j953J6620r953
$$ -19419 13826 41474 39223 39563 -10447 -34358 -5470 -6174 -9641 8876 6923 23543 13590
1217A3590k1830j667n474p517J7303o017k8048J0516J371o959R968M1567n833
$$ 13590 -8240 -9907 -15381 -22898 -5595 -11612 -39660 -29144 -27773 -34732 -24764 16803 10970
1204A0970j3977o323J3604R080k810n457p315N040J1972P904r453M108r775r464
$$ 10970 -3007 -9330 4274 13354 10544 5087 -2228 2812 14784 22688 13235 17343 7568 -1896
1190a896J8053k4021j7406L2438J6447q684j2067j884J1508l3769M889N2695L3343
$$ -1896 16157 -7864 -25270 7168 23615 14931 2864 980 12488 -21281 -16392 36303 69646
1177F9646o4211N321O15p784n230K788p48p217J6359R330k5902O956k2347j0327
$$ 69646 5435 10756 11371 3587 -1643 1145 397 -6820 9539 18869 -7033 -77 -22424 -32751
1163c2751K4957J6160k5845j8140K4954j1995J436L14n529L4759p511o731k1067
$$ -32751 -7794 8366 -17479 -35619 -10665 -22660 -21224 -20910 -26439 8320 809 -5922 -26989
1150b6989K2226k1409k1357K0781J5618j478n100K9678L767O612O708P788m1657
$$ -26989 -4763 -26172 -47529 -26748 -11130 -12608 -17708 11970 15737 22349 29057 36845 -4812
1137d812J7854Q967Q498k6976Q151L2736Q529m5385l8171K531J5830L0675l33
$$ -4812 13042 22009 30507 3531 11682 44418 52947 7562 -30609 -28078 -12248 18427 18094
1124A8094k9494j3750J9922o616j819O545r768q115j5482R697m523K4441J0319
$$ 18094 -11400 -25150 -5228 -11844 -13663 -7118 -16886 -25001 -40483 -30786 -35309 -10868 -549
1111e49J6046l8881K461J6213j0676j0314K60J7465r783k8735L8074M3420m1420
$$ -549 15497 -23384 -20923 -4710 -15386 -25700 -25440 -7975 -17758 -46493 -8419 35001 -6419
1098f419j1657N899R574j6981R177q028p315k1791R752N0610Q855j2700q262J738
$$ -6419 -18076 -12177 -2603 -19584 -10407 -18435 -25750 -47541 -37789 12821 21676 8976 714 2452
1084B452j1219K393m574N747N9614m3181n7891J8615J6703R88j7053J5288j3037
$$ 2452 -8767 -6374 -10948 -5201 54413 11232 -46659 -28044 -11341 -10353 -27406 -12118 -25155
1071b5155k2742J6684L4769k4239N359j710m807R214R155l227j1278J8504J772
$$ -25155 -47897 -31213 3556 -20683 -15324 -17034 -21841 -12627 -3472 -6699 -17977 527 2299
1058B299k2275N400o514M247M102r787R821q106J1688j8528N323P967o891L1957
$$ 2299 -19976 -14576 -21090 -16843 -12741 -22528 -12707 -20813 -9125 -27653 -22330 -14363 -21254 10703
1044A0703J1339k3080j6293J2543J9986r804k466j3564p037N408r364j0325K5936
$$ 10703 22042 -1038 -17331 -4788 15198 5394 2928 -10636 -17673 -12265 -21629 -31954 -6018
1031f018J1793j6943K3529J5829k439M470j7917j9678J7019o499O575j1746k816
$$ -6018 5775 -11168 12361 28190 25751 30221 12304 -7374 9645 3146 9721 -2025 -4841
1018d841r784J2356k2501J019Q645K0449j010q244O277Q196r190j239J3046n3198
$$ -4841 -14625 -2269 -24770 -23751 -15106 5343 4333 -3911 2366 10562 1372 133 13179 -40019
1004d0019K6755N047L7417J417O027J5306m8516R811J585j6574k7194k0816K9582
$$ -40019 -13264 -8217 29200 30617 36644 51950 3434 13245 14830 -1744 -28938 -49754 -20172
991b0172K7412j693j4196k7999q670K6338J2600M961n184J7081m1879r799j6266
$$ -20172 7240 5547 -8649 -36648 -45318 -18980 -6380 -1419 -6603 10478 -31401 -41200 -57466
978e7466L5677J2705J0360J2104j3724K026L4n71q825j5500J3553L4552J2698
$$ -57466 -21789 -9084 1276 13380 -344 1682 1716 1145 -7680 -23180 -9627 24925 37623
965C7623O789j4036m143j3813m777J1946k1830K1984L312j5663K46J1105j4113
$$ 37623 44412 30376 26233 12420 7643 19589 -2241 19743 23055 7392 7638 18743 4630
952D630K5R159j8317j2952L9077L846j394R225n2705R262j3558J7515K323j0678
$$ 4630 4655 13814 -4503 -17455 21622 25468 24074 33299 -19406 -10144 -23702 -6187 -3864 -14542
938a4542N075J242J324P759Q114K89j412J0830k3625M238J9431k7476j0468R301
$$ -14542 -9467 -8225 -6901 858 8972 9261 7849 18679 -4946 -708 18723 -8753 -19221 -9920
924i920M0761nk8821k972J7742l015j231k4844j3825L7755J4324L534R484k2091
$$ -9920 30841 30836 2015 -957 16785 13770 12539 -12305 -26130 11625 25949 29483 38967 16876
910A6876l0262j8453j9450M9505j1754l0436Q914M175K98O797J0255m455K0079
$$ 16876 -13386 -31839 -51289 -1784 -13538 -43974 -35060 -30885 -30587 -23790 -13535 -17990 2089
897B089o574m4616M3081k2856j3182L4760L8657l9540m8433K6126o111K0128k0331
$$ 2089 -4485 -49101 -6020 -28876 -42058 -7298 31359 -8181 -56614 -30488 -36599 -16471 -36802
884c6802j0263j755p112M1895k686J5854r683j0217K0446o454n61J2587N505l692
$$ -36802 -47065 -48820 -55932 -14037 -16723 -869 -10552 -20769 -323 -6777 -7338 5249 10754 7062
870G062R240k5585J2205J0367m557k7336J4452J2232j1441l1254N5564r525k3841
$$ 7062 16302 -9283 2922 13289 8732 -18604 -4152 8080 -3361 -34615 20949 11424 -12417
857a2417L2502j3065K956j3256J7972J4340J3219N874j1449j9865j872o184j5173
$$ -12417 20085 7020 9976 -3280 14692 29032 42251 48125 36676 16811 14939 8755 -6418
844f418k1532Q160K2667j4742J0326m521j9589o581L8682P441m9062K1348j9269
$$ -6418 -27950 -19790 2877 -11865 -1539 -6060 -25649 -32230 6452 13893 -35169 -13821 -33090
831c3090L6990j3398q228J0321l0643J8686K1711o344q231l3371M0549j8807N643
$$ -33090 3900 -9498 -17726 -7405 -38048 -19362 2349 -3995 -12226 -45597 -5048 -23855 -18212
818a8212Q944J4710j9783l0206J6696K9724o680k3734K7075n651k4337q369J4510
$$ -18212 -9268 5442 -14341 -44547 -27851 1873 -4807 -28541 -1466 -7117 -31454 -39823 -25313
805b5313l153J1168q049K8372J7493K1828n0724n146j085J7020L4006j8373o696
$$ -25313 -28466 -17298 -25347 3025 20518 42346 -8378 -13524 -14609 2411 36417 18044 11348
792A1348j1560j463J0402r62J142k1747k918K5717K1876k9460k278j1127J2083
$$ 11348 -212 -1675 8727 7765 8907 -12840 -15758 9959 31835 2375 97 -11030 1053
779A053K5515M488j3266j291j7453k310M564J2388M130l1436K5452o078k7543
$$ 1053 26568 31056 17790 16499 -954 -3264 1300 13688 17818 -13618 11834 5756 -21787
766b1787P172k0025J2998K6341L4473l0123k0677M858K7023j821j265k2594j3742
$$ -21787 -14615 -34640 -21642 4699 39172 9049 -11628 -6770 20253 18432 17167 -5427 -19169
753a9169J1826k0096J2708p747P708j2773P202J6683Q401j5576P113l1843n487
$$ -19169 -7343 -27439 -14731 -22478 -14770 -27543 -20341 -3658 4743 -10833 -3720 -35563 -41050
740d1050K2647J8834L3626k2190j7766j191o584R062n071j4352p195k363J7848
$$ -41050 -18403 431 34057 11867 -5899 -7090 -13674 -4612 -9683 -24035 -31230 -33593 -15745
727a5745J3493K67k7388o031J4392M860O864j3745m129n339K9854J4367k3891
$$ -15745 -2252 -1985 -29373 -35404 -21012 -16152 -9288 -23033 -27162 -32501 -2647 11720 -12171
714a2171l6681L4341o584P955q697k8408J8604J1193J2344K4860k4999k5002O602
$$ -12171 -48852 -14511 -21095 -13140 -21837 -50245 -31641 -20448 -8104 16756 -8243 -33245 -26643
701b6643r865K1683j9137p005n99L2988K6190L925m0605R064K9707l2813N540
$$ -26643 -36508 -14825 -33962 -40967 -41566 -8578 17612 21537 -19068 -10004 19703 -13110 -7570
688g570K8711m01k6579j4195L740o360k8584K1760M1853l192K7345J8405o370
$$ -7570 21141 20740 -5839 -20034 -16294 -22654 -51238 -29478 12375 9183 36528 54933 48563
675D8563k3509R130j0377M472p702l1427J4251K730O523J903j8307O100K7882
$$ 48563 25054 34184 23807 28279 20577 -10850 3401 6131 12654 14557 -3750 2350 30232
662C0232L124l1077O843j882k5364K2595k3644J0881K5483p760k0103K1410l2754
$$ 30232 33356 2279 9122 7240 -18124 4471 -19173 -8292 17191 9431 -10672 10738 -22016
649b2016O183J3465J9254J4312J8949O047l2957j2595k2758j3952k949m527k0437
$$ -22016 -15833 -2368 16886 31198 50147 56194 23237 10642 -12116 -26068 -29017 -33544 -53981
636e3981R299M762J2734J0564J337J3999L1062J7465p643j7546q508j2298m0322
$$ -53981 -44682 -39920 -27186 -16622 -15285 -1286 29776 47241 39598 22052 13544 1246 -39076
623c9076K9321n116j1352j8109j5468J6612L5594J1031r236J4570p305p894j017
$$ -39076 -9755 -14871 -26223 -44332 -59800 -43188 -7594 3437 -5799 8771 1466 -6428 -7445
610g445j5714J6088L685k7356l00K1442J9138J220k696O45k1335j5644K6500O422
$$ -7445 -23159 -7071 -3386 -30742 -31042 -9600 9538 10758 8062 8707 -12628 -28272 -1772 4650
596D650K266J0431j7580K3645m663l512j9952k5440R243k283p59K673R663R741
$$ 4650 6916 17347 -233 23412 18749 15237 -4715 -30155 -20912 -23195 -23954 -21281 -11618 -1877
582a877j342k694K0970j8937j4311j4137O788N848J7749j6134L321j3302K1984
$$ -1877 -3219 -5913 15057 -3880 -18191 -32328 -25540 -19692 -1943 -18077 -14756 -28058 -6074
569f074J2835J441J3647p641k3076J176Q369R930P330J5289k1674m7221Q979R48
$$ -6074 6761 8202 21849 14208 -8868 -7692 677 10607 17937 33226 11552 -35669 -26690 -25742
555b5742J0828J5574n101L9566k4857j5506K791J7387o744j0778j466J2057J3394
$$ -25742 -14914 660 -4441 35125 10268 -5238 -2447 14940 8196 -2582 -4048 8009 21403
542B1403l3271j4256k698j9800R207J1120J2925j4157J788K5656j4238P58J7896
$$ 21403 -11868 -26124 -28822 -48622 -39415 -28295 -15370 -29527 -27739 -2083 -16321 -15563 2333
529B333R013o454j1548J8474k2667j5767K5146K568m46R447j8612M175K5488k074
$$ 2333 11346 4892 -6656 11818 -10849 -26616 -1470 1098 652 10099 -8513 -4338 21150 19076
515A9076k5820k2975j515M272l147N376K2295j6602j0388r5J3171k2668L4501
$$ 19076 -6744 -29719 -31234 -26962 -30109 -24733 -2438 -19040 -29428 -29523 -16352 -39020 -4519
502d519K8168j3715M306l2863Q716K9914k9595j7097m4482L0320K0169P632J752
$$ -4519 23649 9934 14240 -18623 -9907 20007 -9588 -26685 -71167 -40847 -20678 -13046 -11294
489a1294j5530J0010l0795M301m246J5430L2401J5263N197n2560K0952M3169j5710
$$ -11294 -26824 -16814 -47609 -43308 -47554 -32124 277 15540 20737 -31823 -10871 32298 16588
476A6588l3331l80M833L3299j3390m2551p20J5959j6895K3002K4478J0437j5592
$$ 16588 -16743 -17123 -12290 21009 7619 -34932 -35652 -19693 -36588 -13586 10892 21329 5737
463E737l479l396o958j8756j0855K6794L1774k0248k7879j7201K8871O904J5685
$$ 5737 2258 -1138 -8096 -26852 -37707 -10913 20861 613 -27266 -44467 -15596 -8692 6993
450F993M787L509J5212J950m5978k3027R39n357N505K7002L950k7464m913P557
$$ 6993 11780 15289 30501 32451 -13527 -36554 -35615 -40972 -35467 -8465 -4515 -31979 -36892 -29335
436b9335M4762k585o529k318j4194O626R019j7115N2761j4466J7581k0643n5216
$$ -29335 15427 12842 6313 3995 -10199 -3573 5446 -11669 41092 26626 44207 23564 -31652
423c1652K2576P950L447M41J5836L5387o843m0252k6429r473N279J3416M2021
$$ -31652 -9076 -1126 2321 2762 18598 53985 47142 6890 -19539 -29012 -23733 -10317 31704
410C1704k0779r331K6121r781j6187m496K2984K366L7516n0232m565j9225J1369
$$ 31704 10925 1594 27715 17934 1747 -2749 20235 22601 60117 9885 5320 -13905 -2536
397b536M5353j0455O499j4894p024j7900J024R227N08L338j7981J0588J0627O918
$$ -2536 42817 32362 38861 23967 16943 -957 67 9294 9802 13140 -4841 5747 16374 23292
383B3292o0780P264L4894J4565m9700L1143M1370j1032k0554k4019M5895J7670
$$ 23292 -37488 -30224 4670 19235 -30465 678 42048 31016 10462 -13557 32338 50008
371E0008j1250k8058M546l831j1312J6458j4267l1005p462M3328L4186M855k0220
$$ 50008 38758 10700 15246 11415 103 16561 2294 -28711 -36173 7155 41341 46196 25976
358B5976j3200k53l4870K8777o413J4278n996k6224p144p236N5408K0839k3669
$$ 25976 12776 12523 -22347 6430 17 14295 8299 -17925 -25069 -32305 23103 43942 20273
345B0273r373K058J7989j9019k7227K1255L1727j8786l258o379Q589K0623J885
$$ 20273 10900 12958 30947 11928 -15299 5956 37683 18897 15639 9260 17849 38472 40357
332D0357n727j4598l5231o718J2232J726R176J5341q051j4030j3342m757j7112
$$ 40357 34630 20032 -15199 -21917 -9685 -7959 1217 16558 8507 -5523 -18865 -23622 -40734
319d0734k7154J8598M2419K2391j3220l1288K3399R834N682J6471M138l580J6774
$$ -40734 -67888 -49290 -6871 15520 2300 -28988 -5589 4245 9927 26398 30536 26956 43730
306D3730q121j5022L9924j2629K949j0523k3211Q597m3223j1225L1203R393j7375
$$ 43730 35609 20587 60511 47882 50831 40308 17097 25694 -17529 -28754 2449 11842 -5533
293e533n921K7115J8776k0811j1124J7540J6918r268j0569p202o883K6379j40
$$ -5533 -11454 15661 34437 13626 2502 20042 36960 27692 17123 9921 3038 29417 29277
280B9277k2123j6485L0898J920n992l2704J2238J4038j4980J982N8l761J2180
$$ 29277 7154 -9331 21567 23487 17495 -15209 -2971 11067 -3913 -1931 -1873 -5634 6546
267F546O821R355K1190l5403k1744P530L0682j1256r723M688J3613J2048j1277
$$ 6546 13367 22722 43912 8509 -13235 -5705 24977 13721 3998 8686 22299 34347 23070
254B3070Q851k847j3659J6165J7611k9258j0161m994q00O982J4026j5903J662
$$ 23070 31921 29074 15415 31580 49191 19933 9772 4778 3978 10960 24986 9083 10745
241A0745L217j1772k819R405k090P824N933l0026M0358k4302j0028l647J0276
$$ 10745 13962 2190 -629 8776 6686 14510 20443 -9583 30775 6473 -3555 -7202 3074
228C074N63p061J2524K5712q223P982j3286J610N927j6852J5341N016k9030l9214
$$ 3074 3637 -3424 9100 34812 26589 34571 21285 22895 28822 11970 27311 32327 3297 -35917
214c5917K6752J5855m96k878M4621p50j4137N99k0918n315J652J6002j0363J565
$$ -35917 -9165 6690 6194 3316 47937 47187 33050 33649 12731 7416 9068 25070 14707 16272
200A6272j2344N000k1808J307k6851J9217R055l684K57K2985l141J8887J2240
$$ 16272 3928 8928 -12880 -11573 -38424 -19207 -10152 -13836 -13579 9406 6265 25152 37392
187C7392k4568j7999k436J5347r399J0945j291K4745M816L673m9368O995j4918
$$ 37392 12824 -5175 -7611 7736 -1663 9282 7991 32736 37552 41225 -8143 -1148 -16066
174a6066J8341K660L168k883j9942j8158L7705J3254K0370l0129l7190L8879n38
$$ -16066 2275 4935 8103 5220 -14722 -32880 4825 18079 38449 8320 -28870 10009 9471
161I471j3124L0992N221k1648j7396O976j6542J4347j0524J2128J2422q079J7626
$$ 9471 -3653 27339 32560 10912 -6484 492 -16050 -1703 -12227 -99 12323 4244 21870
148B1870j9360J5072j5537j0910L0052O3m873J6158l3272k9364K5763K5370O79
$$ 21870 2510 17582 2045 -8865 21187 21250 16377 32535 -737 -30101 -4338 21032 21711
135B1711j1605K5767j5327k1328K1433j2438k2206J7272K9895P263k5379j9311
$$ 21711 10106 35873 20546 -782 20651 8213 -13993 3279 33174 40437 15058 -4253
123d253o699l5381J1203K5471O72m830k362r730L0710J3243p502K0205k1202J402
$$ -4253 -10952 -46333 -35130 -9659 -8987 -13817 -16179 -25909 4801 18044 10542 30747 9545 10947
109A0947L578m173j9141K061J2473J2183j1877P942K4765j3299J5026j6163k5495
$$ 10947 14525 10352 -8789 -6728 5745 17928 6051 13993 38758 25459 40485 24322 -1173
96a173r99K2306m545J8381m0353k336J3577R866j6203K1246o316J5581K4203j5115
$$ -1173 -2172 20134 15589 33970 -6383 -8719 4858 14724 -1479 19767 13451 29032 53235 38120
82C8120j5857j92j0983J4573k4608K264J7682k9135K7646O91j2291J872J1872
$$ 38120 22263 22071 11088 25661 1053 3317 20999 -8136 19510 20201 7910 9782 21654
69B1654l2789K025N966K4353J6507J1414O924r930j9787j4125J7909p849m839
$$ 21654 -11135 -9110 -3144 21209 37716 49130 56054 46124 26337 12212 30121 22272 17433
56A7433k446k072j427n443L098r980r371q046p265L559J9531O672N272j069k342
$$ 17433 14987 12915 11488 6045 9143 -837 -10208 -18254 -25519 -21960 -2429 4243 9515 8446 6104
41F104Q126K143j0256r68L80M496O062j3690M811q848j5093J6434J1900J7343
$$ 6104 14230 16373 6117 5149 5529 10025 16087 2397 7208 -1640 -16733 -299 11601 28944
27B8944k4317r760K3164k4913J1149K2446J129j7576l880m687o972Q143j45q846
$$ 28944 4627 -5133 18031 -6882 4267 26713 27842 10266 6386 1699 -5273 2870 2725 -6121
13f121p990K6614R54k1455J7206m111n94n117K4454p576J0157p680n592
$$ -6121 -14111 12503 13457 -7998 9208 5097 4503 -614 23840 16264 26421 18741 13149
0A3149
$$ 13149
$$ Imaginary data points
##PAGE= N=2
##DATA TABLE= (X++(I..I)), XYDATA
16383a365258J6140K1998L3401k0188J1914L5196P481K8762J3011J3909K8397
$$ -1365258 -1349118 -1327120 -1293719 -1313907 -1301993 -1266797 -1259316 -1230554 -1217543 -1203634 -1175237
16372a175237J6983K3955J906N078j7708M6158L9483J6335j1302k558J5591K9900
$$ -1175237 -1158254 -1134299 -1132393 -1127315 -1145023 -1098865 -1059382 -1043047 -1054349 -1056907 -1041316 -1011416
16360a011416J526j161L2284M1770N3778J5624L74j9609K1647O159L1545P790
$$ -1011416 -1009890 -1011051 -978767 -936997 -883219 -867595 -867221 -886830 -865183 -859024 -827479 -819689
16348h19689n02Q452K7986J8403K693K8580L1239P299j0963L5412M0653K9718
$$ -819689 -820191 -811739 -783753 -765350 -762657 -734077 -702838 -695539 -706502 -671090 -630437 -600719
16336f00719j2775j5811J5136m650L283M1099L6523J1977o423j2380P354M0424
$$ -600719 -613494 -629305 -614169 -618819 -615536 -574437 -537914 -525937 -532360 -544740 -537386 -496962
16324d96962J3428K2005J6721J5292J3900K3733J4137j5840M5129j06L0854r503
$$ -496962 -483534 -461529 -444808 -429516 -415616 -391883 -377746 -393586 -348457 -348563 -317709 -327212
16312c27212P310L5246K5697Q244n541M771L3719N417K3273J2496r738N126J5043
$$ -327212 -319902 -284656 -258959 -250715 -256256 -251485 -217766 -212349 -189076 -176580 -186318 -181192 -166149
16299a66149J0638J9671j150m887M0925l975n44M8048J8887n126R870L0970M3861
$$ -166149 -155511 -135840 -136990 -141877 -100952 -104927 -105471 -57423 -38536 -43662 -33792 -2822 41039
16286D1039j4639p002J9225K0894J6345J4132k4208P006J4312K5510p133L755
$$ 41039 26400 19398 38623 59517 75862 89994 65786 72792 87104 112614 105481 109236
16274A09236L6664j0338J3680l03K0855K6063L217M060q415K0967M3222J4406
$$ 109236 145900 135562 149242 148939 169794 195857 199074 203134 194719 215686 258908 273314
16262B73314J1794O087j7443K848K0306l8K2496l5831K8154J2005J7145M1139
$$ 273314 285108 291195 273752 276600 296906 296868 319364 283533 311687 323692 340837 381976
16250C81976J5254R112r619J737K3763J431j2299K0725J2147K7322K2623k3259
$$ 381976 397230 406342 396723 398460 422223 423654 411355 432080 444227 471549 494172 470913
16238D70913l5731L0506L567K8961p797J9311L1426Q452N741m478J3885P870m456
$$ 470913 435182 465688 469255 498216 490419 509730 541156 549608 555349 550871 564756 572626 568170
16225E68170k1929J1694L8670K9484p123m1138J0214J3387J9129J6328j1591r99
$$ 568170 546241 557935 596605 626089 618966 577828 588042 601429 620558 636886 625295 624296
16213F24296J6361r294L1527R392k246M0656L470j6514j2608J710L2101k4204
$$ 624296 640657 631363 662890 672282 670036 710692 714162 697648 685040 686750 718851 694647
16201F94647N409K1990O849O365r299K2945J7306j3252J0440J4242r41L979L9339
$$ 694647 700056 722046 728895 735260 725961 748906 766212 752960 763400 777642 776701 780680 820019
16188H20019K5379q211R607l9002J0279N531Q307l392k1885O095P07K2666j0322
$$ 820019 845398 837187 846794 807792 818071 823602 831909 828517 806632 812727 813434 836100 825778
16175H25778L2086K7310k4538K1170N902L2211N429m4238l8712P448K1475k714
$$ 825778 857864 885174 860636 881806 887708 919919 925348 881110 842398 849846 871321 868607
16163H68607J8843K3247k976l14m825L6010k9396J8894j5299k6899N908Q777k702
$$ 868607 887450 910697 907721 907407 902582 938592 909196 928090 912791 885892 891800 900577 897875
16150H97875k121K6825L4357K3816L31l227l7902J766J1804J7162k6786j2853
$$ 897875 895754 922579 956936 980752 981083 977856 939954 941720 953524 970686 943900 931047
16138I31047o371R541J0754n219M8986O480k670O496j8872j9391K866M2193J2210
$$ 931047 924676 934217 944971 939752 988738 995218 992548 999044 980172 960781 963647 1005840 1018050
16125A018050k0267m0611j0447L2342K2035j5804k173J9500R659J604P47k349
$$ 1018050 997783 957172 946725 979067 1001102 985298 983125 1002625 1012284 1013888 1014635 1012286
16113A012286K9719n934J8965l3945j6414J843J3111m437J695J9117j2277j0740
$$ 1012286 1042005 1036071 1055036 1021091 1004677 1006520 1019631 1015194 1016889 1036006 1023729 1012989
16101A012989J8417k0523M341j0074R040N8328r06l0785J3099J6373L4978k1547
$$ 1012989 1031406 1010883 1015224 1005150 1014190 1072518 1071612 1040827 1053926 1070299 1105277 1083730
16089A083730l2838l1362k0551J8603p34K498K7305J243k5694L3157J4698m1069
$$ 1083730 1050892 1019530 998979 1017582 1016848 1019346 1046651 1047894 1022200 1055357 1070055 1028986
16077A028986k72J4873l5788N9122k2595m6175k309O0973k854M602K7305Q721
$$ 1028986 1028714 1043587 1007799 1066921 1044326 998151 995842 1056815 1053961 1058563 1085868 1094589
16065A094589r526K9658j454k0073l3071m506R792j6953K4112K7404k0521J0583
$$ 1094589 1085063 1114721 1113267 1093194 1060123 1055617 1065409 1048456 1072568 1099972 1079451 1090034
16053A090034o182j5033O971m635j5729k2025K940M6183J2857j8649p403l8911
$$ 1090034 1083852 1068819 1075790 1071155 1055426 1033401 1036341 1082524 1095381 1076732 1069329 1030418
16041A030418J8882M566k8020L982K046K2935L2392n653L36K2085r77m577q95
$$ 1030418 1049300 1053866 1025846 1029828 1031874 1054809 1087201 1081548 1081884 1103969 1102992 1098415 1097520
16028A097520q569J4609J8120L690n0785k9514r5K3526K0349j5224J5898l568
$$ 1097520 1088951 1103560 1121680 1125370 1074585 1045071 1044976 1068502 1088851 1073627 1089525 1085957
16016A085957K2507m5645m3356J5065J0394o553K9033K0085j4074J6939l873l307
$$ 1085957 1108464 1062819 1019463 1034528 1044922 1038369 1067402 1087487 1073413 1090352 1086479 1083172
16004A083172l0926K1670L3200k5548k5080Q98L4373K5641j6299k1511N410q512
$$ 1083172 1052246 1073916 1107116 1081568 1056488 1057386 1091759 1117400 1101101 1079590 1085000 1076488
15992A076488J8310J5523m381k0474l4251L3553j4909K3392o119l1255K8428L3795
$$ 1076488 1094798 1110321 1105940 1085466 1051215 1084768 1069859 1093251 1087132 1055877 1084305 1118100
15980A118100l1666j3794J3394K4156N771k9510r122J2180j4085l910M8448j096
$$ 1118100 1086434 1072640 1086034 1110190 1115961 1086451 1077329 1089509 1075424 1071514 1119962 1118866
15968A118866m3616J5206q400k4617k4496N706K1591R28M324m291M789k020K078
$$ 1118866 1075250 1090456 1082056 1057439 1032943 1038649 1060240 1061168 1065492 1061201 1065990 1063970 1066048
15955A066048J2611J0805J3840m9837j890K4800k1828K1490J8669j3787L3322
$$ 1066048 1078659 1089464 1103304 1053467 1051577 1076377 1054549 1076039 1094708 1080921 1114243
15944A114243j1321l2005m982L0060p410l8198K2745K3783k511P194Q71L2290
$$ 1114243 1102922 1070917 1065935 1095995 1088585 1050387 1073132 1096915 1094404 1101598 1102469 1134759
15932A134759k4722m6512j98R577K12o23L2018P255J2171k1162j6563M094j4081
$$ 1134759 1110037 1063525 1063327 1072904 1073116 1072493 1104511 1111766 1123937 1102775 1086212 1090306 1076225
15919A076225r232N2062o716k2083n982L6085p116J0460r868j6581N412k018R881
$$ 1076225 1066993 1119055 1112339 1090256 1084274 1120359 1113243 1123703 1113835 1097254 1102666 1100648 1110529
15906A110529o0963n673K4320m70J2753k5597J453K2925N758J8392K3596J9743
$$ 1110529 1049566 1043893 1068213 1067743 1080496 1054899 1056352 1079277 1085035 1103427 1127023 1146766
15894A146766m217j0095k0900k4609K7666L5107Q281l8227k8257J8053K7012k598
$$ 1146766 1142549 1132454 1111554 1086945 1114611 1149718 1157999 1119772 1091515 1109568 1136580 1133982
15882A133982j6057K063k3958j0758N89L802j3662q311K955O667Q310k5846K1893
$$ 1133982 1117925 1119988 1096030 1085272 1085861 1089663 1076001 1067690 1070645 1077312 1085622 1059776 1081669
$$ [...]
##END NTUPLES=NMR SPECTRUM
##END=
