##TITLE=1H_CG-1042-E
 200.13MHz, CDCl3,
 8 sc
 
 8.8.2025
##JCAMPDX= 6.0         $$ Bruker NMR JCAMP-DX V2.0
##DATA TYPE= NMR SPECTRUM
##DATA CLASS= NTUPLES
##ORIGIN= UXNMR, Bruker Analytische Messtechnik GmbH
##OWNER= pz
$$ XWIN-NMR		Version 3.5
$$ Fri Aug  8 14:29:37 2025 Russian Standard Time (UT+4h)  she@DPX200
##.OBSERVE FREQUENCY= 200.1313
##.OBSERVE NUCLEUS= ^1H
##.ACQUISITION MODE= SIMULTANEOUS
##.ACQUISITION SCHEME= undefined
##.AVERAGES= 8
##.DIGITISER RES= 18
##SPECTROMETER/DATA SYSTEM= spect
##.PULSE SEQUENCE= zg30
##.SOLVENT NAME= CDCl3
##.SHIFT REFERENCE= (INTERNAL, CDCl3, 0, 15.5585)
##AUDIT TRAIL= $$ (NUMBER, WHEN, WHO, WHERE, WHAT)
$$ ##TITLE= Audit trail, XWIN-NMR		Version 3.5
$$ ##JCAMPDX= 5.01
$$ ##ORIGIN= Bruker BioSpin GmbH
$$ ##OWNER= she
$$ F:/spectra/data/she/nmr/H-C/1/pdata/1/auditp.txt
$$ ##AUDIT TRAIL=  $$ (NUMBER, WHEN, WHO, WHERE, WHAT)
(   1,<2025-08-08 14:28:06.15 +0400>,<she>,<DPX200>,
      <created by zg, POWCHK disabled, PULCHK disabled
       configuration hash MD5:
       00 E9 B6 7A A2 85 ED C7 34 08 36 98 17 FE 4E 26
       data hash MD5: 16K
       50 9F F9 E5 DD 5D 17 CB 98 3D 74 E3 65 B1 83 11>)
(   2,<2025-08-08 14:28:08.39 +0400>,<she>,<DPX200>,
      <Start of raw data processing
       efp BC_mod = 2 LB = 0.25 FT_mod = 6 PKNL = 1 PHC0 = -1558.412 PHC1 = 11.3923 SI = 16K 
       data hash MD5: 16K
       06 88 CD EC 99 5B 6C E4 9C E6 D9 E7 82 0A 89 07>)
(   3,<2025-08-08 14:28:27.00 +0400>,<she>,<DPX200>,
      <pk PHC0 = -158.2999 PHC1 = 0 
       data hash MD5: 16K
       85 EC 7B 83 82 70 78 AC 1D 41 C3 09 FF B2 F1 94>)
(   4,<2025-08-08 14:28:30.93 +0400>,<she>,<DPX200>,
      <abs ABSG = 5 
       data hash MD5: 16K
       A6 7D B7 1E 0A D0 B4 82 7A 60 95 C8 04 99 82 55>)
$$ ##END=
$$ 
$$ hash MD5
$$ 62 07 F9 5F 1A E7 5A 3F BC 22 EA 6C CE E3 06 73
##$RELAX= 
##$RELAX= 
##$RELAX= 
##$RELAX= 
##$RELAX= 
##$RELAX= 
$$ Bruker specific parameters
$$ --------------------------
##$DU= <F:/spectra>
##$EXPNO= 1
##$NAME= <H-C>
##$PROCNO= 1
##$TYPE= <nmr>
##$USER= <she>
##$AMP= (0..31)
100 100 100 100 100 100 100 100 100 100 100 100 100 100 100 100 100 100 
100 100 100 100 100 100 100 100 100 100 100 100 100 100 
##$AQSEQ= 0
##$AQ_mod= 1
##$AUNM= <au_zg>
##$AUTOPOS= <>
##$BF1= 200.13
##$BF2= 200.13
##$BF3= 200.13
##$BF4= 200.13
##$BF5= 200.13
##$BF6= 200.13
##$BF7= 200.13
##$BF8= 200.13
##$BYTORDA= 1
##$CFDGTYP= 0
##$CFRGTYP= 5
##$CHEMSTR= <none>
##$CNST= (0..31)
1 1 145 1 1 1 1 1 1 1 1 1 1 1 1 1 1 1 1 1 1 1 1 1 1 1 1 1 1 1 1 1 
##$CPDPRG= <>
##$CPDPRG1= <>
##$CPDPRG2= <>
##$CPDPRG3= <>
##$CPDPRG4= <mlev>
##$CPDPRG5= <mlev>
##$CPDPRG6= <mlev>
##$CPDPRG7= <mlev>
##$CPDPRG8= <mlev>
##$CPDPRGB= <>
##$CPDPRGT= <>
##$D= (0..31)
0 0.7 0 0 0 0 0 0 0 0 0 0.03 0 0 0 0 0 0 0 0 0 0 0 0 0 0 0 0 0 0 0 0 
##$DATE= 1754648885
##$DBL= (0..7)
120 120 120 120 120 120 120 120 
##$DBP= (0..7)
150 150 150 150 150 150 150 150 
##$DBP07= 0
##$DBPNAM0= <>
##$DBPNAM1= <>
##$DBPNAM2= <>
##$DBPNAM3= <>
##$DBPNAM4= <>
##$DBPNAM5= <>
$$ [...]
##$SUBNAM3= <"">
##$SUBNAM4= <"">
##$SUBNAM5= <"">
##$SUBNAM6= <"">
##$SUBNAM7= <"">
##$SUBNAM8= <"">
##$SUBNAM9= <"">
##$SW= 18.0517328524113
##$SWIBOX= (0..15)
0 0 2 0 0 0 0 0 0 0 0 0 0 0 0 0 
##$SW_h= 3612.71676300578
##$TD= 16384
##$TD0= 1
##$TE= 0
##$TE2= 300
##$TE3= 300
##$TEG= 300
##$TL= (0..7)
0 120 120 120 120 120 120 120 
##$TP= (0..7)
150 150 150 150 150 150 150 150 
##$TP07= 0
##$TPNAME0= <>
##$TPNAME1= <>
##$TPNAME2= <>
##$TPNAME3= <>
##$TPNAME4= <>
##$TPNAME5= <>
##$TPNAME6= <>
##$TPNAME7= <>
##$TPOAL= (0..7)
0.5 0.5 0.5 0.5 0.5 0.5 0.5 0.5 
##$TPOFFS= (0..7)
0 0 0 0 0 0 0 0 
##$TUNHIN= 0
##$TUNHOUT= 0
##$TUNXOUT= 0
##$USERA1= <user>
##$USERA2= <user>
##$USERA3= <user>
##$USERA4= <user>
##$USERA5= <user>
##$V9= 5
##$VALIST= <valist>
##$VCLIST= <CCCCCCCCCCCCCCC>
##$VD= 0
##$VDLIST= <DDDDDDDDDDDDDDD>
##$VPLIST= <PPPPPPPPPPPPPPP>
##$VTLIST= <TTTTTTTTTTTTTTT>
##$WBST= 1024
##$WBSW= 4
##$XGAIN= (0..3)
0 0 0 0 
##$XL= 0
##$YL= 0
##$YMAX_a= 431148
##$YMIN_a= -429294
##$ZGOPTNS= <>
##$ZL1= 120
##$ZL2= 120
##$ZL3= 120
##$ZL4= 120
##$ABSF1= 15.45381
##$ABSF2= -2.59804
##$ABSG= 5
##$ABSL= 3
##$ALPHA= 0
##$AQORDER= 0
##$ASSFAC= 0
##$ASSFACI= 0
##$ASSFACX= 0
##$ASSWID= 0
##$AUNMP= <proc_1d>
##$AZFE= 0.1
##$AZFW= 0.1
##$BCFW= 0
##$BC_mod= 2
##$BYTORDP= 0
##$COROFFS= 0
##$CY= -3
##$DATMOD= 1
##$DC= 0
##$DFILT= <>
##$DTYPP= 0
##$F1P= 0
##$F2P= 0
##$FCOR= 1
##$FTSIZE= 16384
##$FT_mod= 6
##$GAMMA= 0
##$GB= 0
##$INTBC= 1
##$INTSCL= 3.241238e-09
##$ISEN= 128
##$LB= 0.25
##$LEV0= 0
##$LPBIN= 0
##$MAXI= 10000
##$MC2= 0
##$MEAN= 0
##$ME_mod= 0
##$MI= 1.114404
##$NCOEF= 0
##$NC_proc= -5
##$NLEV= 6
##$NOISF1= 3.799351
##$NOISF2= 2.8
##$NSP= 0
##$NTH_PI= 0
##$NZP= 0
##$OFFSET= 15.55848
##$PC= 1
##$PHC0= -1716.712
##$PHC1= 11.3923
##$PH_mod= 1
##$PKNL= yes
##$PPARMOD= 0
##$PSCAL= 0
##$PSIGN= 0
##$REVERSE= no
##$SF= 200.129992638936
##$SI= 16384
##$SIGF1= 3
##$SIGF2= 2
##$SINO= 0.751879
##$SIOLD= 32768
##$SREGLST= <19F.Aceton>
##$SSB= 0
##$STSI= 16384
##$STSR= 0
##$SW_p= 3612.71676300578
##$SYMM= 0
##$S_DEV= 0
##$TDeff= 16384
##$TDoff= 0
##$TI= <>
##$TILT= no
##$TM1= 0
##$TM2= 0
##$TOPLEV= 0
##$USERP1= <user>
##$USERP2= <user>
##$USERP3= <user>
##$USERP4= <user>
##$USERP5= <user>
##$WDW= 1
##$XDIM= 16384
##$YMAX_p= 319128896
##$YMIN_p= -158875
$$ End of Bruker specific parameters
$$ ---------------------------------
##NTUPLES= NMR SPECTRUM
##VAR_NAME=  FREQUENCY,     SPECTRUM/REAL,   SPECTRUM/IMAG
##SYMBOL=    X,             R,               I
##VAR_TYPE=  INDEPENDENT,   DEPENDENT,       DEPENDENT
##VAR_FORM=  AFFN,          ASDF,            ASDF
##VAR_DIM=   16384,         16384,           16384
##UNITS=     HZ,            ARBITRARY UNITS, ARBITRARY UNITS
##FACTOR=    0.220516191357247, 1,           1
##FIRST=     3113.71854045846, 0,            0
##LAST=      -498.998222547321, 0,           0
##MIN=       -498.998222547321, -158875,     0
##MAX=       3113.71854045846, 319128896,    0
$$ Real data points
##PAGE= N=1
##DATA TABLE= (X++(R..R)), XYDATA
$$ [...]
6476b4335J1955k458Q975J1569m961J950N417L128o259j6477P027n310o543M149
6462a2173J1333L337j573J5967K372J863k7939j8599l171K0673J3646j0482Q968
6449D222n236Q420k481j1390M348k198J338K846L729L13J4687j3426o128j118
6435b074K936k023r5K2440j425k1679J1995M13k7449P902J5558o574n141P089
6421A873q271P083j4257P781K1606k2537P80M785j8380r987J3063J4742l487J53
6407e053m005L339j4550K0502K620j0404p395J9250M057j4844j88j0744J406m16
6393a6425J147q914R97J5338K203o199M843J3880r509j2607K1181K918l145j2350
6379f642J1108K39m30j348q199M243k666o421J0509k183j2238J705R836M579j9310
$$ plain form
6476 -24335 -12380 -14838 -5863 5706 745 2695 8112 11240 4981 -11496 -4469 -9779 -16322 -12173
6462 -12173 -840 2497 924 16891 19263 21126 -6813 -25412 -28583 -7910 5736 -4746 4222
6449 4222 -1014 7406 4925 -6465 -2117 -4315 -2977 -131 3598 3911 18598 5172 -956 -2074
6435 -2074 862 -1161 -1256 21184 19759 -1920 10075 10488 -16961 -9059 6499 -75 -5216 1873
6421 1873 -6398 685 -13572 -5791 15815 -6722 -5942 -1157 -19537 -29524 -16461 -1719 -5206 -5053
6407 -5053 -9058 -5719 -20269 233 2853 -7551 -14946 4304 8361 -6483 -6671 -17415 -16009 -16425
6393 -16425 -15278 -24192 -23195 -7857 -5654 -11853 -7010 6870 -2639 -15246 5935 8853 5708 -6642
6379 -6642 4466 4705 4275 2927 -5272 -1029 -3695 -10116 393 -1790 -14028 -12323 -2487 2092 -17218
6364a7218J1321K0408j0192N037J0656j5508j890O616j4296K503O266l308r925
6351i530O59M914o016O405k35l157N373M07r182L315K782j0805K942P445R577
6336D894k6495J225K1788N367L391k0641K0577j145j8159j0598J282q296Q511
6323a8299J2861M776r970O034m066N253L453j8557l707J8422Q035j5661l407J991
6309a2842k056l441O51o515P367o349j136P159P215K5154j5796j993R708p196
6295g0J4338k0493l988O836o125j614K902J4937m75l762j3466J0490J2112r140
6281B482K441k183p918k137L866O44P573j3820r51R347J3034j9975P149L684k088
6266A148j304j838O901K749m385k142j0133j9956m714M134Q85J1648J0733l77
$$ plain form
6364 -17218 -5897 14511 4319 9356 20012 4504 2614 9230 -5066 -2563 3703 395 -9530
6351 -9530 -8871 -3957 -9973 -3568 -3803 -6960 -1587 -1180 -10362 -7047 -4265 -15070 -12128 -4683 4894
6336 4894 -21601 -20376 1412 6779 10170 -10471 10106 8961 -9198 -19796 -18514 -26810 -18299
6323 -18299 -5438 -662 -10632 -4598 -8664 -3411 42 -18515 -22222 -3800 4235 -11426 -14833 -12842
6309 -12842 -14898 -18339 -17688 -24203 -16836 -23185 -24321 -17162 -9947 15207 -589 -2582 7126 -70
6295 -70 14268 -6225 -10213 -3377 -9502 -11116 -8214 6723 6248 2486 -10980 -490 11622 2482
6281 2482 4923 2740 -5178 -7315 -3449 -2805 4768 -9052 -10003 -656 12378 -7597 -448 3236 1148
6266 1148 -156 -1994 4907 7656 3271 1129 -9004 -28960 -33674 -29540 -28655 -17007 -6274 -6651
6252f651j6818l552N50J3768N886K609q871j3269K1562n219K398Q152O105J4642
6238B1292j6093j1038p08j5087R371K951L55J8542j8775j0711Q657p787n647K1386
6224c292m260r769J0789N34K0409n626r415p580M861K136Q623j2714J5769j5057
6210d592J3031R77M393M377j4206M704q393N308N320R63j9258Q136N043j1825
6196f022j6583J0109N766P924q067O243j4296J5317k285r372M552n343J8679O899
6182A3521n432q267N689j6201J1125K619N429j5903m690J7615L26o170K999j8328
6168a5668J1424QJ33q004j3080K746J901J7121P912J120o329L581N191j3383j1167
6153a6494K231K687l779P778P140o613J2863j0083N040P19J0412j5406p766l753
$$ plain form
6252 -6651 -23469 -27021 -26471 -12703 -6817 -4208 -13079 -26348 -4786 -10005 -7607 545 6650 21292
6238 21292 5199 -5839 -6547 -21634 -12263 -9312 -8957 9585 -9190 -19901 -11244 -19031 -24678 -3292
6224 -3292 -7552 -17321 -6532 -5998 14411 8785 -630 -8210 -3349 -1213 7410 -5304 10465 -4592
6210 -4592 8439 9416 13809 18186 3980 8684 291 5599 10919 11882 -7376 760 5803 -6022
6196 -6022 -22605 -12496 -6730 1194 -6873 -630 -14926 391 -1894 -11266 -6714 -12057 6622 13521
6182 13521 8089 -178 5511 -10690 435 3054 8483 -7420 -12110 5505 5831 -339 2660 -15668
6168 -15668 -4244 -4236 -4103 -12107 -25187 -22441 -20540 -3419 4493 5613 -716 2865 8056 -5327 -16494
6153 -16494 -14263 -11576 -15355 -7577 -437 -7050 5813 -4270 770 1489 11901 -3505 -11271 -15024
6139a5024N36Q555J963j3305p171J4997M629j0774O874n514N34J8745k0128q079
6125b3162L985J0428R335k626j120L960k527j8005J267j361n517J660o530J1765
6111a8448M384O794L041J656p627o899q097J8643O423l651o477j2798j451l87
6097b4894M775O874O87J0060L600j6210R750P444O077J5149j9257j0355L176j410
6083d534L653l374k2065M362J098M417k435J5628N625l454p812k4508J6303j9241
6069c6337j906J6888O526K998l852R448P727k1367J634J0325n52J149J2911p071
6055a479j6768N017J9255j393j5036N806R094K53k5989P813P842j6877N004J1223
6041f235J1910n99q074q273J4102q08O836n326O373n018r440J1114r49j3755j2653
$$ plain form
6139 -15024 -14488 -5933 -3970 -17275 -24446 -9449 -4820 -15594 -8720 -14234 -13700 5045 -15083 -23162
6125 -23162 -19177 -8749 586 -2040 -3160 800 -1727 -19732 -18465 -19826 -25343 -23683 -30213 -18448
6111 -18448 -14064 -7270 -4229 -2573 -10200 -17099 -25196 -6553 -130 -3781 -10258 -23056 -24507 -24894
6097 -24894 -20119 -13245 -12558 -2498 1102 -15108 -5358 2086 8163 23312 4055 -6300 -3124 -4534
6083 -4534 -881 -4255 -26320 -21958 -20860 -16443 -18878 -3250 2375 -1079 -8891 -33399 -17096 -36337
6069 -36337 -38243 -21355 -14829 -11831 -15683 -6235 1492 -19875 -18241 -7916 -8468 -7319 5592 -1479
6055 -1479 -18247 -13230 6025 4632 -10404 -4598 4496 4749 -21240 -13427 -5585 -22462 -17458 -6235
6041 -6235 5675 5076 -2998 -11271 2831 2023 8859 3533 9906 4888 -4552 6562 5613 -8142 -20795
6026b0795M374J1756n364j1024M893J1551l455R260O626o772n455J5663m203n402
6012A653r947m225N462J369q453l425J606J037K480J70N496L675L340O617m262
5997B593j4039J249L76J2149P27L265M710R376j196M35j5646j3595J42l913J3258
5982a09K86m007R098j2046r70J4602O183j3788M280k3288J3303K888l382m40p979
5967a5369q640N510J1441n408J9094p003L920L022o880N523J926M007j2936m963
5953f756O623L440k058m739O325J6957j1489N078N967m442L560J992m687k059
5939A3712M352J228M099q0J8876m405k2727R099q241Q632m379l223N782M711J0975
5924C8411k304j3303l324n081K411J5884n029j302j1121J3848J1651r04Q854J3540
$$ plain form
6026 -20795 -16421 -4665 -10029 -21053 -16160 -4609 -8064 1196 7822 1050 -4405 11258 7055 1653
6012 1653 -8294 -12519 -7057 -5688 -14141 -17566 -15960 -14923 -12443 -12273 -6777 -3102 238 6855 2593
5997 2593 -11446 -10197 -9821 2328 3055 6320 11030 20406 19210 19645 3999 -9596 -9454 -13367 -109
5982 -109 177 -3830 5268 -6778 -7748 6854 13037 -751 3529 -19759 -6456 -3568 -6950 -7390 -15369
5967 -15369 -24009 -18499 -7058 -12466 6628 -375 3545 6567 -313 5210 7136 11143 -1793 -6756
5953 -6756 -133 3307 1249 -3490 2835 19792 8303 13381 19348 14906 18466 20458 15771 13712
5939 13712 18064 19292 23391 23311 42187 37782 15055 24154 15913 24545 20166 16943 22725 27436 38411
5924 38411 36107 22804 19480 14399 16810 32694 27665 26363 15242 29090 40741 39837 48691 62231
5910F2231o581N03K730q17P119j6395j4844p219J1846N470L748o304n768J4240
5896D9959Q753p305j0507J7013K276m761j1959n571r679K3054K1530n472j792
5883F5539J0513J6175M025p252l88j3847L370p608Q401q507j9324j2745o476k077
5869B9799J5644j2864J244r692n338Q476O080Q613o544J1442q574L171J017K360
5855D4834J7063J6894l757r40l009M647k7068j8137p124O93K011Q484N324j3513
5841B6402O527j137n251J696r950l261N186r672J410K237J0602J7929J0699N894
5827E9311j4498k2970J3029K134m549k606j7960J326j9642R203M892L016o602
5814D084J2634P767j5044J1503l127J1563k224k4670j8619J092P390Q178J0454
$$ plain form
5910 62231 55650 56153 58883 58066 65185 48790 33946 26727 38573 44043 47791 41487 35719 49959
5896 49959 58712 51407 40900 57913 60189 55428 43469 37898 28219 51273 72803 67331 65539
5883 65539 76052 92227 96252 89000 88612 74765 78135 70527 78928 70421 51097 38352 31876 29799
5869 29799 45443 32579 33823 24131 18793 27269 33349 41962 35418 46860 38286 41457 42474 44834
5855 44834 61897 78791 75034 74094 71085 75732 48664 30527 23403 24096 26107 34591 39915 26402
5841 26402 32929 31792 26541 28237 18287 15026 20212 10540 11950 14187 24789 42718 53417 59311
5827 59311 44813 21843 34872 37006 32457 29851 11891 13217 -6425 2778 7670 10686 4084
5814 4084 16718 24485 9441 20944 17817 29380 27156 2486 -16133 -15041 -7651 527 10981
5801A0981L026k3579n477L0236j3209J2792J3384j4122r492M116m840p029L360
5788A47l520r531K1470J665k8977N11J4287n441J9861J958K296j1469m239K9808
5774B8826j1093j3114J765m688n455P246j0313K1262r582m53q750j796J0853p003
5760b295N052P20n220K239j2608M51o74J3844J2618N96R55j6674j1845P762K5725
5745B0646J3926k8971j9562J4045K0985j1921n995p705Q829R937J6808o387q965
5732A5670J2165j6148j4801N883J6035r15k130p036Q66N801Q622j1263k088R325
5718A9986J4712M946l61j7023P162j6320P421J874j2172K3603j1963m306M628
5705B2187p266M148J17J0400P576p6j0479J147j5838N776j3140P418l692r4J1162
$$ plain form
5801 10981 14007 -9572 -15049 15187 1978 14770 28154 14032 4540 8656 3816 -3213 147
5788 147 -3373 -12904 8566 10231 -18746 -18235 -3948 -9389 10472 12430 14726 3257 -982 28826
5774 28826 17733 4619 6384 1696 -3759 3487 -6826 14436 4854 4401 -4349 -6145 4708 -2295
5760 -2295 2757 3477 -1743 496 -12112 -11661 -12335 1509 14127 14723 15678 -996 -12841 -5079 20646
5745 20646 34572 5601 -13961 84 21069 9148 3153 -4552 4277 14214 31022 24635 15670
5732 15670 27835 11687 -3114 2769 18804 17889 15759 8723 9589 15390 24012 12749 10661 19986
5718 19986 34698 39644 39283 22260 29422 13102 20523 22397 10225 33828 21865 17559 22187
5705 22187 14921 19069 19186 29586 37162 37086 26607 27754 11916 17692 4552 11970 8278 8184 19346
5690A9346l016J22J3847j0431m359Q200q945J3106r523q573J8979j893n189j973
5676A9698p917J2353K017q210j1340l299o534Q245J1655L595M44K2113q579o180
5662B8061r196J2310k170p490m985M463P917L556J5322j4758J1886J332q743k622
5648C4883l146J1540l287N732j7299n984M331p765J5537m085J726j1661O850P058
5634C4430J3055r129j1628K5001m206N942K264j2377J1965J0486j1330K2521M946
5621H1940M162m272j231k061k166j6903O348j0240K730J7019j1149J470J1211
5608G6858j0073N030o63J811J4130j7817m680p280J5718k061O186n702K103K6250
5594I9810Q590R008J6562J7556K5033Q269n341j9681j5422j8267j7490j3730n266
$$ plain form
5690 19346 16330 16452 30299 19868 15509 23709 14764 27870 18347 9774 28753 26860 21671 19698
5676 19698 11781 24134 26151 17941 6601 3302 -3232 5013 16668 20263 20707 42820 34241 28061
5662 28061 18865 31175 29005 21515 16530 20993 28910 32466 47788 33030 44916 46248 37505 34883
5648 34883 31737 43277 39990 45722 28423 22439 26770 19005 34542 30457 32183 20522 27372 34430
5634 34430 47485 38356 26728 51729 47523 53465 55729 43352 55317 65803 54473 76994 81940
5621 81940 86102 81830 80599 78538 76372 59469 65817 55577 58307 75326 64177 65647 76858
5608 76858 66785 71815 71152 72963 87093 69276 64596 57316 73034 70973 77159 71457 73560 99810
5594 99810 108400 117408 133970 151526 176559 184828 179487 159806 144384 126117 108627 94897 89631
5581H9631l231k2010m31k735K6623R110R963j2209l095o864N702O538L511K987
5567A03490k1478m329K462Q907o0J4332Q576P305K8465K0619Q224j309k2490p268
5553A45446r93j2416j2851k0928j102j818j4612j9889p04M148l366R463j6766
5540E3612R674p756J350Q120m714M74j3511M181J9354r354L70O815J6444P8j5399
5525F9738J3133q28j9034j6150Q286q105n345R387K1367l556l0679r502n363J5246
5511C8595J0317J8107o032r732m110j0006O776O376O808l344M350M408k8907O311
5497C9917j6911l101J2822P037R678M675k650j0879r58j610j0673J4451J4923
5484E6721j1696j692o614j8077R705J21j4516P869Q061J514J4560o271R316n103
$$ plain form
5581 89631 86400 64390 63959 61224 87847 96957 106920 94711 91616 84752 90454 96992 100503 103490
5567 103490 82012 77683 80145 89052 88992 103324 111900 119205 147670 168289 176513 175204 152714 145446
5553 145446 144453 132037 119186 98258 97156 95338 80726 60837 60133 64281 60915 70378 53612
5540 53612 63286 55530 56880 65000 60286 60760 47249 51430 70784 61430 61800 68615 85059 85137 69738
5525 69738 82871 82043 63009 46859 55145 47040 41695 51082 72449 68893 38214 28712 23349 38595
5511 38595 48912 67019 60987 51255 47145 37139 43915 50291 57099 53755 58105 62513 33606 39917
5497 39917 23006 19905 32727 39764 49442 54117 51467 40588 39630 38020 27347 41798 56721
5484 56721 45025 43333 36719 18642 28347 28468 13952 21821 29882 31396 45956 39685 49001 43898
5470D3898o837r160M167R448r588N822K052o427q92j0338L827K5986J767j1271
5456D2454j5872K4278N227o416k993n779j7171n942M904J0803N34K340N904J027
5442D3298j0184L464n01J2533j3201R501m893j8633l497J2195L710M568J7136
5429E5496k0083P006n138o495P510n296J0956J5950m26l54K90n336J844m727n302
5414D5895l048J2616J2991j2548q888J648K0074k743j1710j084l845l67O801M622
5400F0414K635j2139l904J7377k200L760k0396k617K1097j2194J276K1220j3459
5387F0870K3807N049K319J6820J0785J0531J2523l598j1210k601o07p397q300
5374A08991M381r207J13M923k63l5583l968R098j5807m346K635J1713j5378q504
$$ plain form
5470 43898 37061 27901 32068 41516 31928 37750 39802 33375 32483 22145 25972 51958 53725 42454
5456 42454 26582 50860 56087 49671 46678 40899 23728 17786 22690 33493 34027 36367 42271 43298
5442 43298 33114 36578 36077 48610 35409 44910 40017 21384 17887 30082 33792 38360 55496
5429 55496 35413 42419 37281 30786 38296 33000 43956 59906 59480 59126 59416 54080 55924 51197 45895
5414 45895 42847 55463 68454 55906 47018 48666 68740 65997 54287 53203 49358 48991 55792 60414
5400 60414 63049 50910 47006 64383 62183 65943 45547 42930 64027 51833 53109 74329 60870
5387 60870 84677 89726 92045 108865 119650 130181 142704 139106 127896 125295 124688 117291 108991
5374 108991 113372 104165 104278 109201 108938 73355 69387 78485 62678 58332 60967 72680 57302 48798
5360D8798J6910j8175j222P103l521P740j2992J1143J5483l464j4088R69M970
5347E9654k0327J0687Q480q590J2942j8947K332J2550L672j263j0718j295M178
5334E3355J8167j1643j0479j7230N194J5087m886j2436M848n654m490J027O126
5321C6986J1485J7419q590J3039M732k7017Q650O891j4628n703M176J3675j0264
5308E0851J753R241J477K302R061n202P101j8963p874O769J4678J0585p49P9K640
5293H3749m929r619J2941j3976n980j3725k838L440K1949J010m569l287m062l949
5279E6155j6366J1858J209K564L938J5457J4387q84j3071J029p32P234q31K328
5265H4275r909O716K3304k1115M439K288q189J0017J038J4832j3849j5379l749
$$ plain form
5360 48798 65708 47533 46311 53414 49893 57633 44641 55784 71267 67803 53715 54684 59654
5347 59654 39327 50014 58494 49904 62846 43899 46231 58781 62453 61190 50472 49177 53355
5334 53355 71522 59879 49400 32170 37364 52451 47565 35129 39977 34323 29833 30860 36986
5321 36986 48471 65890 57300 70339 75071 48054 56704 63595 48967 43264 47440 61115 50851
5308 50851 52604 61845 63322 65624 74685 69483 76584 57621 49747 56516 71194 81779 81030 81109 83749
5293 83749 78820 69201 82142 68166 62186 48461 45623 49063 71012 72022 67453 64166 60104 56155
5279 56155 39789 51647 52856 55420 59358 74815 89202 88318 75247 76276 75544 82778 81947 84275
5265 84275 74366 81082 104386 83271 87710 89998 81809 91826 92864 107696 93847 78468 74719
5252G4719j0623M750j9984J2693N044J0162j223j2284O669K075j5124P858J956
5239F6688K009N523j2637J0923J3463l149L766q348j1632J1255J3388M999k364
5226I3884r668j2801k988R101j2742J5218J320j273L378P961j0469J027O408p178
5212H1178Q365L199j120M572K114J47J6426J9548j3271j7388J0305P915j1034
5199A10956o735K562K0950K0526j1246N768j2360j4534J1898m350n5q184j4985
5186A00211K3885j393M977l95J2015M444j1945L590J3679q003O736J0876n003
5173A53674N118L659J3385M8o056n009j4327m871Q317J4262J7849M523m559Q336
5159A94349m397M469K2528K896j8536L522K2333M820j7842N142J1026l364O075
$$ plain form
5252 74719 64096 68846 48862 61555 66599 76761 75538 63254 69923 71998 56874 64732 66688
5239 66688 68697 74220 61583 72506 85969 82820 86586 78238 66606 77861 91249 96248 93884
5226 93884 84216 71415 68427 77528 64786 80004 81324 80051 83429 91390 80921 81948 88356 81178
5212 81178 89543 92742 91622 96194 98308 98455 114881 134429 121158 103770 114075 121990 110956
5199 110956 104221 106783 127733 148259 137013 142781 130421 115887 127785 123435 123380 115196 100211
5186 100211 124096 122703 127680 127285 139300 143744 131799 135389 149068 141065 147801 158677 153674
5173 153674 158792 162451 175836 175884 169828 164819 150492 145621 153938 168200 186049 190572 186013 194349
5159 194349 189952 194421 216949 219845 201309 204831 227164 231984 214142 219284 230310 226946 233021
5146B33021L243K4739J998J5451J6140m379K2207P689j6114J0908Q303n562K2479
5133C40123K6007M549K6709P470J7767L498N178J6285J3719J5996J5808L3336
5121E26445K8183K8810L0420L2118M2148L5998L6735M2944N0814N4555N9181N8334
5109A026685Q7775J00268R7005J17712Q2848O9291O9225L7788M0615O5784O7050
5098A862046Q6896J00187J07313J41825J43128J42335J47562J43569J05424P7062
5088C057347R4506J12254J47077J95741K09095K34579K51120L17419L28201L63225
5078E310564L79511L83431M19423M82129O12125Q05052J046697J399057J787372
5069A2625361J934495J642706R76800j54507j590861j752777j271079q04211m73892
$$ plain form
5146 233021 236264 261003 263001 278452 294592 290213 312420 320109 303995 314903 323206 317644 340123
5133 340123 366130 370679 397388 404858 422625 426123 431301 447586 461305 477301 493109 526445
5121 526445 554628 583438 613858 645976 688124 724122 760857 803801 854615 909170 968351 1026685
5109 1026685 1114460 1214728 1311733 1429445 1512293 1581584 1650809 1688597 1729212 1794996 1862046
5098 1862046 1948942 2049129 2156442 2298267 2441395 2583730 2731292 2874861 2980285 3057347
5088 3057347 3151853 3264107 3411184 3606925 3816020 4050599 4301719 4619138 4947339 5310564
5078 5310564 5690075 6073506 6492929 6975058 7587183 8392235 9438932 10837989 12625361
5069 12625361 14559856 16202562 17179362 17024855 15433994 13681217 12410138 11605927 11132035
5060A1132035l55440m33083n50944p91630r61916q20450o66223o31139o40293
5051E280917n90413n16677m15219l54870l02492k64781k30620j98097k00403j80674
5041B026671j48687j56572j24059r0630q0819q9032o1902p9336n8698o6090n7866
5030A012980n5399m3071m3187m7398k9518k2735k4196k1999l7371j0959j6048
5019F61099l7693m2489r042j5579J0929l0169m2496k8726k1419p325j5835o753
5007D14502r807j7261k3773j1769j5829J3120j3021j6302l865j7334l71q126k4029
4994B66135m485p313N098n495m745l399j7022o255M767k611p647j0649k13O920
4980B13086j5063n964p42R96j7437o911R447j1765J3182Q99k6809P042o306l291
$$ plain form
5060 11132035 10776595 10343512 9792568 9000938 8039022 7218572 6552349 5921210 5280917
5051 5280917 4690504 4173827 3758608 3403738 3101246 2836465 2605845 2407748 2207345 2026671
5041 2026671 1877984 1721412 1597353 1506723 1425904 1336872 1274970 1195634 1136936 1070846 1012980
5030 1012980 957581 914510 871323 823925 794407 771672 747476 725477 688106 677147 661099
5019 661099 623406 580917 571875 556296 567225 537056 494560 465834 444415 437090 421255 414502
5007 414502 404695 387434 363661 351892 336063 349183 336162 319860 315995 298661 298290 290164 266135
4994 266135 261650 254337 259435 253940 249195 245796 228774 222519 227286 224675 217028 206379 206166 213086
4980 213086 198023 192059 191317 192313 174876 167965 177412 165647 178829 179728 152919 159961 153655 150364
4966A50364J6096k700m239m340j3846p249J0202J8490j2556q750j0285L966J1163
4953A46316k63l533O667j6301n95l990K396M42o952L800n688P214Q235j0525o551
4938A20672J738p977k685j9839o96J879k586R328K3767k813p520J669j6144o848
4924I1945n398N04l307n236k076Q633M346j0195j981m377J1260p350p881j1521
4910E7366j317J8341j280R516J9298r291j1252j2137n924j169J0788J5195J602
4897H9736M200j5590k2162j111K0778J810P627Q020L396q802j8474K1950J3238
4884A04616p90k6929J4680j1720n515R39R947J967k3739Q591j845N839p52l451
4870G1838L126j4051O927J720j0339m306n779O79m345K709O591R195m771J3367
$$ plain form
4966 150364 166460 163760 159521 155181 141335 134086 144288 162778 150222 141472 131187 135153 146316
4953 146316 146053 142520 149187 132886 132291 128301 130697 131139 124187 127987 122299 129513 137748 127223 120672
4938 120672 122410 114433 111748 91909 91213 93092 90506 99834 123601 120788 113268 114937 98793 91945
4924 91945 86547 87051 83744 78508 76432 85065 89411 79216 77235 72858 84118 76768 68887 57366
4910 57366 56049 74390 73110 82626 101924 92633 81381 69244 63320 62151 72939 88134 89736
4897 89736 93936 78346 56184 55073 75851 77661 85288 93308 96704 87902 69428 91378 104616
4884 104616 103826 76897 91577 79857 74342 75281 85228 87195 63456 72047 70202 76041 75289 71838
4870 71838 74964 60913 67840 69560 59221 54915 49136 49815 45470 48179 54770 63965 59194 72561
4856G2561j2147J1416k0648j2203K7514N978m534j066m926O46R076p995J9n112
4842E8579Q124K55p8q059j3529k077q75Q473J3412O967r048n271l142P726K399
4827F3856k215n203m283Q715J907n964r707l043O320M395P955O408o918Q549p96
4812F9976j6810n350m571k29K1067j1787J374L572q113N990n030m295J632J8042
4798F5468n967j0145J1114J0213J2919k25q16k3862J630K758j0934J2121J8035
4785H2309k1271m815L076J2806J806J320j003K400K266k4064q101J156K333P901
4771E8119L003o170j6229j895K0012K337K3183o012r67j7035J5858M466n498P495
4757H0667l033j275P971M230O78R297K6600J5075j9808j9548J3558P151j6520
$$ plain form
4856 72561 60414 71830 51182 38979 66493 72471 67937 66871 61945 62591 71667 63672 63691 58579
4842 58579 66703 66958 66880 58821 45292 43215 42340 50813 64225 71192 62144 56873 53731 61457 63856
4827 63856 61641 56438 52155 60870 62777 56813 47106 44063 50383 54778 62733 69141 62223 70772 69976
4812 69976 53166 47816 43245 43016 64083 52296 53670 57242 49129 55119 50089 45794 47426 65468
4798 65468 59501 49356 60470 70683 83602 83377 82561 58699 60329 63087 52153 64274 82309
4785 82309 61038 56223 59299 72105 73911 75231 74228 76628 78894 54830 46729 47885 50218 58119
4771 58119 61122 54952 38723 36828 56840 59177 82360 76348 75381 58346 74204 78670 73172 80667
4757 80667 77634 76359 84330 88560 89238 98535 125135 140210 120402 100854 114412 121563 105043
4744A05043n480q012m384J8760N726j9617o670j5434l150J4602p549K200q152
4731F7883r590p441R207P10l882J5747M298r027k8120O659K0116J0255j9561j267
4717E5987J1358J0046l274l5p349j6469J3619M344j41j116p214O226J7766n487
4703G8261j7596j9522J4468K0553j3633j471J3491m406J2278k0212j584J9537
4691H0164l598o473o231L300l016M267M589P994n969J14m085j5361Q784K090O049
4676G2618p013R235M455p794l648q395L17J3744o027q367k148J0793J0746J1667
4662I0183k205K12k5439k973J1362k92J93l011J7349m436j6397j3442J1194K446
4648F4744q13J2476L686k5729J2420r005o808J2631j123j3723Q371j0109J2799
$$ plain form
4744 105043 99563 91551 87167 105927 111653 92036 85366 69932 66782 81384 73835 76035 67883
4731 67883 58293 50852 60059 60769 56887 72634 76932 67905 39785 46444 66560 76815 57254 55987
4717 55987 67345 77391 74117 74082 66733 50264 63883 68227 68086 66970 59756 65982 83748 78261
4703 78261 60665 41143 55611 76164 62531 61060 74551 70145 82423 62211 60627 80164
4691 80164 76566 70093 63862 67162 64146 68413 73002 80996 75027 75141 71056 55695 64479 66569 72618
4676 72618 65605 74840 79295 71501 67853 59458 59775 73519 67492 59125 56977 67770 78516 90183
4662 90183 87978 88190 62751 59778 71140 70848 71041 68030 85379 80943 64546 51104 62298 64744
4648 64744 63931 76407 80093 54364 66784 57779 50971 63602 62479 48756 57127 47018 59817
4635E9817P162L763p351J5458r351q617J4821J2080J532K405q257P815j8589q67
4621G1821J061Q663P71p675O863l686j3186k9275J3857M64q856J2831J8563p889
4607F4327M694p601J0799k381l608J1708k740J960J4450L274p358o948o091j6062
4593E8423R460P786P621r250m561k359O505l241P612j2385N430K009K654n957
4579F9747o266M959J1900O674m395K1509j8951l330L97j1930O217L755J742L202
4565H5230q148o471Q554K790j2617J1574P325J8513j0204k2688j3687J1245N253
4552G6669N273l265J5942R207n942m159L568p35P138K534n643J3232j190n861
4538A06768m670n953m073Q892r114j1968J4204O292J7758J0086k0306R400O285
$$ plain form
4635 59817 66979 70742 63391 78849 69498 60881 75702 87782 89314 91719 83462 91277 72688 71821
4621 71821 72882 81545 82316 74641 81504 77818 64632 35357 49214 49678 40822 53653 72216 64327
4607 64327 69021 61420 72219 69838 66230 77938 75198 77158 91608 94882 87524 80576 74485 58423
4593 58423 67883 75669 83290 74040 69479 67120 73625 70384 77996 65611 71041 73050 75704 69747
4579 69747 63481 68440 80340 87014 82619 104128 85177 81847 82244 70314 76531 80286 82028 85230
4565 85230 77082 70611 79165 81955 69338 80912 88237 106750 96546 73858 60171 71416 76669
4552 76669 81942 78677 94619 103826 97884 93725 97293 96558 103696 106230 100587 113819 112629 106768
4538 106768 102098 96145 92072 100964 91850 79882 94086 100378 118136 128222 107916 117316 123601
4525A23601o046N28J1503J0839j666o488J1859Q759J6239j8416j987J3382J1367
4512A73474j3133j888O890m380L950J2750k269O704k127J8418m576J1254J2385
4499B17452J0078j3784o527J2419j0768j2996O716J3207p977Q85J5028P086n279
4486B25540n39n928K9256J195K751q442l76o812p532j3248K892J941k0969P861
4472B07590J1873m522N49N375k883L451p464j930j7482j128m504k8897J2189J0687
4458A82904J8655R0j6604r412K864R98r10k131Q356j2471p671O607j3293N611
4444A63593N15O272n43j3824J3665j4074N867o59p633l183J7985J714o444q768
4430A54483l430K4191p343j0732J1715p212j5179N689l432K2826L60K0936j6630
$$ plain form
4525 123601 117555 118083 129586 140425 138759 132271 144130 152889 169128 150712 148725 162107 173474
4512 173474 160341 158453 165343 160963 164913 177663 175394 182098 179971 198389 193813 205067 217452
4499 217452 227530 213746 207219 219638 208870 195874 202590 215797 207820 208705 223733 230819 225540
4486 225540 225001 219073 248329 249524 252275 243833 243457 236645 229113 215865 218757 220698 199729 207590
4472 207590 219463 214941 215490 220865 217982 221433 213969 212039 194557 193429 188925 160028 172217 182904
4458 182904 201559 201649 185045 175633 178497 179495 178585 176454 184810 172339 164668 171275 157982 163593
4444 163593 164108 170380 169837 156013 169678 155604 161471 160812 153179 149996 167981 169695 163251 154483
4430 154483 151053 175244 167901 157169 168884 161672 146493 152182 148750 171576 171936 192872 176242
4417A76242q732J3676j8438O260O013R459j6845M958L765R07L873O757j1066j2522
4403A64307M065j5688N290P784J1298Q529Q974k877j7835J3687k383N990J2021
4390B03162k9111J0311J7880J978J3645Q99q170j478j0208q511M436J6273R702
4377B20808r030J2004k0023Q017L788r686l077j5538K1163P343k803J0354J2478
4364B35798j8060j1364J3035q424j3658P677K768m10O414M468J5477J105R563
4351B44389Q765l531O63q819J5586l819M792M245L088O302j9425p769K7039j2950
4337B58556k4672K0726L0736r172j034j415P358J5901j8637J4865M861n770J0716
4324C03019j4306J1487R272J6612J534j3867K149J5144J9774j368p38K6903j363
$$ plain form
4417 176242 167510 181186 162748 169008 175021 184480 167635 172593 176358 177265 181138 187895 176829 164307
4403 164307 168372 152684 157974 165758 177056 185585 194559 191682 173847 187534 185151 191141 203162
4390 203162 174051 184362 202242 204220 217865 218764 210594 209116 198908 190397 194833 211106 220808
4377 220808 211778 223782 203759 211776 215564 205878 202801 187263 208426 215769 212966 223320 235798
4364 235798 217738 206374 219409 210985 197327 205004 207772 207362 213776 218244 233721 234826 244389
4351 244389 253154 249623 250286 241467 257053 253234 258026 262271 265359 271661 252236 244467 271506 258556
4337 258556 233884 254610 285346 276174 275140 273725 281083 296984 278347 293212 298073 292303 303019
4324 303019 288713 300200 309472 326084 327618 313751 315900 331044 350818 349450 348712 375615 374252
4311C74252k0301L0787l592j0680Q839J3859j031p421J1747J1424J4082q499r220
4298D04246K5717R218m125j5309K102K3050J7353j519J4428R250J3013K646J4946
4285E15016K4985k781Q700J7553m116L175M2984Q489K647J3545l176L4239J8518
4272F79778N145J7192K7589K4187L0111L5850J5331K4853L0418J9325M7682L2120
4260I89581M1433K5244M0266O0798J9095L5079L5981P1363N7553M5425M8598N6327
4248A526743N8071P0090R1901R6291Q4949R0234J04976J20459J34010J24594J18591
4237B620909J29605J32698J52770J57542J76931K03313K17400K17749K11971K24045
4227D444933K48184K51581K58441K70243K70983L23737L48228L44256M07414M25966
$$ plain form
4311 374252 353951 384738 381146 370466 379305 393164 392133 384712 396459 407883 421965 413466 404246
4298 404246 429963 439181 435056 419747 421849 444899 462252 460733 475161 484411 497424 500070 515016
4285 515016 540001 537220 545920 563473 559357 562532 605516 614005 616652 630197 627021 661260 679778
4272 679778 684923 702115 729704 753891 784002 819852 835183 860036 890454 909779 957461 989581
4260 989581 1031014 1056258 1096524 1157322 1176417 1211496 1247477 1318840 1376393 1421818 1470416 1526743
4248 1526743 1584814 1654904 1746805 1843096 1928045 2018279 2123255 2243714 2377724 2502318 2620909
4237 2620909 2750514 2883212 3035982 3193524 3370455 3573768 3791168 4008917 4220888 4444933
4227 4444933 4693117 4944698 5203139 5473382 5744365 6068102 6416330 6760586 7168000 7593966
4217G593966M66916M83250N05819M73371M23438L73528L69171L39643L32253L77384
4207A1738739M15445M61692N45996O33866P16956P64725P69030P04937N52021
4198A7303407L56651J71527N2460l7306j7543L9731J27151K40060L87209N21945
4188A9145292O41519O80314O10877M16746J23174k20244m83973o60784o91702
4179A9561219o59554n57268m27288k64657o8524Q4140J82713J82257O3753j69329
4169A7927462m50582o89144q93749r48643r33909q46041p44706o20444m83865
4160A1316379l49425k58333j90256j91332k59601l78517n02884n97944o28823
4151G959264n92151n65545m97105m30533l79678l28398k67074k23166k15365k00473
$$ plain form
4217 7593966 8060882 8544132 9049951 9523322 9946760 10320288 10689459 11029102 11361355 11738739
4207 11738739 12154184 12615876 13161872 13795738 14512694 15277419 16046449 16751386 17303407
4198 17303407 17660058 17831585 17884045 17846739 17829196 17868927 17996078 18236138 18623347 19145292
4188 19145292 19786811 20467125 21078002 21494748 21617922 21397678 20913705 20252921 19561219
4179 19561219 18901665 18344397 17917109 17652452 17583928 17668068 17850781 18033038 18096791 17927462
4169 17927462 17476880 16787736 15893987 14945344 14011435 13165394 12420688 11800244 11316379
4160 11316379 10966954 10708621 10518365 10327033 10067432 9688915 9186031 8588087 7959264
4151 7959264 7367113 6801568 6304463 5873930 5494252 5165854 4898780 4675614 4460249 4259776
4141D259776k11800k33836k39297k29219j91162k14156j83799j66685j32660j15185
4131B341977j29854j04004p7971q9404q1295n3647n5047o2520p0630m2428m5002
4120A530175n0460k4091k5555l1682l6393k8374n5228l0037k6213l1355l5820
4109A154967l1886k0457m2059l9317l5007k6625j9297k9053k8340j5707q282Q83
4097H59820l5419l850R978j1716p386Q40m943J047k906j1378L1624l434J0261
4084H32538O652P584J7008L4126J1661O397N938K0677J5880J1430J6143j4686
4072I71348l8850k0470k6115k6338k0489m8503l8476l9675k7162k9935j7858j6411
4060F21066k3916l2103K276l5042k7187r167p935P956j1769m619k2548j5224r997
$$ plain form
4141 4259776 4047976 3814140 3574843 3345624 3154462 2940306 2756507 2589822 2457162 2341977
4131 2341977 2212123 2108119 2030148 1940744 1859449 1805802 1750755 1688235 1617605 1575177 1530175
4120 1530175 1479715 1455624 1430069 1398387 1361994 1333620 1278392 1248355 1222142 1190787 1154967
4109 1154967 1123081 1102624 1060565 1021248 986241 959616 940319 911266 882926 867219 858937 859820
4097 859820 824401 820551 830529 818813 811427 812267 807324 808371 805465 794087 825711 822277 832538
4084 832538 839190 846774 863782 897908 909569 915966 921904 942581 958461 969891 986034 971348
4072 971348 932498 912028 885913 859575 839086 790583 752107 712432 685270 655335 637477 621066
4060 621066 597150 565047 567323 532281 505094 495927 487992 495948 484179 479560 457012 441788 431791
4047D31791j3623m154j5186Q734j229j601j3217j4887J0749k540o536n804k456
4034C70041L47q187J592l411k297O573p284j5118q604k608J737O332L165j546
4020C40732n156j896j6454j1871M571J5133j2569R513q948M292M761j3981l402
4007C04725J3385M355j0114k526l665K769Q46N515M98j2473m39n38M296j8953
3993B87681j527J0084m473P482N833j993j0571N077j9435K981L802m264R908J1857
3979C02442p641k6527J6629J0329M692r299k1441J3403K741J7520J586r780j760
3966B92894L64m485j525M294J5728O473r118L659N965o036Q772j4052R302N607
3952C17842j219j0627J5261L035N936L574k884o437K2421k06p301Q542o267K81
$$ plain form
4047 431791 418168 414014 398828 407562 406333 404732 391515 376628 387377 384837 378301 372497 370041
4034 370041 370388 362201 363793 360382 358085 364658 357374 342256 333652 331044 332781 339113 342278 340732
4020 340732 335576 333680 317226 305355 309926 325059 312490 322003 313055 317347 322108 308127 304725
4007 304725 318110 322465 312351 309825 306160 308929 309775 315290 315788 303315 302876 302338 306634 287681
3993 287681 286154 296238 291765 299247 305080 303087 292516 297593 278158 281139 284941 280677 290585 302442
3979 302442 294801 268274 284903 295232 299924 290625 269184 282587 285328 302848 304434 294654 292894
3966 292894 293258 288773 287248 291542 307270 313743 304625 308284 314249 308213 316985 302933 312235 317842
3952 317842 316623 305996 321257 324292 330228 333802 330918 324481 346902 346696 339395 347937 341670 341951
3938C41951Q653J5200m299l947L547j8642P689K3158j7531j409l146K916N261
3925C59401N252p952o17O6J4823l021J290R066J1632J3571l07L999K4976m186
3911D27993m892r326J4794p717K919K2227J2372J1103j5902L793K8701L048K1567
3898E10680K1107N635M868j2844M353J3019k457R849n778M882P066R705N088J3208
3884E88381L1980J524p434j1712k845J401J9902k4216o353O283K7598R157K6m588
3870F29104J0798P068m285L5j106J3487k0849L079j723n430K3389K8735k560l7
3856F79705q6L788K978K5752L0660N575J324J8398P729J4822K5398J5357J9452
3843H50852K8089K0657O803Q388j456j168J160p584J2261j3978l752j217j2876
$$ plain form
3938 341951 350604 365804 361505 357558 361105 342463 350152 373310 355779 354370 351224 354140 359401
3925 359401 364653 356701 356084 356150 370973 367952 369242 378308 389940 403511 403204 407203 432179 427993
3911 427993 423101 413775 428569 420852 423771 445998 458370 469473 453571 457364 486065 489113 510680
3898 510680 531787 537422 542290 529446 533799 546818 544361 554210 548432 553314 560380 570085 575173 588381
3884 588381 620361 621885 614451 602739 599894 601295 621197 596981 590628 596911 624509 633666 633692 629104
3870 629104 639902 646970 642685 642720 641614 655101 634252 637331 635608 630178 653567 682302 679742 679705
3856 679705 679619 683407 686385 712137 742797 748372 749696 768094 775823 790645 816043 831400 850852
3843 850852 878941 899598 906401 914789 913333 912165 913325 905741 918002 904024 900272 899055 886179
3830H86179N253J0185K5154l041j8508N16r300K265N950j7285j6127j3548J7797
3817H75490r808o084K354p39N301R599o237q372K6619L6735N311K4434O585J740
3803I62928J4045J0592K1730K9159J0680J9249J1097K652L416j78k793J4799J2831
3790A110207j4631o057k8314k4972j2950N916N338j0935J3859k698j6459J4000
3778A032304K9251J2009R667N108J9686Q96J4386J1250j229L7496J5248N572K4914
3765A216558Q313n434J80J1439L68P081J6050Q90o073k7913j7023k7779n76p560
3751A168521j431q613r622j4427K057J4107J624j1097J2381q848L848N450j0969
3738A142981L710N623K150L681L4206J2820K064P559J7162M1296l9M2057L1237
$$ plain form
3830 886179 891432 901617 926771 923730 905222 905738 896438 898703 904653 887368 871241 857693 875490
3817 875490 865682 859598 861952 861213 866514 876113 869876 861504 888123 924858 930169 954603 961188 962928
3803 962928 976973 987565 1009295 1038454 1049134 1068383 1079480 1082132 1085548 1085370 1082577 1097376 1110207
3790 1110207 1095576 1089519 1061205 1036233 1023283 1029199 1034537 1023602 1037461 1034763 1018304 1032304
3778 1032304 1061555 1073564 1083231 1088339 1108025 1108921 1123307 1134557 1133328 1170824 1186072 1191644 1216558
3765 1216558 1224871 1219437 1219617 1231056 1231424 1238505 1254555 1255445 1249372 1221459 1204436 1176657 1176081 1168521
3751 1168521 1167090 1158477 1148855 1134428 1136485 1150592 1152216 1141119 1153500 1144652 1148500 1153950 1142981
3738 1142981 1146691 1152314 1154464 1158145 1192351 1205171 1207235 1214794 1231956 1273252 1273213 1315270 1346507
3725A346507N498L0429J1934K2646J7889K6726L7757K8881K3962M2004N6738O1172
3713A712143L6615M0129L4212K4930L4750K2533n73R168j866J8711K3145L812
3701A957709k363Q45O161J2339K2817L164K937M226j0571o236n707k5037k959
3688A957325j8018m551j2727j0893n301k55R376n299Q177K5306K9784J3613K2285
3675B008822K0295K6564J9298J0417J8991L6215L0795L9821L3428N0928M3007
3664B338581K2502L7995N4321K8534M1313N6605L0585M7113L0390L6071M6939
3653B770949K9170L2899L7699M7605P859K9382L8025N4481M6510M6859M0446M9416
3641C231300N1488O2090M5262O7672N4856L5920M2742M6628M9524M2008P2413
$$ plain form
3725 1346507 1352005 1382434 1394368 1417014 1434903 1461629 1499386 1528267 1552229 1594233 1650971 1712143
3713 1712143 1748758 1788887 1823099 1848029 1882779 1905312 1904739 1913907 1912041 1930752 1953897 1957709
3701 1957709 1955346 1956191 1962352 1974691 1997508 2000672 2003609 2007835 1997264 1991028 1985321 1960284 1957325
3688 1957325 1939307 1934756 1922029 1911136 1905835 1905580 1914956 1909657 1917834 1943140 1972924 1986537 2008822
3675 2008822 2029117 2055681 2074979 2085396 2104387 2140602 2171397 2211218 2244646 2295574 2338581
3664 2338581 2361083 2399078 2453399 2481933 2523246 2579851 2610436 2657549 2687939 2724010 2770949
3653 2770949 2800119 2833018 2870717 2918322 2926181 2955563 2993588 3048069 3094579 3141438 3181884 3231300
3641 3231300 3282788 3344878 3390140 3457812 3512668 3548588 3591330 3637958 3687482 3729490 3801903
3630C801903O1444Q2920O3037P0542R5269P4308J01973J25602J37751J29478J15555
3619D859782J47534J37817J31975J48085J72476J89961K20076K42520K61251L01796
3609F813273L16868K84288K58550J86488J50272J79409K31899K48827K82094L16082
3599I268050L31807L53406L87311M24983M70790N08841N41374N70132N98736O23776
3589A4079206O76210O96405P47058Q72573R92640J058653J035504Q94964O02502
3580B1655715L44361K49773K55481K60145K63660L22311M16565N63953P29906
3571B5061870Q86122J043617J225003J393813J601768J822072K111134K428334
3563C7573733K730757L042270L291202L418433L429886L269757K984865K537760
$$ plain form
3630 3801903 3863347 3946267 4009304 4079846 4175115 4249423 4351396 4476998 4614749 4744227 4859782
3619 4859782 5007316 5145133 5277108 5425193 5597669 5787630 6007706 6250226 6511477 6813273
3609 6813273 7130141 7414429 7672979 7859467 8009739 8189148 8421047 8669874 8951968 9268050
3599 9268050 9599857 9953263 10340574 10765557 11236347 11745188 12286562 12856694 13455430 14079206
3589 14079206 14755416 15451821 16198879 17071452 18064092 19122745 20158249 21053213 21655715
3580 21655715 22000076 22249849 22505330 22765475 23029135 23351446 23768011 24331964 25061870
3571 25061870 25947992 26991609 28216612 29610425 31212193 33034265 35145399 37573733
3563 37573733 40304490 43346760 46637962 50056395 53486281 56756038 59740903 62278663
3555F2278663K018882J469184Q34807J37542n09360r98057j146038r74876o89234
3546F2421513m54812k99874k58953l65590n99717r37637j295672j726288k179406
3537E4303564k615753k963831l218356l313541l259091l122545k949638k696664
3529C0164145k429174k176811j908184j699085j538821j349549j211590j075565
3521A6775366r44896q25624p34461o34799n77286n00234m43568l72628l18240
3512A1423630k87114k27874k32960j97295j42958j03433j10292p3600m3625m9580
3502I954899l8815j7079m202k178L1961K7846K9619M1447O9189P9430J04992J21297
3490A0398406J35583J58043J72073J83723K07379J95950J95257J92490J86079
$$ plain form
3555 62278663 64297545 65766729 66601536 66739078 66229718 65231661 64085623 63110747 62421513
3546 62421513 61966701 61666827 61407874 61042284 60442567 59504930 58209258 56482970 54303564
3537 54303564 51687811 48723980 45505624 42192083 38932992 35810447 32860809 30164145
3529 30164145 27734971 25558160 23649976 21950891 20412070 19062521 17850931 16775366
3521 16775366 15830470 15004846 14270385 13635586 13058300 12558066 12114498 11741870 11423630
3512 11423630 11136516 10908642 10675682 10478387 10335429 10231996 10121704 10048104 10004479 9954899
3502 9954899 9916084 9899005 9894803 9892625 9924586 9952432 9982051 10023498 10092687 10172117 10277109 10398406
3490 10398406 10533989 10692032 10864105 11047828 11255207 11451157 11646414 11838904 12024983
3481A2024983J60239J66364K21107K28692K53382K75017K88658L25885L62331
3472A4306658M12957M38754M60874N08934N24621N46870N77340O11382O03126
3463A8991516N92921O20322O42780O75229O97201P42966Q01547Q61925R26272
3454B5552679J011682J091847J166960J248099J325195J425332J500840J620914
3446C5943548J717760J848165J979370K172237K366379K560514K784510L039607
3438E4412090L354218L663950M063161M512964N037486N590101O058994O479518
3430I3172482O675235O581932O171792N532210M697636L677119K613292J526272
3422A30647970O08036o5968m53468n39209l83093j29337O5612J53731J17526o5634
$$ plain form
3481 12024983 12185222 12351586 12572693 12801385 13054767 13329784 13618442 13944327 14306658
3472 14306658 14719615 15158369 15619243 16128177 16652798 17199668 17777008 18388390 18991516
3463 18991516 19584437 20204759 20847539 21522768 22219969 22962935 23764482 24626407 25552679
3454 25552679 26564361 27656208 28823168 30071267 31396462 32821794 34322634 35943548
3446 35943548 37661308 39509473 41488843 43661080 46027459 48587973 51372483 54412090
3438 54412090 57766308 61430258 65493419 70006383 75043869 80633970 86692964 93172482
3430 93172482 99847717 106429649 112601441 118133651 122831287 126508406 129121698 130647970
3422 130647970 131256006 131190038 130736570 130197361 129814268 129684931 129750543 129904274 130021800 129956166
3412A29956166l97838q66310j518208k290950l115773l895475m505567m929814
3404A08436231n082305n060220m909995m635963m258334l813235l299442k746097
3396G4630640k213437j724664j239182p71602l63363N5413M26107P95748J185647
3387G0781307J532973J939296K345204K779059L305759L828898M356103M857532
3379I5726131N245436N506882N551420N421926N221413N027422M862566M618692
3371A37181888M274067L788052L096753K321949J599188R25082L33033j57604
3363A53362408o39405j093796j519431j896685k230403k539569k798938l087787
3355A37556394l388792l749067m139729m607326n057548n379954n604658n767976
$$ plain form
3412 129956166 129558328 128692018 127173810 124882860 121767087 117871612 113366045 108436231
3404 108436231 103353926 98293706 93383711 88747748 84489414 80676179 77376737 74630640
3396 74630640 72417203 70692539 69453357 68681755 68318392 68373805 68799912 69595660 70781307
3387 70781307 72314280 74253576 76598780 79377839 82683598 86512496 90868599 95726131
3379 95726131 100971567 106478449 112029869 117451795 122673208 127700630 132563196 137181888
3371 137181888 141455955 145244007 148340760 150662709 152261897 153186979 153520012 153362408
3363 153362408 152723003 151629207 150109776 148213091 145982688 143443119 140644181 137556394
3355 137556394 134167602 130418535 126278806 121671480 116613932 111233978 105629320 99861344
3347I9861344n854800n813749n663400n462335n198611m887014m561982m234218
3339E8185235l876055l548374l218425k877488k586245k311121k036870j828125
3331C5902532j604787j394816j227794j069500q97147p92201p08777o51338o26523
3322B6929649n55037m22792l36017l09804l12832k79501k44945j82696j25524
3313B4160501p3823Q33Q374O7080J36498J87583K51919L35286L66348L41727K63608
3302B6045934J28156l4919j85234k49669k95712l36706l66512l87995l98831l96407
3292B3522105l87846l71707l29879l13730k35190j75414j06554o6899M088Q7336
3282B1626310J68289K62122L85699M81827N65271O64065P84998Q97148J020205
$$ plain form
3347 99861344 94006544 88192795 82529395 77067060 71868449 66981435 62419453 58185235
3339 58185235 54309180 50760806 47542381 44664893 42078648 39767527 37730657 35902532
3331 35902532 34297745 32902929 31675135 30605635 29708488 28916287 28207510 27556172 26929649
3322 26929649 26374612 25951820 25615803 25305999 24993167 24713666 24468721 24286025 24160501
3313 24160501 24086678 24087511 24095885 24162965 24299463 24487046 24738965 25074251 25440599 25782326 26045934
3302 26045934 26174090 26139171 25953937 25704268 25408556 25071850 24705338 24317343 23918512 23522105
3292 23522105 23134259 22762552 22432673 22118943 21883753 21708339 21601785 21534886 21538974 21626310
3282 21626310 21794599 22056721 22442420 22924247 23489518 24153583 24938581 25835729 26855934
3273B6855934J161571J325259J498599J706025J933851K197590K461941K722336
3265D1863106K920218L011069L040065K967978K878932K836423K792857K695273
3257F5005921K461748K014993J409701P21526L8068n49583j068304j614031k144161
3248F6275878k678513l156887l491414l679646l780711l750159l642431l491627
3240C8604490l288709l058421k770936k474704k206051j969099j736935j553715
3232A9545920j382823j224918j099983r69781q48033p78018o97530o27340n79613
3223A1337881m99919m47102l99880l52705l19505l00585k81072k41229k31038
3214H264846k23232k04237j93791j60322j57949j61922j23826j20316r6560p8475
$$ plain form
3273 26855934 28017505 29342764 30841363 32547388 34481239 36678829 39140770 41863106
3265 41863106 44783324 47794393 50834458 53802436 56681368 59517791 62310648 65005921
3257 65005921 67467669 69482662 70892363 71613889 71651957 71102374 70034070 68420039 66275878
3248 66275878 63597365 60440478 56949064 53269418 49488707 45738548 42096117 38604490
3240 38604490 35315781 32257360 29486424 27011720 24805669 22836570 21099635 19545920
3232 19545920 18163097 16938179 15838196 14868415 14020382 13242364 12544834 11917494 11337881
3223 11337881 10837962 10390860 9990980 9638275 9318770 9018185 8737113 8495884 8264846
3214 8264846 8041614 7837377 7643586 7483264 7325315 7163393 7039567 6919251 6822691 6744216
3204F744216n7834k4382m0106j1046K0401J8916M176J5587J3530m903r858n4532
3192F614165p2190r7154j44694j55316j73947j73486j87553j98519j96189j81064
3182E034053j91458j71316j51575j31958j32750j16856j02493q5905p4613o8120
3172C807009p2675o0477l3777m2342k8501k8105k2554j5913k1564p206J06o76
3160C473325K867J1N466J9600J7346M154K1327K241K7110R577N700P176P784K9372
3146C633056L4729J6051L8205M0820M7996J8314J7539J9636J145L7815j891J226
3134C904641J1267O827p248K0076K1511K8764M7200K9576L0355J6693K7049M8033
3122D184744L9367K4369J5564K3442K8574L2009L3300M6671K6614L0406L0533
$$ plain form
3204 6744216 6686382 6662000 6621894 6610848 6631249 6650165 6654341 6669928 6683458 6678555 6668697 6614165
3192 6614165 6541975 6444821 6300127 6144811 5970864 5797378 5609825 5411306 5215117 5034053
3182 5034053 4842595 4671279 4519704 4387746 4254996 4138140 4035647 3949742 3875129 3807009
3172 3807009 3734334 3673857 3640080 3597738 3569237 3541132 3518578 3502665 3481101 3473895 3474001 3473325
3160 3473325 3476192 3476203 3481669 3501269 3518615 3522769 3544096 3546337 3573447 3583024 3588724 3595900 3603684 3633056
3146 3633056 3667785 3683836 3722041 3762861 3810857 3829171 3846710 3866346 3867491 3905306 3903415 3904641
3134 3904641 3915908 3922735 3915487 3935563 3957074 3985838 4033038 4062614 4092969 4109662 4136711 4184744
3122 4184744 4224111 4248480 4264044 4287486 4316060 4348069 4381369 4428040 4454654 4485060 4515593
3111D515593L2674L3800M0879N9768P3123P2785Q3213P2273O9349O5113O5906
3100E184476R6302J09478J17972J21754J40081J54048J53572J73407J80856J81536
3090F613482J83680K01919K16781K38187K55650K54497K62525K61169K61976K85385
3080I035251K99410L02377L49170M24422M92094N49739O21395O66923P53036P98720
3070A4292537Q62234R34536J027321J141716J298892J472709J685655J886680
3062B4602280J866747J620435J236479R17897P36949O59035P32947R66837J207219
3053C4546825J392440J552366J734117J911646K101181K325556K522262K573786
3045E0660179K613144K821300L192224L651588M128811M648664N241720N886842
$$ plain form
3111 4515593 4548267 4582067 4622946 4682714 4755837 4828622 4911835 4984108 5053457 5118570 5184476
3100 5184476 5280778 5390256 5508228 5629982 5770063 5924111 6077683 6251090 6431946 6613482
3090 6613482 6797162 6999081 7215862 7454049 7709699 7964196 8226721 8487890 8749866 9035251
3080 9035251 9334661 9637038 9986208 10410630 10902724 11452463 12073858 12740781 13493817 14292537
3070 14292537 15154771 16089307 17116628 18258344 19557236 21029945 22715600 24602280
3062 24602280 26469027 28089462 29325941 30243838 30980787 31639822 32372769 33339606 34546825
3053 34546825 35939265 37491631 39225748 41137394 43238575 45564131 48086393 50660179
3045 50660179 53273323 56094623 59286847 62938435 67067246 71715910 76957630 82844472
3037H2844472O633420P424088Q048640Q240169Q086808Q233193R235889J1385444
3029A50132123J4748906J9522265K5520850L1066548L3052592K8521593J6564019
3022C19128896j523446k0721194l1773088l1879096k6879050k1869292j8616628
3015A65867102j6885777j5554261j3872603j2099586j0561547r313483q285845
3008G9294000p559913o913882o125070n257028m471378l858793l366225l005954
3000C8735757k688432k437815k174829j996249j830964j672059j522024j375918
2992B3037467j200584j064948j020398r67066r30639q78667q24096p55144o80773
2983A4715152n89315n22273m91733m71126m36021m26128l66489l48461l36793
$$ plain form
3037 82844472 89477892 96901980 104950620 113190789 121277597 129510790 138746679 150132123
3029 150132123 164881029 184403294 209924144 240990692 274043284 302564877 319128896
3022 319128896 317605450 296884256 265111168 233232072 206353022 184483730 165867102
3015 165867102 148981325 133427064 119554461 107454875 96893328 87579845 79294000
3008 79294000 71734087 64820205 58695135 53438107 48966729 45107936 41741711 38735757
3000 38735757 36047325 33609510 31434681 29438432 27607468 25935409 24413385 23037467
2992 23037467 21836883 20771935 19751537 18784471 17853832 16975165 16151069 15395925 14715152
2983 14715152 14125837 13603564 13111831 12640705 12204684 11778556 11412067 11063606 10726813
2974A0726813k77175k60760k63607k53967k70315k57618k68032l12752k99729
2965H262858k98611k83798k83926k60292k23572k19971j83071k08638k22615j86066
2955E892298j64944j86374j56104j39410j34656j45054j18877j02017j46025j20772
2945D478065j12151j31765j08771j19686j22392r1852n4231n8250r4132q4349
2935C500486q1170p0443o2557p2549p2348o5454m4509l5393m5303m6450l9878
2924B864432m1878m6386k5815j2053k9016k3693m0297k7003k8360m5483o360l5565
2912B502523l3484l5235n4485n2991n4909o5663n9565n2804l3185k2015k9981
2901B008206j8972k9244k5411k7845n4821m8058l0867l1996k3642j6399o057j5046
$$ plain form
2974 10726813 10449638 10188878 9925271 9671304 9400989 9143371 8875339 8562587 8262858
2965 8262858 7964247 7680449 7396523 7136231 6912659 6692688 6509617 6300979 6078364 5892298
2955 5892298 5727354 5540980 5384876 5245466 5110810 4965756 4846879 4744862 4598837 4478065
2945 4478065 4365914 4234149 4125378 4005692 3883300 3791448 3737217 3678967 3584835 3500486
2935 3500486 3419316 3348873 3286316 3213767 3141419 3075965 3031456 2996063 2950760 2904310 2864432
2924 2864432 2822554 2776168 2750353 2738300 2709284 2685591 2645294 2618291 2589931 2544448 2538088 2502523
2912 2502523 2469039 2433804 2379319 2326328 2271419 2205756 2146191 2093387 2060202 2038187 2008206
2901 2008206 1989234 1959990 1934579 1906734 1851913 1803855 1772988 1740992 1717350 1700951 1694894 1679848
2889A679848l0518m0197Q264O619j8470l442j7325j1741k153p035l7408k8091
2877A498351q951N029k381o736m959j2342q513j5259l0492k5285l9252j2344l4810
2864A302056k6143j8250l3318l5573k3080k0065k1988m593j044k875j3088k829
2852A099210N104j4142r527n819r030k480n886p978j1890k0877j8707k6709l3449
2839I37820k8781m6618m4558l5543l7822k2813R381k1671l0214k1418j2749Q320
2827F53334K976l3241j536K1844k205j383J1429p867p101k1810j0239j708k3072
2814E79421K430J0045o916J014j4941J2367M97j1468N566r032j6815R515j3790
2801E47893m775Q8j0674j089R182J9449j1222n854n846r681j9224m155R059J676
$$ plain form
2889 1679848 1649330 1609133 1617397 1624016 1605546 1602104 1584779 1573038 1570885 1563850 1526442 1498351
2877 1498351 1489400 1494429 1492048 1485312 1480353 1468011 1459498 1444239 1413747 1388462 1349210 1336866 1302056
2864 1302056 1275913 1257663 1224345 1188772 1165692 1145627 1123639 1119046 1118002 1115127 1102039 1099210
2852 1099210 1104314 1090172 1080645 1074826 1065796 1063316 1057430 1049452 1037562 1016685 997978 971269 937820
2839 937820 909039 862421 817863 782320 744498 721685 731066 709395 679181 657763 645014 653334
2827 653334 656310 623069 621533 643377 641172 639789 651218 643351 636250 614440 604201 602493 579421
2814 579421 581851 591896 584980 585994 571053 583420 583917 572449 578015 568983 552168 561683 547893
2801 547893 543118 543206 532532 531443 540625 560074 548852 542998 537152 527471 508247 504092 513151 514827
2787E14827n460p550p895j648J2299k436j0138j39n284P18j3802m307K3274l6
2773D92423n740J1977O26O286N804J4321K2877j0084J2752K8373J9700M046K623
2760F05984K9887K3220K7902M1854K5073M0234M7367L9305K6594L2661M7931M5367
2748A033379N5604N3673P2568R8731J39168J33620J90098J54899Q6013p766j07653
2737A902334j67841j65279j45533j48438j16915r9208q8725q9971r0522q5503
2727G04399n0268m0028n7815l5102l9509k8527k6227j6121m2474k8937n860j4882
2715C18649m649L426j0589J3260K7744j3122n712L267L237J0342j569k2418j1686
2702C10180n469n285m402j129l744K928K980L721p707p427j9298j0272m427o365
$$ plain form
2787 514827 509367 501817 493922 492274 504573 502137 491999 491860 486576 487294 473492 469185 492459 492423
2773 492423 486683 498660 499286 505572 511376 525697 548574 538490 551242 579615 599315 603361 605984
2760 605984 635871 659091 686993 728847 753920 794154 841521 880826 907420 940081 988012 1033379
2748 1033379 1088983 1142656 1215224 1313955 1453123 1586743 1776841 1931740 2017753 2009987 1902334
2737 1902334 1734493 1569214 1423681 1275243 1158328 1059120 970395 880424 789902 704399
2727 704399 654131 614103 556288 521186 481677 453150 426923 410802 368328 339391 333531 318649
2715 318649 314000 317426 306837 320097 347841 334719 329007 332274 335511 345853 344284 321866 310180
2702 310180 304711 299426 295024 293895 290151 293079 296059 299780 292073 284646 265348 255076 250649 244284
2688B44284m279J154j8209p694k097Q592o748o567j0943p250J4007o823l918n536
2674A87973J0430q330J0138l776j7015o22J092R65k427j717J4906J572j4422J4480
2660A93247k093J5568k479J946r446j1052J7772p610k6860r824j2660l547J5457
2647A58419m801M506p575k5159K858l731J7431O875k772P470K2413R07q192M811
2633A73460j6424Q18r146j3665k409m806M113l230Q773J5333j7259k979J1200
2620A43779q254k876L234q125N015Q285l315j9498l667p647j0970n408o277J4094
2606I8370P202R175M982l442m638j1804r087J2991K022n712J745J3153j2973l995
2592I7989J6666K1425j7382j0665k3148P679K2662M581r633L388j0915j7931J2638
$$ plain form
2688 244284 240005 241159 222950 215256 213159 221751 215003 208436 197493 190243 204250 197427 193509 187973
2674 187973 198403 190073 200211 196435 179420 178798 179890 180855 178428 176711 191617 193189 178767 193247
2660 193247 191154 206722 204243 206189 196743 185691 203463 195853 168993 159169 146509 142962 158419
2647 158419 153618 158124 150549 125390 128248 124517 141948 148823 146051 153521 175934 176841 168649 173460
2633 173460 157036 157854 148708 135043 132634 127828 131941 128711 137484 152817 135558 132579 143779
2620 143779 135525 132649 135883 127758 132773 141058 137743 118245 114578 106931 95961 90553 84276 98370
2606 98370 105572 114747 119729 116287 111649 99845 90758 103749 105771 100059 101804 114957 101984 97989
2592 97989 114655 136080 118698 108033 84885 92564 115226 119807 110174 113562 102647 84716 97354
2579I7354j1575J2612j3453J3391J128q016Q120l83O084K7848j3821q328R818
2566A20779k1682J805K760J7393l0859R416J8537j4148m06k0668M880R671J6700
2553A14178j3882o63o305l726l572J521J894j1293o15M217o286J305m926L517
2539G5364L658O980j5097P347Q762P620K779L915j3900P402k393k539j3252q382
2525F8264j8191M26N346o498k50o361O97J364m028J501J1672j5709R522M279O634
2510E8668k2656N134J3792o0j0473J5289l682k3945j0795j3330J0018O539N881
2497C0380R261J033q362Q811J5398R249O274K389M233j4131k0003q371j739J0934
2483D5356k932J4390J2269j4543p577o864O984j303J7542j9010M295J4853n624
$$ plain form
2579 97354 85779 98391 84938 98329 99457 91441 99561 99178 105262 133110 119289 110961 120779
2566 120779 99097 100902 103662 121055 90196 99612 118149 104001 103595 82927 87807 97478 114178
2553 114178 100296 99633 93328 89602 86030 87551 89445 78152 77537 81754 75468 76773 71847 75364
2539 75364 79022 86002 70905 78252 87014 94634 97413 101328 87428 94830 92437 89898 76646 68264
2525 68264 50073 50499 55845 49347 49097 42736 43433 44797 40769 42270 53942 38233 47755 52034 58668
2510 58668 36012 41146 54938 54878 44405 59694 56012 32067 21272 7942 17960 24499 30380
2497 30380 39641 40674 32312 41123 56521 65770 72044 74433 78666 64535 44532 36161 34422 45356
2483 45356 42424 56814 69083 54540 46963 40099 47083 45780 63322 44312 48607 63460 57836
2470E7836N470p565j3946P841N464j1246N956q546J1826m703M78J812j3031k941
2456C4705m597K03r475l212J4342J2444k505j867p693L575q721o228k08Q833L738
2441C3334O003l729p280K4640j6382n469O858j0848N445j465N14j5764J2336J0529
2427C8722J3688R71j0418j2540J542M290Q728R479j8462j0183J253q913J0614
2414B8771J1306K058J0198j953k5852j6467J8181J8614p460j5261K116J8369J4490
2401E7110j6768m839q169j3588O732N015Q481j3637L485Q267J4054o715j3698
2388B5730j938L470o281R500Q282j724O69O662L166J752J7695p225j132l899r926
2373D4801r1M241p006l684J4115R185q264L978j3985j959L045M55q902N967p059
$$ plain form
2470 57836 63306 55741 41795 49636 55100 43854 49810 41264 53090 48387 48865 50677 37646 34705
2456 34705 30108 30311 20836 17624 31966 44410 41905 40038 32345 35920 27199 20971 20763 29596 33334
2441 33334 39337 35608 28328 52968 36586 31117 37975 27127 32572 31107 31621 15857 28193 38722
2427 38722 52410 53381 42963 30423 31965 36255 44983 54462 36000 25817 27070 18157 28771
2414 28771 40077 42135 52333 50380 24528 8061 26242 44856 37396 22135 24251 42620 57110
2401 57110 40342 35503 27334 13746 20478 25493 33974 20337 23822 32089 46143 39428 25730
2388 25730 23792 27262 20981 30481 38763 37039 37708 44370 47536 49288 66983 59758 58626 54727 44801
2373 44801 44710 48951 41945 38261 52376 61561 53297 57275 43290 41331 44376 44831 35929 41896 34837
2358C4837J4241L6o420L762N380r465l195M779l423N308R20j0796K3145K682j5365
2343D6426Q09j042L627J0436K890n756M434j1110j229j8917J774L7119J7139n000
2329H1600j3497o821j3676n010J3503Q525J8485R861j3509J3919N281Q053p271
2316I9443K485K4624r287o427L3504R630q149K1665J048J6332M6583K2105K9697
2303B83253Q257J1072K5098J3948j2085J955J6347J2684O282K0955J7014K1441
2291D26221J9717M3329L2662K2329M8087K0704L3928N5842L5658N6480P2244P6275
2279I43476Q0393O9425Q2688P3903P3950R8084Q8485R5138J45484J78890K41048
2268B170964L38603M34986N02925M80661K67333M348m99616n86234m31207l17800
$$ plain form
2358 34837 49078 49114 42694 46456 51836 42371 39176 43955 40532 45840 46760 35964 59109 61791 46426
2343 46426 47235 46193 49820 60256 63146 57390 61824 50714 49485 30568 32342 69461 86600 81600
2329 81600 68103 61282 47606 42596 56099 64624 83109 92970 79461 93380 98661 106714 99443
2316 99443 101928 126552 117265 110838 144342 153972 145823 167488 168536 184868 231451 253556 283253
2303 283253 291510 302582 327680 341628 329543 331498 347845 360529 366811 387766 404780 426221
2291 426221 445938 489267 521929 544258 592345 613049 646977 702819 738477 794957 867201 943476
2279 943476 1023869 1093294 1175982 1249885 1323835 1421919 1510404 1605542 1751026 1929916 2170964
2268 2170964 2509567 2944553 3447478 3928139 4195472 4199820 3700204 3113970 2682763 2364963
2258B364963k45104k30454k03081k08568j82817j21627r4397r2964p8022q4764
2248H23165o8781r1723o3259m9207n4251l7257l1235m0315l2285l1615j2531j7200
2236B93506k1740l0683j4944o878k2109j5516J0612l447k1140j9889r215Q495
2224A47052j5144j4858N025O791K014j0254j2265M352P03j713m185r967J234J528
2210A00313R914k202j1934j4549j1159L573K720j1222q624k053J6155R159j4076
2197F6015J1058L74j6347k2484N717P896J028j3868J1088j6420m642M680K236
2184C6331P120r868J0523J87n204k180J8353m571j1274p247k0422M056J7541Q07
2170C4152j3676O335p82l865m148j8579k981J7428k999j4103J945J1722p206R78
$$ plain form
2258 2364963 2119859 1889405 1686324 1477756 1294939 1173312 1078915 985951 907929 823165
2248 823165 754384 662661 599402 550195 495944 458687 427452 387137 354852 323237 310706 293506
2236 293506 271766 241083 226139 219261 197152 181636 192248 188801 167661 147772 138557 147052
2224 147052 131908 117050 122075 128866 130880 120626 108361 112713 113416 111703 107518 97551 98785 100313
2210 100313 110227 108025 96091 81542 70383 73956 76676 65454 56830 54777 70932 80091 66015
2197 66015 77073 77447 61100 38616 44333 52229 53257 39389 50477 34057 29415 34095 36331
2184 36331 43451 33583 44106 44293 39089 36909 55262 50691 39417 32170 11748 15804 33345 34152
2170 34152 20476 26811 26029 22164 18016 -563 -3544 13884 10885 -3218 -1273 10449 3243 4221
2156D221J1217k071K685j1270Q403r953N495K690j1647j0932P088J9923K652r049
2142I452k557o60p460N984J7138n495r212J266J1827P582j0505m607j1789J6479
2128A7443Q896j4624m147k0358K5190k898r982L060K396L233J0947o147r493K0409
2114B3925k2693l642j421j331N086j31p142p295M852k896K4530j5158j0293P487
2100f122n082K415j642j69K1305n478l2581J2564R232R522o264j2722J7350l448
2086a120J2530o495l861j3484O484Q985j103n927m471J2007L129j7210j152J2589
2072I01J206j2441j6555J1260J1134j3037M685L4432J0415k4465j2033J523k3058
2059b6033K582J0052k979M385O827O440L321p395j2367L93l366m185K584R192
$$ plain form
2156 4221 15438 13367 16052 4782 13185 3232 8727 11417 -230 -11162 -4074 15849 18501 9452
2142 9452 6895 6235 -1225 4759 21897 16402 7190 8456 20283 27865 17360 12753 964 17443
2128 17443 26339 11715 7568 -12790 12400 9502 -480 2580 4976 8209 19156 13009 3516 23925
2114 23925 1232 -2410 -3831 -5162 -76 -207 -7349 -14644 -9792 -12688 11842 -3316 -13609 -6122
2100 -6122 -11204 -8789 -10431 -10600 10705 5227 -27354 -14790 -5558 3964 -2300 -15022 2328 -1120
2086 -1120 11410 4915 1054 -12430 -5946 3039 1936 -3991 -8462 3545 6674 -10536 -11688 901
2072 901 2107 -10334 -26889 -15629 -4495 -17532 -12847 21585 32000 7535 -4498 -2975 -26033
2059 -26033 -23451 -13399 -16378 -11993 -5166 1274 4595 -2800 -15167 -14774 -18140 -22325 -19741 -10549
2045a0549J8545j9845j0446L621O808O513k202j1106p768M750l054J0828O155
2032g750j0624l925n580J4778j362Q71m525k253j721J1264q918k10J8964j860
2018b851q186M267o754n414q352J1438n021L002O420J424M246O988r535j0918
2004a9246J0706P629M268J2713k67m73j4339o778J2131J4039j1484p456K863P933
1990A2239R286k5542Q082L677p195p170K387j735j3632r783J1401J8428J0219
1977A0662k502k2950J464M021q91p86j189K236q214J153n891l376K2263Q799j478
1962C321J964m034m799j441j4470m667Q779j0391m895Q634M729P574J2725j009
1948B020o223r167k411k904R019p036j1191M642P577j2030J1075P107j50l094
$$ plain form
2045 -10549 7996 -11849 -22295 -18674 -11866 -5353 -7555 -18661 -26429 -21679 -24733 -13905 -7750
2032 -7750 -18374 -22299 -27879 -13101 -14463 -13592 -18117 -20370 -22091 -10827 -19745 -19955 -991 -2851
2018 -2851 -11037 -6770 -13524 -18938 -27290 -15852 -20873 -17871 -11451 -10027 -5781 1207 -8328 -19246
2004 -19246 -8540 -911 3357 16070 15803 15330 991 -5787 6344 20383 8899 1443 4306 12239
1990 12239 21525 -4017 4065 7742 547 -6623 -4236 -5971 -19603 -29386 -17985 443 10662
1977 10662 8160 -14790 -13326 -9305 -10196 -10982 -12171 -9935 -18149 -16996 -22887 -26263 -4000 4799 3321
1962 3321 5285 1251 -3548 -4989 -19459 -24126 -15347 -25738 -30633 -21999 -17270 -9696 3029 2020
1948 2020 -4203 -13370 -15781 -18685 -9666 -16702 -27893 -23251 -15674 -27704 -16629 -9522 -9672 -12766
1934a2766j0329N228O61Q845K138j7829j1567L301P975N377Q810j1576k2388P952
1920c6168N90j3140Q044Q018J4908q067N484k310l030j1308J3107j4530J8558
1907a9844J6654K089J165k4644j6004Q777q358J0871J1659r03J0943n908j3968
1894b7471j687o899j1970J8125Q192j8574n930K2780m957P191k3842K68J3160
1881c1614J1527N407j6255Q823r916m728J0188K111r185m18R727M361k464J2420
1867a0016P799j9920L288N385n824p277Q061P074P936q021j2277P949M526o187
1853a7504J0510m207p2J971J712n910J3738K35k6761j5153O429K972R796j1150
1839c3394O032N231p541k818k57J5010K01n957j0939J3557O759n724j103l791
$$ plain form
1934 -12766 -23095 -17867 -17206 -8361 -6223 -24052 -35619 -32318 -24343 -18966 -10156 -21732 -44120 -36168
1920 -36168 -35578 -48718 -40674 -32656 -17748 -25815 -20331 -22641 -25671 -36979 -23872 -38402 -19844
1907 -19844 -3190 -1101 64 -24580 -40584 -31807 -40165 -29294 -17635 -18538 -7595 -13503 -27471
1894 -27471 -29158 -36057 -48027 -29902 -21710 -40284 -46214 -23434 -28391 -21200 -45042 -44774 -31614
1881 -31614 -20087 -14680 -30935 -22112 -32028 -36756 -26568 -24457 -33642 -34060 -24333 -19972 -22436 -10016
1867 -10016 -2217 -22137 -18849 -13464 -19288 -26565 -18504 -11430 -3494 -11515 -23792 -15843 -11317 -17504
1853 -17504 -6994 -11201 -11273 -9302 -7590 -13500 238 473 -26288 -41441 -35012 -32040 -22244 -33394
1839 -33394 -27362 -22131 -29672 -32490 -32747 -17737 -17536 -23493 -34432 -20875 -14116 -19840 -20943 -24734
1825b4734n67q060p313m42J6221J2920K178k828n863j5334M04J3797M973n896
1811b0544o887p438O954M964J1199N048p389N700J3040j4335n331o509l103J3005
1797a1626N554o934L202l194r318m936j434J0019k872N97j6249m669J7481P923
1783a6456l116K886p810L694k865j0367R924J9217J139j256J311k027j0653J1190
1769e189m127O463j6997m562M533K450J3765j1623j1713R337m215K097K1103J1434
1755A2756p129j9036J0225l665n700j1807j0709J9417J8178j9670J1996o317j5549
1742b7010J370n030K3520J196o532P793j1375l991N221N465J492J730J6120j9669
1728i700M768j8272k349J9466J0691k3244J2633K646j7730n699J346J508m785
$$ plain form
1825 -24734 -25301 -33361 -40674 -41116 -24895 -11975 -9797 -12625 -18488 -33822 -33418 -19621 -14648 -20544
1811 -20544 -27431 -34869 -27915 -22951 -11752 -6704 -14093 -8393 4647 -9688 -15019 -21528 -24631 -11626
1797 -11626 -6072 -13006 -9804 -12998 -22316 -27252 -28686 -18667 -21539 -20942 -37191 -41860 -24379 -16456
1783 -16456 -19572 -16686 -24496 -20802 -23667 -34034 -24110 -4893 -3754 -5010 -3699 -5726 -16379 -5189
1769 -5189 -9316 -2853 -19850 -24412 -19879 -17429 -3664 -15287 -27000 -17663 -21878 -19781 1322 12756
1755 12756 5627 -13409 -3184 -6849 -12549 -24356 -35065 -15648 2530 -17140 -5144 -11461 -27010
1742 -27010 -25640 -30670 -7150 -5954 -12486 -4693 -16068 -20059 -14838 -9373 -7881 -6151 9969 -9700
1728 -9700 -4932 -23204 -25553 -6087 4604 -18640 -6007 -3361 -21091 -26790 -25444 -23936 -28721
1715b8721J976J7290J0918M966N502m880P167j0712j9332k100J1714j2233n483
1702b3928N31O135j101J258k0557Q426q652J413J2898k271J457N716L752K959
1688a1964j953j412m528J7213J315n401j1059m302K9634L125k2942N572N422r632
1674a0912j258L579L289M919q831n428K171j9598J154J9999n450j1989o554J1554
1660b3355L348J373P204P568N252j2132J071k118m256o870l433L415N943o605
1646b3595K2843O37K428j5258j2078M531O399R002L214J540M17n47r384J4680
1632D829M049j1384k3100N902J5329l387J1960k836k5837n646O985O578J6810
1619B52j1348m236R630L21j5057j702N821L08J1197m945l960J5918j868j9298
$$ plain form
1715 -28721 -26745 -9455 1463 6429 11931 7051 14218 3506 -15826 -17926 -6212 -18445 -23928
1702 -23928 -23397 -17262 -18363 -17105 -37662 -29236 -37888 -36475 -23577 -25848 -24391 -18675 -14923 -11964
1688 -11964 -13917 -15329 -19857 -2644 -1329 -6730 -17789 -22091 7543 10668 -12274 -6702 -1280 -10912
1674 -10912 -12170 -8591 -5302 -383 -9214 -14642 -12471 -32069 -30915 -10916 -16366 -28355 -34909 -23355
1660 -23355 -20007 -18634 -11430 -3862 1390 -10742 -9671 -11789 -16045 -22915 -26348 -22933 -16990 -23595
1646 -23595 -752 -115 2313 -12945 -25023 -20492 -14093 -5091 -1877 -337 80 -467 -9851 4829
1632 4829 8878 -2506 -25606 -19704 -4375 -7762 4198 1362 -24475 -30121 -23136 -16558 252
1619 252 -11096 -15332 -5702 -5381 -20438 -22140 -16319 -16011 -4814 -9759 -13719 2199 331 -18967
1605a8967q503K2220J5841j0845j0319j5369N971q830M195P803R295q702P210
1592i000j4538k0894k414J3794J0429q168R123J850L258R199M374j5057p602j1262
1578c6908O266k907J4073J0108O268l176l30j2112M142j1462p393r976O591O127
1564c0689J8650M780M119R8j8033J3275n869j246k570K360L113n288k749K977
1550a7072m264J3709n331K348k1334J3668l572k99J0046n269o424p446n882M119
1536c3003J1313m231L444L057l627P829j843L647M040k478J4682R36j2061j1152
1522a9447n7J2626M242p331o186J4370J2186N776p692j4424j1086O824N718j7497
1508b1978N440J4412k481R22J0037J050o852m511J1535M765j6889q149j8711p187
$$ plain form
1605 -18967 -27470 -5250 10591 -254 -10573 -25942 -19971 -28801 -24606 -16803 -7508 -16210 -9000
1592 -9000 -23538 -44432 -46846 -33052 -22623 -30791 -21668 -19818 -16560 -7361 -2987 -18044 -25646 -36908
1578 -36908 -30642 -33549 -19476 -9368 -3100 -6276 -6606 -18718 -14576 -26038 -33431 -43407 -36816 -30689
1564 -30689 -12039 -7259 -3140 -3042 -21075 -7800 -13669 -14915 -17485 -15125 -12012 -17300 -20049 -17072
1550 -17072 -21336 -7627 -12958 -10610 -31944 -18276 -21848 -22147 -12101 -17370 -23794 -31240 -37122 -33003
1536 -33003 -21690 -25921 -22477 -19420 -23047 -15218 -17061 -13414 -9374 -11852 2830 3766 -8295 -19447
1522 -19447 -19504 -6878 -2636 -9967 -16153 -1783 10403 16179 8487 -5937 -17023 -10199 -4481 -21978
1508 -21978 -16538 -2126 -4607 -3685 6352 7402 550 -3961 7574 12339 -4550 -12699 -31410 -38597
1494c8597J997m727K1240J3212k247q957K75J8524R668j4543J0065k256k0723
1481a7069L75O787j9678J2660J1838M329j674j2326p909L677O838J792k741n067
1467a8168r529J2229M194Q909O8n848j3571m034J7236l342p641J137J5253l653
1453f760J721K439P638l392O508j4374j279r829J1584k1709j0507R214J6963Q225
1439c558k3015p33p174O695N765P809J3555l714j3277J6200j0148o607K257k649
1425a8594j026k721m042J1742j832J2979n138m292N02J0549Q419k5645o961J7830
1411h230j0775q552J0335j1584J6736K437j2428J264J3184n100m614k907n460
1398b5694O526n753J6480J5763j6494k0460Q446M143J1609J0970p431O901P767
$$ plain form
1494 -38597 -36600 -41327 -20087 -6875 -9122 -18079 -17804 720 10388 -4155 5910 3654 -17069
1481 -17069 -16694 -9907 -29585 -16925 -5087 -758 -2432 -14758 -22667 -18990 -12152 -10360 -13101 -18168
1467 -18168 -27697 -15468 -11274 -2365 -2297 -8145 -21716 -25750 -8514 -11856 -19497 -18360 -3107 -6760
1453 -6760 -5039 -2600 5038 1646 8154 -6220 -7499 -17328 -5744 -27453 -37960 -28746 -11783 -3558
1439 -3558 -26573 -27306 -34480 -27785 -22020 -14211 -656 -4370 -17647 -1447 -11595 -18202 -15945 -18594
1425 -18594 -19620 -22341 -26383 -14641 -16473 -3494 -8632 -12924 -12422 -1873 6546 -19099 -26060 -8230
1411 -8230 -19005 -27557 -17222 -28806 -12070 -9633 -22061 -20797 -7613 -12713 -17327 -20234 -25694
1398 -25694 -19168 -24921 -8441 7322 -9172 -29632 -21186 -17043 -5434 5536 -1895 5006 12773
1385A2773Q410r08j8690k1152L301O36L784J979K331Q510K3419j137j1159k0736
1371h639m833K1833p134r030J335j1976q429o55K6121q22o126J411r347n352l659
1356b5302R089J0650j0055j2350J6842n608J1036Q910j2833L88n130m063R603
1343h823q80j1091O908J2364p901m090j4773l839j009Q272q45J9429P639o261
1329d900n408J475K376r832j3352O986l611L758J609O188J7444J081J05m610j089
1314a780j2522r667p001K2847n287l081M702Q366O883j2268l886J2915P287p814
1300c06q647M685J7292j714j5815l15j2860J13J2902J5100j3331k4564Q79J5522
1286a1059J173J484M232L417N40j3149J0634m187O592n404j8540J1085r990k751
$$ plain form
1385 12773 21183 20275 1585 -19567 -16266 -15630 -11846 -9867 -7536 974 24393 23256 12097 -8639
1371 -8639 -13472 8361 1227 -7803 -6468 -18444 -26873 -27528 -1407 -2229 -8355 -6944 -16291 -21643 -25302
1356 -25302 -16213 -5563 -15618 -27968 -11126 -16734 -5698 3212 -9621 -9233 -14363 -18426 -8823
1343 -8823 -9703 -20794 -13886 -1522 -9423 -13513 -28286 -32125 -33134 -24862 -25707 -6278 1361 -4900
1329 -4900 -10308 -8833 -6457 -16289 -29641 -22655 -26266 -22508 -20899 -14711 2733 3814 3919 -691 -1780
1314 -1780 -14302 -23969 -30970 -8123 -13410 -16491 -11789 -3423 3460 -8808 -12694 221 7508 -306
1300 -306 -8953 -4268 13024 11310 -4505 -4820 -17680 -17567 -4665 10435 -2896 -27460 -26581 -11059
1286 -11059 -9886 -8402 -4170 -753 -213 -13362 -2728 -6915 -323 -5727 -24267 -13182 -23172 -25923
1272b5923J4826J66p355P12P953l311J0157Q273j1100O159J7421n903k8426p898
1258b4249J1717k255l130J3374M090j3564M677J1775j6106M972n820p586M256
1245a7849J0330k714J0209j4053j3510Q638n278J131R22O086p024k710j643J1376
1231a6089J6168m750l503K0698k417j8285r85P686k435L153m301J631k0939O844
1217a7524K1723m042l532j6115P019l965J2055L948j8901J1100J1385K240j7799
1204a2408j0476J337J8727J3556p954p537k0738K7728J8052k0435n044j4138j59
1191a9489J5150J3102P871r854l816r33j9587K349Q805M442p508N633P584N984
1177I733o251O444r489k1739K2523P387l60k6299O666j0888Q52J4398K959R578
$$ plain form
1272 -25923 -11097 -10931 -18286 -17574 -9621 -12932 -2775 5498 -5602 557 17978 12075 -16351 -24249
1258 -24249 -12532 -14787 -17917 -4543 -453 -14017 -9340 2435 -13671 -8699 -14519 -22105 -17849
1245 -17849 -7519 -10233 -24 -14077 -27587 -18949 -24227 -23096 -22174 -16088 -23112 -25822 -27465 -16089
1231 -16089 79 -4671 -8174 12524 10107 -8178 -9163 -1477 -3912 -759 -5060 -3429 -24368 -17524
1217 -17524 4199 157 -3375 -19490 -12471 -16436 -4381 -433 -19334 -8234 3151 5391 -12408
1204 -12408 -22884 -21547 -2820 10736 2782 -4755 -25493 2235 20287 -148 -5192 -19330 -19489
1191 -19489 -4339 8763 16634 6780 2964 2031 -17556 -15207 -6402 -1960 -9468 -3835 3749 9733
1177 9733 3482 9926 437 -21302 1221 8608 8248 -18051 -11385 -22273 -21421 -7023 -4064 5514
1163E514p573J2617l12m696m958L356p127R132o947k315o12p799J0803N906L967
1148H956j5558q97J2392L252o943q581J1699p385j638O251j0887K0342L215j8168
1134c950J0795l246j575O722o954j9681M523r611m245J169N371M855J2623J703
1120a501K292j1727M247M524J232J0339j5843p780M991J7920K0035q73l9025J911
1106i258J2896j9k558M769K260n990j569n632o641Q509L277J708q862r573R263
1091g420J2393q580n505R543O692k0243J3005l273L495p179m847p09R098J1117
1077G587j816j6266J4791J254m621J9816j8971n402O481P958M516k1088l42o249
1063a2352N952K6737n193j2242k3308K1817M921n217k87j0217M973M987k451K82
$$ plain form
1163 5514 -2059 10558 10246 5550 592 3948 -3179 5953 -994 -3309 -3921 -11720 -917 4989 8956
1148 8956 -6602 -7499 4893 8145 1202 -7379 4320 -3065 -4703 1548 -9339 11003 14218 -3950
1134 -3950 6845 3599 2024 8746 1792 -17889 -13366 -22977 -27222 -26053 -20682 -15827 -3204 -1501
1120 -1501 791 -10936 -6689 -2165 -933 9406 -6437 -14217 -9226 8694 28729 27856 -11169 -9258
1106 -9258 3638 3619 1061 5830 8090 2100 531 -5101 -11742 -3233 44 1752 -7110 -16683 -7420
1091 -7420 4973 -3607 -9112 431 7123 -13120 -115 -3388 107 -7072 -11919 -12628 -3530 7587
1077 7587 5771 -10495 4296 5550 929 20745 1774 -3628 2853 10811 15327 -5761 -6103 -12352
1063 -12352 -6400 20337 15144 2902 -20406 1411 6332 1115 828 -9389 -4416 571 -1880 -1598
1049a598R055O005O501j3918r133P864j884j2991j6953j3972J3600K328J7336
1036g760O417j4933M169n497R06l747J3840J600L862P056r313j8003N877J1268
1022d258P67j1636L406L680J4673k544j5272l384q579Q53l284J7258J7735k971
1008F444o417J265Q285r143P416M032O856P219k8859K229Q195K242k147M821j8168
993e730j7148l70J9106J491l235J1533j6194J0773R632Q213N101K192k7306M25
979a517P656O88J2102l32o144Q545q966l290J530P799k875l040j686O528o154
964A0844k0780K664k444j3801j2166K2796J4159O780L810M900j5243N100o518
951A01K0819j401j1666R493O282m033l201l35n354m469J3858P353j1757O549o330
$$ plain form
1049 -1598 7457 13462 19963 6045 -3088 4776 2892 -10099 -27052 -41024 -27424 -25096 -7760
1036 -7760 -1343 -16276 -12107 -17604 -16698 -20445 -6605 -5005 -1143 5913 -3400 -21403 -15526 -4258
1022 -4258 -3491 -15127 -11721 -8041 6632 4088 -11184 -14568 -23147 -22294 -25578 -8320 9415 6444
1008 6444 27 1292 9577 434 7850 11882 18738 25957 -2902 -673 7522 9764 7617 12438 -5730
993 -5730 -22878 -23248 -4142 -2651 -5886 5647 -10547 226 9858 18071 23172 25364 -1942 -1517
979 -1517 6139 6827 18929 18597 12453 20998 12032 8742 10272 18071 15196 12156 10470 16998 10844
964 10844 -9936 -7272 -9716 -23517 -35683 -12887 1272 8052 11862 16762 1519 6619 101
951 101 20920 19519 7853 17346 23628 19595 16394 16059 10705 6236 20094 27447 15690 22239 15909
936A5909j6817n101O333J798n431j6837n779J121Q316J0307L745J1087O765k3305
922g889j62R552K888O430l158m923l890k0016r497K3929O903j1620J688J638J1434
907C307J0187r582j0554K209O961J2620n381J0797k1686L972q12K356K298q389
893a697o58P585k683j4297o550J390J0402p377n910J2004J2827m345J0907q019
879C579p150K922j5179N245j2971Q619R186j7097R112Q329L212n992K272j460
865g373K002j7616K7755J426N205j3227l250R43J30O73r291p730J9829Q966j1192
850b750n098k996Q887j3980o981M440J0293J7882K382r945m08O976j325Q049R83
835A6409o152k040j1070o690N484k064p225J2036N259j1745N174J613J377j401
$$ plain form
936 15909 -908 -6009 324 2122 -3309 -20146 -25925 -24804 -16488 -6181 -2436 8651 15416 -7889
922 -7889 -8051 1501 4389 10819 7661 2738 -1152 -21168 -30665 -6736 167 -11453 -9765 -8127 3307
907 3307 13494 3912 -6642 -4433 2528 15148 9767 20564 -1122 2850 2038 4394 6692 -1697
893 -1697 -2355 5230 2547 -11750 -18300 -16910 -6508 -13885 -19795 -7791 5036 691 11598 3579
879 3579 -3571 -649 -15828 -10583 -23554 -14935 -5749 -22846 -13734 -5405 -2193 -8185 -5913 -7373
865 -7373 -5371 -22987 4768 6194 11399 -1828 -5078 -4135 -4005 -3332 -12623 -20353 -524 8442 -2750
850 -2750 -7848 -10844 -1957 -15937 -22918 -18478 -8185 9697 12079 2134 1726 8702 7377 15426 16409
835 16409 10257 8217 -2853 -9543 -4059 -6123 -13348 -1312 3947 -7798 -2624 -1011 366 -1035
821a035j0846R25J5255k0720k99K1521m933J7147l120p029N541o660j6477p708
807a8438J0052J6295o609q09j3647q309J8219J1544R69Q555M843j3485j258O627
793A4549l528j9208R119J0661k539J8530J0762J63q606r038k6840N705K297j8164
779a6137K2021J1416k132k932n81j387P236q34M614Q98Q462P018k0519k431p532
764G180J2184j1325j77K156j3128J36N057L144j504o402m229M161L578N27L688
749E046n197K966o494r340M912M334L937J3779L076j2000K049J117o189N343o97
734F642J7158k3248j4862J1059O638r220N82J8047l144l108O535j5054j069N229
720B185P609P08r533P90j1940J75k243L753J4666O150n321N157J3035k69j010
$$ plain form
821 -1035 -11881 -10956 4299 -16421 -16720 4801 -132 17015 13895 6866 12407 5747 -10730 -18438
807 -18438 -8386 7909 1300 491 -13156 -21465 -3246 8298 9267 17822 22665 9180 7922 14549
793 14549 11021 -8187 932 11593 9054 27584 38346 38509 29903 20865 -5975 -270 2027 -16137
779 -16137 5884 17300 15168 12236 11655 10268 17504 16670 21284 22182 30644 37662 17143 14712 7180
764 7180 19364 8039 7862 10018 -3110 -2974 2083 5227 3723 -2679 -6908 -2747 831 1358 5046
749 5046 -151 2815 -3679 -13019 -8107 -3773 164 13943 17019 5019 7068 8185 1996 7339 6642
734 6642 23800 552 -14310 -3251 3387 -5833 -5251 12796 9652 6544 13079 -1975 -3044 2185
720 2185 9794 10502 969 1759 -10181 -10006 -12249 -8496 6170 12320 6999 12156 25191 24922 23912
705B3912j6956j3398r44j1250j0819Q873J3733N873L977j512J89j4604R074J619
691b233L862m37l260j6080q666J4844P694J1345k597l387L1238q463o757R306
677B6409k219j1589K287l247o488K3308j4850l083M275j3033j2451J4210P330
664A0859j5558L148J65o931J1018J0592j4524J9380P766p114j1293o715M226J6503
650B1522j6413j4369J5039l775m269Q863j52R640p212j3747q153J4660o631Q007
636C010J1499n175j1240J137O308J4549M657j5300m728J0418K739J042j429j4784
622B703k007Q131O03k0922L862M161J2842J0180N994O478K913j3414k3766J4993
608A2751M267r520k631P646j11j8617K0046J797M636q011O578O083L913n901j2987
$$ plain form
705 23912 6956 -6442 -7386 -18636 -29455 -20582 -6849 -976 3001 1489 1678 -12926 -3852 -2233
691 -2233 1629 1192 -2068 -18148 -26814 -11970 -4276 7069 4472 1085 32323 23860 17103 26409
677 26409 24190 12601 14888 11641 5153 28461 13611 10528 14803 1770 -10681 3529 10859
664 10859 -4699 -1551 -1386 -8317 2701 13293 -1231 18149 25915 18801 7508 793 5019 21522
650 21522 5109 -9260 5779 2004 -2265 6598 6446 16086 8874 -4873 -13026 1634 -4997 3010
636 3010 14509 9334 -1906 -769 5539 20088 24745 9445 4717 15135 17874 18916 17487 2703
622 2703 696 8827 9430 -11492 -7630 -3469 9373 19553 25547 32025 34938 21524 -2242 12751
608 12751 17018 7498 4867 12513 12402 -6215 13831 15628 20264 12253 18831 24914 28827 22926 9939
593I939j994m067n580K410N934N748M856p382L748l894j0861R767p311P075P381
578A5769j1101J2490N106j6689P454L235J893j379q638j108k73P353p313j4743
564g944J3254r075K120M677p92O85K458j085L602j0370q941M929L931Q09r452
549a1194J6334R838N58J984k59N300N362j0544p568J1639j4630j3773P977j636
535f12N593j886J7942Q265j0975q889Q616P479o559j1256p486R350j1312m431
521f161M654O087J6099j3414k999m327L596N848J0343O212k9273k3772K2853J6174
507A1920n561N71L422K053J1006j1951j1773n471m58l302J293P135J2439m64n970
492D889J1886n159k0474P113n001K30J4286l875J3641k2302J2103p109P149N666
$$ plain form
593 9939 7945 3878 -1702 708 6642 12390 17246 9864 13612 9718 -1143 8624 1313 8388 15769
578 15769 4668 17158 22264 5575 13029 16264 18157 16778 8140 7032 6759 14112 6799 -7944
564 -7944 5310 -3765 -1645 3032 2240 2925 5383 4298 7900 -2470 -11411 -6482 -2551 -1742 -11194
549 -11194 5140 14978 15536 17520 17261 22561 27923 17379 9811 21450 6820 -6953 1024 -612
535 -612 4981 3095 21037 29302 18327 9438 18054 25533 18974 7718 232 9582 -1730 -6161
521 -6161 -1507 4580 20679 7265 4266 -61 3535 9383 19726 25938 -3335 -27107 -4254 11920
507 11920 6359 6930 10352 12405 23411 11460 -313 -5784 -6242 -9544 -8251 -1116 11323 10859 4889
492 4889 16775 11616 -8858 -1745 -6746 -6516 7770 3895 17536 -4766 7337 228 7377 13043
478A3043O021L59r84J0293J2803q815R371n880l121p653j6927M375J0035r289
464A3631j1684K6558j0222J0182j8436l041M488q55K90J151R078j0822m237K823
450H904M940J1679j885P891j3109j3628J7855J8861j7833p428L884R54n478j6912
436a305j6437Q779j1162N551J2200J6321P331p934M893N811p214n907N214o947
422I194l259r09J8554k271k1699K78k544J4431J7015k0879n255J4761M775M713
408B6905L767m995j1802l181R459J0455R292K8m972q13p008k9583J555R086l19
393G874J634J529M623J0715j5665o394J3161J4161j2801j0343Q342p818j1214
380b196K275J8749N670n836j5665k339J0949J1394j979j6686j0710J0478M709
$$ plain form
478 13043 19064 19423 18439 28732 41535 32720 42091 36211 33090 25437 8510 12885 22920 13631
464 13631 1947 28505 18283 28465 10029 6988 11476 10621 10911 12062 21140 10318 6081 8904
450 8904 13844 25523 23638 31529 18420 4792 22647 41508 23675 16247 20131 21085 15607 -1305
436 -1305 -17742 -8963 -20125 -14574 -2374 13947 21278 13344 18237 24048 16834 10927 16141 9194
422 9194 5935 5026 23580 21309 -390 -112 -2656 11775 28790 7911 2656 17417 22192 26905
408 26905 30672 25677 13875 10694 20153 30608 39900 39928 34956 34143 27135 -2448 -893 8193 7874
393 7874 9508 11037 15660 26375 10710 4316 17477 31638 18837 8494 16836 9018 -2196
380 -2196 79 18828 24498 18662 2997 658 11607 23001 21022 4336 -6374 4104 8813
367H813O384J7654j7439J191M007p526O730O384O773j3132k672J0084j7828n198
353D225J1683m31J7445q850q026M320o997K151q274o87J0620k629l27O450j6214
338D459Jo174O669L311Q287N128j1624l251N493k56J2335k958o72K642J9368o817
322C5941k8460J6532Q225K896j5877n056j6782J073J370K469J4729N60k4314J4590
308G896R265j4868J245K866K3275R638k1855q559K939k35m338J6214j0425j3072
294a4L338k419R461N538K00q070Q893M378n846k0057J2348j3661Q098j5092p579
279b0484J8006J5435l701J0221k448j5329R53J7380k870R7O192o03J2424j6113
265A9160l201r234r371n35J2597k991J4343N264j8962N822K15m532N215j9989
$$ plain form
367 8813 15197 32851 15412 16603 20610 13084 19814 26198 32971 19839 17167 27251 9423 4225
353 4225 15908 15477 32922 24072 16046 20366 13369 15520 7246 6559 17179 14550 14223 20673 4459
338 4459 4460 -1714 4955 8266 16553 21681 10057 6806 12299 12043 24378 21420 20748 23390 42758 35941
322 35941 7481 24013 32238 35134 19257 14201 -2581 -1508 -138 2331 17060 17620 -6694 7896
308 7896 17161 2293 3538 6404 29679 39317 17462 8903 11842 11607 7269 23483 13058 -14
294 -14 3324 905 10366 15904 16104 8034 16927 21305 15459 -4598 7750 -5911 2187 -12905 -20484
279 -20484 -2478 12957 9256 19477 17029 1700 2653 20033 17163 17260 23452 22849 35273 19160
265 19160 15959 6725 -2646 -3181 9416 6425 20768 26032 7070 12892 13107 8575 13790 -6199
251f199J8255R692Q003j4370j97o782l49R114Q085j7056j3933J4989N348j2062
237B538J0397j2116P901J5528o671n259J2262j1279R65j3686r548R268J1291n551
223F040j5981J0165L302N899j0683R065K0028n435p575P426k1096J9705O371n379
209B1852o049N549r474j3188J1544J8159J3288l372k4117J2528j9966L638M672
196A5064j7814l116l096L723r693p075J1148R055M844j1297J929r7J9232l974
182H833j7931J54R952R867j7304m04M649p83k431L915R744k355r27J1009m675
167A1313K53m330j7112k376M204N890O112q188M0j134J770n41J414j2561J1992
152c254J8122N768m033j1908r90p330L163N1r719q85J1335l369n774j724J8991
$$ plain form
251 -6199 12056 21748 29751 15381 15184 8402 8053 17167 25252 8196 -5737 9252 14600 2538
237 2538 12935 819 8720 24248 17577 12318 24580 13301 14266 580 -8968 300 11591 6040
223 6040 -9941 224 3526 9425 -1258 7807 27835 22400 14825 22251 1155 20860 27231 21852
209 21852 15803 21352 11878 -1310 10234 28393 41681 38309 14192 26720 6754 10392 15064
196 15064 -2750 -5866 -8962 -5239 -14932 -22007 -10859 -1804 3040 -8257 -6328 -6425 12807 8833
182 8833 -9098 -8944 1008 10875 -6429 -6833 -2184 -2967 -5398 -1483 8261 5906 4979 15988 11313
167 11313 11566 7236 -9876 -12252 -8048 -2158 3954 -4234 -4194 -5328 -3558 -4099 -2685 -15246 -3254
152 -3254 14868 20636 16603 4695 3705 -3625 -462 -411 -10130 -11015 320 -3049 -8823 -10547 8444
137H444J960j7331r05j0258M934M241o440R81R183l828j343M318K855J2196j938
122G069j7411P39L173N069p78R452J198j0088o321R959m941q340p737J185l748
107b1520P677p424j5717k985P788R850l963q89O327L773k304o761l928m106J3879
92b0303J430m876M200j0403J0530j0551k977J1536p220l881N157m67J4394r749
78b3180r235j0768J3826n593j3187J496l034J0222J407J0873Q926r303j0027j549
64c9126o113P536O969K45j3036K228l741j0651J1727P04l261n59r265q834j724
49f6901L34J6398n84l995n097l815l36L843o28j127N278l680j521l738j6424R446
33g2547M858q534m35N085p576J2573n613Q77O890k236o051j73K368q8M940o978
$$ plain form
137 8444 10404 -6927 -7832 -18090 -13156 -8915 -15355 -14374 -5191 -9019 -10362 -6044 -3189 9007 7069
122 7069 -10342 -9603 -6430 -1361 -2139 7313 8511 -1577 -7898 2061 -2880 -11220 -18957 -17772 -21520
107 -21520 -13843 -21267 -36984 -39969 -32181 -22331 -26294 -27183 -20856 -17083 -19387 -26148 -30076 -34182 -20303
92 -20303 -18873 -23749 -19549 -29952 -19422 -29973 -32950 -21414 -28634 -32515 -27358 -27825 -13431 -23180
78 -23180 -32415 -43183 -29357 -34950 -48137 -46641 -49675 -39453 -38046 -27173 -18247 -27550 -37577 -39126
64 -39126 -45239 -37703 -30734 -30489 -43525 -41297 -45038 -55689 -43962 -43258 -46519 -47078 -56343 -65177 -66901
49 -66901 -66567 -50169 -50753 -54748 -59845 -63660 -63996 -60153 -60781 -61908 -56630 -60310 -61831 -65569 -81993 -72547
33 -72547 -67689 -76223 -76658 -71573 -79149 -66576 -72189 -71312 -64422 -66658 -72709 -72882 -70514 -70602 -65662 -72640
17g2640q03O148M034j1131q437K338J3439j7295k085J4093l889j1698L779o601
3i0748M47J3446K871
0g3984
$$ plain form
17 -72640 -73443 -67295 -63261 -74392 -82829 -80491 -67052 -84347 -86432 -72339 -76228 -87926 -84147 -90748
3 -90748 -90301 -76855 -73984
0 -73984
$$ Imaginary data points
##PAGE= N=2
##DATA TABLE= (X++(I..I)), XYDATA
16383a009781J0365J4223J4796J5627J2168Q743J2291K1691J8834J7459Q761j1404
16371h66227J3679J9234L230J2746N132J5556J6996J0198N873O768N345J1473
16359g39997J4293P462K8237J8603L172K429R701K7075J2709Q288N454J5869J5350
16346e71355L82r041J6927K3313J5837Q295O722O131J1477K1487r514J4398J5038
16333d49903R822J1419R347P826K1296J8627o937Q647K4588K4950j0833P923K1295
16320c01933p60J2805R104j646J4383J634J5101L502R112J3444J0033J8694J0296
16307a86231J1823J4609J4695L8Q169k675Q157J2482O695P364J0606K3270R691
16294f1307j710R633J7976N261N804J6160J3309J1406j1202J3209R660J2595o591
$$ plain form
16383 -1009781 -999416 -985193 -970397 -954770 -942602 -933859 -921568 -899877 -881043 -863584 -854823 -866227
16371 -866227 -852548 -833314 -830084 -817338 -812206 -796650 -779654 -769456 -763583 -756815 -751470 -739997
16359 -739997 -725704 -718242 -690005 -671402 -668230 -665801 -656100 -629025 -616316 -608028 -602574 -586705 -571355
16346 -571355 -570973 -580014 -563087 -539774 -523937 -515642 -508920 -502789 -491312 -469825 -479339 -464941 -449903
16333 -449903 -440081 -428662 -419315 -411489 -390193 -371566 -378503 -369856 -345268 -320318 -331151 -323228 -301933
16320 -301933 -302693 -289888 -280784 -282430 -268047 -266413 -251312 -247810 -238698 -225254 -215221 -196527 -186231
16307 -186231 -174408 -159799 -145104 -145066 -136897 -139572 -131415 -118933 -112238 -104874 -94268 -70998 -61307
16294 -61307 -63017 -53384 -35408 -30147 -24343 -8183 5126 16532 5330 18539 28199 40794 34203
16281C4203J7097N179J168J6636O437j5P823J2475Q627Q451Q686J3637P794N817
16267A54015j4453J3420J5453K0045N938R415k174P172J5370o492L520j57K8225
16254B49297q722J298Q398K1973Q603m80m283K8223J5938J800J613k242J4903
16241C36319J2401p418K611L595N246M439J246J9876m244Q718J9299J2689j4522
16228D00255J1197L76j4758J8491J6183r078N45m060J7109Q641K4569p85k221
16215D66464O50J2100J1930k665m506L641J7638o986j1929J8667J3148J7762J0782
16202E46696K323o312q51P682p824o3K017J4330O052R151Q13l532J3377K768j5604
16187E71023J6932J1144m206J118J0748n483J4282J1333m534N9J3811r94j3055
$$ plain form
16281 34203 51300 56479 57647 74283 80720 80705 88528 101003 109630 118081 126767 140404 148198 154015
16267 154015 139562 152982 168435 188480 194418 203833 201659 208831 224201 217709 221229 221072 249297
16254 249297 240575 241873 250271 272244 280847 280367 276084 304307 320245 322045 323658 321416 336319
16241 336319 348720 341302 343913 347508 352754 357193 358439 378315 374071 382789 402088 414777 400255
16228 400255 411452 411828 397070 415561 431744 422666 423211 419151 436260 444901 469470 468685 466464
16215 466464 467114 479214 491144 488479 483973 487614 505252 498266 486337 505004 518152 535914 546696
16202 546696 549019 542707 541856 549538 541714 541651 543668 557998 564050 573201 574014 570482 583859 586627 571023
16187 571023 587955 599099 594893 596011 606759 601276 615558 626891 622357 622416 636227 635233 622178
16174F22178O808R518J1906j5555Q218q922j966N562l496J5051R048j1885N311
16161F51776j491O844K139n459J0178l76r832m498K2046M109J1248L657L96j172
16147F89565m336k085k090K4692k493o885O174j2107j1063J8326J7300O113j3113
16134G07998P563O90J7650M840j7589j9318K2181P926k0463K116Q219j4846j2709
16121F94258J8138k377J2076R217P048l018J0189J0908K813K471j2749m854N020
16108G49140L607J6289M83m18k660J380j8331o285n571J9770J7581N942j2830
16095G68097j2026n673j2358J458L3781p874j4795R814n10P057Q154j872j4522
16082G58731Q217K957O439q413m487L273K822j395m368K87p341N099M339J4909
$$ plain form
16174 622178 628986 638504 650410 634855 643073 634151 632185 637747 634251 649302 658350 646465 651776
16161 651776 650285 657129 659268 653809 663987 663611 653779 649281 671327 675436 686684 690341 690737 689565
16147 689565 685229 683144 681054 705746 703253 696368 702542 690435 679372 697698 714998 721111 707998
16134 707998 715561 716251 733901 738741 721152 701834 724015 731941 711478 713594 721813 706967 694258
16121 694258 712396 710019 722095 731312 738360 735342 745531 756439 759252 761723 748974 744120 749140
16108 749140 752747 769036 769519 769101 766441 767821 749490 743205 737634 757404 774985 780927 768097
16095 768097 756071 750398 738040 739498 773279 765405 750610 760424 759914 766971 775125 773253 758731
16082 758731 766948 769905 776344 767931 763444 766717 769539 768144 763776 764063 756722 761821 766160 781069
16068G81069o73o955l976l108J7038J2046n424k6792K850J0236j4193O254M605
16055G72977J483k876l855L063O151J533K398k924J2600j778M957J7615k9248
16042G82096j0384l542M151N808k904L182o97o259k80K5791n683r827J638L358
16028G86448K330M015L008j3045j807N114o183N684K11N827N952n296k695k886
16014G86677j157o859q786O439K75O730l696o54J0002J0693J1148k3448p259L979
16000G84084n275J817J3155n65K1766p226l716p963L0752l779j6973j0969j521
15987G93587J134q334r908J0422J3605L794p92j555J6K435j0995j3936J1278m393
15973G86358l685P857O455m059J6187q140j5759K579J791j4313Q345K605J5143
$$ plain form
16068 781069 780396 773441 769465 766357 783395 795441 790017 763225 766075 776311 762118 768372 772977
16055 772977 774460 771584 767729 770792 776943 778476 780874 777950 790550 788772 793729 811344 782096
16042 782096 771712 768170 772321 778129 775225 778407 777710 771451 771171 796962 791279 781452 783090 786448
16028 786448 788778 792793 795801 782756 780949 786063 779880 785564 785775 791602 797554 792258 789563 786677
16014 786677 785520 778661 769875 776314 776589 783319 779623 778969 788971 799664 810812 787364 780105 784084
16000 784084 778809 780626 793781 793216 814982 807756 804040 796077 826829 823050 806077 795108 793587
15987 793587 794721 786387 776479 786901 800506 804300 803508 801953 801969 804404 793409 779473 790751 786358
15973 786358 782673 790530 796985 792926 809113 800973 785214 787793 789584 775271 783616 786221 801364
15960H01364M89o157j9477o454J3284K257J5277j2604n34L997L832q999N51P212
15946G94038O645p70J1846k325j5455Q76o356M041L893j730l581L507J7002L50
15932H11981j7974k595O954J1660L015j3522j0185P128q343j3475K1029q200j006
15919G86467Q535j5070K202o496P167R658M218J6476j1344Q935j72o154j368k0020
15905G83034Q694L179q291L144n163J3019l336J1009Q701k0364O387j7679R066
15892G91400M578J830j0304k289L054M575J3008J0606m742j2200q072O026O896
15879H04366M691j500j0865l743Q423Q620J2082k6169R885j837m021J5643J042
15866H16617m521k2119m407K3625m906n440r887r028q63O410J6985M5q86r834
$$ plain form
15960 801364 801853 795696 776219 769765 783049 785306 800583 787979 787445 791442 795274 786275 786826 794038
15946 794038 800683 799913 811759 809434 793979 794855 788499 792540 796433 794703 791122 794629 811631 811981
15932 811981 794007 791412 798366 810026 813041 799519 789334 796462 788119 774644 795673 787473 786467
15919 786467 795002 779932 782134 775638 782805 792463 796681 813157 801813 810748 810576 804422 803054 783034
15905 783034 791728 794907 786616 789760 784597 797616 794280 805289 813990 793626 800013 782334 791400
15892 791400 795978 797808 787504 785215 788269 792844 805852 816458 811716 799516 791444 797470 804366
15879 804366 809057 807557 796692 792949 801372 809992 822074 795905 805790 803953 799932 815575 816617
15866 816617 812096 789977 785570 809195 804289 798849 788962 779934 779071 785481 802466 802511 801625 791791
15852G91791k953K413J2413j313K523O846q521J5317J0726k1896Q923R447n356
15839H20360j2244j2728L61J5199q74o897K00o520L770J3339j1535L838R548j3514
15825H02303J333l413j0445m434R698N988n655J9105o871o578j9030J4868O561
15812H03430k1599J0031m410K886N952N474Q147j7776o483J3446j1077j5m636
15799G83370K366R748J5427R928j1124P683k473n998o811O360M475p079P519o358
15785H07033r801n555N229J2074j1783Q836j2285K563P003O329j3296n359J1530
15772H02518q52R562l771n53j8904R138P929r459l022J675J777k694O623P018
15758H06985j0706l78K1596m89l462P40J0313j0217j359J1727k729j6205r17N581
$$ plain form
15852 791791 788838 791251 803664 802351 804874 811720 803199 818516 829242 807346 816269 825716 820360
15839 820360 808116 795388 795749 810948 810074 803177 803377 796857 800627 813966 802431 806269 815817 802303
15825 802303 803636 800223 789778 785344 795042 801030 795375 814480 807609 801031 782001 796869 803430
15812 803430 781831 791862 787452 790338 796290 801764 809911 792135 785652 799098 788021 788006 783370
15799 783370 785736 795484 810911 820839 809715 817398 814925 808927 802116 808476 812951 805872 813391 807033
15785 807033 797232 791677 796906 808980 797197 806033 793748 796311 803314 809643 796347 790988 802518
15772 802518 801666 811228 807457 806904 788000 797138 805067 795608 792586 794261 796038 793344 799967 806985
15758 806985 796279 795901 817497 817008 813546 814286 824599 814382 813023 824750 822021 805816 804899 810480
15744H10480k548j0948l42k219P049J0023P031k377p425k99n72l37q297o213J0886
15729H03892j34M356J3547o574k2293j1414J4336K101M886P333O509r207R175
15716H16513L967n699J3778J581o219j8786l132J9898q965J5983n371N330k963
15703H25915k995k638j5596j0624j639R905Q856J4421N90k6894O201M181j3452
15690G96231J0783o056M649K530J4077o384j4148J3302m382O305O028j3846k95
15677H08794m167n030L877J4789l510L96l557j5445M415j594J4641L662K290j4480
15663H05081Q010k612m326m713J5782Q926o604q215Q529L69j3061N304k2676N38
15649G90332O164P172J6429O768k3602j3447R838N099N251J3738n112l542P469
$$ plain form
15744 810480 807932 796984 796642 794423 801472 811495 818526 816149 808724 808425 807853 807516 799219 793006 803892
15729 803892 803758 808114 821661 815087 792794 781380 795716 797817 802703 810036 816545 807338 816513
15716 816513 820480 814781 828559 830140 823921 805135 802003 821901 812936 828919 823548 828878 825915
15703 825915 822920 820282 804686 794062 792423 802328 811184 825605 826195 799301 805502 809683 796231
15690 796231 807014 800958 805607 808137 822214 815830 801682 814984 810602 816907 822935 809089 808794
15677 808794 804627 799597 803474 818263 814753 815149 811592 796147 800562 798968 813609 817271 819561 805081
15663 805081 813091 810479 806153 801440 817222 826148 819544 811329 819858 820227 807166 812470 789794 790332
15649 790332 796496 803668 820097 826865 803263 789816 799654 804753 810004 823742 818630 815088 822557
$$ [...]
##END NTUPLES=NMR SPECTRUM
##END=
