##TITLE=1H_CG-1042-D
 200.13MHz, CDCl3,
 8 sc
 
 6.8.2025
##JCAMPDX= 6.0         $$ Bruker NMR JCAMP-DX V2.0
##DATA TYPE= NMR SPECTRUM
##DATA CLASS= NTUPLES
##ORIGIN= UXNMR, Bruker Analytische Messtechnik GmbH
##OWNER= pz
$$ XWIN-NMR		Version 3.5
$$ Wed Aug  6 14:00:25 2025 Russian Standard Time (UT+4h)  she@DPX200
##.OBSERVE FREQUENCY= 200.1313
##.OBSERVE NUCLEUS= ^1H
##.ACQUISITION MODE= SIMULTANEOUS
##.ACQUISITION SCHEME= undefined
##.AVERAGES= 8
##.DIGITISER RES= 18
##SPECTROMETER/DATA SYSTEM= spect
##.PULSE SEQUENCE= zg30
##.SOLVENT NAME= CDCl3
##.SHIFT REFERENCE= (INTERNAL, CDCl3, 0, 15.5673)
##AUDIT TRAIL= $$ (NUMBER, WHEN, WHO, WHERE, WHAT)
$$ ##TITLE= Audit trail, XWIN-NMR		Version 3.5
$$ ##JCAMPDX= 5.01
$$ ##ORIGIN= Bruker BioSpin GmbH
$$ ##OWNER= she
$$ F:/spectra/data/she/nmr/H-C/1/pdata/1/auditp.txt
$$ ##AUDIT TRAIL=  $$ (NUMBER, WHEN, WHO, WHERE, WHAT)
(   1,<2025-08-06 13:58:34.31 +0400>,<she>,<DPX200>,
      <created by zg, POWCHK disabled, PULCHK disabled
       configuration hash MD5:
       00 E9 B6 7A A2 85 ED C7 34 08 36 98 17 FE 4E 26
       data hash MD5: 16K
       92 6E 5E 41 B3 91 83 E1 DE 7D 4C BA 18 44 10 1C>)
(   2,<2025-08-06 13:58:37.56 +0400>,<she>,<DPX200>,
      <Start of raw data processing
       efp BC_mod = 2 LB = 0.25 FT_mod = 6 PKNL = 1 PHC0 = -1157.756 PHC1 = -35.2077 SI = 16K 
       data hash MD5: 16K
       1F B4 CB 52 EE 71 40 E3 F4 7B B3 83 91 4D 54 EA>)
(   3,<2025-08-06 13:59:11.48 +0400>,<she>,<DPX200>,
      <pk PHC0 = -193.375 PHC1 = 38.6 
       data hash MD5: 16K
       61 D3 8C D9 60 F6 FB 43 9C 2B 5D 0B A9 C4 25 86>)
(   4,<2025-08-06 13:59:15.82 +0400>,<she>,<DPX200>,
      <abs ABSG = 5 
       data hash MD5: 16K
       74 89 F3 3B E2 79 C7 A5 26 88 8E 79 39 41 77 F5>)
$$ ##END=
$$ 
$$ hash MD5
$$ C7 6A 3E 1D 06 A7 4F 1D 6C DB B0 6F 66 CA 17 31
##$RELAX= 
##$RELAX= 
##$RELAX= 
##$RELAX= 
##$RELAX= 
##$RELAX= 
$$ Bruker specific parameters
$$ --------------------------
##$DU= <F:/spectra>
##$EXPNO= 1
##$NAME= <H-C>
##$PROCNO= 1
##$TYPE= <nmr>
##$USER= <she>
##$AMP= (0..31)
100 100 100 100 100 100 100 100 100 100 100 100 100 100 100 100 100 100 
100 100 100 100 100 100 100 100 100 100 100 100 100 100 
##$AQSEQ= 0
##$AQ_mod= 1
##$AUNM= <au_zg>
##$AUTOPOS= <>
##$BF1= 200.13
##$BF2= 200.13
##$BF3= 200.13
##$BF4= 200.13
##$BF5= 200.13
##$BF6= 200.13
##$BF7= 200.13
##$BF8= 200.13
##$BYTORDA= 1
##$CFDGTYP= 0
##$CFRGTYP= 5
##$CHEMSTR= <none>
##$CNST= (0..31)
1 1 145 1 1 1 1 1 1 1 1 1 1 1 1 1 1 1 1 1 1 1 1 1 1 1 1 1 1 1 1 1 
##$CPDPRG= <>
##$CPDPRG1= <>
##$CPDPRG2= <>
##$CPDPRG3= <>
##$CPDPRG4= <mlev>
##$CPDPRG5= <mlev>
##$CPDPRG6= <mlev>
##$CPDPRG7= <mlev>
##$CPDPRG8= <mlev>
##$CPDPRGB= <>
##$CPDPRGT= <>
##$D= (0..31)
0 0.7 0 0 0 0 0 0 0 0 0 0.03 0 0 0 0 0 0 0 0 0 0 0 0 0 0 0 0 0 0 0 0 
##$DATE= 1754474313
##$DBL= (0..7)
120 120 120 120 120 120 120 120 
##$DBP= (0..7)
150 150 150 150 150 150 150 150 
##$DBP07= 0
##$DBPNAM0= <>
##$DBPNAM1= <>
##$DBPNAM2= <>
##$DBPNAM3= <>
##$DBPNAM4= <>
$$ [...]
##$SUBNAM3= <"">
##$SUBNAM4= <"">
##$SUBNAM5= <"">
##$SUBNAM6= <"">
##$SUBNAM7= <"">
##$SUBNAM8= <"">
##$SUBNAM9= <"">
##$SW= 18.0517328524113
##$SWIBOX= (0..15)
0 0 2 0 0 0 0 0 0 0 0 0 0 0 0 0 
##$SW_h= 3612.71676300578
##$TD= 16384
##$TD0= 1
##$TE= 0
##$TE2= 300
##$TE3= 300
##$TEG= 300
##$TL= (0..7)
0 120 120 120 120 120 120 120 
##$TP= (0..7)
150 150 150 150 150 150 150 150 
##$TP07= 0
##$TPNAME0= <>
##$TPNAME1= <>
##$TPNAME2= <>
##$TPNAME3= <>
##$TPNAME4= <>
##$TPNAME5= <>
##$TPNAME6= <>
##$TPNAME7= <>
##$TPOAL= (0..7)
0.5 0.5 0.5 0.5 0.5 0.5 0.5 0.5 
##$TPOFFS= (0..7)
0 0 0 0 0 0 0 0 
##$TUNHIN= 0
##$TUNHOUT= 0
##$TUNXOUT= 0
##$USERA1= <user>
##$USERA2= <user>
##$USERA3= <user>
##$USERA4= <user>
##$USERA5= <user>
##$V9= 5
##$VALIST= <valist>
##$VCLIST= <CCCCCCCCCCCCCCC>
##$VD= 0
##$VDLIST= <DDDDDDDDDDDDDDD>
##$VPLIST= <PPPPPPPPPPPPPPP>
##$VTLIST= <TTTTTTTTTTTTTTT>
##$WBST= 1024
##$WBSW= 4
##$XGAIN= (0..3)
0 0 0 0 
##$XL= 0
##$YL= 0
##$YMAX_a= 510007
##$YMIN_a= -502278
##$ZGOPTNS= <>
##$ZL1= 120
##$ZL2= 120
##$ZL3= 120
##$ZL4= 120
##$ABSF1= 15.50009
##$ABSF2= -2.55176
##$ABSG= 5
##$ABSL= 3
##$ALPHA= 0
##$AQORDER= 0
##$ASSFAC= 0
##$ASSFACI= 0
##$ASSFACX= 0
##$ASSWID= 0
##$AUNMP= <proc_1d>
##$AZFE= 0.1
##$AZFW= 0.1
##$BCFW= 0
##$BC_mod= 2
##$BYTORDP= 0
##$COROFFS= 0
##$CY= -3
##$DATMOD= 1
##$DC= 0
##$DFILT= <>
##$DTYPP= 0
##$F1P= 0
##$F2P= 0
##$FCOR= 1
##$FTSIZE= 16384
##$FT_mod= 6
##$GAMMA= 0
##$GB= 0
##$INTBC= 1
##$INTSCL= 3.241238e-09
##$ISEN= 128
##$LB= 0.25
##$LEV0= 0
##$LPBIN= 0
##$MAXI= 10000
##$MC2= 0
##$MEAN= 0
##$ME_mod= 0
##$MI= 1.114404
##$NCOEF= 0
##$NC_proc= -6
##$NLEV= 6
##$NOISF1= 3.799351
##$NOISF2= 2.8
##$NSP= 0
##$NTH_PI= 0
##$NZP= 0
##$OFFSET= 15.5673
##$PC= 1
##$PHC0= -1351.131
##$PHC1= 3.3923
##$PH_mod= 1
##$PKNL= yes
##$PPARMOD= 0
##$PSCAL= 0
##$PSIGN= 0
##$REVERSE= no
##$SF= 200.129990874995
##$SI= 16384
##$SIGF1= 3
##$SIGF2= 2
##$SINO= 0.751879
##$SIOLD= 32768
##$SREGLST= <19F.Aceton>
##$SSB= 0
##$STSI= 16384
##$STSR= 0
##$SW_p= 3612.71676300578
##$SYMM= 0
##$S_DEV= 0
##$TDeff= 16384
##$TDoff= 0
##$TI= <>
##$TILT= no
##$TM1= 0
##$TM2= 0
##$TOPLEV= 0
##$USERP1= <user>
##$USERP2= <user>
##$USERP3= <user>
##$USERP4= <user>
##$USERP5= <user>
##$WDW= 1
##$XDIM= 16384
##$YMAX_p= 579830788
##$YMIN_p= -200981
$$ End of Bruker specific parameters
$$ ---------------------------------
##NTUPLES= NMR SPECTRUM
##VAR_NAME=  FREQUENCY,     SPECTRUM/REAL,   SPECTRUM/IMAG
##SYMBOL=    X,             R,               I
##VAR_TYPE=  INDEPENDENT,   DEPENDENT,       DEPENDENT
##VAR_FORM=  AFFN,          ASDF,            ASDF
##VAR_DIM=   16384,         16384,           16384
##UNITS=     HZ,            ARBITRARY UNITS, ARBITRARY UNITS
##FACTOR=    0.220516191357247, 1,           1
##FIRST=     3115.48357549477, 0,            0
##LAST=      -497.233187511006, 0,           0
##MIN=       -497.233187511006, -200981,     0
##MAX=       3115.48357549477, 579830788,    0
$$ Real data points
##PAGE= N=1
##DATA TABLE= (X++(R..R)), XYDATA
$$ [...]
5992e7452L331l883M6340Q10k2714m6425k136J6869L4298l5164k2761M8245J6867
5979b3775J2175j8684j3748K1346q976r780J2073o248k9315K265j0673j025J1234
5966f3131K7461K3276k3955J7259n304j6400j0484J3513L6955k8925l2553K022
5954f0266J8185M396p43n401J1902j2801j4528R297K3132P811p902p584p905L1858
5940a0549k4271J4282J7781P931o310k2391m3199j60L7075k569P076j9582q221
5927e3107N568j4612L7746q541J6967J6285j4350K4900m4368K5426j0818j8712
5915c7616k4870k1201K0704N3197L9573k60j2693k1672P736j6511K1947J8617
5903B6951P13J0137K037l4972K914J6887j5717k8279o040K3616L0731J2681J079
$$ plain form
5992 -57452 -54121 -58004 -11664 -10854 -33568 -79993 -82129 -65260 -30962 -66126 -88887 -40642 -23775
5979 -23775 -11600 -30284 -44032 -22686 -31662 -41442 -29369 -35617 -64932 -62667 -73340 -74365 -63131
5966 -63131 -35670 -12394 -36349 -19090 -24394 -40794 -51278 -37765 -810 -29735 -62288 -60266
5954 -60266 -42081 -37685 -38428 -43829 -31927 -44728 -59256 -49959 -26827 -19016 -26918 -34502 -42407 -10549
5940 -10549 -34820 -20538 -2757 5174 -1136 -23527 -66726 -66886 -29811 -32380 -25304 -44886 -53107
5927 -53107 -47539 -62151 -24405 -32946 -15979 306 -14044 10856 -33512 -8086 -18904 -37616
5915 -37616 -62486 -83687 -62983 -9786 29787 29527 16834 -4838 2898 -13613 8334 26951
5903 26951 27664 37801 39838 4866 7780 24667 8950 -19329 -25369 -1753 28978 41659 42738
5890D2738J3290k6895K2209R994p147j8150K9154K1062j3469k8396p549N6806
5878I3647Q912r225o808K2585M279R772l3294j2527K3864n10l4904O632J9481
5865I1904K690q774L686L1940l265J1943J8509m732O386p431Q660J5214Q759L6894
5851B12383L880P822J577m7441J8802J404n791N864J2525K369M934M187k9256
5838A93259K7038J3843J3330j5640k2775r344j386k979p726m8397q221M0884K2275
5825A94161l2184J37L3948k2679r68j8680r084J7434J1801Q113j0817K1874J075
5812A94131J5418P072k2302n037j7K6610l0253j0879J380l3522n86J0470q406
5799A44079J3068m5347m7474J9106J4274r680n579j525L1138k4929j8413K4158
$$ plain form
5890 42738 56028 29133 51342 61336 54189 36039 65193 86255 72786 44390 36841 93647
5878 93647 102559 93334 86526 109111 113390 123162 89868 77341 101205 100695 65791 72423 91904
5865 91904 94594 85820 89506 121446 118181 130124 148633 143901 150287 142856 151516 166730 175489 212383
5851 212383 216263 224085 225662 178221 197023 198427 192636 198500 211025 213394 218328 222515 193259
5838 193259 220297 234140 247470 231830 209055 199711 198325 195346 187620 139223 131002 171886 194161
5825 194161 161977 162114 196062 173383 172415 153735 144651 162085 173886 181999 171182 193056 194131
5812 194131 209549 216621 194319 189282 189265 215875 185622 174743 176123 142601 142015 152485 144079
5799 144079 157147 111800 64326 83432 97706 88026 82447 80922 112060 87131 68718 92876
5787I2876J1405L0975J0160j1757k6071J2111j8156k0628L885J2534L9940q818
5775A28456L836J2220J1062k0728j1314J9111J1402j6306k4875J3957R655J7704
5763A54180k239O872k28l519Q649M930k7814L894J9598j2158K5700Q319o806P574
5749A86952K5491L2048L4653K2614k049L1823L685L706j1107n333q605P356R230
5736C30464l2132K3717m430k0254J2284k6504J945J657l180p159K4053K2432K1427
5723C44320N0384J1609J8268K2535M9929M5003N4923L9441N0195j9229l6165K0585
5711F51798m2712k1356n5028o2130k4060k0700m8030p174n592k9904j1579n9123
5699B64410k0127L628K9246j0523l4869K076k1826j1405j1061N400K257R88L064
$$ plain form
5787 92876 104281 135256 145416 133659 107588 119699 101543 80915 84800 97334 137274 128456
5775 128456 132292 144512 155574 134846 123532 142643 154045 137739 112864 126821 136476 154180
5763 154180 151941 158813 158585 155066 163715 168645 140831 144725 164323 152165 177865 186184 179378 186952
5749 186952 212443 244491 279144 301758 299709 331532 335217 338923 327816 322483 313878 321234 330464
5736 330464 298332 322049 317619 297365 309649 283145 285090 286747 283567 276408 300461 322893 344320
5723 344320 394704 406313 424581 447116 497045 542048 596971 636412 686607 667378 631213 651798
5711 651798 609086 587730 532702 470572 446512 425812 377782 370608 365016 335112 323533 264410
5699 264410 244283 247911 277157 266634 231765 233841 212015 200610 189549 194949 197206 198194 201258
5686B01258J6234Q779k1720k4799K6383R462k9162K5916l5293l9361J2324j4859
5674A35162j7206J6235k218j612j3557m1609J2644M719l7578J6562n739p097M7274
5661A05980l169J9561J2596k9664l5339L0114R676O598J6862K1387j6251M323
5649A42674R874l610L6686L0049J6689k3749j8786L062l485J1103J2600k6528
5637A86579R145m3451n947k280L9810J9961k4488o569M682L277j2685L0688k6923
5624A71799K0121K6089J5830M8939O236m6659m64K9173p899r660n6738k1955K5196
5611B00008J7947K374n130k3015Q290r984j3314k2555K1784L2068J5437J6817
5599B40727j6504J1793J4412J9305J0071K7696J9074L2889J5239J9460N5616j6232
$$ plain form
5686 201258 217492 226271 204551 179752 206135 215597 186435 212351 177058 137697 150021 135162
5674 135162 117956 134191 131973 130361 116804 75195 87839 92558 54980 71542 65803 58706 105980
5661 105980 102811 122372 134968 105304 69965 100079 109755 116353 133215 154602 138351 142674
5649 142674 152548 148938 185624 215673 232362 208613 189827 192889 189404 200507 213107 186579
5637 186579 195724 152273 146326 144046 183856 203817 179329 172760 177442 180719 168034 198722 171799
5624 171799 191920 218009 233839 282778 289014 242355 241891 271064 263165 253505 196767 174812 200008
5611 200008 217955 220329 215199 192184 200474 190490 177176 154621 176405 208473 223910 240727
5599 240727 224223 236016 250428 269733 279804 307500 326574 359463 374702 394162 449778 433546
5587D33546n2069m2832m0746l5220J2227j6451m9510k2951J6664j8609p903l7814
5575A38332L990k4468J5936K7517M37p173k7861K0848L1878J1259K1768K3442
5563B35905k1708M4559L7072N4733Q278M1850J2485q506n0908j1244l4207o1552
5551B46757J8321k3223l4566j9986m847k1070P914j2459O772L5050n3828m1178
5539A03657K5765q076P520K5422K2585p821K4851Q310k706L3004j2806P200K5758
5526B52663M7964K5225J5159j2807l5328k5147m6799k4835L810M1297M287o7556
5514A77933L4551K2928R327k907K1746j543J3352K0773j6953M597L3966J5460
5502C33230l8118m47K8370L2093N9419K5361J9084j7497j3435J1068k4100l0310
$$ plain form
5587 433546 381477 338645 297899 262679 274906 258455 208945 185994 202658 184049 176146 138332
5575 138332 142322 117854 133790 161307 161744 154571 126710 147558 179436 190695 212463 235905
5563 235905 214197 258756 295828 350561 358839 400689 413174 404668 353760 342516 308309 246757
5551 246757 265078 241855 207289 187303 182456 161386 169300 156841 163613 198663 144835 103657
5539 103657 129422 121346 128866 154288 176873 169052 193903 202213 199507 232511 219705 226905 252663
5526 252663 300627 325852 341011 328204 292876 267729 220930 196095 199905 241202 245489 177933
5514 177933 212484 235412 244739 241832 263578 262035 275387 296160 279207 283804 317770 333230
5502 333230 295112 294665 323035 355128 414547 439908 458992 441495 428060 439128 415028 384718
5490C84718P895J1123l8600k1721K2260P365J4946K4906O543L9129N1792L5210
5478E45566O500l7744m9981J3733j0208m30j7781K2989J3576K1455J9242J8092
5466E45009P623l0653m2947l6214M441l3075q676N516m034Q659l1330J4401K2932
5453D21652L5660j0912J1427M9599j8051o040l3613R513k1952k0729k1045k0197
5441C75312k3071J5519k1801m8692j797P993R631k1066R922Q385l0584q215M890
5428B76426j5353M4063p048j8876q562L3087j9926o688k54p558P015N345Q103
5415B89774j6841j2253j3681J0667k3514M309J6210J9902j678j8034J5135j9382
5403B50614K8734j2644J2371K7392j86K677o1953q014N7971O200N49n525K9566
$$ plain form
5490 384718 392613 403736 365136 343415 365675 373040 387986 412892 419435 458564 510356 545566
5478 545566 552066 514322 464341 478074 467866 467436 449655 472644 486220 507675 526917 545009
5466 545009 552632 521979 479032 442818 447259 414184 405508 411024 406990 415649 384319 398720 421652
5453 421652 457312 446400 457827 507426 489375 483335 449722 459235 437283 416554 395509 375312
5441 375312 352241 367760 345959 297267 295470 303463 313094 292028 301950 310335 279751 271536 276426
5428 276426 261073 305136 298088 279212 270650 303737 283811 277123 276869 269311 276326 281671 289774
5415 289774 272933 260680 246999 257666 234152 238461 254671 274573 272895 254861 269996 250614
5403 250614 279348 266704 279075 306467 306281 308958 247005 238991 296962 303162 303711 298186 327752
5390C27752M0129k2646J5978r64k6701K0620K3167J8933N6354K2620N8452K0724
5378E54418j9042J508L65k6529K6328K3434m4646j1779L728q523k4910l7749j2344
5365D24259J875m6470m0977j0061L786j907m2278m306J7741j8196K81j1158j3480
5352B59109R808P00L9026K3606J4063J7515p803p055j150j1233j1556k4193l5006
5339B65831r525j8318q760J0791k4178p872L1432J3773j3932j045L3238k4582
5327B46853O178K805J624m288o66K1325j3211j2913J6251L1967n0939o354J7057
5314B55689J6216l7351J1384m254k0964R194K4496N514K0734l6474J0431l7106
5302B17509j8122M842n376M0454k5567k7825J4939M0964l0421L261L6731J5291
$$ plain form
5390 327752 367881 345235 361213 360249 333548 354168 377335 396268 452622 475242 533694 554418
5378 554418 535376 536884 537249 510720 537048 560482 515836 504057 507785 499262 474352 436603 424259
5365 424259 426134 379664 338687 328626 332412 330505 288227 283921 301662 283466 283747 272589 259109
5352 259109 268917 269617 308643 332249 346312 363827 356024 348969 347819 336586 325030 300837 265831
5339 265831 256306 237988 229228 240019 215841 207969 239401 253174 239242 238197 271435 246853
5327 246853 253031 255836 257460 253172 252506 273831 260620 247707 263958 295925 244986 238632 255689
5314 255689 271905 234554 245938 241684 220720 229914 254410 259924 280658 244184 254615 217509
5302 217509 199387 204229 198853 239307 213740 185915 200854 241818 211397 214658 251389 266680
5290B66680j1614J7260k2119k2464O999K7280O197Q523j9850J9918j1512r928
5278B55370p913N315K4694J1032k5376K0540k6660l8445M8388K1361K5203L2364
5266C45873J0003J1316k109k6610J0559J3822l1151m851J2703K3045J493J1398
5254C75491O28l1622M956R546n124j3690n65m434J4788J5654L158n057l2172K5468
5240C57025L9745J783k6107q006J6454L8140K8794j461M6649k6059q124L0778
5228D89611J441q312N592n9006L815K0947j0768K2373J124J9081j144p559j7102
5215D60093O404J5825j6036j8708J9639N394K259l0554K4773K7476J9400K6764
5203E42729M5388J2272j5250J9923l2173M0982K078J685J7925J6427k0838k4315
$$ plain form
5290 266680 255066 272326 250207 227743 234742 262022 268219 276742 256892 276810 265298 255370
5278 255370 247457 252772 277466 288498 263122 283662 257002 218557 266945 288306 313509 345873
5266 345873 355876 367192 365083 338473 349032 362854 331703 326852 339555 362600 364093 375491
5254 375491 376119 344497 349453 358999 353875 340185 339620 335186 349974 365628 368786 363729 331557 357025
5240 357025 396770 398553 372446 364440 380894 419034 447828 446367 493016 466957 458833 489611
5228 489611 491052 482740 488332 429326 433141 454088 443320 465693 466817 485898 484754 477195 460093
5215 460093 466497 482322 466286 447578 467217 472611 474870 444316 469089 496565 515965 542729
5203 542729 588117 600389 585139 605062 572889 613871 615949 617634 635559 651986 631148 606833
5191F06833l1496n679M4659k1017L45J3680J0348l3055k3349J6812K7734J2563
5179F18378j5215R774J6562p560O172K1772p995J4929P668q86J0215K0295j4655
5166F79454K9365K9460k2954j962l183l1769K7803J2251J1355O305K2906m259
5154G54772j5186N1824J2542k6601L0358J5880L5298L7141q676N5392O767K5535
5142I75046M4162P146J3499L3805J2310K1752N6523N2726O0355L4064L8521M8809
5130A398718L9752L0292K8599P1825N2292J13527J11166J20882J35245P6550Q4750
5119B263598P8929N5842O6063Q5799J25927J21593J19772J15978J51764J48341
5109C333606J68247J67583J64762J49857K25524J88224J12007J37906J37095J88092
$$ plain form
5191 606833 575337 569658 614317 593300 593645 607325 617673 584618 561269 578081 605815 618378
5179 618378 603163 612937 629499 621939 628111 649883 641888 656817 664485 663599 673814 694109 679454
5166 679454 708819 738279 715325 713363 710180 678411 706214 718465 729820 736125 759031 754772
5154 754772 739586 791410 803952 777351 807709 823589 858887 896028 887352 942744 949511 975046
5142 975046 1019208 1026354 1039853 1073658 1085968 1107720 1164243 1216969 1277324 1311388 1349909 1398718
5130 1398718 1438470 1468762 1497361 1569186 1621478 1735005 1846171 1967053 2102298 2178848 2263598
5119 2263598 2342527 2398369 2464432 2550231 2676158 2797751 2917523 3033501 3185265 3333606
5109 3333606 3501853 3669436 3834198 3984055 4209579 4397803 4509810 4647716 4784811 4972903
5099D972903K31354K49116K43448K61602K52137K61862L03135L56841M15931M31595
5089G979924M93474N05946L91959L39048L97813L95206M21965M98539N70075O97265
5079A2691214P99759R28580J101944J247403J375311J463766J762896K062264
5071B3433137K549329L284911M494931N787303P101648P115781L341353q58631
5063E6249762l111643m084965m179577k850965j273323q4984R35805J39644j922622
5054C9817132l283283l788743l996595l705491l106303k692417k348272j960366
5046A4935662j592112j345246j135158r72383q18331o94794o37484n30989m67397
5037F741768l78744l02324l41666k94332k34568k39078k09787k18739k06730k09411
$$ plain form
5099 4972903 5204257 5453373 5696821 5958423 6210560 6472422 6775557 7132398 7548329 7979924
5089 7979924 8473398 8979344 9371303 9710351 10108164 10503370 10925335 11423874 11993949 12691214
5079 12691214 13490973 14419553 15521497 16768900 18144211 19607977 21370873 23433137
5071 23433137 25982466 29267377 33762308 39549611 46651259 53767040 57108393 56249762
5063 56249762 53138119 49053154 44873577 42022612 40749289 40664305 41600110 41739754 39817132
5054 39817132 36533849 32745106 28748511 25043020 21936717 19244300 16896028 14935662
5046 14935662 13343550 11998304 10863146 9890763 9072432 8377638 7740154 7209165 6741768
5037 6741768 6363024 6060700 5719034 5424702 5190134 4951056 4741269 4522530 4315800 4106389
5027D106389j81381j41203j18950r9381q4035j23463r6603r9133j44246j49202
5017B868792r9666r6164p2083o7082m8776q9139p5456l3359m5165j9528j0038
5006B212336n0433o6047j5573l4010m2977P61J7881j1391j4037o865L0692P158
4994B027495l1673k7806n3271n9258p1516l6379l6101j8967m4681L149K8236j5450
4982A663778l524K9704p313j0070K8241j9451l1551J6826J9922L7371O5070K6601
4970A815604N0912M4421M1623N3956M8862O0637Q5207O1790O0531M5283J09317
4959B478143J43983J57351J54330J51623K20511K05318K22730K65704L11277L90892
4949D701862N07512O79580Q86190J165170J181169Q95648L85556k46553p79501
$$ plain form
5027 4106389 3925008 3783805 3664855 3565474 3481439 3357976 3261373 3162240 3017994 2868792
5017 2868792 2769126 2672962 2600879 2533797 2485021 2395882 2320426 2287067 2241902 2222374 2212336
5006 2212336 2161903 2095856 2080283 2046273 2003296 2004057 2021938 2010547 1996510 1989645 2020337 2027495
4994 2027495 1995822 1968016 1914745 1855487 1783971 1747592 1711491 1692524 1647843 1650992 1679228 1663778
4982 1663778 1660254 1689958 1682645 1672575 1700816 1681365 1649814 1666640 1686562 1723933 1789003 1815604
4970 1815604 1866516 1910937 1952560 2006516 2055378 2116015 2201222 2263012 2323543 2368826 2478143
4959 2478143 2622126 2779477 2933807 3085430 3305941 3511259 3733989 3999693 4310970 4701862
4949 4701862 5209374 5888954 6775144 7940314 9121483 10017131 10402687 10156134 9376633
4940I376633j085633j022298r86131q80238o60807n57330m75048l57760k92490
4931C058898k45927j94630j98119j04040r4268j22015j17091r1051o6601m6757
4921A778399k9306m7979m6885m0687m1055J1019l6731l305L4798J5919O651m860
4909A595978L2709J4259J1170l1909k5509M0064L517K1458L7757M7030Q2749j663
4897A827610N9457R5889O8078O9411P2588L4708M5017O1715O8099Q5620J09465
4886B597657J52177J58187J83580J77801K25695K44371K77170L52311M10213M78750
4876E257912O24057Q82735J052236J029522P08886M17273L0107n54626q63533
4867H584569r52096r14033q75022p41883o01030n02254m11358l24896k95624k33729
$$ plain form
4940 9376633 8291000 7268702 6282571 5402333 4741526 4184196 3709148 3351388 3058898
4931 3058898 2812971 2618341 2420222 2316182 2221914 2099899 1982808 1891757 1825156 1778399
4921 1778399 1749093 1701114 1654229 1613542 1572487 1583506 1546775 1543470 1578268 1594187 1600838 1595978
4909 1595978 1628687 1642946 1654116 1622207 1596698 1636762 1640279 1661737 1699494 1746524 1829273 1827610
4897 1827610 1887067 1982956 2051034 2120445 2193033 2227741 2272758 2334473 2402572 2488192 2597657
4886 2597657 2749834 2908021 3091601 3269402 3495097 3739468 4016638 4368949 4779162 5257912
4876 5257912 5881969 6764704 7816940 8846462 9555348 9972621 10002728 9448102 8584569
4867 8584569 7632473 6718440 5843418 5101535 4500505 3998251 3586893 3261997 2966373 2732644
4857B732644j53674j52309j15148o0974l3560j9311j4289l6608p3906m5879l037
4846B023949p7019r1782o3322n8769p3674m0258k8742o5281m2972r039K9j699
4834A471421J2311l8036j436K4866m9486k0245k0763o962K3256P451J4072J0961
4822A427410J1238L7147j4607L2046N5817M2851K0765N2049J7396O2778N8660
4811A803550N9241P8500J01122J00149R0928J19532J02451J29844J67654J94332
4801B947303J38168K08501K69649K95235L66530M85906O77349Q35594Q47458M53809
4791G525502j01712m78860o15320o64119o85533n51334n45825m79803l80443k88722
4781B733831k42776j78704j55990j40123q9944j07562n8145n1316r3603m8691
$$ plain form
4857 2732644 2578970 2426661 2311513 2250539 2216979 2197668 2183379 2146771 2072865 2026986 2023949
4846 2023949 1946930 1855148 1791826 1733057 1659383 1619125 1590383 1525102 1482130 1473091 1473120 1471421
4834 1471421 1483732 1445696 1444260 1469126 1419640 1399395 1378632 1371670 1394926 1402377 1416449 1427410
4822 1427410 1438648 1475795 1461188 1493234 1549051 1591902 1612667 1664716 1682112 1744890 1803550
4811 1803550 1862791 1941291 2042413 2142562 2233490 2353022 2455473 2585317 2752971 2947303
4801 2947303 3085471 3293972 3563621 3858856 4225386 4711292 5388641 6224235 7071693 7525502
4791 7525502 7423790 6944930 6329610 5665491 4979958 4428624 3882799 3402996 3022553 2733831
4781 2733831 2491055 2312351 2156361 2016238 1926294 1818732 1760587 1709271 1615668 1566977
4771A566977m3395m7759r3274p0310l9488l9340m6969K4241J0175o9606j5507
4760A135745N3487j9240l2486j4984l621j24j7441l157K6428L8055L7162N8723
4748A258547L1390J4117k5493j0521k072j5004n069O592J8809K0980K1500r386
4736A304390L89J8280m7573l2166k8499l776j9383j272J7288k1439k766l1163
4724A152310L3432n451R96K0205m3658K5213L1605L7541K0712J1087L1774J2416
4712A328182K5204L9153M0438Q4834L3387K5389L154J1067J7315m4818Q890K1357
4700A593552m9362M430J0043j5081k3916k0176J0669m878j7732J1697m8860k1373
4688A429013k466j3115j8360j5172M5839K7285K2658L1341M2794J1367j0336m31
$$ plain form
4771 1566977 1523582 1475823 1382549 1312239 1272751 1233411 1186442 1210683 1220858 1151252 1135745
4760 1135745 1189232 1169992 1137506 1122522 1118901 1118777 1101336 1098179 1124607 1162662 1199824 1258547
4748 1258547 1289937 1304054 1278561 1268040 1265968 1250964 1245895 1252487 1271296 1292276 1313776 1304390
4736 1304390 1304779 1323059 1275486 1243320 1214821 1211045 1191662 1190390 1207678 1186239 1183473 1152310
4724 1152310 1185742 1180291 1181287 1201492 1157834 1183047 1214652 1252193 1272905 1283992 1315766 1328182
4712 1328182 1353386 1392539 1432977 1517811 1551198 1576587 1579741 1590808 1608123 1563305 1572195 1593552
4700 1593552 1544190 1548620 1558663 1543582 1519666 1499490 1510159 1505281 1487549 1499246 1450386 1429013
4688 1429013 1426547 1413432 1395072 1379900 1425739 1453024 1475682 1507023 1549817 1561184 1550848 1550417
4676A550417k0106k2406L252n2676j7783j6750j9448R53N028j1323L2056R724
4664A440938l0899m845l6205m5993o7489j0306l8229p4888J8569J9785l0094k0433
4652A119911n0282j8780K4462K7225m134j0622K5748N339r6141o455K4415m2055
4640I98631L9952J1209l7488l7960p687J1546p379k2920q478j2013M1058k1899
4628I46572n6747m1823j8402p091k396n404m3886K0677P676P356N096j3043k6490
4615G72095k7628j237M4893j0591n2114l534K524J3818j037k362l3039J2877J0168
4602G24833j3072j2014J0096j1568j7496m029M325L5070Q569L5473p35j2801k0073
4589G26578O528R068k339m293j1558k4504K5971L2128k166J3765j8645l472J2161
$$ plain form
4676 1550417 1530311 1507905 1511157 1458481 1440698 1423948 1404500 1405453 1410481 1399158 1431214 1440938
4664 1440938 1410039 1405194 1368989 1322996 1255507 1245201 1206972 1132084 1150653 1170438 1140344 1119911
4652 1119911 1069629 1050849 1075311 1102536 1098402 1087780 1113528 1118867 1022726 1016271 1040686 998631
4640 998631 1038583 1049792 1012304 974344 966657 978203 970824 947904 939426 927413 968471 946572
4628 946572 889825 848002 829600 822509 820113 814709 770823 791500 799176 806532 811628 798585 772095
4615 772095 744467 743230 788123 777532 725418 721884 724408 738226 737189 734827 701788 714665 724833
4602 724833 711761 699747 709843 698275 680779 676750 681075 716145 724714 760187 759452 746651 726578
4589 726578 733106 742174 739835 735542 723984 699480 725451 757579 755413 769178 750533 747061 759222
4576G59222J6366K0842K2432J7045j5769m472K189j408Q659J5707K4983O156M2528
4563I14480J9169j9938r083K5976K1237K9560M5104M9438K8405Q122L5980J6439
4551A164889J0145M1405K1278N018N856M241K595P154R139J8052J8234M0927L4088
4538A383021J2462K1906N2433J5657N4330P5819N4982N8189L8419P8201P6563
4527A921982Q1993Q5722O7821P3950J17906O8530O9334P4378N6260J6669R718
4516B644263O1266K9121Q308j8752j3214M7103O4749Q3230P9900J01023Q7708
4505C174705Q1902J23359J49114J45366J01538N5318Q3257N3519p171L6223M1618
4494D038748P6437Q3135M9571J4498J6843j2041K021J1003k7004J6544M076j861
$$ plain form
4576 759222 775588 796430 818862 835907 820138 815666 817855 816447 825106 840813 865796 871952 914480
4563 914480 933649 913711 904628 930604 951841 981401 1026505 1075943 1104348 1112470 1148450 1164889
4551 1164889 1175034 1216439 1237717 1242735 1248591 1252832 1255427 1262581 1271720 1289772 1308006 1348933 1383021
4538 1383021 1395483 1417389 1469822 1485479 1539809 1615628 1670610 1728799 1767218 1845419 1921982
4527 1921982 2003975 2089697 2157518 2231468 2349374 2417904 2487238 2561616 2617876 2634545 2644263
4516 2644263 2705529 2734650 2742958 2724206 2710992 2758095 2822844 2906074 2985974 3086997 3174705
4505 3174705 3256607 3379966 3529080 3674446 3775984 3831302 3914559 3968078 3960907 3997130 4038748
4494 4038748 4115185 4198320 4247891 4262389 4279232 4267191 4269212 4280215 4253211 4269755 4273831 4271970
4482D271970J6219J9325k7325n0756k8267k6953l3512K266l731n8771r4230p4859
4470C911376j24810j18487r5195q2184r1291p6506l5283k9439M769j177k922q268
4458C250583M324l950l2969r468m1403m5402m3667o5786q5987p8003o4955j04719
4446B678598j21179j33800r2428p8773j04857q7283m0034l3322m9485n1014k6589
4435A859834M7o96P223j0211J2364K7439q633k529k7021J2728J9829O343K279
4422A898996j0552J4617j1646k1876n8606m3715k3868m9436j4550l5948j3383
4411A630033l6739l5257m4056n3594O0665L8520l7041j2536J8455J4530j6252
4400A526728l817N7R596n160N6287M1695K5200l5215J0931K4546j5736M9054L6370
$$ plain form
4482 4271970 4288189 4307514 4280189 4229433 4201166 4174213 4140701 4142967 4139236 4080465 3986235 3911376
4470 3911376 3786566 3668079 3572884 3490700 3399409 3322903 3287620 3258181 3262950 3261773 3258851 3250583
4458 3250583 3254907 3250957 3217988 3208520 3167117 3121715 3078048 3012262 2926275 2848272 2783317 2678598
4446 2678598 2557419 2423619 2331191 2252418 2147561 2060278 2020244 1986922 1937437 1886423 1859834
4435 1859834 1859881 1859185 1866408 1856197 1868561 1896000 1887367 1884838 1857817 1870545 1890374 1896717 1898996
4422 1898996 1888444 1903061 1891415 1869539 1810933 1767218 1743350 1693914 1679364 1643416 1630033
4411 1630033 1593294 1558037 1513981 1460387 1521052 1559572 1522531 1509995 1528450 1542980 1526728
4400 1526728 1522911 1522968 1532564 1527404 1583691 1625386 1650586 1615371 1626302 1650848 1635112 1684166 1720536
4387A720536j4830k4929L1506j3132l681K404o128K2634L6327J7317L0816J4315
4375A813155K9239K5238K3532L3614R860M2350K6995j0374n407K3538K7074K1528
4363B060342N4413M1322K0930O1718M4751K9248J1445P851K0659k7869l8519o208
4351B280083L430K4660J2075K9893K3754M1733M7530L7565J6168l622N5737K2844
4339B591850R735l0331r347L8047K6660J4302j4822J9826O5893K2455L1111M9143
4327B814522N9492J7958K5703L2464M3558L7969J1044R090L0706L2569O5753Q1241
4315C262069O5820L4712L3807K5567L3701P1792P6568M4931Q0688O1570P6733
4304C867958N8184K9505N3699K8223P2033Q1936O9055Q3844J88976J24591J29802
$$ plain form
4387 1720536 1705706 1680777 1712283 1699151 1695470 1697874 1691746 1714380 1750707 1768024 1798840 1813155
4375 1813155 1842394 1867632 1891164 1924778 1934638 1976988 2003983 1993609 1988202 2011740 2038814 2060342
4363 2060342 2114755 2156077 2177007 2238725 2283476 2312724 2324169 2332020 2352679 2324810 2286291 2280083
4351 2280083 2283513 2308173 2320248 2350141 2373895 2415628 2463158 2500723 2516891 2513269 2569006 2591850
4339 2591850 2601585 2571254 2561907 2599954 2626614 2640916 2626094 2645920 2711813 2734268 2765379 2814522
4327 2814522 2874014 2891972 2917675 2950139 2993697 3031666 3042710 3051800 3082506 3115075 3180828 3262069
4315 3262069 3327889 3362601 3396408 3421975 3455676 3527468 3604036 3648967 3729655 3791225 3867958
4304 3867958 3926142 3955647 4009346 4037569 4109602 4191538 4260593 4344437 4533413 4658004 4787806
4293D787806J36809J57750J07023J39826J11463P4003J20304Q3723J42189J41840
4283F002736J72601J58586J90412K58516K00270K38020K19870J43978J19385O9056
4273G773430Q5269R3114J28074J88785K22217K77884L41660M14198M41079M04213
4263A0369923L76340L13904K28172K10234K82948K93818L34748K23355L5554q630
4253A2660366k926j55L4715Q6269M1708n2691r5512j85403k30949k10688j98396
4242A1846338j32266m4920N2589J23984K18858K87159K95243K65587K62329J52642
4232A3327543N7023k5256m9087l6724L8406R9021J72960K27403K95865M17689
4222A4524843N62813N54621N28819N66676M73119L73317K96627L34508L79405
$$ plain form
4293 4787806 4924615 5082365 5189388 5329214 5440677 5514680 5634984 5718707 5860896 6002736
4283 6002736 6175337 6333923 6524335 6782851 6983121 7221141 7441011 7584989 7704374 7773430
4273 7773430 7858699 7951813 8079887 8268672 8490889 8768773 9110433 9524631 9965710 10369923
4263 10369923 10746263 11060167 11288339 11498573 11781521 12075339 12410087 12633442 12668996 12660366
4253 12660366 12657440 12657285 12692000 12778269 12819977 12767286 12671774 12486371 12255422 12044734 11846338
4242 11846338 11714072 11669152 11721741 11845725 12064583 12351742 12646985 12912572 13174901 13327543
4232 13327543 13384566 13359310 13310223 13273499 13311905 13410926 13583886 13811289 14107154 14524843
4222 14524843 15087656 15642277 16171096 16737772 17210891 17584208 17880835 18215343 18594748
4213A8594748M58351N24806O27685P90355R40628J086721J206435J256061J227441
4204B6713231J176836J112256J118078J215734J238032J026182O64940L19970
4196C4585259K64426L21932M79337P33020P69137O90706M96861K04412n9729k26089
4186C8259272l60019l54902k69756j05589J50004M34677P37870R97929J068859
4177D0558345R04811N63215j2409n35404q64816j162099j262106j280545j105298
4168C5803694q62479n77204k32844M9557K34234J97529m8450l66949q08700j222905
4158C2165483j479493j575855j586317j486456j315669j062108p97352n77902
4150B2284331m32836l72932l27090m78764o13089q07867r12417r50828r89515
$$ plain form
4213 18594748 19053099 19577905 20205590 20995945 21936573 23023294 24229729 25485790 26713231
4204 26713231 27890067 29002323 30120401 31336135 32574167 33600349 34265289 34585259
4196 34585259 34849685 35171617 35650954 36383974 37153111 37843817 38340678 38545090 38485361 38259272
4186 38259272 37899253 37544351 37274595 37169006 37319010 37753687 38491557 39489486 40558345
4177 40558345 41463156 42026371 42013962 41478558 40613742 39451643 38189537 36908992 35803694
4168 35803694 34941215 34364011 34131167 34180724 34414958 34612487 34564037 34197088 33388388 32165483
4158 32165483 30685990 29110135 27523818 26037362 24721693 23659585 22862233 22284331
4150 22284331 21851495 21478563 21151473 20672709 20059620 19251753 18339336 17388508 16398993
4141A6398993r50663q11973p06898o29101m86546m28180l34122k91822k93536
4132A1466152l14621l51244l49582l42008l18096k98949k71503k35306j90848
4123H793995j69819j15737j40289j17156q0279o2624j02407m8756o5366o1417
4113G830145q5245q2777n2068o2074o3651k0841m0536q8501l0560o5352k6358
4102G212182k3108k2835n869n5971l9715l0566n6937j2916k1514j4765l711r820
4090F914455J2682j4387M4337M6117J681N997L7550J11198J5026M0910P3204N6958
4078G345728O1343N4944O8947R7722M3528N5790P1949R0647P0841O7524R9375
4067H128338N9671R4980Q5985O2988M0175O6665M4298P8125R136L5782O8214K5018
$$ plain form
4141 16398993 15448330 14636357 13929459 13300358 12813812 12385632 12051510 11759688 11466152
4132 11466152 11151531 10800287 10450705 10108697 9790601 9491652 9220149 8984843 8793995
4123 8793995 8624176 8508439 8368150 8250994 8170715 8108091 8005684 7956928 7891562 7830145
4113 7830145 7744900 7662123 7610055 7547981 7484330 7463489 7422953 7334452 7303892 7238540 7212182
4102 7212182 7189074 7166239 7160370 7104399 7064684 7034118 6977181 6964265 6942751 6927986 6924275 6914455
4090 6914455 6927137 6912750 6957087 7003204 7004885 7010882 7048432 7159630 7174656 7215566 7288770 7345728
4078 7345728 7407071 7462015 7530962 7628684 7672212 7728002 7799951 7890598 7961439 8028963 8128338
4067 8128338 8188009 8282989 8368974 8431962 8472137 8538802 8583100 8661225 8670361 8706143 8774357 8799375
4055H799375O9404K6620K4399L8966N1613N5929Q7864P9709J05986Q3000J25522
4044I548387J19526P9537O6439J22287N8855Q8144J19028P9759J42780J34190
4034A0558932J26975J13935J02132J71322J44522J16298J03660J50040K10259
4025A1798075J49872J47669J65729J70635J12970J63848J34380J25026J52185
4016A3120389J42921J58193J27902J61328J73599J81729J79557J61189J90677
4007A4597484K00262K21038K17069K14462J94934K21589K13312K02347K01149
3998A6483646J94049K09640K05928K36983K35845J98985K74854K57053J88770
3989A8485753K22163K53902K74410K54993K62831K57323K35330K82878K48800
$$ plain form
4055 8799375 8868779 8895399 8919798 8958764 9010377 9066306 9154170 9233879 9339865 9422865 9548387
4044 9548387 9667913 9747450 9813889 9936176 9995031 10083175 10202203 10281962 10424742 10558932
4034 10558932 10685907 10799842 10901974 11073296 11217818 11334116 11437776 11587816 11798075
4025 11798075 11947947 12095616 12261345 12431980 12544950 12708798 12843178 12968204 13120389
4016 13120389 13263310 13421503 13549405 13710733 13884332 14066061 14245618 14406807 14597484
4007 14597484 14797746 15018784 15235853 15450315 15645249 15866838 16080150 16282497 16483646
3998 16483646 16677695 16887335 17093263 17330246 17566091 17765076 18039930 18296983 18485753
3989 18485753 18707916 18961818 19236228 19491221 19754052 20011375 20246705 20529583 20778383
3980B0778383K75259K97295K98469K53236K84141K65385K68471K82576L07298
3971B3310513L52706L04316L28624L39326L23655L41858M34018M40782L92910
3962B6568708M40349M75343M96447N53126N89023O63846O77563P82804P96427
3953C2043636Q65019Q71771Q71665Q95929Q29513O86982N94414M85333K96101
3944C8440363J68946N8317q393j55859j76449j66014j24782j35505j15552j38832
3934C7646240j71409k05873k88369l85362m40520n49665o71355p33163p59554
3925C3440970p60679p51414p43883p12169o39655n79213n73866n28554m49737
3916B7701800m27019m26470l73993l18333l17043l31809l17476k66268k71701
$$ plain form
3980 20778383 21053642 21350937 21649406 21902642 22186783 22452168 22720639 23003215 23310513
3971 23310513 23663219 23967535 24296159 24635485 24959140 25300998 25735016 26175798 26568708
3962 26568708 27009057 27484400 27980847 28533973 29122996 29786842 30464405 31247209 32043636
3953 32043636 32908655 33780426 34652091 35548020 36377533 37064515 37658929 38144262 38440363
3944 38440363 38609309 38667626 38659233 38503374 38326925 38160911 38036129 37900624 37785072 37646240
3934 37646240 37474831 37268958 36980589 36595227 36154707 35605042 34933687 34200524 33440970
3925 33440970 32680291 31928877 31184994 30472825 29833170 29253957 28680091 28151537 27701800
3916 27701800 27274781 26848311 26474318 26155985 25838942 25507133 25189657 24923389 24651688
3907B4651688k72410k60037k70644k40513j92833k31810k40002k30756k02942
3898B2509741k12344k21117k14028k41909k08252j84941j98077k06938j81677
3889B0640458k12089j95367j57629k28541j75739j95971k22655k04468j96272
3880A8851727j80716j96793j74479j56482j98723j76280j48157j63110j69732
3871A7287255j80046j66672j37416j24138j73985j68860j49774j58913j45678
3862A5881773j31171j19496j69805j35441j35610j36725j06748q6622j28905j27778
3852A4603472j29021p8445n5994o1461n1644m3427l7318l4147l3311k7308K140
3841A4053536K1636k2142n289K8552O8870L3577P0006L7813N0520K9557M5786
$$ plain form
3907 24651688 24379278 24119241 23848597 23608084 23415251 23183441 22943439 22712683 22509741
3898 22509741 22297397 22076280 21862252 21620343 21412091 21227150 21029073 20822135 20640458
3889 20640458 20428369 20233002 20075373 19846832 19671093 19475122 19252467 19047999 18851727
3880 18851727 18671011 18474218 18299739 18143257 17944534 17768254 17620097 17456987 17287255
3871 17287255 17107209 16940537 16803121 16678983 16504998 16336138 16186364 16027451 15881773
3862 15881773 15750602 15631106 15461301 15325860 15190250 15053525 14946777 14860155 14731250 14603472
3852 14603472 14474451 14396006 14340012 14278551 14226907 14183480 14146162 14112015 14078704 14051396 14053536
3841 14053536 14075172 14053030 14047741 14076293 14145163 14178740 14248746 14286559 14337079 14366636 14412422
3830A4412422P5169K7856N2742L4716Q7489Q5389L1202N5582K7354p245K6835
3819A4909511L4420Q3376Q0108M9859R8839J33469J57198K14792K04053K20136
3809A6185761K59348L32270L13925L84221L95995M74646N53564N90042O25054
3800B0114826P81024R26432J048258J149129J277196J341808J408746J390559
3792B9437978J349268J241837J123601J028181Q14655O29789N13609M42215M26106
3783C7007239N23401O72432Q62087J059006J302453J510801J608529J619581J560243
3774D7725772J348809J035053O70104K27298k12676o97144j189069j673931k022003
3765D5212213k287577k482910k517825k455258k387699k258190k080754j954465
$$ plain form
3830 14412422 14487591 14515447 14568189 14602905 14690394 14775783 14806985 14862567 14889921 14882676 14909511
3819 14909511 14943931 15027307 15107415 15157274 15256113 15389582 15546780 15761572 15965625 16185761
3809 16185761 16445109 16777379 17091304 17475525 17871520 18346166 18899730 19489772 20114826
3800 20114826 20895850 21822282 22870540 24019669 25296865 26638673 28047419 29437978
3792 29437978 30787246 32029083 33152684 34180865 34995520 35625309 36138918 36581133 37007239
3783 37007239 37530640 38203072 39065159 40124165 41426618 42937419 44545948 46165529 47725772
3774 47725772 49074581 50109634 50779738 51007036 50794360 50097216 48908147 47234216 45212213
3765 45212213 42924636 40441726 37923901 35468643 33080944 30822754 28742000 26787535
3757B6787535j813655j615844j502967j396014j227836j125099r84831q36970
3749A6284319p71669p11435o07680n31417m70100m44597m15671l16012l25310
3740A1690428k80066k04157k06015j64574j63165j72972j51518j56635j14749
3731A0076577r2642j19895n3417p6726q4424j11030n7004k9616m4731n119m161
3720I397812k3993p933Q405l183j4147L8808K6627m53N293l0605L6797K1494L0789
3707I485711O356j8284j4057j1043J3637m365m2756j0422O206l4629q983L863
3695I371234P998j9931q463j4932N2550L0923O762O9498L9026L2425P3771M3275
3683I684136N3977N3986M6782n106L2307O6451O1974M8726J11798J06174J27144
$$ plain form
3757 26787535 24973880 23358036 21855069 20459055 19231219 18106120 17121289 16284319
3749 16284319 15512650 14801215 14193535 13662118 13192018 12747421 12331750 12015738 11690428
3740 11690428 11410362 11206205 11000190 10835616 10672451 10499479 10347961 10191326 10076577
3731 10076577 9983935 9864040 9810623 9733897 9649473 9538443 9481439 9451823 9407092 9401973 9397812
3720 9397812 9373819 9365886 9374291 9371108 9356961 9395769 9422396 9421943 9427236 9396631 9433428 9454922 9485711
3707 9485711 9492067 9473783 9459726 9448683 9462320 9457955 9415199 9404777 9410983 9376354 9367371 9371234
3695 9371234 9379232 9359301 9350838 9335906 9388456 9419379 9426141 9495639 9534665 9567090 9640861 9684136
3683 9684136 9738113 9792099 9838881 9833775 9866082 9932533 9994507 10043233 10155031 10261205 10388349
3672A0388349J18352J35469J50592J37913J47666J87049J81786J75433K59571
3663A1882180K49082K57296L30809L43383L15000L21587L46476L57736L42173
3654A4745722L14362L11999K03739J44966J57736R4155M3610K5327M387R784J9364
3643A6075151k622K7444N3471M9231O6451J14941J26356J63723J47883J96593
3633A7018622K00711K61617K68711K80326K94387L25566L34832L87097M48574
3624A9820443M69062N58360N99686O71989P56197P83140Q22460Q77169R69657
3615B6328163J026111J066195J189231J345050J469366J574363J781444J994127
3607C7774050K207147K417484K617673K855101L015361L115230L183631L065401
$$ plain form
3672 10388349 10506701 10642170 10792762 10930675 11078341 11265390 11447176 11622609 11882180
3663 11882180 12131262 12388558 12719367 13062750 13377750 13699337 14045813 14403549 14745722
3654 14745722 15060084 15372083 15575822 15720788 15878524 15972679 16016289 16041616 16046003 16055787 16075151
3643 16075151 16072529 16099973 16153444 16202675 16269126 16384067 16510423 16674146 16822029 17018622
3633 17018622 17219333 17480950 17749661 18029987 18324374 18649940 18984772 19371869 19820443
3624 19820443 20289505 20847865 21447551 22119540 22875737 23658877 24481337 25358506 26328163
3615 26328163 27354274 28420469 29609700 30954750 32424116 33998479 35779923 37774050
3607 37774050 39981197 42398681 45016354 47871455 50886816 54002046 57185677 60251078
3599F0251078K593490K001723J383919R43670P00360N05751M32722L66452K36528
3590F9415693J09383Q3446R3576J20841K97446M05325N43864P17736P96448Q56453
3580G3440211Q74324Q38372P63826Q59064J049447J285151J353054P52438L331
3571H1219218o58141j240119j779873j994196j899976j648900j171846o01224
3563G0224943j4236N96511J213039J807594K408649L065426L652368M153426M569508
3554I1677228M715221M684678M363120L871131L283816K502166J626881R21052
3546A17645293L67844M8540j92671p66456j416280j726277j663030j500115j431590
3537A09365258j450024j809239k358323k895562l539031m179547m716249n049132
$$ plain form
3599 60251078 62844568 64846291 66230210 67173880 67874240 68379991 68812713 69179165 69415693
3590 69415693 69525076 69608522 69702098 69822939 70120385 70525710 71069574 71787310 72583758 73440211
3580 73440211 74314535 75152907 75916733 76775797 77825244 79110395 80463449 81215887 81219218
3571 81219218 80561077 79320958 77541085 75546889 73646913 71998013 70826167 70224943
3563 70224943 70210707 70807218 72020257 73827851 76236500 79301926 82954294 87107720 91677228
3554 91677228 96392449 101077127 105440247 109311378 112595194 115097360 116724241 117645293
3546 117645293 118013137 118061677 117869006 117102550 115686270 113959993 112296963 110796848 109365258
3537 109365258 107915234 106105995 103747672 100852110 97313079 93133532 88417283 83368151
3529H3368151n192660n154529m904599m611286m184824l696905l210119k787325
3521D9625904k425755k015850j700166j510850j237828j048789q00788n79235
3513C8306643m45850k64904q0631R4788K27817L61932N11874O02158O34439P52110
3503D0700376Q28729Q70742J019666J176287J266336J414514J598841J756067
3495E0631558J888764K022643K139278K166590K164670K056935J893391J689053
3487F6652882J455970J204690Q56121N27313L07090J49384j709j2836k6444l5122
3477G1077339P39j00082j44337k70878l98022n54990p61525j006509j203741j348501
3467F5289493j418789j405281j321541j220567j088172q57460o61539n47971l86337
$$ plain form
3529 83368151 78175491 73020962 68116363 63505077 59320253 55623348 52413229 49625904
3521 49625904 47200149 45184299 43484133 41973283 40735455 39686666 38885878 38306643
3513 38306643 37860793 37595889 37515258 37610046 37837863 38199795 38711669 39313827 39948266 40700376
3503 40700376 41529105 42399847 43419513 44595800 45862136 47276650 48875491 50631558
3495 50631558 52520322 54542965 56682243 58848833 61013503 63070438 64963829 66652882
3487 66652882 68108852 69313542 70169663 70696976 71004066 71153450 71151741 71138905 71112461 71077339
3477 71077339 71078078 70977996 70833659 70562781 70164759 69609769 68848244 67841735 66637994 65289493
3467 65289493 63870704 62465423 61143882 59923315 58835143 57977683 57316144 56768173 56381836
3458E6381836k57238j21060L2967J65604K24286L89802N05824N81299P54764Q62922
3448E9521006R48871J027849J096588J186832J354044J429691J567492J744170
3440F9876543J957801K184333K379172K626236K925756L260286L655523M010866
3432I2876516M499968N055951N607340O160602O827064P505678Q320110R123372
3424A45976601R935808J0479715J0667805J0481483R814597Q877965P667021O270416
3416B20171411M634547K906537J209101k14240j141775j635935j630293j302378
3408B22996975q63329n69286m10377m51499p33607j351506k273613l424477m787425
3399B08131856o160484p327528q191902q688438q877529q686064q265291p670079
$$ plain form
3458 56381836 56124598 56003538 56036505 56202109 56426395 56816197 57322021 57903320 58658084 59521006
3448 59521006 60469877 61497726 62594314 63781146 65135190 66564881 68132373 69876543
3440 69876543 71834344 74018677 76397849 79024085 81949841 85210127 88865650 92876516
3432 92876516 97376484 102432435 108039775 114200377 121027441 128533119 136853229 145976601
3424 145976601 155912409 166392124 177059929 187541412 197356009 206233974 213900995 220171411
3416 220171411 224805958 227712495 228921596 228707356 227565581 225929646 224299353 222996975
3408 222996975 222133646 221564360 221153983 220702484 219968877 218617371 216343758 212919281 208131856
3399 208131856 201971372 194643844 186451942 177763504 168885975 160199911 151934620 144264541
3391A44264541o926559o080986n190513m361707l554357k903132k248141j681142
3383A11318004j151110o14451p6476M81646J090201J753033K511356L343692M197551
3374A22853446M952004N442387N723115N724658N515903N208988M873532M474871
3366A64768904L878315L180532K269581J290891L21945n48253j288486j716054
3358A72157375k067743k315958k467285k485300k559957k697395k768107k926347
3350A51869283l145520l446722l794092m244095m669598n103088n533720n845188
3342A16087260o070223o112244n934226n636434n216186m725749m166798l553421
3334G4671979k960499k434868j883283j369957r61375n44170j83959J21743L25569
$$ plain form
3391 144264541 137337982 131256996 126066483 121704776 118150419 115247287 112999146 111318004
3383 111318004 110166894 109552443 109475967 109957613 111047814 112800847 115312203 118655895 122853446
3374 122853446 127805450 133247837 138970952 144695610 150211513 155420501 160294033 164768904
3366 164768904 168647219 171827751 174097332 175388223 175710168 175161915 173873429 172157375
3358 172157375 170089632 167773674 165306389 162821089 160261132 157563737 154795630 151869283
3350 151869283 148723763 145277041 141482949 137238854 132569256 127466168 121932448 116087260
3342 116087260 110017037 103904793 97970567 92334133 87117947 82392198 78225400 74671979
3334 74671979 71711480 69276612 67393329 66023372 65061997 64517827 64333868 64455611 64781180
3325F4781180M99025N87197N37587M64884K60440J85001O5248k14525n34620q68485
3315F5762932j061488j126961j185678j183022j098808j072411r67121q59803
3307E7207640p85607o81061n77926m65608m23382m03419m21196m50003m81056
3298E2518382m95024n09350n00445m58739n49275p37420r21984j113721j355871
3289D5876553j532718j589358j535094j370190j239535j096102q80772o97962
3281C5934822n54622l94516k09522l6995P1511L09236M90867O07734P82623R53293
3271C7954431J158478J354678J552558J761172J934766K046768K288426K592819
3263E2644096K837445L148081L590457L960704M411108M919395N341567N703021
$$ plain form
3325 64781180 65280205 65867402 66404989 66869873 67130313 67315314 67380562 67166037 66631417 65762932
3315 65762932 64701444 63574483 62388805 61205783 60106975 59034564 58067443 57207640
3307 57207640 56422033 55740972 55163046 54697438 54274056 53870637 53449441 52999438 52518382
3298 52518382 52023358 51514008 51013563 50554824 50005549 49268129 48346145 47232424 45876553
3289 45876553 44343835 42754477 41219383 39849193 38609658 37513556 36632784 35934822
3281 35934822 35380200 34985684 34776162 34739167 34810678 35119914 35610781 36218515 37001138 37954431
3271 37954431 39112909 40467587 42020145 43781317 45716083 47762851 50051277 52644096
3263 52644096 55481541 58629622 62220079 66180783 70591891 75511286 80852853 86555874
3255H6555874N760556N641005N421832N265056N041275M738680M311985L471852
3247A26208115K388652J154223j15846j294334k420984l447259m339472n191434
3239A12941661n905392o316140o550007o555959o405336o240281o020972n694343
3231F3253231n270209m765692m234310l691982l130871k678317k310435j922769
3223C5248646j632221j492217j239204j030980q84725p08905n43300m76092k88119
3214B6952883n3393O8045L19132N67557O58403P81150P68542N91668L81160Q241
3204C1043388l14704n09058o36056o06042n04109m39179m14629m04600l71988
3195B6843023l60039k06614j24790R216J45210K68687L71391L28285J89368j6856
$$ plain form
3255 86555874 92316430 97957435 103379267 108644323 113685598 118424278 122736263 126208115
3247 126208115 128596767 129750990 129635144 128340810 125919826 122472567 118133095 112941661
3239 112941661 107036269 100720129 94170122 87614163 81208827 74968546 68947574 63253231
3231 63253231 57983022 53217330 48983020 45291038 42160167 39481850 37171415 35248646
3223 35248646 33616425 32124208 30885004 29854024 28969299 28260394 27717094 27241002 26952883
3214 26952883 26899490 26967535 27286667 27854224 28512627 29293777 30062319 30653987 31035147 31043388
3204 31043388 30728684 30219626 29583570 28977528 28473419 28034240 27619611 27215011 26843023
3195 26843023 26482984 26276370 26151580 26160796 26306006 26574693 26946084 27274369 27463737 27446881
3185B7446881r7343j39687j53626j71624k44870m35857o88277r60173j036698
3176B3518726j048778j030230q49504o75602n53592m43958m26185m56529m24324
3167A7610024m12747l33216k60918j63436m8901L5585J94031K85616L48515K88727
3157A7543280K26018J78995J76369R2158p157j51704l67412m86612n51982n12452
3147A6139501m21805l35471k75412k32243j71387j00551o1797o8704m6128L4604
3137A4460607Q9647J73529K03898K24983L05736K85514L01951L35822L17077L68722
3127A7067486M79298M51862M21001L99549K77848J70302J95r7367p5528o3299
3117A9031347M4234J11396K40725L72227M59526N97967O92809P93049Q88178R70255
$$ plain form
3185 27446881 27349538 27209851 27056225 26884601 26639731 26203874 25515597 24555424 23518726
3176 23518726 22469948 21439718 20590214 19914612 19361020 18917062 18490877 18034348 17610024
3167 17610024 17197277 16864061 16603143 16439707 16390806 16426391 16620422 16906038 17254553 17543280
3157 17543280 17769298 17948293 18124662 18216820 18209663 18057959 17690547 17203935 16651953 16139501
3147 16139501 15717696 15382225 15106813 14874570 14703183 14602632 14540835 14472131 14426003 14460607
3137 14460607 14550254 14723783 14927681 15152664 15458400 15743914 16045865 16381687 16698764 17067486
3127 17067486 17546784 17998646 18419647 18819196 19097044 19267346 19267541 19170174 19094646 19031347
3117 19031347 19075581 19186977 19427702 19799929 20259455 20857422 21550231 22343280 23231458 24201713
3107B4201713Q61203N68433Q1178l09602n42130o11869n78281l83977k61055o1801
3097B2963812O7183J35345K69164L23116L84669M55849M96636N54278O17513P52256
3087B7019821R00038R87343J076415J167684J302120J448283J650523J788520
3079C7340747J844141J819165J642043J525340J578586J718415K072215K443902
3071E1984554K795519L211066L442762L666918L672964L266953K659925K183027
3063G6883688J981271J960597K364134L170689M259363N785031P755591R870732
3055A14031096J1543597J1468290Q152640K366810k943355o261823p645096p543697
3047A23168462o336418m819503l377827j989906p08095L50617J265798K161356
$$ plain form
3107 24201713 25062916 25631349 25712527 25402925 24860795 24248926 23670645 23286668 23025613 22963812
3097 22963812 23030995 23166340 23435504 23758620 24143289 24599138 25095774 25650052 26267565 27019821
3087 27019821 27919859 28907202 29983617 31151301 32453421 33901704 35552227 37340747
3079 37340747 39184888 41004053 42646096 44171436 45750022 47468437 49540652 51984554
3071 51984554 54780073 57991139 61433901 65100819 68773783 72040736 74700661 76883688
3063 76883688 78864959 80825556 83189690 86360379 90619742 96404773 104160364 114031096
3055 114031096 125574693 137042983 145195623 147562433 144619078 138357255 130712159 123168462
3047 123168462 116832044 112012541 108634714 106644808 105936713 106287330 107553128 109714484
3039A09714484L036955L921986N032463O449603Q231605J0264997J1984584J2752530
3031A71389207J1653773Q890018O039846M535222M470284N558887P380981R348007
3023B29266225J1179814J3353292J6494975K0907651K7341041L6253658M6818214
3016D01614870N6363544N9130373M6025927J6696074j5140263l8454691n1861157
3009D74374677n6376235n3412256m7072510m0569386l4128875k8214846k3535562
3002A91065007k0238865j7678842j5494624j3546493j1628427j0003648q588299
2995I3885809p413637o402590n623327n077816m649467m276270l965369l643391
2987E2833942l281197k955843k675042k381823k122536j966812j683599j517414
$$ plain form
3039 109714484 112751439 116673425 121705888 128155491 136387096 146652093 158636677 171389207
3031 171389207 183042980 191932998 197972844 202508066 206978350 212537237 219918218 229266225
3023 229266225 240446039 253799331 270294306 291201957 318542998 354796656 401614870
3016 401614870 457978414 517108787 563134714 579830788 564690525 526235834 474374677
3009 474374677 417998442 364586186 317513676 276944290 242815415 214600569 191065007
3002 191065007 170826142 153147300 137652676 124106183 112477756 102474108 93885809
2995 93885809 86472172 80069582 74446255 69368439 64718972 60442702 56477333 52833942
2987 52833942 49552745 46596902 43921860 41540037 39417501 37450689 35767090 34249676
2979C4249676j408067j361150j349882j285681j214104j164789j077146r95045
2971B4393812q88941q21486p20595o58964n86503n18610m99132m64505m64089
2962A8770987m88151n09132n41915n48394n80433n21805m83954m85946m42837
2953A4168420m07029l86461l90928l91343m20661m19491m30631m03274l25873
2944A0592729k93750k72508k52611k24055k38025k06117j98597k00235j70649
2935H536182j81667j86356k41060j73783j62146j65724j47833p2269q5967j42039
2925F977338j21964j09087j07412j03955j00047q5301p6924r3417p2739q2119
2915F024373j40085r6928q4592j40965j44842r1366o1847n5458j17000p3147p1401
$$ plain form
2979 34249676 32841609 31480459 30130577 28844896 27630792 26466003 25388857 24393812
2971 24393812 23504871 22683385 21962790 21303826 20717323 20198713 19699581 19235076 18770987
2962 18770987 18282836 17773704 17231789 16683395 16102962 15581157 15097203 14611257 14168420
2953 14168420 13761391 13374930 12984002 12592659 12171998 11752507 11321876 10918602 10592729
2944 10592729 10298979 10026471 9773860 9549805 9311780 9105663 8907066 8706831 8536182
2935 8536182 8354515 8168159 7927099 7753316 7591170 7425446 7277613 7205344 7119377 6977338
2925 6977338 6855374 6746287 6638875 6534920 6434873 6349572 6272648 6179231 6106492 6024373
2915 6024373 5884288 5787360 5702768 5561803 5416961 5325595 5263748 5208290 5091290 5018143 4946742
2904D946742j37255j08559o6553j06436j18785r6063n4189l2339n2869q2546m8377
2893D042771l8089l7961K2637Q00J6096l0787m2908l959o3604n1066n4618k9244
2881C730068o0097j21745j05039p4716p0786r0211o8243p0080j01426o2257m5531
2870B859937q7243n5780K6287J2332l7269r085k9698l1492m898k9589n1874q4174
2858B477454m6325Q053j9269m4380j7806L2490k0327j4359l374J2654n579L162
2846B362394k0967K1234L4311l5991r705k8590n8556p0862k9744o8564n0604j0301
2834B034055n1856J9718M7660q207k0603j0806j9002m9186l4952m6983n3931n4734
2822A751173p5301o7193n0897o5247l9372l6158m4479j7754l3300k945J1504K191
$$ plain form
2904 4946742 4809487 4700928 4634375 4527939 4409154 4313091 4258902 4226563 4173694 4091148 4042771
2893 4042771 4004682 3966721 3989358 3990158 4006254 3975467 3932559 3928600 3864996 3813930 3759312 3730068
2881 3730068 3669971 3548226 3443187 3368471 3297685 3207474 3139231 3069151 2967725 2905468 2859937
2870 2859937 2772694 2716914 2743201 2755533 2718264 2709179 2679481 2647989 2643091 2613502 2561628 2477454
2858 2477454 2431129 2439182 2419913 2375533 2357727 2390217 2369890 2355531 2352157 2364811 2359232 2362394
2846 2362394 2341427 2362661 2396972 2360981 2351276 2322686 2264130 2193268 2163524 2094960 2044356 2034055
2834 2034055 1982199 2001917 2049577 2041370 2020767 2009961 1990959 1941773 1906821 1859838 1805907 1751173
2822 1751173 1675872 1608679 1557782 1492535 1453163 1417005 1372526 1354772 1321472 1318527 1330031 1332222
2810A332222j479o963L025l4536k9678J1337K2620N0340K5262L7404J118l6830
2798A373842j5159k3715l0916m49j4509N341r837j0366j0379J193M4116K7318
2786A336480J4183K6229M8503N5012k8035j1363j5983j054j6036J1930q830J5074
2774A426110l1143L5941N4037N1003O6500L9575L4922j4499Q798m7897l3236m8439
2762A541672l4077M081j2706m0157j1697o230o185k9197j4911M867P6183K2342
2750A493985P7788M8329N1319J7863N4876K9790L7241R742L9680L1984m235Q3169
2738A971531N8755R7440J68180J66104K26916K34880K97921K53343J34160p542
2728C601688k60798l14911l12829k88487k86957k23935j73092j78301j75585j37954
$$ plain form
2810 1332222 1330743 1323780 1326805 1292269 1262591 1273928 1296548 1346888 1372150 1409554 1410672 1373842
2798 1373842 1358683 1334968 1304052 1303603 1289094 1294435 1284598 1274232 1263853 1265046 1309162 1336480
2786 1336480 1350663 1376892 1425395 1480407 1452372 1441009 1425026 1423972 1407936 1419866 1411036 1426110
2774 1426110 1394967 1430908 1484945 1535948 1602448 1642023 1676945 1662446 1671244 1623347 1590111 1541672
2762 1541672 1507595 1511676 1498970 1458813 1447116 1440886 1434701 1405504 1390593 1395460 1471643 1493985
2750 1493985 1571773 1620102 1671421 1689284 1744160 1773950 1811191 1820933 1860613 1892597 1888362 1971531
2738 1971531 2030286 2127726 2295906 2462010 2688926 2923806 3221727 3475070 3609230 3601688
2728 3601688 3340890 3025979 2713150 2424663 2137706 1913771 1740679 1562378 1386793 1248839
2718A248839r6200p6734r7039q9464p7990k1446m2785o2270k5778k3390l0022
2707F05721n4339m0794k1927m4005L8324j420L149o1767O748K9966j6959j7013
2695D25684R154J6464J1039L077j773k662J0970r131j7721j0927j3872J848p158
2682D14992o967K1999l6062o354r683p068J1239L001O444k8309q420L9317J5527
2669D09656l6320J1694j2254K011m5469R004J6444L0738q992l1088k1261J3189
2657C37352J4635J1194j7925k0452J121L4612j8889J3808o258j5446L9978N443
2645C79173l3876Q608J3597N30j3862n759M888l579n575k5232o34k1192J8624
2632C15711K5229K2859j2655l0283J3751j6355j8888j2826k0457o384J3584L751
$$ plain form
2718 1248839 1152639 1075905 978866 889402 811412 789966 747181 684911 659133 635743 605721
2707 605721 551382 510588 488661 444656 482980 481560 484709 422942 429690 459656 442697 425684
2695 425684 434838 451302 462341 465418 463645 460983 471953 462822 445101 434174 420302 422150 414992
2682 414992 408025 430024 393962 387608 377925 370857 382096 385097 391541 363232 354812 394129 409656
2669 409656 373336 385030 372776 374787 329318 338322 354766 385504 376512 345424 324163 337352
2657 337352 351987 363181 345256 324804 325925 360537 341648 355456 349198 333752 373730 379173
2645 379173 345297 353905 367502 368032 354170 348411 353299 349720 344145 318913 318279 297087 315711
2632 315711 340940 363799 351144 320861 334612 318257 299369 286543 266086 259702 273286 277037
2620B77037l280k7011j4139J8321M780L363K3820L92M462l0072J8892L1223j1957
2607B95831j2907j1696J8337k2936k8620j2688m175O156K9777j9556m4446K3576
2595B16653O974k2573k3883j1485K5641R981j252k4103j5035j4726P000K2306
2583A75498R22k9841L597m3357Q902k4871k5078K7051Q253j2610L4831j7400n857
2570A00040J9139L716k4476j2722q415j2078m769K2006j4708N651K9965J2241
2558A15590K4941q75O603K3986M621r164N7947m057m2782n948J1746p211j9036
2545A56361q060l127l2409Q53Q676K0206L7394k8626p989k0876k404N704k6632
2532I9071K7106J1814k4634j5467J3517o280J1889K0701L801L94r045m0673J6992
$$ plain form
2620 277037 273757 246746 232607 250928 255708 259071 282891 283283 287745 257673 276565 307788 295831
2607 295831 282924 271228 289565 266629 238009 225321 221146 227302 257079 237523 193077 216653
2595 216653 223627 201054 177171 165686 191327 201308 200056 175953 160918 146192 153192 175498
2583 175498 176420 146579 150176 106819 115721 90850 65772 92823 101076 88466 123297 105897 100040
2570 100040 119179 122895 98419 85697 77282 65204 60435 82441 67733 73384 103349 115590
2558 115590 140531 139656 146259 170245 174866 165702 223649 219592 176810 170862 182608 175397 156361
2545 156361 148301 145174 112765 113618 122294 142500 179894 151268 143279 122403 119999 125703 99071
2532 99071 126177 137991 113357 97890 111407 105127 117016 137717 141518 141912 132867 92194 109186
2519A09186j8227l658J6907j0427l4355L9398L9278k1888r289N1658k7208j4352
2507A17023K2070j3601j8177O806J8220m8821k4151k160O408K537O887J7011J5955
2494A06007Q302J797l4665J2663L5833j3398l204j151l1630k656J9519J9901j2940
2481A04378m181l4340J5542J8517j735J4011r48M22j3254R31M671J5101n891O850
2467A20074J9502l4853k1857L344J374q969j7745K4511J9732N37k0038L21K104
2454H8037R128j2426m470K6546j9684n866L5064o436k0393j9994j6427J9866K876
2441G5821K7142k2175m7299K4167O176J010k051K5378M5028l85l0325K307k9882
2428G4912o3998P467K2669M12J9941j1170k338j849j0724P151J4627K3810k7956
$$ plain form
2519 109186 90959 87301 104208 93781 59426 98824 138102 116214 106925 158583 131375 117023
2507 117023 139093 125492 107315 114121 132341 83520 59369 57209 63617 66154 73041 90052 106007
2494 106007 114309 116106 81441 94104 129937 116539 113335 112184 80554 77898 97417 117318 104378
2481 104378 100197 65857 81399 99916 98181 112192 111244 111666 98412 99343 104014 119115 113224 120074
2467 120074 139576 104723 82866 86210 87584 78615 60870 85381 105113 105650 85612 85933 88037
2454 88037 97165 84739 80269 106815 87131 81265 116329 109893 89500 69506 53079 72945 75821
2441 75821 102963 80788 33489 57656 63832 64842 62791 88169 133197 132812 102487 104794 74912
2428 74912 10914 18381 41050 41462 61403 50233 47895 46046 35322 42473 57100 80910 52954
2415E2954m612j6007K0561j3293J0322k6957P407J9000j7422L420J814J3813Q904
2402E9904k3157K1339K6622n4141R106L2521K948m7672P459J0201r306n657J1904
2389D2071j3402j3440m4131j4165L6063K0328j332k9667R046L6288l474J5794
2377C9979k851N458j6343k1355O897N174K0715l255j7444L258Q049M07k2299J6754
2363B3144o66J7616P206L0968n364q890J0460k809J7314m322J9713l5812l459
2350F5099j072J3700j8271k2949M6485j2266N173P953J0272k998o7495L8757K505
2337F4893p15k4955m708j0849L7940P015j1012q60k2617q360J2622j044j337K3789
2323E9802K4268q25K3797M252l3381l0395J7923N6776j5635M9432K0095n192K3187
$$ plain form
2415 52954 48342 32335 52896 39603 49925 22968 30375 49375 31953 35373 37187 51000 59904
2402 59904 36747 58086 84708 30567 39673 72194 75142 27470 34929 45130 35824 30167 42071
2389 42071 28669 15229 -28902 -43067 -7004 13324 11992 -17675 -8629 27659 24185 39979
2377 39979 37128 42586 26243 4888 11785 16959 37674 34419 16975 20233 28282 28689 6390 23144
2363 23144 22478 40094 47300 78268 72904 64014 74474 71665 88979 84657 104370 68558 65099
2350 65099 64027 77727 59456 36507 82992 70726 75899 83852 94124 91126 23631 62388 64893
2337 64893 64178 39223 34515 23666 61606 68621 57609 56749 34132 25772 38394 37350 36013 59802
2323 59802 84070 83245 107042 111294 77913 47518 65441 122217 106582 156014 176109 170917 194104
2310A94104K5497k556m374l978J4574K5627J6286J0705%J9891J8094r799M4755
2297C48826J5541K1838O3646J4001M1921K2169L2471O762j2189J615K5848K1230
2285F03679K6938K9041L6981N6777J5436L4761M3828M8530N9859O6009J17132
2274A138971J15496J17275J48392J70378J05182J37630J29437J16010J46440J80146
2264B505357J92983K41729L07531L34449M10330O26789R37789J108277J444426
2255H109660R48483r9114p30841r55980j092470j032968p67700o35667o01300
2246C142103m85494l29961k48929j80953k15285j38382r8758j60314j05896j05855
2236A072276j11576q1334o0170o0434p2900m6146p0117n3343m8893p053k2189
$$ plain form
2310 194104 219601 217045 212671 208693 223267 248894 265180 275885 275885 295776 313870 304071 348826
2297 348826 364367 386205 449851 463852 505773 527942 560413 567175 554986 556601 582449 603679
2285 603679 630617 659658 696639 753416 768852 803613 847441 895971 955830 1021839 1138971
2274 1138971 1254467 1371742 1520134 1690512 1795694 1933324 2062761 2178771 2325211 2505357
2264 2505357 2698340 2940069 3247600 3582049 3992379 4619168 5556957 6665234 8109660
2255 8109660 9058143 8959029 8228188 7272208 6179738 5146770 4379070 3743403 3142103
2246 3142103 2656609 2326648 2077719 1896766 1681481 1543099 1444341 1284027 1178131 1072276
2236 1072276 960700 879366 819196 758762 685862 639716 569599 516256 467363 460310 438121
2225D38121m3885J2405l8172k5438k2567m993n002j5824j9809k8151J0336n7901
2213A99120k1349j5450R772K8291n6093k114L4605N278k6489J4384l6880j5997
2201A17078J5785K2882k2810m8455O050R035j0615L1802p176p643p856J0226O812
2188A15115l0466L34j9463K80j5011L2188q088j2003l3909P958K0464l0220j2534
2175A4645J9916J078l2451N436K0846l705K168K0301k4233j6135k488n427j910
2162a959K6419j3783J5988K4457j8293k8147J1038j710J1097k0313q687J2749
2150H856m4559k8027J3838N6351K0791j4693m4313j4223K0763J3812l419J7195
2138B372j4847L3183j5697l0388J3488J2596r454l2072J109j6390m889L8087K396
$$ plain form
2225 438121 394236 406641 368469 343031 320464 315471 310469 294645 274836 246685 257021 199120
2213 199120 177771 162321 172093 200384 144291 142177 176782 182060 155571 169955 133075 117078
2201 117078 132863 155745 132935 84480 90530 99565 88950 120752 113576 105933 98077 108303 115115
2188 115115 84649 84983 65520 65800 50789 82977 74889 62886 28977 36935 57399 27179 14645
2175 14645 34561 35639 3188 8624 29470 25765 27933 48234 24001 7866 5378 -49 -1959
2162 -1959 24460 10677 26665 51122 32829 4682 15720 14010 25107 4794 -3893 8856
2150 8856 -35703 -63730 -49892 6459 27250 12557 -31756 -45979 -25216 -11404 -14823 2372
2138 2372 -12475 20708 5011 -25377 -11889 707 -8747 -40819 -39710 -56100 -60989 -22902 -20506
2125b0506l920j1291J4679j6944J4054J4770k949k7269N475Q138J3706j2061l78
2112b4496l064k084j0206o596K2589o929J2191L5019j8900K866K1251m4176m2774
2099f5309Q259J6790K2627J411k3735J0924l5723K6727J2408J3058k5270o206
2087d4039R221M1816Q562m5599l5843r532l195J8201L2773J5903J580k272j8659
2074c1083J5493K9134j0294k2398M57n206m122q95n304M2577j7270k0450M7530
2061A8169O8m8886J0723J8887J751O189k2316P378R044o747L53j8155O61J3964
2047h917j1549K2584q078o086p630j7125L0465J8897K923l6267J4575R920p40
2034B972k3417O486j794p329J8935N580j1657k756M999k2696M7108J4028k0036
$$ plain form
2125 -20506 -24426 -35717 -21038 -37982 -23928 -9158 -12107 -39376 -33901 -25763 -12057 -24118 -24496
2112 -24496 -27560 -29644 -39850 -46446 -23857 -30786 -18595 16424 -2476 390 21641 -22535 -65309
2099 -65309 -57050 -40260 -17633 -16222 -39957 -29033 -64756 -38029 -25621 -12563 -37833 -44039
2087 -44039 -34818 6998 15560 -30039 -65882 -75414 -78609 -60408 -27635 -11732 -10152 -12424 -31083
2074 -31083 -15590 13544 3250 -19148 -18691 -23897 -28019 -28914 -34218 8359 -8911 -29361 18169
2061 18169 18237 -30649 -19926 -1039 712 6901 -15415 -8037 1007 -5740 -5387 -23542 -22881 -8917
2047 -8917 -20466 2118 -5960 -12046 -19676 -36801 -6336 12561 15484 -20783 -6208 3712 2972
2034 2972 -20445 -13959 -15753 -23082 -4147 1433 -10224 -12980 -7981 -30677 16431 30459 10423
2021A0423k4301j5201k51M0725j2706l6942M817J224j6048P929k9137K033K3341
2008d4094Q905J6940k4064J3043q042L5170J5266k4469K0861n801j06l5565j0113
1995d2069K4574K1036j4029J8214O357n334N013j967K0200J402L0174J871k5072
1982D0370j7730Q454j9430j0410J0353j0210j0992l579R207M313m4665l738N3887
1969E830l564L938k9904J5417R886k5021p723K618L5543m553k4473k4274j9401
1956f5681j4594K1168k7212K24L8267j3218j3672P62K740J7597j286M5781j6271
1943b5395p609J6712K464O151j0727M039J968j6504m156j818L482L019P554k8782
1929d9602J070j4178K5574J2874q76J6099J1577M815j4486o3100J2991J1029K5733
$$ plain form
2021 10423 -13878 -29079 -29330 11395 -1311 -38253 -33436 -32212 -48260 -40331 -69468 -67435 -44094
2008 -44094 -35189 -18249 -42313 -29270 -37312 -2142 13124 -11345 9516 3715 3609 -31956 -42069
1995 -42069 -17495 3541 -10488 7726 14083 8749 13762 11795 31995 33397 63571 65442 40370
1982 40370 22640 31094 11664 1254 11607 1397 -9595 -13174 -3967 346 -44319 -48057 5830
1969 5830 2266 6204 -23700 -8283 1603 -23418 -31141 -28523 7020 2467 -22006 -46280 -65681
1956 -65681 -80275 -59107 -86319 -86095 -47828 -61046 -74718 -73956 -71216 -53619 -54905 -9124 -25395
1943 -25395 -33004 -16292 -13828 -7677 -18404 -14365 -12397 -28901 -33057 -34875 -31393 -28374 -20820 -49602
1929 -49602 -48532 -62710 -37136 -24262 -25138 -9039 2538 7353 -7133 -70233 -57242 -46213 -20480
1916b0480K6840l3885K9520k4488L495K8249j0467j2522J996l4522K3036j6135
1904c9363j2911O598K1870l751j4625J9174k6683q098K9659O26m813J951R17K4710
1890d739j1427L07j4842l2533m54Q797J0072j9362J0474k6850L2872k1870K8834
1877d0721k1872J7970Q742J9991J7029j6593j9287R598J2171j5441m027J3588
1865a8852r074m810J4056k2350L2057j0834R378K252J1005J9460j9967l7870K2036
1852a3513j4447K753J1955J0978p337j129p073j1071j4319J6102M772J4379K2285
1839A4335q737k6444n50J8336J3932j8966o045J2220j7897l6372K1901J2656J2334
1826i297K2503j0967l8150j5036L0468K6207k8124j1411J3990m6350j3944k305
$$ plain form
1916 -20480 6360 -27525 1995 -22493 -18998 9251 -1216 -13738 -11742 -46264 -23228 -39363
1904 -39363 -52274 -45676 -23806 -27557 -42182 -23008 -49691 -57789 -28130 -27504 -32317 -30366 -29449 -4739
1890 -4739 -16166 -15859 -30701 -63234 -63688 -54891 -44819 -64181 -53707 -80557 -47685 -69555 -40721
1877 -40721 -62593 -44623 -35881 -15890 1139 -15454 -34741 -25143 -12972 -28413 -32440 -18852
1865 -18852 -27926 -32736 -18680 -41030 -8973 -19807 -10429 -8177 2828 22288 2321 -35549 -13513
1852 -13513 -27960 -25207 -13252 -2274 -9611 -10740 -17813 -28884 -43203 -27101 -22329 -7950 14335
1839 14335 5598 -20846 -21396 -3060 10872 -8094 -14139 -1919 -19816 -56188 -34287 -21631 -9297
1826 -9297 13206 2239 -35911 -50947 -20479 5728 -22396 -33807 -19817 -66167 -80111 -82416
1814h2416q308L9467K2807K2815n958j6181J0530O331K9583N797j5924l2176J2214
1801a1419K3555l5126j7939K9753j5041j4209L087k731k364L5916J4577j5618
1789g559j9220l0216K721L7735K0307m4171j9524K5680m602m676J1648k0579K6081
1776b6375J8561j6674o403k932J7234K16k8588O49J1767j5374q691Q564j6171
1763f4217j8198M822J1524J7577p172k014L1509Q093m1713J1796J2211j911p872
1750d5565j8713m251K2558M196k751J7776J4778j3608j6293J2420O607L758J5207
1737c881l5090J3662j0761k8138J3399n109L4281J2402k2039o701j6367K2026
1725c2316j150k0677m024O339K5575K2619j6488N417n1331R87j6158N693K8533
$$ plain form
1814 -82416 -90724 -51257 -28450 -5635 -11593 -27774 -17244 -10913 18670 24467 8543 -23633 -11419
1801 -11419 12136 -22990 -40929 -11176 -26217 -40426 -37339 -40070 -42434 -6518 8059 -7559
1789 -7559 -26779 -56995 -54274 -16539 3768 -40403 -59927 -34247 -38849 -43525 -31877 -52456 -26375
1776 -26375 -7814 -24488 -30891 -33823 -16589 -16373 -44961 -44312 -32545 -47919 -56610 -48046 -64217
1763 -64217 -82415 -77593 -66069 -48492 -55664 -57678 -26169 -18076 -59789 -47993 -35782 -37693 -45565
1750 -45565 -64278 -68529 -45971 -41775 -44526 -26750 -11972 -25580 -41873 -29453 -22846 -19088 -3881
1737 -3881 -38971 -25309 -36070 -64208 -50809 -55918 -21637 -9235 -31274 -37975 -54342 -32316
1725 -32316 -33466 -54143 -58167 -51828 -26253 -3634 -20122 -14705 -66036 -65049 -81207 -75514 -46981
1712d6981R023k798j2305L3476l98M87j1319K6503k9095o489m406J7760m827R702
1698b1667j4583R964N173j6919j7732K1199j8333o238K4742J3431k2925j6245
1686f0133J1024K1695j143k3339l19l386L1185r739P213R251R783r304j0471k0129
1672d7812n446K6249L2915J1570m0747l633J0596l2742L8371j3833m963J1539
1660a7936J1418M822j6425l892K0805O586k2876L358R771J6354k6465J23j1333
1647b5690N889j2611J9706l5230K2772K4113l2208J7927N595m1205j1673M2872
1635a9743j4861j5597L6671M184m3781J6387L151r236l7172q73L4491K8756r301
1622b6924r994J2846K3455J506j8241m849m86R157M2567N970L365j614m1577o062
$$ plain form
1712 -46981 -37958 -40756 -53061 -19585 -19983 -19496 -30815 -4312 -33407 -39896 -44302 -26542 -31369 -21667
1698 -21667 -36250 -26286 -21113 -38032 -55764 -34565 -52898 -59136 -34394 -20963 -43888 -60133
1686 -60133 -49109 -27414 -28557 -51896 -52215 -55601 -24416 -34155 -26942 -17691 -7908 -17212 -27683 -47812
1672 -47812 -53258 -27009 5906 17476 -23271 -26904 -16308 -49050 -10679 -24512 -29475 -17936
1660 -17936 -6518 -1696 -18121 -22013 -1208 5378 -17498 -14140 -4369 11985 -14480 -14357 -25690
1647 -25690 -19801 -32412 -12706 -47936 -25164 -1051 -33259 -15332 -9737 -50942 -62615 -19743
1635 -19743 -34604 -50201 -13530 -9346 -53127 -36740 -33589 -42825 -79997 -80870 -46379 -17623 -26924
1622 -26924 -36918 -24072 -617 889 -17352 -22201 -22687 -13530 29037 35007 38372 36758 -4819 -10881
1608a0881j9003J0700L5932k8251J2111Q403o426j5239j0552j5924j4157L4353
1596a8934O456j5268J6755K4160m0927M8032j4952k1759R112K684j2343j0564
1584b7548J6032J0850r321N427P759k8022l9409K1510K7284k5374M229J0004R8
1571b6481J6078J3921r690j7919j70K902J5535K0213k255n5910K2350M5454l4481
1558a0453j1664k3488L941J7178K5464K1595l1293k3826k0487r561j1574L5141
1546c9027R378j2976k565j3828L1201l1336K6069j0279L4320K618k716M89P205
1533a447J7039k8264l2541r643k6282K727L8592J9773j5433q36j1639j1895N841
1520e4008L660J1225j9583j7837L5612j7754l0283J1402K4299Q489J88Q18j2127
$$ plain form
1608 -10881 -29884 -19184 16748 -11503 608 9011 2585 -12654 -23206 -39130 -53287 -18934
1596 -18934 -12478 -27746 -10991 13169 -27758 20274 5322 -16437 -7325 -4641 -16984 -27548
1584 -27548 -11516 -666 -9987 -4560 3199 -24823 -64232 -42722 -15438 -40812 -36583 -26579 -26481
1571 -26481 -10403 3518 -6172 -24091 -24261 -21359 -5824 14389 12134 -43776 -21426 24028 -10453
1558 -10453 -22117 -45605 -41664 -24486 978 22573 -8720 -32546 -53033 -62594 -74168 -39027
1546 -39027 -29649 -42625 -45190 -59018 -27817 -59153 -33084 -43363 -9043 -6425 -9141 -8652 -1447
1533 -1447 15592 -12672 -45213 -54856 -81138 -78411 -39819 -20046 -35479 -36315 -47954 -59849 -54008
1520 -54008 -50348 -39123 -58706 -76543 -40931 -58685 -88968 -77566 -53267 -44778 -44590 -43772 -55899
1507e5899K9524m19m5630r031K2188K0484k403R920L5821k3994j8976l5854k6669
1494a00938K8754K7675K4305J265m8049j60L8035J3640m415K6137k6457l4254
1482e4462N6944q573j6104K3002R646j100k4214k3810k271K4261K3570k1113p314
1469b1538j2866p91L2888j0778Q962N957k564l5035l962K2194J4521k424l5673
1456d1109J70M771J4777K406j9780j95J2464J3366L877J7524m5036N8834p195
1443A4874M522J3752j9604k6597K7673K0200K816m5439J8600K2282l3662k5596
1431b6179l0935L6786L342J0784L6490m2045L852K8383k2169J1317K1765o836
1419B4555K27K0635j2378j8712j1530n370M786L4335q935L524k8745L010j79k884
$$ plain form
1507 -55899 -26375 -26794 -72424 -81455 -59267 -38783 -41186 -31266 4555 -19439 -38415 -74269 -100938
1494 -100938 -72184 -44509 -20204 -18939 -66988 -67148 -29113 -15473 -19888 6249 -20208 -54462
1482 -54462 2482 -6091 -22195 807 10453 9353 -14861 -38671 -40942 -16681 6889 -14224 -21538
1469 -21538 -34404 -35195 -2307 -13085 -4123 1834 -730 -35765 -39727 -17533 -3012 -5436 -41109
1456 -41109 -40939 -36168 -21391 -18985 -38765 -38960 -26496 -13130 -9253 8271 -36765 22069 14874
1443 14874 19396 33148 13544 -13053 14620 34820 37636 -7803 10797 33079 -583 -26179
1431 -26179 -57114 -20328 -16986 -6202 30288 -11757 -7905 20478 -1691 9626 31391 24555
1419 24555 24782 45417 33039 14327 2797 -2573 2213 36548 27613 31137 2392 5402 5223 2339
1405B339J1340k6674q04o701j8421j5624k0996M0284J4736L4176k0052k5979l2412
1392f4788J6375K8183J1324J7231k6204l8703j7782L3986K7966R748J0904L029
1380A1269j4271l1702j1509k225K5881l081J1269m869K1363j1248j9497N3903
1368B5283j1381l7306m6610L4079M2105k4625M9642l8725j0258J6216J0628J2467
1356B1515l1493M980l303J4867k0938j9120J3516J3551k2091j371n44K7745N195
1343B509J5459k8329k0664l0168j71J9738J8250J3787j5826o992k9403R63O575
1330e4272N0263k3j90K352K06r923r874k521j0258l328M1363J6349o530m3709
1316c0095j3999L7884J302K0886j7871k1109k4803K5526j2320K8308n684k1287
$$ plain form
1405 2339 13679 -12995 -13799 -20500 -38921 -54545 -75541 -35257 -20521 13655 -6397 -32376 -64788
1392 -64788 -48413 -20230 -8906 8325 -17879 -56582 -74364 -40378 -12412 -2664 8240 11269
1380 11269 -3002 -34704 -46213 -48438 -22557 -25638 -14369 -19238 2125 -9123 -28620 25283
1368 25283 13902 -23404 -70014 -35935 6170 -18455 31187 -7538 -17796 -1580 9048 21515
1356 21515 -9978 -4998 -8301 6566 -14372 -33492 -19976 -6425 -28516 -29887 -30431 -2686 2509
1343 2509 17968 -10361 -31025 -61193 -61364 -41626 -23376 -9589 -25415 -32407 -61810 -60847 -54272
1330 -54272 -4009 -4032 -4222 -1870 -1664 -11587 -21461 -23982 -34240 -37568 3795 20144 13614 -30095
1316 -30095 -44094 -6210 -4908 15978 -1893 -23002 -47805 -22279 -34599 -6291 -11975 -33262
1304c3262l362L7849O18m0456L039J1689m234K0256p055k6979J5447J6254K7171
1291A6975n826P077j7338j9260q298Q081k9474J1465J6536J7391k0787j1984L8697
1278C255L4389J9087m2294n150o752j1633r667j4818L2142k1045K806j1758k0876
1265e2314J9231L1P114N310J5701J8622k2805L83N30Q030Q6j1818J2480O02p484
1250f301K5572J6492j5756p588J320k0880n871J4491K0042j6428j6967j217r305
1237b2396J1811l4542j3312L3121K2838J6102j337j5932J3356j1707M4727j4877
1225B7852k3890k0364j0579p218K6078J6245j624J408q658M362L52r765l161K8862
1211A9900Q774p943o210j1792k74j5128P498k9076K500p105L3986L3268r952n472
$$ plain form
1304 -33262 -36624 1225 1843 -38613 -35574 -23885 -28119 -7863 -14918 -41897 -26450 -10196 16975
1291 16975 11149 18226 888 -18372 -26670 -18589 -48063 -36598 -20062 -2671 -23458 -35442 3255
1278 3255 37644 56731 14437 9287 2535 -9098 -18765 -33583 -1441 -22486 -19680 -31438 -52314
1265 -52314 -33083 -33052 -25938 -20628 -4927 13695 -9110 -8727 -8197 -167 -81 -11899 581 1183 -6301
1250 -6301 19271 35763 20007 12419 13739 -7141 -13012 1479 21521 5093 -11874 -13091 -22396
1237 -22396 -10585 -45127 -58439 -25318 -2480 13622 12285 -3647 9709 -1998 42729 27852
1225 27852 3962 -16402 -26981 -34199 -8121 8124 6500 7908 -750 3612 3964 -5801 -8962 19900
1211 19900 28674 20731 14521 2729 2455 -12673 -5175 -34251 -31751 -38856 -4870 28398 18446 12974
1197A2974p340J0126j2029O053l1627k3180L7363J3354l0622K7151J722j0317
1185f372l3783K8852j9609P253L4868j0107k1650n39K4649R831L4127q381K1538
1172F0677j6500m7088m428n96j4446J658J2865J4601K1973m2349j4915l1201J0379
1159d9370L8298r01l7653J3585N0814p564l0036R869L4847j1390K7274k3052l6962
1146b2241P419j9235J675M0569k860k3011K1972N92J225r16J352R778j0434l348
1132B537j0630k8105p694K4476J3147P861J4424p765P608l072j1711k1875J0626
1119a0173K460J2850j9847K31j3232K257L3231J0879O087j3261j1157p121r624
1106a6420j4013J1651J9216K1702J1816l6749M551L7854j7144L206j7777K296
$$ plain form
1197 12974 5634 15760 3731 9784 -21843 -45023 -7660 5694 -24928 2223 3945 -6372
1185 -6372 -40155 -11303 -30912 -23659 11209 1102 -20548 -21087 3562 13393 47520 39139 60677
1172 60677 44177 -2911 -7339 -7935 -22381 -20723 -7858 6743 28716 -13633 -28548 -59749 -49370
1159 -49370 -11072 -11973 -49626 -36041 14773 7209 -22827 -12958 21889 10499 37773 14721 -22241
1146 -22241 -14822 -34057 -32382 8187 5327 -17684 4288 4880 6105 5189 6541 16319 5885 2537
1132 2537 -8093 -36198 -43892 -19416 -6269 1592 16016 8251 15859 12787 1076 -20799 -10173
1119 -10173 -7713 5137 -14710 -14479 -27711 -25454 7777 18656 24743 11482 325 -6796 -16420
1106 -16420 -30433 -18782 434 22136 33952 -2797 1754 39608 22464 25670 7893 10189
1094A0189n956j459J2219k0792k1955Q260M231q034j3125K1108J01o18J3833K5419
1080B3421R791j0667j8032j2604k21P459j3700j9964k17m970J3047K6848j7817
1067a7626j0391K7161L9981j9587j7072j8063L3326J4564J0630j7729l414P597
1055B9377k0345l4697J3912M5854j6086j4696M271j0024o554j8351q78P282j7989
1042c8924O9220R383M626j5292L3672l0523k6990O936j8182N839K6568m9024k7385
1029e0076J2435J4305K4965l516k2959K5497j5001j5681N151j7001K3738k155
1017b0298j0859J9099J9816k2330o329J5177k0224k6914P302P584L4177K9170
1005B5371J4643l8174K073K6558j0222O868j2514j9163l7968J880K2323J4276
$$ plain form
1094 10189 4233 2774 14993 -5799 -27754 -19494 -15263 -23297 -36422 -15314 -15213 -15831 -1998 23421
1080 23421 33212 22545 4513 -8091 -8312 -853 -14553 -34517 -34734 -39704 -26657 191 -17626
1067 -17626 -28017 -856 39125 19538 2466 -15597 17729 32293 42923 25194 21780 29377
1055 29377 9032 -25665 -11753 34101 18015 3319 7590 -2434 -8988 -27339 -28217 -20935 -38924
1042 -38924 30296 39679 44305 29013 62685 32162 5172 12108 -6074 -235 26333 -22691 -50076
1029 -50076 -37641 -23336 1629 -1887 -24846 651 -14350 -30031 -24880 -41881 -18143 -20298
1017 -20298 -31157 -12058 7758 -14572 -20901 -5724 -25948 -52862 -45560 -37976 -3799 25371
1005 25371 40014 1840 3913 30471 20249 27117 14603 -4560 -42528 -40648 -18325 -4049
993d049j569q406Q570O763L8410n15m5783k9548K046K4800j3925m1296K0697J3566
979c0239N141L3185K5798n074j4243r237j316o829J7636K2615n172j2107N692
966B5850K6749J0240k4176k3619L828j6234k9802L6972L7042M0540m3786l0249
954A3355r958q869j9297l3565J7575O854K4253K7281R818J2871k3203j0824J6197
941B2488r792N373j03K7317J058j1519j987k6117J3209j5941J6184M570p471k7565
927a0296n223L1949k2068R54K8923k0850j27J9456J7635P942j9433j9429l5210
914b5777J2587j3374r584L0784M3404k9546m014J2572P051o882j4712J3252j6925
901a164J2562j50M810K3009k0314o588k7577J6956j3123k5058L3909R163k9872
$$ plain form
993 -4049 -5618 -14024 -5454 1309 39719 39204 -6579 -36127 -34081 -9281 -23206 -64502 -43805 -30239
979 -30239 -25098 8087 33885 28811 14568 5331 4015 -2814 14822 37437 32265 20158 25850
966 25850 52599 62839 38663 15044 18872 2638 -27164 9808 46850 87390 43604 13355
954 13355 3397 -5472 -24769 -58334 -40759 -33905 -9652 17629 27447 40318 17115 6291 22488
941 22488 12696 18069 17966 45283 46341 34822 32835 6718 19927 3986 20170 24740 17269 -10296
927 -10296 -15519 16430 -5638 -4684 24239 3389 3262 22718 40353 48295 28862 9433 -25777
914 -25777 -13190 -26564 -36148 -5364 38040 8494 4480 17052 24103 17221 2509 15761 -1164
901 -1164 11398 11248 16058 39067 18753 12165 -15412 1544 -11579 -36637 -2728 6435 -23437
888b3437J470J0753M28k904J1285J0721Q127m943L395q444L3110K1969k4072l5260
874B198N775j780k5895J6291K633n010k7691q873J5274J580K8853K416j3147p158
860a4534q605K5983J4015J032k8086j9525K7536o512K5014J7312l2226K7987m791
847B4600r426k505k260M371j7105j3697K6791O473j4220j192K7864J9441n567
834D3568J655k8402j8613K7012j1964l0104M0743R989j6979k0805p219K8882L293
821B1056r738k5954J1502K7850j8043k0990P72J1387K0879j09K47K2301J967l6280
807F847Q202k0455J0725J741k343J7019j9224J201k4551L3290m465j5533M5382
794C7836k8313k898j2453J3041j2958m6733J2083M1860J8379K774j5236j8527
$$ plain form
888 -23437 -21967 -11214 -10786 -13690 -2405 8316 16443 11500 14895 6451 39561 61530 37458 2198
874 2198 7973 6193 -19702 -3411 -778 -5788 -33479 -42352 -27078 -25498 3355 5771 -7376 -14534
860 -14534 -23139 2844 16859 17891 -10195 -29720 -2184 -8696 16318 33630 1404 29391 24600
847 24600 15174 12669 10409 14780 -2325 -16022 10769 17242 3022 1830 29694 49135 43568
834 43568 45223 16821 -1792 25220 13256 -16848 23895 33884 16905 -3900 -11119 17763 21056
821 21056 11318 -14636 -3134 24716 6673 -14317 -13545 -2158 18721 18612 18859 41160 43127 6847
807 6847 15049 -5406 5319 7060 4717 21736 2512 3713 -20838 12452 7987 -7546 37836
794 37836 9523 6625 -5828 7213 -5745 -52478 -40395 1465 19844 22618 7382 -11145
782a1145L4289L1128k856l3015n99k0183k746L8416k5708j9956N016J2014r598
769d943Q239J1618k0971L9364R599r158J9428m399l1257k059K5336k1203j0445
756I149J0359M0566l5330q392p468j1591K377k9831J4264L8321P981n007K110
743B7508j8801n620m794L038k4840l061K0232Q126K171j7292O791O648P634j1394
729c654j3164k3676J9967J0986K618M4560O73j5781l3035N286P702J6427K613
716B1522p621m2833N89J6293R04K2388p538K153L0504k1996j2230j4701J8408
703E842J4288j3896l9197J5884K4144K0845K925k0643q202J2930N746P009L800
690C1475R6K064p324O69j1579J780L7443O400l2561n312r269l1687L0864J8291
$$ plain form
782 -11145 23144 54272 51416 18401 17802 -2381 -5127 33289 7581 -12375 -7359 4655 -4943
769 -4943 3296 14914 -6057 33307 42906 33748 53176 48777 17520 15461 40797 19594 9149
756 9149 19508 60074 24744 16352 8884 -2707 -330 -30161 -15897 22424 30405 25398 27508
743 27508 8707 3087 -1707 1331 -23509 -26570 -6338 1788 3959 -13333 -6542 106 7740 -3654
729 -3654 -16818 -40494 -20527 -9541 -6923 37637 38310 22529 -10506 -5220 2482 18909 21522
716 21522 13901 -28932 -28343 -12050 -11146 11242 3704 5857 36361 14365 2135 -12566 5842
703 5842 20130 6234 -32963 -17079 7065 27910 30835 10192 1990 14920 20666 27675 31475
690 31475 31571 33635 26311 26980 15401 17181 54624 61024 28463 23151 13882 -17805 13059 31350
676C1350j0065l3430J0951N419L196P076K610J6189j9762Q643j3030P388j136
663A5399k3616K0701j931k2132P409J0622J0826l140l978j4213N880J4558J4589
650C0974J7233j6230k4457N5699k8664l3505R978L2807O320l5449l499r996K1174
637B2385O152m1032J3517K3918K8473m9694k12j551m160P030j347p271J7824L460
623A7492j7158K9664p049k0884j5793J1035m19J1941L3782J6107Q614k2633k8278
610A6421J0970r044N1671j9063k3305J957l7325K49R595K0660J7585o727j4445
597A9199M613o819j09l128P380l557p129k9843R095N8899J6393k0077j7991j6635
583A0291J2910J4926n411N803m296n865q901j0140P751l218p369r961o219j6117
$$ plain form
676 31350 21285 -12145 -1194 4225 7421 14497 17107 33296 13534 22177 9147 16535 15399
663 15399 -8217 12484 10553 -11579 -4170 6452 17278 14138 10160 -4053 1827 16385 30974
650 30974 48207 31977 7520 63219 34555 1050 11028 43835 50155 14706 11207 1211 22385
637 22385 28537 -12495 1022 24940 53413 3719 3507 1956 -2204 4826 3479 -3792 14032 17492
623 17492 334 29998 22949 2065 -13728 -2693 -3112 8829 42611 58718 67332 44699 16421
610 16421 27391 18347 70018 50955 27650 29607 -7718 -7469 2126 22786 40371 33644 19199
597 19199 23812 16993 16884 13756 21136 17579 10450 -19393 -10298 48601 64994 44917 26926 10291
583 10291 23201 38127 32716 38519 34223 28358 19457 9317 17068 13850 6481 -3480 -9699 -25816
569b5816L6397J2855p762j2966l3751K6303L5056j32j8465l2261j1536K8947J0027
556F896K5533J0292o658k0912K6925O211j8061j2289K5631j0514k4162k7345K842
543a5611Q520K6002j8574j1616K8729M280k694J7523J5633k1303k1661p393L218
530E053k7709k947K3275J7080J4660J559k516j9833k8055m334L0438J2885N9N911
516B5526K0018P206j7883K0851j4119k1564p135L3234q305n7948n202P4628l3126
503A6181l8543j9491K766l636J0597l247q625n600K9413L2507m087K0006k2714
490E527L1261j9966m0125J7412L4912K5449l8431k8881O238J2386l808M546J9352
477B5872m61L038j9773J174P008j3776j7157k162J6931N3779j3596q265K6731
$$ plain form
569 -25816 10581 23436 15674 2708 -31043 -4740 30316 30184 11719 -20542 -32078 -3131 6896
556 6896 32429 42721 36063 15151 42076 48287 30226 17937 43568 33054 8892 -18453 -15611
543 -15611 -7091 18911 337 -11279 17450 21730 19036 36559 52192 30889 9228 1835 5053
530 5053 -22656 -25603 -2328 14752 29412 30971 28455 8622 -19433 -23767 6671 19556 19615 25526
516 25526 45544 52750 34867 55718 41599 20035 12900 46134 37829 -20119 -25321 49307 16181
503 16181 -22362 -41853 -39087 -42723 -32126 -35373 -43998 -49598 -20185 12322 8235 28241 5527
490 5527 36788 16822 -23303 -5891 29021 54470 16039 -12842 -6604 5782 1974 6520 25872
477 25872 25411 28449 8676 9850 16858 3082 -14075 -16237 694 54473 40877 32612 59343
464E9343k2877k6956J4997j8758k175L599K8282m0587N609L5812k5081j3354N365
451C219K7550k5856k0707M350K2974K3937m185j4647k8081K9992L073j3223j3335
438d939J1135N061k6977K8708M7K0195k8081J5850J8389k0223J1467n239m898
425B0495R902M57k8658J2027k1260Q825l824J1016R438k354L6374R185O435l5973
411C2085j3175j2366n3J2805R252R798J2512L60r886p3011N57M1662J7173j8483
397I230Q420L1006k2568l7222Q842J6083p006J5928J6070k1202k3368K4537K2539
384D1289k8906Q182K040J3945L7j0530k8295K7791J8116Q012k5551m58J6977J437
370D4086O910k2072q844J784P50n0486L1752k000K7887J2318k3010J0616J813
$$ plain form
464 59343 36466 9510 24507 5749 3574 7173 35455 -5132 477 36289 11208 -2146 3219
451 3219 30769 4913 -15794 -11444 11530 35467 31282 16635 -11446 18546 21619 8396 -4939
438 -4939 6196 11257 -15720 12988 13035 33230 5149 20999 39388 19165 30632 25393 20495
425 20495 30397 30854 2196 14223 -7037 1788 -2036 8980 18418 16064 52438 61623 68058 32085
411 32085 18910 6544 6491 19296 28548 38346 50858 51218 41332 -31679 -31122 10540 27713 9230
397 9230 17650 48656 26088 -11134 -2292 13791 6785 22713 38783 17581 -5787 18750 41289
384 41289 12383 20565 22605 36550 36587 26057 -2238 25553 43669 51681 26130 25672 42649 44086
370 44086 50996 28924 20080 21864 22614 -27872 3880 1880 29767 42085 19075 29691 31504
357C1504k3421n740J6137m153m3033l5167P4300K3082M060k198k5648J6788p426
344A9085J6368M343j7920k7031L9696N873j7793J7726l9032J1238O261L125R047
331C0986K3063O111k9704p204J6365m0431J2910J4833k0434K1437J6814j3887
319C0859L692L2294l7997J8677l5688J012J0838j8982R954j393k4542K8611P955
306B5290M711n991N101L669q720k4039j2084N517L493L9111l3359q472Q669J0681
292A3577K6249q12J8301q614J5995K1760l0182l6622J3508k0463m804j8966j9202
279c0275L4071O546K0349J4663k1022J3008q797N057j437J6178j9065j3311K0543
266C6508J4380m782k0149j2642K3498M992p548r755j4282O091m0789K2075K8958
$$ plain form
357 31504 8083 2343 18480 14327 -28706 -63873 10427 33509 37569 35371 9723 26511 19085
344 19085 35453 39796 21876 -5155 34541 40414 22621 40347 1315 12553 18814 21939 30986
331 30986 54049 60160 30456 23252 39617 -814 12096 26929 6495 27932 44746 30859
319 30859 34551 66845 28848 47525 11837 12849 23687 4705 14659 13266 -11276 17335 25290
306 25290 30001 24010 29111 32780 24060 21 -12063 -6546 -3053 36058 2699 -5773 2896 13577
292 13577 39826 39014 57315 48701 64696 86456 56274 19652 33160 12697 7893 -11073 -30275
279 -30275 3796 10342 30691 45354 24332 37340 28543 33600 32163 48341 29276 15965 36508
266 36508 50888 46106 25957 13315 36813 41805 34257 24502 10220 16311 -24478 -2403 26555
253B6555k486j7683J0913k8171J8670J3893M6522l7419j9140n950p578Q175J1494
240A7795J1492j0474R46J8272J4932o529p433k3809M478R433l644l19p244R325
226B7221l07J5476j5691j1537L1105j3567k1930J5875q587o823j9037M415K1184
213A7797J5684l217k422j6059q450K0196L437j3325j2143q765R064J9534k0800
200E31j1690K1272J2288j3449K605O549K2573J4862j7843Mn410R079N143R885
186E6399K7335m4055o968J2527m697l7549o9j6658J3618K2266j4364j539M278
173A0524L2964j2560r194J3029k517L35k7745m337L518N043K2553K221j2905l546
159A7383j899j7641L6714J7054l4030p662J3859L9126k1591k5547J5817p197j1681
$$ plain form
253 26555 24069 6386 17299 -10872 7798 21691 68213 30794 11654 5704 -1874 6301 17795
240 17795 29287 18813 19759 38031 52963 46434 39001 15192 19670 29103 25459 25140 17896 27221
226 27221 26914 42390 26699 15162 46267 32700 10770 26645 18058 11235 -7802 -3387 17797
213 17797 33481 30264 27842 11783 3333 23529 26966 13641 1498 -7267 1797 21331 531
200 531 -11159 10113 22401 8952 11557 18106 40679 55541 37698 37702 32292 41371 46514 56399
186 56399 83734 39679 32711 45238 40541 2992 2923 -13735 -117 22149 7785 6246 10524
173 10524 43488 30928 21734 34763 32246 32581 4836 499 4017 9060 31613 33834 20929 17383
159 17383 15484 -2157 34557 51611 17581 9919 23778 62904 41313 15766 31583 24386 12705
146A2705K3688J1406K1581m0638l5428J2414K1425J7351o085k1242J4592K2449
134E4218J308j3585j3074K2685n973J155K1298l0200j1296Q705k2693N215R881
121B7644k0370R299J995K607L4634l0651l0119O130J4660J3690K174j4883K1786
108C8596K1482l6385k9945K3849J7211p500k1499J589M458l643J2313k0700J3775
95A3601K9406N33K241J3501q34l2643l288K7272k3765N717J3939j1548k998r064
81B2070M517o531l742L254N708n624j6086j1101k193K4051k482l768L3583k5586
67A6070K428k0555J3174O867N23J4068o01n479n470Q127P857q31k4860R603K075
52B2996l459J2038j5419Q461Q877r306J0153j01K074j2561r574J3178p146L818
$$ plain form
146 12705 36393 47799 69380 28742 -6686 5728 27153 44504 38419 17177 31769 54218
134 54218 55526 41941 28867 51552 45579 46734 68032 37832 26536 35241 12548 17763 27644
121 27644 7274 16573 18568 21175 55809 25158 -4961 1169 15829 29519 31693 16810 38596
108 38596 60078 23693 -6252 17597 34808 27308 5809 7398 11856 8213 20526 -174 13601
95 13601 43007 43540 45781 59282 58448 25805 22517 49789 26024 31741 45680 34132 31134 22070
81 22070 26587 20056 16314 19568 25276 19652 3566 -7535 -9728 14323 11841 8073 41656 16070
67 16070 18498 -2057 11117 17984 18507 32575 31974 26495 21025 29152 37009 36178 11318 20921 22996
52 22996 19537 31575 16156 24617 33494 24188 34341 34240 36314 23753 14179 27357 20211 24029
38B4029J4988o691j0352j3617J1639J321Q900J857j0466m547K22J5881K1663j64
24E4663l8283j2182K2174J0501r201j7946N861L1274r908k0537K6754k2116j1384
11I670L806J017J0300K078M58r806K436Q358J6188N963j3744
0C6724
$$ plain form
38 24029 39017 32326 21974 8357 19996 21317 30217 32074 21608 17061 17283 33164 54827 54663
24 54663 16380 4198 26372 36873 27672 9726 15587 46861 36953 16416 43170 21054 9670
11 9670 13476 14493 24793 26871 27329 17523 19959 28317 44505 50468 36724
0 36724
$$ Imaginary data points
##PAGE= N=2
##DATA TABLE= (X++(I..I)), XYDATA
16383b390343K0885J2820L5662K8120M7814M5132K9159l493J5971N2030K9468
16372b076775l983K3814L5619K1739M4062N7590K0252K4574J2320K0186J8590
16361a802012M7796L6645J4678L9990L1880J4948L6946J8204J0289L4854M0209
16350a475573J4454K4711K9870K5410L1167L5315J6034K1603J7148l330K6741
16339a236450J8654M6293K3311K9715L0127J8808M0709M6378K7600K7179J4245
16328i13431J8333J5182M7885J5207K713K6621K873M1014J9606L1585K8707L6761
16316f26944L3114K6797o083K6945L0716K0968O235L43M2594N8136J4692o391
16304c78878L6524K4298L0337L4395L4504K7987N721J0489J9604L103J6511J68
$$ plain form
16383 -2390343 -2369458 -2356638 -2320976 -2292856 -2245042 -2199910 -2170751 -2174244 -2158273 -2106243 -2076775
16372 -2076775 -2080758 -2056944 -2021325 -1999586 -1955524 -1897934 -1877682 -1853108 -1840788 -1820602 -1802012
16361 -1802012 -1754216 -1717571 -1702893 -1662903 -1631023 -1616075 -1579129 -1560925 -1550636 -1515782 -1475573
16350 -1475573 -1461119 -1436408 -1406538 -1381128 -1349961 -1314646 -1298612 -1277009 -1259861 -1263191 -1236450
16339 -1236450 -1217796 -1171503 -1148192 -1118477 -1088350 -1069542 -1028833 -982455 -954855 -927676 -913431
16328 -913431 -895098 -879916 -832031 -816824 -814111 -787490 -784617 -743603 -723997 -692412 -663705 -626944
16316 -626944 -593830 -567033 -573116 -546171 -515455 -494487 -488252 -487909 -445315 -387179 -372487 -378878
16304 -378878 -342354 -318056 -287719 -253324 -218820 -190833 -185112 -174623 -155019 -151916 -135405 -135237
16292a35237K4106L7073M8330K6035L9875K0601p924J767M0478L0713N47O451
16280A32815M3319J1132J1450K6371J5952J2733L0735K1720L1091J0733J74N3543
16268D01768L6786j2558N878K5925K1389K0402K3440J1991M143L2595Q19J4357
16256E86935R632K3078M3236J2548o200l490o37L3590K8146K2798K3529L6534
16244H09699K3285l535j0767N9744O98J3502L8665j8958J7903J5455K0109r488
16232I56312L41J5994P207J0325l758M904J6787l940M6789M4438M3807p570J2907
16219A144543K4539j6776K6806j6614q073K7070K7031o388Q92N1648p332j5512
16207A231834J6624L6422N0345j2611k1887K3376J3136R595K4824p813J7233J3963
$$ plain form
16292 -135237 -111131 -74058 -25728 307 40182 60783 52859 54626 95104 125817 126364 132815
16280 132815 176134 187266 198716 225087 241039 253772 284507 306227 337318 348051 348225 401768
16268 401768 438554 425996 431874 457799 479188 499590 523030 535021 539164 571759 572578 586935
16256 586935 596567 619645 662881 675429 669229 665739 665102 698692 726838 749636 773165 809699
16244 809699 832984 829449 818682 878426 879124 892626 931291 912333 930236 945691 965800 956312
16232 956312 956653 972647 979854 990179 986421 991325 1008112 1004172 1050961 1095399 1139206 1131636 1144543
16219 1144543 1169082 1152306 1179112 1162498 1154425 1181495 1208526 1202138 1203030 1254678 1247346 1231834
16207 1231834 1248458 1284880 1335225 1322614 1300727 1324103 1337239 1346834 1371658 1363845 1381078 1395041
16195A395041M796m87K1019j0424P948K4531J5040K4494j5791k6589J8541n873
16183A452246P602K3059J8411j924L255J5625O593K9011j0939M84K7996J9802
16171A591221J573J7226P550J6027k86k5872J9016N862R425J5105R174J681J1863
16158A679565j5393j4000J084K6922o736j6114L3663q733N084K9820L6990K695
16146A754847q586k5457J8637k0792j3213N0472P823j7517K2159O195n1699N0609
16134A773478K8246l0563j7026K551J4436R006k8747J8452R004O713L2275Q914
16122A826739N311j0444K2254k0544l825K2501J0915R084Q394j3359O350k4907
16110A838469P626j5573K7940K004p991P717K474r303M685L1656m526j2158k1319
$$ plain form
16195 1395041 1399837 1399350 1420369 1409945 1417893 1442424 1457464 1481958 1466167 1439578 1458119 1452246
16183 1452246 1459848 1482907 1501318 1499394 1502649 1518274 1524867 1553878 1542939 1543423 1571419 1591221
16171 1591221 1592794 1610020 1617570 1633597 1633311 1607439 1626455 1632317 1641742 1656847 1666021 1667702 1679565
16158 1679565 1664172 1650172 1651256 1678178 1671442 1655328 1688991 1680258 1685342 1715162 1752152 1754847
16146 1754847 1746261 1720804 1739441 1718649 1705436 1755908 1763731 1746214 1768373 1774568 1722869 1773478
16134 1773478 1801724 1771161 1754135 1756686 1771122 1780128 1751381 1769833 1778837 1785550 1817825 1826739
16122 1826739 1832050 1821606 1843860 1823316 1819491 1841992 1852907 1861991 1870385 1857026 1863376 1838469
16110 1838469 1846095 1830522 1858462 1860466 1852475 1860192 1862666 1853363 1858048 1889704 1885178 1873020 1851701
16097A851701k318Q764K1531P59J2496J9913k33j5392m767L155n942O471j4094
16084A882044M91j9143P077K3752M0201K328k2403n136k8276R008K1463J6472
16072A927878r156J5982q265J1147k7860K3388k5253j5128R643k6408R606j9702
16060A865872j6338L3139J0507J8956K791k7493P477k982K9917J0409k0279P386
16048A919362K480p380J5599O38j7015r202J7219P309j1055k073M6985J157l0813
16035A933211m2178j1122L8451L02J0880M838N637J0405O502j0855k8581K0891
16023A938381j6273K597P764j5570j8784L765K8047M308K6490j5110k4125K0674
16011A942164k953k2910K3642J5025J172J1766J0914m0775N658Q241k0489r512
$$ plain form
16097 1851701 1849383 1858147 1879678 1880437 1892933 1912846 1912613 1897221 1892454 1895609 1889667 1896138 1882044
16084 1882044 1882535 1863392 1870469 1894221 1934422 1936750 1914347 1909211 1880935 1889943 1911406 1927878
16072 1927878 1918722 1934704 1926439 1937586 1909726 1933114 1907861 1892733 1902376 1875968 1885574 1865872
16060 1865872 1849534 1882673 1893180 1912136 1914927 1887434 1894911 1891929 1921846 1932255 1911976 1919362
16048 1919362 1921842 1914462 1930061 1930699 1913684 1904482 1921701 1929010 1917955 1915882 1962867 1964024 1933211
16035 1933211 1891033 1879911 1918362 1918664 1929544 1934382 1940019 1950424 1956926 1946071 1917490 1938381
16023 1938381 1922108 1924705 1932469 1916899 1898115 1901880 1929927 1934235 1960725 1945615 1921490 1942164
16011 1942164 1939211 1916301 1939943 1954968 1956140 1967906 1978820 1938045 1943703 1951944 1931455 1921943
15999A921943j3661J2815L0646R965l299P47K821l4694l530L0950J4955q041m958
15986A956659n020K8099j9148j8868k3743j0815M0508J2818j473O797k2196j1428
15974A932190J8192l3171J9671K0177j9035k4609L4750J2842o915O089j7513L772
15962A946440L4123j2270n956P865m38m122k3678J6700k4805K8834K9744j4729
15950A977708M363j4896k8034J2419Q770j1918K7559R659j6559Q714K948l1847
15938A948886J736m873m389M1496J1964m1837k185l802R040R978j3355n643K6688
15925A973704j8382k2399J4394L016m040k7808K0779L2500k0000j5854p112P762
15913A936560K1390n412l8513R201K3968o895O098J9260M262K979J0662K033j2552
$$ plain form
15999 1921943 1908282 1921097 1951743 1961708 1958409 1959156 1961977 1927283 1923753 1954703 1969658 1961617 1956659
15986 1956659 1951639 1979738 1960590 1941722 1917979 1907164 1947672 1960490 1959017 1965814 1943618 1932190
15974 1932190 1950382 1917211 1936882 1957059 1938024 1913415 1948165 1961007 1954092 1960181 1942668 1946440
15962 1946440 1980563 1968293 1962337 1970202 1969764 1965642 1941964 1958664 1933859 1962693 1992437 1977708
15950 1977708 1982071 1967175 1939141 1951560 1960330 1948412 1975971 1985630 1969071 1977785 1980733 1948886
15938 1948886 1950622 1945749 1941360 1982856 1994820 1952983 1950798 1946996 1956036 1966014 1952659 1947016 1973704
15925 1973704 1955322 1932923 1947317 1950333 1946293 1918485 1939264 1971764 1951764 1935910 1928798 1936560
15913 1936560 1957950 1952538 1914025 1923226 1947194 1940299 1946397 1965657 1969919 1972898 1983560 1985593 1973041
15900A973041m62l0871K9781m744k0096j0051r707J0509K0052J4010J3897l287
15888A982072k423j3478r043J2471j0573M403k3480K380N7378n764j3335m2816
15876A937792l363J8187k391j0077M529J0310p327J4026N785K7718j7469j8161
$$ plain form
15900 1973041 1972579 1941708 1971489 1966745 1946649 1936598 1926891 1937400 1957452 1971462 1985359 1982072
15888 1982072 1979649 1966171 1957128 1969599 1959026 1963429 1939949 1942329 1999707 1993943 1980608 1937792
15876 1937792 1934429 1952616 1950225 1940148 1944677 1954987 1947660 1961686 1967471 1995189 1977720 1959559
$$ [...]
##END NTUPLES=NMR SPECTRUM
##END=
