##TITLE=1H_CG1049_A_spectr spectr
 CDCl3, 8 sc, 
 18.11.2020
##JCAMPDX= 6.0         $$ Bruker NMR JCAMP-DX V2.0
##DATA TYPE= NMR SPECTRUM
##DATA CLASS= NTUPLES
##ORIGIN= UXNMR, Bruker Analytische Messtechnik GmbH
##OWNER= root
$$ XWIN-NMR		Version 3.5
$$ Wed Nov 18 12:53:35 2020 Russian Standard Time (UT+4h)  she@DPX200
##.OBSERVE FREQUENCY= 200.1315066352
##.OBSERVE NUCLEUS= ^1H
##.ACQUISITION MODE= SIMULTANEOUS
##.ACQUISITION SCHEME= undefined
##.AVERAGES= 8
##.DIGITISER RES= 18
##SPECTROMETER/DATA SYSTEM= spect
##.PULSE SEQUENCE= zg30
##.SOLVENT NAME= CDCl3
##.SHIFT REFERENCE= (INTERNAL, CDCl3, 0, 15.9865)
##AUDIT TRAIL= $$ (NUMBER, WHEN, WHO, WHERE, WHAT)
$$ ##TITLE= Audit trail, XWIN-NMR		Version 3.5
$$ ##JCAMPDX= 5.01
$$ ##ORIGIN= Bruker BioSpin GmbH
$$ ##OWNER= she
$$ F:/spectra/data/she/nmr/H-F/1/pdata/1/auditp.txt
$$ ##AUDIT TRAIL=  $$ (NUMBER, WHEN, WHO, WHERE, WHAT)
(   1,<2020-11-18 12:46:06.43 +0400>,<she>,<DPX200>,
      <created by zg, POWCHK disabled, PULCHK disabled
       configuration hash MD5:
       00 E9 B6 7A A2 85 ED C7 34 08 36 98 17 FE 4E 26
       data hash MD5: 16K
       EE 78 83 42 B2 5C D3 07 A4 37 96 00 93 96 A0 2D>)
(   2,<2020-11-18 12:46:08.76 +0400>,<she>,<DPX200>,
      <Start of raw data processing
       efp BC_mod = 2 LB = 0.24 FT_mod = 6 PKNL = 1 PHC0 = -11033.06 PHC1 = 0.8009024 SI = 16K 
       data hash MD5: 16K
       38 A9 A9 93 3F E1 D4 9C 30 A2 FA 6A F8 30 EC BA>)
(   3,<2020-11-18 12:46:22.89 +0400>,<she>,<DPX200>,
      <pk PHC0 = -22.50599 PHC1 = 22.6 
       data hash MD5: 16K
       D5 18 2D 16 EF 3C 88 27 07 6F 8A B8 F8 F4 60 69>)
(   4,<2020-11-18 12:46:26.14 +0400>,<she>,<DPX200>,
      <abs ABSG = 5 
       data hash MD5: 16K
       F6 43 7E B1 29 E7 E4 74 E9 A2 6D C1 46 78 EF 6D>)
(   5,<2020-11-18 12:46:42.78 +0400>,<she>,<DPX200>,
      <pk PHC0 = 1.738572 PHC1 = 0.6 
       data hash MD5: 16K
       72 FA 40 D0 1C F6 1C 88 97 E8 57 5D 60 4B DE 19>)
(   6,<2020-11-18 12:46:45.93 +0400>,<she>,<DPX200>,
      <abs ABSG = 5 
       data hash MD5: 16K
       40 D2 68 46 27 1F A2 D3 58 72 A9 3C D7 DC 88 05>)
$$ ##END=
$$ 
$$ hash MD5
$$ 41 A7 08 FF 2D 3D 1E D3 D2 25 D3 E7 75 0C B5 52
##$RELAX= 
##$RELAX= 
##$RELAX= 
##$RELAX= 
##$RELAX= 
##$RELAX= 
$$ Bruker specific parameters
$$ --------------------------
##$DU= <F:/spectra>
##$EXPNO= 1
##$NAME= <H-F>
##$PROCNO= 1
##$TYPE= <nmr>
##$USER= <she>
##$AMP= (0..31)
100 100 100 100 100 100 100 100 100 100 100 100 100 100 100 100 100 100 
100 100 100 100 100 100 100 100 100 100 100 100 100 100 
##$AQSEQ= 0
##$AQ_mod= 1
##$AUNM= <au_zg>
##$AUTOPOS= <>
##$BF1= 200.13
##$BF2= 200.13
##$BF3= 200.13
##$BF4= 200.13
##$BF5= 200.13
##$BF6= 200.13
##$BF7= 200.13
##$BF8= 200.13
##$BYTORDA= 1
##$CFDGTYP= 0
##$CFRGTYP= 5
##$CHEMSTR= <none>
##$CNST= (0..31)
1 1 145 1 1 1 1 1 1 1 1 1 1 1 1 1 1 1 1 1 1 1 1 1 1 1 1 1 1 1 1 1 
##$CPDPRG= <>
##$CPDPRG1= <>
##$CPDPRG2= <>
##$CPDPRG3= <>
##$CPDPRG4= <mlev>
##$CPDPRG5= <mlev>
##$CPDPRG6= <mlev>
##$CPDPRG7= <mlev>
$$ [...]
##$SUBNAM3= <"">
##$SUBNAM4= <"">
##$SUBNAM5= <"">
##$SUBNAM6= <"">
##$SUBNAM7= <"">
##$SUBNAM8= <"">
##$SUBNAM9= <"">
##$SW= 16.9725356469052
##$SWIBOX= (0..15)
0 0 2 0 0 0 0 0 0 0 0 0 0 0 0 0 
##$SW_h= 3396.73913043478
##$TD= 16384
##$TD0= 1
##$TE= 0
##$TE2= 300
##$TE3= 300
##$TEG= 300
##$TL= (0..7)
0 120 120 120 120 120 120 120 
##$TP= (0..7)
150 150 150 150 150 150 150 150 
##$TP07= 0
##$TPNAME0= <>
##$TPNAME1= <>
##$TPNAME2= <>
##$TPNAME3= <>
##$TPNAME4= <>
##$TPNAME5= <>
##$TPNAME6= <>
##$TPNAME7= <>
##$TPOAL= (0..7)
0.5 0.5 0.5 0.5 0.5 0.5 0.5 0.5 
##$TPOFFS= (0..7)
0 0 0 0 0 0 0 0 
##$TUNHIN= 0
##$TUNHOUT= 0
##$TUNXOUT= 0
##$USERA1= <user>
##$USERA2= <user>
##$USERA3= <user>
##$USERA4= <user>
##$USERA5= <user>
##$V9= 5
##$VALIST= <valist>
##$VCLIST= <CCCCCCCCCCCCCCC>
##$VD= 0
##$VDLIST= <DDDDDDDDDDDDDDD>
##$VPLIST= <PPPPPPPPPPPPPPP>
##$VTLIST= <TTTTTTTTTTTTTTT>
##$WBST= 1024
##$WBSW= 4
##$XGAIN= (0..3)
0 0 0 0 
##$XL= 0
##$YL= 0
##$YMAX_a= 555752
##$YMIN_a= -426090
##$ZGOPTNS= <>
##$ZL1= 120
##$ZL2= 120
##$ZL3= 120
##$ZL4= 120
##$ABSF1= 15.98646
##$ABSF2= -0.9862041
##$ABSG= 5
##$ABSL= 3
##$ALPHA= 0
##$AQORDER= 0
##$ASSFAC= 0
##$ASSFACI= 0
##$ASSFACX= 0
##$ASSWID= 0
##$AUNMP= <proc_1d>
##$AZFE= 0.1
##$AZFW= 0.1
##$BCFW= 0
##$BC_mod= 2
##$BYTORDP= 0
##$COROFFS= 0
##$CY= -3
##$DATMOD= 1
##$DC= 0
##$DFILT= <>
##$DTYPP= 0
##$F1P= 0
##$F2P= 0
##$FCOR= 1
##$FTSIZE= 16384
##$FT_mod= 6
##$GAMMA= 0
##$GB= 0
##$INTBC= 1
##$INTSCL= 1.245715e-10
##$ISEN= 128
##$LB= 0.24
##$LEV0= 0
##$LPBIN= 0
##$MAXI= 10000
##$MC2= 0
##$MEAN= 0
##$ME_mod= 0
##$MI= 1.114404
##$NCOEF= 0
##$NC_proc= -6
##$NLEV= 6
##$NOISF1= 3.799351
##$NOISF2= 2.8
##$NSP= 0
##$NTH_PI= 0
##$NZP= 0
##$OFFSET= 15.98646
##$PC= 1
##$PHC0= -11053.83
##$PHC1= 24.0009
##$PH_mod= 1
##$PKNL= yes
##$PPARMOD= 0
##$PSCAL= 0
##$PSIGN= 0
##$REVERSE= no
##$SF= 200.130005634774
##$SI= 16384
##$SIGF1= 3
##$SIGF2= 2
##$SINO= 5.538805
##$SIOLD= 16384
##$SREGLST= <1H.CDCl3>
##$SSB= 0
##$STSI= 16384
##$STSR= 0
##$SW_p= 3396.73913043478
##$SYMM= 0
##$S_DEV= 0
##$TDeff= 16384
##$TDoff= 0
##$TI= <>
##$TILT= no
##$TM1= 0
##$TM2= 0
##$TOPLEV= 0
##$USERP1= <user>
##$USERP2= <user>
##$USERP3= <user>
##$USERP4= <user>
##$USERP5= <user>
##$WDW= 1
##$XDIM= 16384
##$YMAX_p= 477724449
##$YMIN_p= -479720
$$ End of Bruker specific parameters
$$ ---------------------------------
##NTUPLES= NMR SPECTRUM
##VAR_NAME=  FREQUENCY,     SPECTRUM/REAL,   SPECTRUM/IMAG
##SYMBOL=    X,             R,               I
##VAR_TYPE=  INDEPENDENT,   DEPENDENT,       DEPENDENT
##VAR_FORM=  AFFN,          ASDF,            ASDF
##VAR_DIM=   16384,         16384,           16384
##UNITS=     HZ,            ARBITRARY UNITS, ARBITRARY UNITS
##FACTOR=    0.207333158178281, 1,           1
##FIRST=     3199.37027625639, 0,            0
##LAST=      -197.368854178392, 0,           0
##MIN=       -197.368854178392, -479720,     0
##MAX=       3199.37027625639, 477724449,    0
$$ Real data points
##PAGE= N=1
##DATA TABLE= (X++(R..R)), XYDATA
$$ [...]
6594B787502j59592M2870K6126J25945j38693L5278M5320J0750J21227M8556n4836
$$ 2787502 2627910 2670780 2696906 2822851 2684158 2719436 2764756 2775506 2896733 2945289 2890453
6583B890453j084j28501j08665o6102M3707J5531j02115l129J1448o9390J16452
$$ 2890453 2889369 2760868 2652203 2586101 2629808 2645339 2543224 2540095 2551543 2482153 2598605
6572B598605M9872j97812j01142K2884Q3844p6594o9196j280J21415N4000J17694
$$ 2598605 2648477 2450665 2349523 2372407 2456251 2379657 2310461 2309181 2430596 2484596 2602290
6561B602290N8585R6557O2846J67593K82844p9314j40839J5950j2230o0065p3120
$$ 2602290 2660875 2757432 2820278 2987871 3270715 3191401 3050562 3066512 3054282 2994217 2921097
6550B921097n7101j32832j11078j03867o4300j15112k15274Q5025k69667n3685
$$ 2921097 2863996 2731164 2620086 2516219 2451919 2336807 2121533 2206558 1936891 1883206
6540A883206M0533M2179P785k22321J0862J30961o7754q2117K25183K6227o8560
$$ 1883206 1923739 1965918 1973703 1751382 1762244 1893205 1825451 1743334 1968517 1994744 1926184
6529A926184n2688Q9807J11717o0582n0055q8892n1008J64185q581J2978l37194
$$ 1926184 1873496 1963303 2075020 2014438 1964383 1875491 1824483 1988668 1980087 1993065 1655871
6518A655871q5470J2046M0427J20653n4738j20886R6896j83246k89634R1472j6612
$$ 1655871 1570401 1582447 1622874 1743527 1688789 1567903 1664799 1481553 1191919 1283391 1266779
6507A266779k6197O6423L9366N7765j66309j14187K24382Q4504j3027J08487n2949
$$ 1266779 1240582 1307005 1346371 1404136 1237827 1123640 1348022 1432526 1419499 1527986 1475037
6496A475037j09070J0786L0826r3846p9639o3943O5106J7988m3673Q93M4143M9766
$$ 1475037 1365967 1376753 1407579 1313733 1234094 1170151 1235257 1253245 1209572 1210465 1254608 1304374
6484A304374o9318L2163o9958j09433M5556j0268m1262p4613o7816K10161J5026
$$ 1304374 1235056 1267219 1197261 1087828 1133384 1123116 1081854 1007241 939425 1149586 1164612
6473A164612j96672j05599j2969K23083L8789Q4836J388o4888P7417k0436j32186
$$ 1164612 967940 862341 849372 1072455 1111244 1196080 1197468 1132580 1209997 1189561 1057375
6462A057375p6955m2303o2946K01206j1863k1673J57226m0965J50181J75476j8139
$$ 1057375 980420 938117 875171 1076377 1064514 1042841 1200067 1159102 1309283 1484759 1466620
6451A466620m6331o5507K8128O9605K8311j9289M1122Q882m5119k09252R0398
$$ 1466620 1420289 1354782 1382910 1452515 1480826 1461537 1502659 1511541 1466422 1257170 1347568
6440A347568J24824k39140L6989J39712l45051j17093J54516M7103j32988m6605
$$ 1347568 1472392 1233252 1270241 1409953 1064902 947809 1102325 1149428 1016440 969835
6430I69835P9525j36884j05988J6022k5835R683J38226J3122r2584L0467o7056
$$ 969835 1049360 912476 806488 822510 796675 806358 944584 957706 865122 895589 828533
6419H28533m1041n2902j84607O8208J09042J22173o1908l0989J74026j08493O182
$$ 828533 787492 734590 549983 618191 727233 849406 787498 756509 930535 822042 828224
6408H28224J25970l2571n5454q4553k1729r4569q9285o645R6202R0477O8210m2861
$$ 828224 954194 921623 866169 781616 759887 665318 576033 569388 665590 756067 824277 781416
6396G81416r142Q6974l7457l5075K5960j43082O0219J70565l1908m5721N8667
$$ 781416 772274 859248 821791 786716 812676 669594 729813 900378 868470 822749 881416
6385H81416M1753j55323j28443J73563K11976J19910L9180O0247J98743j37480
$$ 881416 923169 767846 639403 812966 1024942 1144852 1184032 1244279 1443022 1305542
6375A305542j03977K03188P7580k12193L558M0005j3076q7180J65331O9616R303
$$ 1305542 1201565 1404753 1482333 1270140 1273698 1313703 1300627 1213447 1378778 1448394 1457697
6364A457697j0071J31457J1840p4208r6029J25169j0662k57694j60047R2711n1922
$$ 1457697 1447626 1579083 1590923 1516715 1420686 1545855 1535193 1277499 1117452 1210163 1158241
6353A158241j58091R6569j03169p2234O791J38687J04492j77406n3426J12941
$$ 1158241 1000150 1096719 993550 921316 928107 1066794 1171286 993880 940454 1053395
6343A053395j18947j84277j0251l872J88127j3991j6407Q2539n9329n8115j8259
$$ 1053395 934448 750171 739920 736048 924175 910184 893777 976316 916987 858872 840613
6332H40613J79611Q0271J16360J04109n6589j01460p3636J42503P2704r4966N9663
$$ 840613 1020224 1100495 1216855 1320964 1264375 1162915 1089279 1231782 1304486 1209520 1269183
6321A269183K96414J19481m6926Q0585l3027R7424Q0101J34114K45067p8422q7413
$$ 1269183 1565597 1685078 1638152 1718737 1685710 1783134 1863235 1997349 2242416 2163994 2076581
6310B076581M9905l08725j19050K9133L3061K6916q0040n7334J4252k57652L7866
$$ 2076581 2126486 1817761 1698711 1727844 1760905 1787821 1707781 1650447 1664699 1407047 1444913
6299A444913q5357j9264k82030o3986J06113k33278l0731R9528J22853p955l4177
$$ 1444913 1359556 1340292 1058262 994276 1100389 867111 836380 935908 1058761 1050806 1016629
6288A016629P9299p6608j67405j20034J99075J11022r7070n1095L7942p8868j00452
$$ 1016629 1095928 1019320 851915 731881 930956 1041978 944908 893813 931755 852887 752435
6277G52435J87296r009j59350k3718K54271N9395q2708p1546P7303l3780J0158
$$ 752435 939731 930722 771372 747654 1001925 1061320 978612 907066 984369 950589 960747
6266I60747J85059p7594M2794r699J59945J6478L6457J18609J03723J33546p9717
$$ 960747 1145806 1068212 1111006 1101307 1261252 1277730 1314187 1432796 1536519 1670065 1590348
6255A590348n2305P2508k1839j76100M859J96577q5282j26601J1775N2379j01243
$$ 1590348 1538043 1610551 1588712 1412612 1417471 1614048 1528766 1402165 1413940 1466319 1365076
6244A365076j36270K2354r4220Q4226k7132m5995j20996k3360l9469J9219n4797
$$ 1365076 1228806 1251160 1156940 1241166 1214034 1168039 1047043 1023683 984214 1003433 948636
6233I48636q6360N8240K6864j33774J05620J43872L9471k9098m4505k4500l0398
$$ 948636 862276 920516 947380 813606 919226 1063098 1102569 1073471 1028966 1004466 974068
6222I74068j16202Q4296J30930p781p1755R163k6090j62311n2797J17919R7693
$$ 974068 857866 942162 1073092 1065311 993556 1002719 976629 814318 761521 879440 977133
6211I77133j49313O9395K68926q843k5488L7835q7010j35054J0124j7779K9084
$$ 977133 827820 897215 1166141 1157298 1131810 1169645 1082635 947581 957705 939926 969010
6200I69010M0731N1082K02505M7600l253m1517M3482j15684n9715K36460j38305
$$ 969010 1009741 1060823 1263328 1310928 1307675 1266158 1309640 1193956 1134241 1370701 1232396
6189A232396Q8595K7661J74457n1985n7096K58700J3962J00024m6147K1440P6540
$$ 1232396 1320991 1348652 1523109 1471124 1414028 1672728 1686690 1786714 1740567 1762007 1838547
6178A838547N9464o679J03350Q5066o2613N9932K42568j02092q2457J04569P4202
$$ 1838547 1898011 1891332 1994682 2079748 2017135 2077067 2319635 2217543 2135086 2239655 2313857
6167B313857k2334l9668J00588K464j66385K35747R0123p3623J14614p2542j6255
$$ 2313857 2291523 2251855 2352443 2354907 2188522 2424269 2514392 2440769 2555383 2482841 2466586
6156B466586M8426n3046M3342K15026o8897k2772L043o3552p3389r0263P3591
$$ 2466586 2515012 2461966 2505308 2720334 2651437 2628665 2631708 2568156 2494767 2404504 2478095
6145B478095J4463j98717j70685n4162K5670j02809J77000P5394m0576L7372j77332
$$ 2478095 2492558 2293841 2123156 2068994 2094664 1991855 2168855 2244249 2203673 2241045 2063713
6134B063713l8513j40547j24206j33501J52040j90384k7485K07616j75608m9550
$$ 2063713 2025200 1884653 1760447 1626946 1778986 1588602 1561117 1768733 1593125 1543575
6124A543575J18409J92883K8582J20159J45525n2918m2868j1502L5917J14468
$$ 1543575 1661984 1854867 1883449 2003608 2149133 2096215 2053347 2041845 2077762 2192230
6114B192230K5846N1515O4124j20680Q3292K60074J24345M6235O8777J68655m1527
$$ 2192230 2218076 2269591 2333715 2213035 2296327 2556401 2680746 2726981 2795758 2964413 2922886
6103B922886p1254J3097p4831J7726n1060M733k6548Q4774N1346o4769p4410j32599
$$ 2922886 2851632 2864729 2789898 2807624 2756564 2761297 2734749 2819523 2870869 2806100 2731690 2599091
6091B599091j02650J07158J4928k62750m7444J3566k6395J0149j28567k0018m960
$$ 2599091 2496441 2603599 2618527 2355777 2308333 2321899 2295504 2305653 2177086 2157068 2152108
6080B152108r4312O0644R9245M1148Q1583J86917j13125k3680k8952j91167j53773
$$ 2152108 2057796 2118440 2217685 2258833 2340416 2527333 2414208 2390528 2361576 2170409 2016636
6069B016636m1813M4770J7516P4882j4182J40159K7100p6309p0057N3183J58980
$$ 2016636 1974823 2019593 2037109 2111991 2097809 2237968 2265068 2188759 2118702 2171885 2330865
6058B330865P4729m1333L4943O7913j14362O8598K7897j39402J50440J33115J53770
$$ 2330865 2405594 2364261 2399204 2467117 2352755 2421353 2449250 2309848 2460288 2593403 2747173
6047B747173M2706l4444R0698j9927k3738K6822M9848m4595J700k896L16771P145
$$ 2747173 2789879 2755435 2846133 2826206 2802468 2829290 2879138 2834543 2836243 2833347 3150118 3157263
6035C157263L9114J65376j0617J56104L8558K36040N8516K2383K34521J67653
$$ 3157263 3196377 3361753 3351136 3507240 3545798 3781838 3840354 3862737 4097258 4264911
6025D264911K33423J37572K62754K15673K63794K31159K30104J54740K2535K27893
$$ 4264911 4498334 4635906 4898660 5114333 5378127 5609286 5839390 5994130 6016665 6244558
6015F244558J02856K7686q0756j58473o3564l4609l4523J0585M3880m6084k49252
$$ 6244558 6347414 6375100 6294344 6135871 6072307 6037698 6003175 6013760 6057640 6011556 5762304
6004E762304k04312m0022j43933k81242k37614r2038j96985k65813l2644p6846
$$ 5762304 5557992 5517970 5374037 5092795 4855181 4763143 4566158 4300345 4267701 4190855
5994D190855k98634m626J56785j08407j22026M8493J15246J96482j26277O46J83158
$$ 4190855 3892221 3887595 4044380 3935973 3813947 3862440 3977686 4174168 4047891 4048537 4231695
5983D231695j78109L0512O992K48436L1757K3733K87893J26895J31874K76841
$$ 4231695 4053586 4084098 4091090 4339526 4371283 4395016 4682909 4809804 4941678 5218519
5973E218519L48839j04904J35095K30119K52554l5639l60344J25429K899m885
$$ 5218519 5567358 5462454 5597549 5827668 6080222 6044583 5684239 5809668 5812567 5807682
5963E807682O0220J58683K3423q4601J41517K10949P5811j86359M4451K5706j9936
$$ 5807682 5867902 6026585 6050008 5965407 6106924 6317873 6393684 6207325 6251776 6277482 6257546
5952F257546k24840L6604R4606K2846J57386J17442J71119Q2921J95413K08830
$$ 6257546 6032706 6069310 6163916 6186762 6344148 6461590 6632709 6715630 6911043 7119873
5942G119873K14247J11022J31197L88362L5231K92070J40378K57332L60071J32335
$$ 7119873 7334120 7445142 7576339 7964701 7999932 8292002 8432380 8689712 9049783 9182118
5932I182118L08221J36964M4240O4280L77131K6935m6781J79107J52842M1925
$$ 9182118 9490339 9627303 9671543 9735823 10112954 10139889 10093108 10272215 10425057 10466982
5922A0466982k79208k30086j94272l13943k08157l09259j39644k85002k56646
$$ 10466982 10187774 9957688 9763416 9449473 9241316 8932057 8792413 8507411 8250765
5913H250765l05432k56359l33675k65641j22766j62226j34903k44591k5184l02764
$$ 8250765 7945333 7688974 7355299 7089658 6966892 6804666 6669763 6425172 6399988 6097224
5903F097224j42461m9827q4195N7973n4508J21337j19873j02276n2657n1391r9321
$$ 6097224 5954763 5904936 5820741 5878714 5824206 5945543 5825670 5723394 5670737 5619346 5520025
5892E520025l7445K5437k031j32517J8454J77005j7900O1911n6835J4610K35210
$$ 5520025 5482580 5508017 5505986 5373469 5391923 5568928 5551028 5612939 5556104 5570714 5805924
5881E805924j67954j03462J215O858k8810K8979O7781q0842j33442j9355M728
$$ 5805924 5637970 5534508 5535723 5542581 5513771 5542750 5610531 5529689 5396247 5376892 5381620
5870E381620k28663m8941M6990p8308j83925j52725N9773j5737k19909k24935
$$ 5381620 5152957 5104016 5151006 5072698 4888773 4736048 4795821 4780084 4560175 4335240
5860D335240P6986j66944j46945m3263o1970K4250j98277n6281k5531j31292j26726
$$ 4335240 4412226 4245282 4098337 4055074 3993104 4017354 3819077 3762796 3737265 3605973 3479247
5849C479247O2154k08535j49045p8074L8394j03963k25122l9863J33520q952q8411
$$ 3479247 3541401 3332866 3183821 3105747 3144141 3040178 2815056 2775193 2908713 2899761 2811350
5838B811350p7800J9549j30337K7917j1603p8305p9229o0667r761J6452P2198
$$ 2811350 2733550 2753099 2622762 2650679 2639076 2560771 2481542 2420875 2411114 2427566 2499764
5827B499764p5938O5621J03420j95744j05198L3758n3736r8952q4777n3707M2128
$$ 2499764 2423826 2489447 2592867 2397123 2291925 2325683 2271947 2172995 2088218 2034511 2076639
5816B076639r6403k2065N2322m7959Q0689J5519j8810j47941L2425Q9291j58001
$$ 2076639 1980236 1958171 2010493 1962534 2043223 2058742 2039932 1891991 1924416 2013707 1855706
5805A855706j11800N9119L3300l6803J07424O1527R6466j97335o4400J91682j32483
$$ 1855706 1743906 1803025 1836325 1799522 1906946 1968473 2064939 1867604 1803204 1994886 1862403
5794A862403k7450J8981J03495J24492j89658l2793J7807K00251q2259r9944j01255
$$ 1862403 1834953 1853934 1957429 2081921 1892263 1859470 1877277 2077528 1995269 1895325 1794070
5783A794070p7318J26664L7101P4620k35417L1950N1107L5688j30385p817l6890
$$ 1794070 1716752 1843416 1880517 1955137 1719720 1751670 1802777 1838465 1708080 1700263 1663373
5772A663373n4463P5354m796j75018n1205M0202J2402m1861m3566l6897P3249
$$ 1663373 1608910 1684264 1679468 1504450 1453245 1493447 1505849 1463988 1420422 1383525 1456774
5761A456774j34700N8828j3287J3630j04627q1940J49772j34659r3459L1927J21184
$$ 1456774 1322074 1380902 1367615 1381245 1276618 1194678 1344450 1209791 1116332 1148259 1269443
5750A269443n5763q1104l5396k7501J36284n8252j81412L3156K0778J9805P6034
$$ 1269443 1213680 1132576 1097180 1069679 1205963 1147711 966299 999455 1020233 1040038 1116072
5739A116072k376k10959j80407J16283J46294p855K3535R5714r2854j26368K3056
$$ 1116072 1113696 902737 722330 838613 984907 977052 1000587 1096301 1003447 877079 900135
5728I00135j4030L535j7492Q5012J20458o0807j4504K00530K8375k05942r090
$$ 900135 886105 889640 872148 957160 1077618 1016811 1002307 1202837 1231212 1025270 1016180
5717A016180J12663j34196o9821J32302o3220q2403O666m5014P0788n2257K4968
$$ 1016180 1128843 994647 924826 1057128 993908 911505 918171 873157 943945 891688 916656
5706I16656M0634j5256J17676O9618N3244k5984k53931L6269Q5777k0749p2236
$$ 916656 957290 942034 1059710 1129328 1182572 1156588 902657 938926 1024703 1003954 931718
5695I31718n9764N4108Q6527J11779o0230J9322r5156R1704l9778j39352o615
$$ 931718 871954 926062 1012589 1124368 1064138 1083460 988304 1080008 1040230 900878 894263
5684H94263J36227K5898N6780J2679k2422J28455P7832J3571N929L2382n0506
$$ 894263 1030490 1056388 1113168 1125847 1103425 1231880 1309712 1323283 1329212 1361594 1311088
5673A311088J4110L9575j95300l1020J39015j07144K0978o053N9496O8365j09841
$$ 1311088 1325198 1364773 1169473 1138453 1277468 1170324 1191302 1185249 1244745 1313110 1203269
5662A203269n278J90288o3609O6122m5963K779J0273j0956q6638L8662P2385M867
$$ 1203269 1197991 1388279 1324670 1390792 1344829 1347608 1357881 1346925 1260287 1298949 1371334 1376201
5650A376201k2337P4672J64616q5527Q6821N3642m8854M1316j95093j85846P1322
$$ 1376201 1353864 1428536 1593152 1507625 1594446 1648088 1599234 1640550 1445457 1259611 1330933
5639A330933m2421j2415j01827R4452N7519o9238R4001K7267p7188k6694l4998
$$ 1330933 1288512 1276097 1174270 1268722 1326241 1257003 1351004 1378271 1301083 1274389 1239391
5628A239391l6099p8821n6966O2492L124r6888P2924J15288m8279K7310P348J86061
$$ 1239391 1203292 1124471 1067505 1129997 1133121 1036233 1109157 1224445 1176166 1203476 1210824 1396885
5616A396885O7601o1458j25926Q2740p4215l070J3645J2334j979p3171J29209
$$ 1396885 1464486 1403028 1277102 1359842 1285627 1282557 1296202 1308536 1306557 1233386 1362595
5605A362595J05828k3197N312Q5963o1252J890j20076j11325J57669o0124L1876
$$ 1362595 1468423 1445226 1450538 1536501 1475249 1477139 1357063 1245738 1403407 1343283 1375159
5594A375159M0987J26192O4037j02491r1729l2126K30622R6856J01786J8992j8252
$$ 1375159 1416146 1542338 1606375 1503884 1412155 1380029 1610651 1707507 1809293 1828285 1810033
5583A810033q6673O0484j67369O7690J82989O232J70849j2109n8486J52000R766
$$ 1810033 1723360 1783844 1616475 1684165 1867154 1873386 2044235 2032126 1973640 2125640 2135406
5572B135406M7632o9338j68200P4965O7224j17170j7423K3578J1482o4812k9583
$$ 2135406 2183038 2113700 1945500 2020465 2087689 1970519 1953096 1976674 1988156 1923344 1893761
5561A893761j826L7430l9287j2544O8865m2229n3390j37521m517j1188n2538j7203
$$ 1893761 1891935 1929365 1890078 1877534 1946399 1904170 1850780 1713259 1708742 1697554 1645016 1627813
5549A627813j808Q5544J69663n8570L1078J21673J56178o9347q1802J84498j10029
$$ 1627813 1626005 1711549 1881212 1822642 1853720 1975393 2131571 2062224 1980422 2164920 2054891
5538B054891j46651J36583q0055j28289J56197K1340r1427L3521K5720R2712J5473
$$ 2054891 1908240 2044823 1964768 1836479 1992676 2014016 1922589 1956110 1981830 2074542 2090015
5527B090015o3101j7618M0906J4630j75395N5964J12592L1795K5141R5927m9638
$$ 2090015 2026914 2009296 2050202 2064832 1889437 1945401 2057993 2089788 2114929 2210856 2161218
5516B161218N9074M890Q2040N4989l7910J35191j8605p2648J57188l5230l7317
$$ 2161218 2220292 2225182 2307222 2362211 2324301 2459492 2440887 2368239 2525427 2490197 2452880
5505B452880P5835M5957K7804J73471J262l0393k7908K03651R5624l5306J00171
$$ 2452880 2528715 2574672 2602476 2775947 2777209 2746816 2718908 2922559 3018183 2982877 3083048
5494C083048J8156J2688P3356R7710j49005J5092j06929J40986M727r9952K05956
$$ 3083048 3101204 3113892 3187248 3284958 3135953 3151045 3044116 3185102 3189829 3089877 3295833
5483C295833K66326j9341K1619J91022N4956O1221O536J4394j8381o1094J91934
$$ 3295833 3562159 3542818 3564437 3755459 3810415 3871636 3878172 3892566 3874185 3813091 4005025
5472D005025K20920J61036K15804J27494L71470J72657K23980M65831K85255K8613
$$ 4005025 4225945 4386981 4602785 4730279 5101749 5274406 5498386 5964217 6249472 6278085
5462F278085L54339N88391L72259O23453N04447P24017O96824O88651Q80072R18619
$$ 6278085 6632424 7220815 7593074 8216527 8720974 9444991 10141815 10830466 11710538 12629157
5452A2629157R37433O70447N62923L70766m3121l36947l63650m96218n99759l34176
$$ 12629157 13566590 14237037 14799960 15170726 15127605 14790658 14427008 13930790 13331031 12996855
5442A2996855j73606l11352j32873J00943L16970M33158N02428M13049P8128j56442
$$ 12996855 12823249 12511897 12379024 12479967 12796937 13230095 13732523 14145572 14223700 14067258
5432A4067258n50909q14327r69682j089592q74927p76583p55043o18026o38943
$$ 14067258 13516349 12702022 11732340 10642748 9767821 8991238 8236195 7618169 6979226
5423F979226l23359l36208k47336k61186l08351j61743j69516j19813j6275j56792
$$ 6979226 6655867 6319659 6072323 5811137 5502786 5341043 5171527 5051714 5035439 4878647
5413D878647j19469n5959J7388l8049l1822j05187o1794m2222j18969n0696p7420
$$ 4878647 4759178 4703219 4720607 4682558 4650736 4545549 4483755 4441533 4322564 4271868 4194448
5402D194448M0489k02384k52289k50955K9777P5832J7299r385k63287J47502K9109
$$ 4194448 4234937 4032553 3780264 3529309 3559086 3634918 3652217 3642832 3379545 3527047 3556156
5391C556156p5151j37580l8530j06633j15823k149M3925r271Q3235O714L3057
$$ 3556156 3481005 3343425 3304895 3198262 3082439 3080290 3124215 3114944 3198179 3204893 3237950
5380C237950n3861j61239q9060l1080k67756J8520R9327k3613J2848l01494p9709
$$ 3237950 3184089 3022850 2933790 2902710 2634954 2653474 2752801 2729188 2742036 2440542 2360833
5369B360833l8135k6830J79747R2797q6290n0170M3371P1720j07106J8708L6378
$$ 2360833 2322698 2295868 2475615 2568412 2482122 2431952 2475323 2547043 2439937 2458645 2495023
5358B495023j16637l2073J29676r8632l6475j08433J05488J9215q7711p7137M4441
$$ 2495023 2378386 2346313 2475989 2377357 2340882 2232449 2337937 2357152 2269441 2192304 2236745
5347B236745N1672o1129Q0721p6367p1468r935j41123J47310J17520P603M9828
$$ 2236745 2288417 2227288 2308009 2231642 2160174 2150239 2009116 2156426 2273946 2281549 2331377
5336B331377Q6196J14376k42220P230J46556q3265K5491M2160R5183q3261j04407
$$ 2331377 2417573 2531949 2289729 2296959 2443515 2360250 2385741 2427901 2523084 2439823 2335416
5325B335416o2056O1802n214K60316J36551Q6495m7574j1584O9222N8034o4644
$$ 2335416 2273360 2335162 2329948 2590264 2726815 2813310 2765736 2754152 2823374 2881408 2816764
5314B816764J02578n6615p5985M437J17767K83506o2615o4917J27155Q1621P8038
$$ 2816764 2919342 2862727 2786742 2791179 2908946 3192452 3129837 3064920 3192075 3273696 3351734
5303C351734R9305J52550K70256r5588j56345J24908J76624m7558Q2398o164K8775
$$ 3351734 3451039 3603589 3873845 3778257 3621912 3746820 3923444 3875886 3958284 3952120 3980895
5292C980895j02762k1929j7025j22539Q172j44552k57622j36277j27421j44430
$$ 3980895 3878133 3856204 3839179 3716640 3724812 3580260 3322638 3186361 3058940 2914510
5282B914510R350M2895P1286o5124O3434J06158K14558P7540j72015k6547J31546
$$ 2914510 2923860 2966755 3038041 2972917 3036351 3142509 3357067 3434607 3262592 3236045 3367591
5271C367591p827j85938l5991L79565J56868j1269N3672J51615K47064j68241
$$ 3367591 3359764 3173826 3137835 3517400 3674268 3662999 3716671 3868286 4115350 3947109
5261C947109j89988K6469j53930j6214L4157R782j5578r2481J2289J35832N7018
$$ 3947109 3757121 3783590 3629660 3613446 3647603 3657385 3641807 3549326 3561615 3697447 3754465
5250C754465P5496K01138Q225q2233l0256K68313P1619J36536J53989J87727R9816
$$ 3754465 3829961 4031099 4039324 3957091 3926835 4195148 4266767 4403303 4557292 4745019 4844835
5239D844835k8334J63122J49157J55107J83621R7887J54847p2721J07215o6410
$$ 4844835 4816501 4979623 5128780 5283887 5467508 5565395 5720242 5647521 5754736 5688326
5229E688326l0511j88625J30721Q7499m8600j36071j18026l7358j38157j21846
$$ 5688326 5657815 5469190 5599911 5687410 5638810 5502739 5384713 5347355 5209198 5087352
5219E087352j01054N696r6555k23897L660q7084Q8578q5190l4903r3674k03170
$$ 5087352 4986298 4991994 4895439 4671542 4675202 4588118 4676696 4591506 4556603 4462929 4259759
5208D259759l9587N5766M8833o0991l3898L2227l6057j31953Q8112K13025m3092
$$ 4259759 4220172 4275938 4324771 4263780 4229882 4262109 4226052 4094099 4182211 4395236 4352144
5197D352144j07468l5385J47526q379n5017q194j3687J10338n8851R9110o138
$$ 4352144 4244676 4209291 4356817 4348438 4293421 4285227 4271540 4381878 4323027 4422137 4415999
5186D415999k8847j8042K29002J27362K1061J8846R1303m9691Q3021J29769N9769
$$ 4415999 4387152 4369110 4598112 4725474 4746535 4765381 4856684 4806993 4890014 5019783 5079552
5175E079552r7420L788K8070J00840Q1691J76132P8611J97460J53629j2067K22407
$$ 5079552 4982132 4985920 5013990 5114830 5196521 5372653 5451264 5648724 5802353 5790286 6012693
5164F012693J98437O3748K1300j6777J21595J44471K19520Q1392J80099K03252
$$ 6012693 6211130 6274878 6296178 6279401 6400996 6545467 6764987 6846379 7026478 7229730
5154G229730K78956J26890J03260l35J17813J64971N6612K11085L9509l37070
$$ 7229730 7508686 7635576 7738836 7738501 7856314 8021285 8077897 8288982 8328491 7991421
5144G991421m18032k43628J2344J41811j75840k1667R155j37466m7404m3387Q5696
$$ 7991421 7573389 7329761 7342105 7483916 7308076 7286409 7295564 7158098 7110694 7067307 7153003
5133G153003J26204l2326L6652N4490K17101K23060J74475J32032K04181K47898
$$ 7153003 7279207 7246881 7283533 7338023 7555124 7778184 7952659 8084691 8288872 8536770
5123H536770J76743J35728J42817J68204K40954k9474j28787q0824k14994j03884
$$ 8536770 8713513 8849241 8992058 9160262 9401216 9371742 9242955 9162131 8947137 8843253
5113H843253n7289l1233k2711q4297l6638L8974P9740J72171K61960K54138J88780
$$ 8843253 8785964 8754731 8732020 8647723 8611085 8650059 8729799 8901970 9163930 9418068 9606848
5102I606848K32775J93008M06367L87038J99370L02627K29926K80398J68579J64282
$$ 9606848 9839623 10032631 10438998 10826036 11025406 11328033 11557959 11838357 12006936 12171218
5092A2171218L7108k0810J29014L0823L6033q465r3114j38720k9710J05348Q4402
$$ 12171218 12208326 12187516 12316530 12347353 12383386 12374921 12281807 12143087 12113377 12218725 12303127
5081A2303127j15882j93821M8112J7585j8423M006J71611K05387j81924J43972
$$ 12303127 12187245 11993424 12041536 12059121 12040698 12044704 12216315 12421702 12239778 12383750
5071A2383750L26721J64408K06508K84203O0141J2941J3628J78780J65204k49777
$$ 12383750 12710471 12874879 13081387 13365590 13425731 13438672 13452300 13631080 13796284 13546507
5061A3546507J8756o7428K0417l9858L684J02354K1822m5300M7951L20058L0261
$$ 13546507 13565263 13497835 13518252 13478394 13482078 13584432 13606254 13560954 13608905 13928963 13959224
5050A3959224n5816L14123L81965L7238J11286K87488L34443J77913J24593L59631
$$ 13959224 13903408 14217531 14599496 14636734 14748020 15035508 15369951 15547864 15672457 16032088
5040A6032088L33312L18347R1541J65140M21290J89821L53008M54014L46985L53725
$$ 16032088 16365400 16683747 16775288 16940428 17361718 17551539 17904547 18358561 18705546 19059271
5030A9059271N72166N65727N65565N30263N80310N61088M66886O69601N46323
$$ 19059271 19631437 20197164 20762729 21292992 21873302 22434390 22901276 23570877 24117200
5021B4117200M65582P66114P60334Q02838Q71934J001515J218191J281640J391227
$$ 24117200 24582782 25348896 26109230 26912068 27784002 28785517 30003708 31285348 32676575
5012C2676575J579221J887096K052739K189597K600443K988713L477227M106246
$$ 32676575 34255796 36142892 38195631 40385228 42985671 45974384 49451611 53557857
5004E3557857M518967M679707M237121L268849J391126o74965k513379l313539
$$ 53557857 58076824 62756531 66993652 70262501 71653627 70978662 68465283 65151744
4996F5151744l360137k986574k397373k031765j532412r36646o67329m32025j19874
$$ 65151744 61791607 58805033 56407660 54375895 52843483 51906837 51239508 50807483 50687609
4987E0687609J72754M82424Q67903R70670J319572J682513K259813K618833L128423
$$ 50687609 50860363 51342787 52210690 53181360 54500932 56183445 58443258 61062091 64190514
4978F4190514L607995M250166M839054N374400O548598P877576R309894J0514436
$$ 64190514 67798509 72048675 76887729 82262129 88810727 96688303 105998197 116512633
4970A16512633J1010894J0104786O883692K190312k589150n586056o330687m988152
$$ 116512633 127523527 137628313 144512005 146702317 144113167 138527111 132196424 127208272
4962A27208272k965572j073645k91316j053303l234611n572147o816452o992657
$$ 127208272 124242700 123169055 122877739 121824436 118589825 113017678 106201226 99208569
4954I9208569o040977n329890m065566l144727k087209j306135l92541M37263
$$ 99208569 93167592 87837702 83772136 80627409 78540200 77234065 76841524 77278787
4946G7278787J220342J826159K635438L385365M055284N125717O279602P582797
$$ 77278787 78499129 80325288 82960726 86346091 90401375 95527092 101806694 109389491
4938A09389491Q752119R654114J0038426R727794Q485770O275207L170161j366097
$$ 109389491 118141610 127795724 137834150 147561944 156047714 162322921 165493082 164126985
4930A64126985n668966r078263j1717846j3375295j3189138j1642983r555182
$$ 164126985 158458019 149379756 137661910 124286615 111097477 99454494 89899312
4923H9899312p603354o421071m974853l987788l178106k285110j634802j098325
$$ 89899312 82295958 75874887 70900034 66912246 63734140 61449030 59814228 58715903
4915E8715903o22571k27075L19849N37716J073250J733283K400845L090284L733279
$$ 58715903 58093332 57866257 58186106 58723822 59797072 61530355 63931200 67021484 70754763
4906G0754763M361186M579337L916345J937030j176661m395650o650411o987986
$$ 70754763 75115949 79695286 83611631 85548661 84372000 79976350 73325939 66337953
4898F6337953o364533n383762m414057l717250l162119k677052k174412j676129
$$ 66337953 59973420 54589658 50175601 46458351 43296232 40619180 38444768 36768639
4890C6768639j529403j368916j144841r63286o57919p12331o98146n46719l48998
$$ 36768639 35239236 33870320 32725479 31762193 31104274 30391943 29693797 29147078 28798080
4881B8798080n35872k62054j61040j99869k42121j79529r7126l12266m60806k91991
$$ 28798080 28262208 28000154 27839114 27639245 27397124 27217595 27120469 26808203 26347397 26055406
4871B6055406m24751o02719m71913n27367o20350m98428m02857l83409l61196
$$ 26055406 25630655 25027936 24556023 24028656 23408306 22909878 22507021 22123612 21762416
4862B1762416n31793m96211l35327j12778l02746k95606k43924k92956j19241
$$ 21762416 21230623 20734412 20399085 20286307 19983561 19687955 19444031 19151075 19031834
4853A9031834J3179q9059k38060M7320k63614M4851q4559q1308M7957r3642N2038
$$ 19031834 19045013 18955954 18717894 18765214 18501600 18546451 18461892 18380584 18428541 18334899 18386937
4842A8386937N4622J9927r7142N9886L49683M07512K75590J63183N96366M78032
$$ 18386937 18441559 18461486 18364344 18424230 18773913 19181425 19457015 19620198 20216564 20694596
4832B0694596K24204L98981O24745L90129J65777l5581m33197p42488r54636r85211
$$ 20694596 20918800 21317781 21942526 22332655 22498432 22462851 22029654 21287166 20332530 19347319
4822A9347319r54573p38262q31313o18877m12926j54536k90777k62431N6066k45496
$$ 19347319 18392746 17654484 16823171 16204294 15791368 15636832 15346055 15083624 15139690 14894194
4812A4894194L2842K35452J183R0336K44934M55066L97448L38345N03974L90137
$$ 14894194 14927036 15162488 15163671 15254007 15498941 15954007 16351455 16689800 17193774 17583911
4802A7583911J61163o8614l49855n49969q52577q25403r26069o30365p09520p13760
$$ 17583911 17745074 17676460 17326605 16776636 15924059 15098656 14172587 13542222 12832702 12118942
4792A2118942m79936l61323m47119l92312l20592k44652l37279k04936k00922
$$ 12118942 11639006 11277683 10830564 10438252 10117660 9873008 9535729 9330793 9129871
4783I129871k06499j24807k64680n0632o3585k71606j78928j4447j00855k16921
$$ 9129871 8923372 8798565 8533885 8483253 8419668 8148062 7969134 7954687 7853832 7636911
4773G636911m4395k7632J11567k2604p6657j39470q3468J594p8744M6255Q1046
$$ 7636911 7592516 7564884 7676451 7653847 7577190 7437720 7354252 7355846 7277102 7323357 7404403
4762G404403R1640k8564O7853J9389J33989N5331K0840p0716r4980J21489k4484
$$ 7404403 7496043 7467479 7535332 7554721 7688710 7744041 7764881 7694165 7599185 7720674 7696190
4751G696190J2865r4493l6846Q757n4687j33056l0164O5225j12742k33787l9087
$$ 7696190 7709055 7614562 7577716 7586473 7531786 7398730 7368566 7433791 7321049 7087262 7048175
4740G048175j7585j98753j84368r278N6071J905j40847L6633K01234P0747J07143
$$ 7048175 7030590 6831837 6647469 6638191 6694262 6696167 6555320 6591953 6793187 6863934 6971077
4729F971077P3909J9779j54216J48551J16584j7351J12215m1012J13269J19687
$$ 6971077 7044986 7064765 6910549 7059100 7175684 7158333 7270548 7229536 7342805 7462492
4719G462492J55151J7400J26139K45678n733q3644K7949R0303L591l732N1116
$$ 7462492 7617643 7635043 7761182 8006860 8001127 7917483 7945432 8035735 8039326 8035594 8086710
4708H086710q749j5838k2511O9539o746n129J88710m3034N0878p7006j71022j18321
$$ 8086710 8077961 8062123 8039612 8109151 8102405 8097276 8285986 8242952 8293830 8216824 8045802 7927481
4696G927481K3819N8029K13481K170Q453q5532N4004J64723P7562N0374j42659
$$ 7927481 7951300 8009329 8222810 8224980 8233433 8147901 8201905 8366628 8444190 8494564 8351905
4685H351905J42336j794N5906J29565M404O451J0104P1032J12450l4006j74630
$$ 8351905 8494241 8492447 8548353 8677918 8682322 8688773 8698877 8769909 8882359 8848353 8673723
4674H673723K5728l9025j46774k2887k28727o2643M766L5148l3327k08408j36883
$$ 8673723 8699451 8660426 8513652 8490765 8262038 8199395 8204161 8239309 8205982 7997574 7860691
4663G860691j48874o2348j89000l6174q0127M5389q4431q270O747j26791j61455
$$ 7860691 7711817 7649469 7460469 7424295 7344168 7389557 7305126 7296856 7303603 7176812 7015357
4652G015357l6961j5739k0257r1833J5089m8712K6088m8479J49224J7697j86343
$$ 7015357 6978396 6962657 6942400 6850567 6865656 6816944 6843032 6794553 6943777 6961474 6775131
4641F775131k21911J0746l9020j4496J1932j34114N7722r2891l3332k2056K4402
$$ 6775131 6553220 6563966 6524946 6510450 6522382 6388268 6445990 6353099 6319767 6297711 6322113
4630F322113p7872j63638j04030l4624J07205j62194l07273j69622R2460N0662
$$ 6322113 6244241 6080603 5976573 5941949 6049154 5886960 5579687 5410065 5502525 5553187
4620E553187j50351J03232l1403J99889Q819m2382q9104P0318J3629r3278N4146
$$ 5553187 5402836 5506068 5474665 5674554 5683373 5640991 5551887 5622205 5635834 5542556 5596702
4609E596702l4749q2418P7376K9898J12126r60J21175N9463l4241K4308n201K942
$$ 5596702 5561953 5479535 5556911 5586809 5698935 5697975 5819150 5878613 5844372 5868680 5863479 5866421
4597E866421j2804J1610k8078J00984l8515N1756M9291Q4560M8545R0911L7164
$$ 5866421 5853617 5865227 5837149 5938133 5899618 5951374 6000665 6085225 6133770 6224681 6261845
4586F261845p9430m1817j8021k1326j24095J98467Q7028j04026j8057J34748J84720
$$ 6261845 6182415 6140598 6122577 6101251 5977156 6175623 6262651 6158625 6140568 6275316 6460036
4575F460036l877J09695L2224O5910l7035n3135J28043J59626J09264Q2610K12754
$$ 6460036 6456159 6565854 6598078 6663988 6626953 6573818 6701861 6861487 6970751 7053361 7266115
4564G266115m1606O6379k7806n8662r9550n8338j8323q9641q1950N7294o736J9804
$$ 7266115 7224509 7290888 7263082 7204420 7104870 7046532 7028209 6938568 6856618 6913912 6907176 6926980
4552F926980P8138k9783K4375N4158P4668P8673J28601K14355n9560N0301K55245
$$ 6926980 7005118 6975335 6999710 7053868 7128536 7207209 7335810 7550165 7490605 7540906 7796151
4541G796151q1143M9130k395P9510J96178K17925K0281N8566N05949K31336K97874
$$ 7796151 7715008 7764138 7761743 7841253 8037431 8255356 8275637 8334203 8840152 9071488 9369362
4530I369362J92191j50290k07588m0962J09468N298K37436R1182R7886L12311
$$ 9369362 9561553 9411263 9203675 9162713 9272181 9277479 9514915 9606097 9703983 10016294
4520A0016294N2658J75419J96000n3768r6806J3782N8033p4455o4878J96625p1236
$$ 10016294 10068952 10244371 10440371 10386603 10289797 10303579 10361612 10287157 10222279 10418904 10347668
4509A0347668O3839K82438J58472K65439J43012L45800M54500K48602M17212P34957
$$ 10347668 10411507 10693945 10852417 11117856 11260868 11606668 12061168 12309770 12726982 13461939
4499A3461939O79335O29201O43897K73284q2480k23505k20520O4459L4703l2564
$$ 13461939 14141274 14770475 15414372 15687656 15605176 15381671 15161151 15225610 15260313 15227749
4489A5227749J44618K64560M7508p7383O4797J03349j31900j9562K68292K10157
$$ 15227749 15372367 15636927 15684435 15607052 15671849 15775198 15643298 15623736 15892028 16102185
4479A6102185K64214M03915N67268M24945M53678N32845N43323N39183N85782
$$ 16102185 16366399 16770314 17337582 17762527 18216205 18749050 19292373 19831556 20417338
4470B0417338Q66986R55477P96160J043359J470039J524217J212004J265799P56657
$$ 20417338 21284324 22239801 23035961 24079320 25549359 27073576 28285580 29551379 30308036
4461C0308036L79839K44436K80655R80300Q91942J104089J371460J618397J948066
$$ 30308036 30687875 30932311 31212966 32193266 33085208 34189297 35560757 37179154 39127220
4452C9127220K154561K555383K726222L026615L602728M254829M624135N103117
$$ 39127220 41281781 43837164 46563386 49590001 53192729 57447558 62071693 67174810
4444F7174810O018322O678785P433673Q042566Q482748Q699508R016608R166286
$$ 67174810 73193132 79871917 87305590 95348156 103830904 112530412 121547020 130713306
4436A30713306R032660Q386845P344143N342682K689730q28511m004744o264819
$$ 130713306 139745966 148132811 155476954 160819636 163509366 162680855 158676111 152411292
4428A52411292p816844q574860q725453q734361q618343q389229p929385p324494
$$ 152411292 144594448 136019588 127294135 118559774 109941431 101552202 93622817 86298323
4420H6298323o595424n806647n039997m327297l399128k921092k565294k482196
$$ 86298323 79702899 73896252 68856255 64528958 61129830 58208738 55643444 53161248
4412E3161248k137518k013904j854331j858111j945517j919809k169544k076440
$$ 53161248 51023730 49009826 47155495 45297384 43351867 41432058 39262514 37186074
4404C7186074j704111j568454j473973j259391j261497j324943j097019q30999
$$ 37186074 35481963 33913509 32439536 31180145 29918648 28593705 27496686 26665687
4396B6665687q63319p82760p06469o85392o26571p21005p26974n31172n83956
$$ 26665687 25802368 25019608 24313139 23627747 23001176 22280171 21553197 21022025 20438069
4387B0438069n83926n52467m99360n47921m71911l11814m24385m72734k88956
$$ 20438069 19854143 19301676 18802316 18254395 17782484 17470670 17046285 16573551 16284595
4378A6284595l86203j72004l36001k61807k74657j77935l83552m22118j51984
$$ 16284595 15898392 15726388 15390387 15128580 14853923 14675988 14292436 13870318 13718334
4369A3718334k07423k21970k52333k65453l8355j12677j46036j83267j20280j85553
$$ 13718334 13510911 13288941 13036608 12771155 12732800 12620123 12474087 12290820 12170540 11984987
4359A1984987l6014J05155j4415k46096j51340j29138n5889j4938m9059j13407
$$ 11984987 11948973 12054128 12039713 11793617 11642277 11513139 11457250 11442312 11393253 11279846
4349A1279846j1801q4286K251n0492j19160p7313K10697q321o7267J44231J29750
$$ 11279846 11268045 11183759 11186010 11135518 11016358 10939045 11149742 11141421 11074154 11218385 11348135
4338A1348135O2151q3933J76105J30260J03742J08535K44484J60541J90498j74146
$$ 11348135 11410286 11326353 11502458 11632718 11736460 11844995 12089479 12250020 12440518 12266372
4328A2266372j6493q9955l33660j08108j52481k14712l11006j98571l07049l31134
$$ 12266372 12249879 12159924 11826264 11718156 11565675 11350963 11039957 10841386 10534337 10203203
4318A0203203k02897j64908j43153j88917l10467j27580k30583k21889j62212
$$ 10203203 10000306 9835398 9692245 9503328 9192861 9065281 8834698 8612809 8450597
4309H450597j08738k4221k31689r5627j51141l7199n1189m3608p1733m7258L660
$$ 8450597 8341859 8317638 8085949 7990322 7839181 7801982 7750793 7707185 7635452 7588194 7591854
4298G591854j72688j24091p929M5386O9567R4071l30977q7216k3512N5642J23538
$$ 7591854 7419166 7295075 7287146 7332532 7402099 7496170 7165193 7077977 7054465 7110107 7233645
4287G233645q4558n5685J8699j5791O5310K05040j9284K04314R9673J53443K92901
$$ 7233645 7149087 7093402 7112101 7096310 7161620 7366660 7347376 7551690 7651363 7804806 8097707
4276H097707m3040L7398O5535j48760j56513o2085P3924L4824n5193j45570r8482
$$ 8097707 8054667 8092065 8157600 8008840 7852327 7790242 7864166 7898990 7843797 7698227 7599745
4265G599745k46661j16732j69210l5009r1040j64377p6808k80803j52601m6521
$$ 7599745 7353084 7236352 7067142 7032133 6941093 6776716 6699908 6419105 6266504 6219983
4255F219983j2104j87106q9769J29495j79982N5624p7549j07452o4406J85810
$$ 6219983 6207879 6020773 5931004 6060499 5880517 5936141 5858592 5751140 5686734 5872544
4245E872544K120n4473p943J6132J37071J62930K40269K34196K30575K87925L49652
$$ 5872544 5874664 5820191 5812248 5828380 5965451 6128381 6368650 6602846 6833421 7121346 7470998
4234G470998L93140P58761Q80736J245429J767485J418433R9407j149792j790106
$$ 7470998 7864138 8622899 9503635 10749064 12516549 13934982 14034389 12884597 11094491
4225A1094491j597007j079007o74220o05926m23054l39099p5802k22182k39510
$$ 11094491 9497484 8418477 7744257 7138331 6715277 6376178 6300376 6078194 5838684
4216E838684J2084j52648N54M2063o4758m8740m2649r2406q0906k7299k0424j17394
$$ 5838684 5850768 5698120 5698674 5740737 5675979 5627239 5584590 5492184 5411278 5383979 5363555 5246161
4204E246161j5469l2746j01456k4373k55430j19380m4655j48332k1732p7808J0825
$$ 5246161 5230692 5197946 5096490 5072117 4816687 4697307 4652652 4504320 4482588 4404780 4415605
4193D415605j37085n5480o9900j27450m002q9438j48320j5934n098j07797J8674
$$ 4415605 4278520 4223040 4153140 4025690 4021688 3932250 3783930 3767996 3762898 3655101 3673775
4182C673775Q5749J60684p0921r4288N2165o533j39288l9781R6086j3276q2944
$$ 3673775 3759524 3920208 3849287 3754999 3807164 3800631 3661343 3621562 3717648 3704372 3621428
4171C621428Q529j57831M138J51505J10388l6562j07559P4380M1521L1124n1842
$$ 3621428 3629957 3472126 3476264 3627769 3738157 3701595 3594036 3668416 3709937 3741061 3689219
4160C689219Q1699r6148j15090J48097L6204Q3852n8918P5355J14224p3331o1123
$$ 3689219 3770918 3674770 3559680 3707777 3743981 3827833 3768915 3844270 3958494 3885163 3824040
4149C824040P2824J78313j15447q1480j28634j32847P5344R6001J25550K4857
$$ 3824040 3896864 4075177 3959730 3878250 3749616 3616769 3692113 3788114 3913664 3938521
4139C938521j37821M2199J85968n067k2435P3740k6360N9476n6863N9863M8643
$$ 3938521 3800700 3842899 4028867 4023800 4001365 4075105 4048745 4108221 4051358 4111221 4159864
4128D159864k8383L40204N24131K17938L23326L62247J36490l93728l28836j55404
$$ 4159864 4131481 4471685 4995816 5213754 5537080 5899327 6035817 5642089 5313253 5157849
4118E157849m28493r9234j05596j14415M0906R276r4016J40049O7164M0658L3322
$$ 5157849 4729356 4630122 4524526 4410111 4451017 4460293 4366277 4506326 4573490 4614148 4647470
4107D647470j7699j08084l359P4100J07884j54038p1796M6728j0549J48766K1527
$$ 4647470 4629771 4521687 4518328 4592428 4700312 4546274 4474478 4521206 4510657 4659423 4680950
4096D680950n8001J6241l976q3691K0668l5465K8933O8316q9831O0571o8553J56494
$$ 4680950 4622949 4639190 4635214 4551523 4572191 4536726 4565659 4633975 4544144 4604715 4536162 4692656
4084D692656P5026j30837K04043J74179J5643q4987m1729k1886m0883J84281J34124
$$ 4692656 4767682 4636845 4840888 5015067 5030710 4945723 4903994 4882108 4841225 5025506 5159630
4073E159630j84472k6675K09980P7798l5701N0928J29116J77849P9844k2764J21800
$$ 5159630 4975158 4948483 5158463 5236261 5200560 5251488 5380604 5558453 5638297 5615533 5737333
4062E737333L0836K5803R5663Q0945k5705l4985J20719K28928K7535J13161J25227
$$ 5737333 5768169 5793972 5889635 5970580 5944875 5909890 6030609 6259537 6287072 6400233 6525460
4051F525460L8570k7215J18638J77579o1551k747J63244P5451l4692R8541L10318
$$ 6525460 6564030 6536815 6655453 6833032 6771481 6768734 6931978 7007429 6972737 7071278 7381596
4040G381596J73785J07328J87892J91935J34854J70514K50243K26862K80288K07603
$$ 7381596 7555381 7662709 7850601 8042536 8177390 8347904 8598147 8825009 9105297 9312900
4030I312900J44459J28997K68677L46288N14940M62876L78188N18961O19101M56432
$$ 9312900 9457359 9586356 9855033 10201321 10716261 11179137 11557325 12076286 12695387 13151819
4020A3151819K45089O09919O30388M75320N58953N52945N76100N17915P26764
$$ 13151819 13396908 14006827 14637215 15112535 15671488 16224433 16800533 17318448 18045212
4011A8045212Q18652P01778N18939L30472L54378K71745k37809m63756m89775
$$ 18045212 18863864 19565642 20084581 20415053 20769431 21041176 20803367 20339611 19849836
4002A9849836m53595o28269m98524m01848o04464n09816m08636n86678k19414
$$ 19849836 19396241 18767972 18269448 17867600 17263136 16753320 16344684 15758006 15538592
3993A5538592k15275l56204k40303l04658r4765j34109k45551m2980l3556K5444
$$ 15538592 15323317 14967113 14726810 14422152 14327387 14193278 13947727 13904747 13871191 13896635
3983A3896635o4036k9737P9991R1342K6133N6173m3020j06121k71791j2855o0996
$$ 13896635 13832599 13802862 13882853 13974195 14000328 14056501 14013481 13907360 13635569 13622714 13561718
3972A3561718k37166l2408j407r7190l5855q2531O9767N7707O1576J68674J07038
$$ 13561718 13324552 13292144 13290737 13193547 13157692 13075161 13144928 13202635 13264211 13432885 13539923
3961A3539923m7425j14306J65212J14208P0656P1021J06489k04957o6637L18957
$$ 13539923 13492498 13378192 13543404 13657612 13728268 13799289 13905778 13700821 13634184 13953141
3951A3953141Q0181P2004J17008K83821L48942L12628M29471L88257L88850J36046
$$ 13953141 14033322 14105326 14222334 14506155 14855097 15167725 15597196 15985453 16374303 16510349
3941A6510349P0602J78484K75073K22675L12798M01721J07752l460J68837l4624
$$ 16510349 16580951 16759435 17034508 17257183 17569981 17971702 18079454 18075994 18244831 18210207
3931A8210207m3820J31051j06725m9898j32299L0618J47142p5333p2328J37091
$$ 18210207 18166387 18297438 18190713 18140815 18008516 18039134 18186276 18110943 18038615 18175706
3921A8175706J88765J87265K74478K30558J65896M8239J05367K49461K17669K48610
$$ 18175706 18364471 18551736 18826214 19056772 19222668 19270907 19376274 19625735 19843404 20092014
3911B0092014J21758K88317J99941J21131L03355K39773K26227K02195O9304J01914
$$ 20092014 20213772 20502089 20702030 20823161 21126516 21366289 21592516 21794711 21864015 21965929
3901B1965929K8896k3727P5629j82515r5919k34924L5407P0425L08952L07173
$$ 21965929 21994825 21971098 22046727 21864212 21768293 21533369 21568776 21639201 21948153 22255326
3891B2255326J83789R1321l11827l49567k95882j76925r8690j63193j82951q4898
$$ 22255326 22439115 22530436 22218609 21869042 21573160 21396235 21297545 21134352 20951401 20866503
3881B0866503J45763J16899m7943j69716Q9183J43063L3058R7683M21859K61293
$$ 20866503 21012266 21129165 21081222 20911506 21000689 21143752 21176810 21274493 21696352 21957645
3871B1957645m916J55779Q3951J50855J65435K6724J76856J88960L18891K94815
$$ 21957645 21952729 22108508 22192459 22343314 22508749 22535473 22712329 22901289 23220180 23514995
3861B3514995L51382M07827N13825M67781N52587J77535M05312P23125P84100
$$ 23514995 23866377 24274204 24788029 25255810 25808397 25985932 26391244 27114369 27898469
3852B7898469P02567Q77832O81091j04387q6870j24765j9212P8934J17400M50232
$$ 27898469 28601036 29478868 30159959 30055572 29968702 29843937 29824725 29903659 30021059 30471291
3842C0471291M84580M16408L71303P11755N48269N58355N23489N27833M40548
$$ 30471291 30955871 31372279 31743582 32455337 33003606 33561961 34085450 34613283 35053831
3833C5053831N23096R37128R48246R00201J273000J413252J649417J702309J832768
$$ 35053831 35576927 36514055 37462301 38362502 39635502 41048754 42698171 44400480 46233248
3824D6233248K236095K462257K520054L194799M126871M995756N733907N104291
$$ 46233248 48469343 50931600 53451654 56646453 60773324 65769080 71502987 76607278
3816G6607278L190455J08522j798660k448406j623263r29503l81827L51579R47295
$$ 76607278 79797733 79906255 78107595 75659189 74035926 73106423 72724596 73076175 74023470
3807G4023470J812349K217327K814518L899048N006034O621758Q141321R584014
$$ 74023470 75835819 78053146 80867664 84766712 89772746 96394504 104535825 114119839
3799A14119839J0638111J2334987J4319312J7716280K2154487K9656530M0359090
$$ 114119839 124757950 137092937 151412249 169128529 191283016 220939546 261298636
3792B61298636N4865054P1756040O9139215K0665504m2643771p6368907p0680618
$$ 261298636 316163690 387919730 457058945 477724449 435080678 358711771 288031153
3785B88031153n1327034l7059407k7691246k1893692j6765188j2935455r897070
$$ 288031153 236704119 199644712 171953466 150059774 133294586 120359131 110462061
3778A10462061q071220o197951n224367m037789l695845l128265k558975k140254
$$ 110462061 102390841 96192890 90968523 86930734 83234889 80106624 77547649 75407395
3770G5407395k161722j704590j544768j503732j448898j103676q48351o74051
$$ 75407395 73245673 71541083 69996315 68492583 67043685 65940009 65091658 64417607
3762F4417607o45429m45837m46699k67993m39498m70641j13705N8262J05269M43979
$$ 64417607 63772178 63326341 62879642 62611649 62172151 61701510 61587805 61646067 61751336 62195315
3752F2195315K22693J13959M51849N43841R60753R32139Q16230O59301K74072
$$ 62195315 62418008 62531967 62983816 63527657 64488410 65420549 66236779 66896080 67170152
3743F7170152J66444L62811M89743L53253K03764K32512K03525J31079M62514
$$ 67170152 67336596 67699407 68189150 68542403 68746167 68978679 69182204 69313283 69775797
3734F9775797P14204O75328Q81304J337949J778133J752394K051502K439537K691757
$$ 69775797 70490001 71165329 72046633 73384582 75162715 76915109 78966611 81406148 84097905
3725H4097905K893069L248700L399381L753441M012237M291787M832595N541733
$$ 84097905 86990974 90239674 93639055 97392496 101404733 105696520 110529115 116070848
3717A16070848O191388O977977P971631Q662900R696654J0858827J2395034J3710941
$$ 116070848 122262236 129240213 137211844 145874744 155571398 166430225 178825259 192536200
3709A92536200J5108034J6840472J8068727J8885378J8935255J8418424J7094830
$$ 192536200 207644234 224484706 242553433 261438811 280374066 298792490 315887320
3702C15887320J4279780J0455586N303512k81985o066879j0794395j4991909j9084377
$$ 315887320 330167100 340622686 345926198 345644213 339577334 328782939 313791030 294706653
3694B94706653k2224204k3562776k2730446k1147824j8608718j5849913j3462965
$$ 294706653 272482449 248919673 226189227 205041403 186432685 170582772 157119807
3687A57119807j1320746r940809q412961p174819o177024n496270m958946m346224
$$ 157119807 145799061 135858252 127445291 120270472 114093448 108597178 103638232 99292008
3679I9292008m161875l644408l217385k797191k800381k590657k269094k144170
$$ 99292008 95130133 91485725 88268340 85471149 82670768 80080111 77811017 75666847
3671G5666847j884160j829769j903909j922312k149154j869087j689802j642028
$$ 75666847 73782687 71952918 70049009 68126697 65977543 64108456 62418654 60776626
3663F0776626j732956j694930j421537j532962j220427j130423j139201j175696
$$ 60776626 59043670 57348740 55927203 54394241 53173814 52043391 50904190 49728494
3655D9728494r61910q80809p20562q05423n99028p34051n62549m24609n61674
$$ 49728494 48766584 47885775 47165213 46359790 45760762 45026711 44464162 44039553 43477879
3646D3477879n69139n59112n43943m64234m39768m24766l98622l03580l98218
$$ 43477879 42908740 42349628 41805685 41341451 40901683 40476917 40078295 39774715 39376497
3637C9376497n30618o17884n37483o02664p73603o08832n23802m53891p12672
$$ 39376497 38845879 38227995 37690512 37087848 36314245 35705413 35181611 34727720 34015048
3628C4015048n36348m10738k67266l79606n91017m73133m90615m13344l99552
$$ 34015048 33478700 33067962 32800696 32421090 31830073 31356940 30866325 30452981 30053429
3619C0053429l16782j61469j27318j27506j47390J25602j6773o465M9810K0105
$$ 30053429 29736647 29575178 29447860 29320354 29172964 29298566 29281793 29275328 29325138 29345243
3609B9345243K21685K65797M17097M08403O08023O45242Q04631J114442J025859
$$ 29345243 29566928 29832725 30249822 30658225 31266248 31911490 32716121 33830563 34856422
3600C4856422J476698J648868J974217K569007L045536L693079M487186M719689
$$ 34856422 36333120 37981988 39956205 42525212 45570748 49263827 53751013 58470702
3592E8470702L645330P75902k253267m561400n635471n319545m180085l648324
$$ 58470702 62116032 62891934 60638667 56077267 50441796 45122251 40942166 37293842
3584C7293842l176754k452531j885265j638960j552438j062749r35494o92080
$$ 37293842 34117088 31664557 29779292 28140332 26587894 25525145 24589651 23897571
3576B3897571q11546o51943m89675o46758p61924m77551j48900l71346m57149
$$ 23897571 23086025 22434082 21944407 21297649 20535725 20058174 19909274 19537928 19080779
3567A9080779j91153k15405k40731k57965k29709j46513Q339p6360J8380j79571
$$ 19080779 18889626 18674221 18433490 18175525 17945816 17799303 17807642 17731282 17749662 17570091
3557A7570091k60576j46348j74270J5191j58777k2549q3592J6327p554Q5848J52009
$$ 17570091 17309515 17163167 16988897 17004088 16845311 16822762 16739170 16755497 16747943 16833791 16985800
3546A6985800o6879J6865R4887J91104L3853N7052K93697k15815J9108n6711j61000
$$ 16985800 16918921 16935786 17030673 17221777 17255630 17312682 17606379 17390564 17409672 17352961 17191961
3535A7191961l17643k23123m3314j63937j27783k03473j01395l6876o8707K9473
$$ 17191961 16874318 16651195 16607881 16443944 16316161 16112688 16011293 15974417 15905710 15935183
3525A5935183J02354q1540l02638N3368K74267P8063O1639L05079M01054K67428
$$ 15935183 16037537 15955997 15653359 15706727 15980994 16059057 16120696 16425775 16826829 17094257
3515A7094257J69819K35569K84824J15125K14563J61624q19r6267j7014M6079
$$ 17094257 17264076 17499645 17784469 17899594 18114157 18275781 18274962 18178695 18161681 18207760
3505A8207760k30924j58497j1609o2855o9921j64240R2786j46122n6553m3831
$$ 18207760 17976836 17818339 17806730 17743875 17673954 17509714 17602500 17456378 17399825 17355994
3495A7355994J23267J61941O1227K77143L97594K94446R2736L84071L05109K94149
$$ 17355994 17479261 17641202 17702429 17979572 18377166 18671612 18764348 19148419 19453528 19747677
3485A9747677L63016L67227K99592K67273J47334K96103J45877L27290J98872
$$ 19747677 20110693 20477920 20777512 21044785 21192119 21488222 21634099 21961389 22160261
3476B2160261N8271L56088J87212O0653J75096M02491K97028M25837L33071J62285
$$ 22160261 22218532 22574620 22761832 22822485 22997581 23400072 23697100 24122937 24456008 24618293
3466B4618293L14891O13395N46970N95892O81687Q54227P50201R38492J088456
$$ 24618293 24933184 25546579 26093549 26689441 27371128 28225355 28975556 29914048 31002504
3457C1002504J080274J074252J188403J437515J385141J296125J168031J349129
$$ 31002504 32082778 33157030 34345433 35782948 37168089 38464214 39632245 40981374
3449D0981374J598320J807275K092295J995796K184894K153927K347484K676200
$$ 40981374 42579694 44386969 46479264 48475060 50659954 52813881 55161365 57837565
3441E7837565K886886L510166L983014M580948N417148O389146P409157Q461085
$$ 57837565 60724451 64234617 68217631 72798579 78215727 84604873 92014030 100475115
3433A00475115R588836J1150474J2840162J4995673J7706991K1121449K5616618
$$ 100475115 110063951 121214425 134054587 149050260 166757251 187878700 213495318
3426B13495318L0215887L3668877L3097840K3614480N091361j5365636k9938203
$$ 213495318 243711205 277380082 310477922 334092402 339183763 323818127 293879924
3419B93879924l4507375l2249405k7594053k2805031j8811590j5234122j1900601
$$ 293879924 259372549 227123144 199529091 176724060 157912470 142678348 130777747
3412A30777747r555912p839486o221228n048633m198948l378250k815228k242579
$$ 130777747 121221835 113382349 107161121 102112488 97913540 94535290 91720062 89477483
3404H9477483j697462j147375o09688O9328M82139P42812J049410J319198J083527
$$ 89477483 87780021 86632646 86022958 86092286 86574425 87317237 88366647 89685845 90769372
3395I0769372J40167j112043k640621l747803l888453l596638l137239k656443
$$ 90769372 90909539 89797496 87156875 83409072 79520619 75923981 72786742 70130299
3387G0130299k109064j865555j948646k161077k074599k248588k264588k198382
$$ 70130299 68021235 66155680 64207034 62045957 59971358 57722770 55458182 53259800
3379E3259800k047718j852543j791336j489913j474559j419884j344018j018721
$$ 53259800 51212082 49359539 47568203 46078290 44603731 43183847 41839829 40821108
3371D0821108j057727j270585j120976j162231r99885j025184j113289q19980
$$ 40821108 39763381 38492796 37371820 36209589 35209704 34184520 33071231 32251251
3363C2251251o76453p17315o25350n93887n75157m34015m00331q7984l33351k65397
$$ 32251251 31574798 30857483 30232133 29638246 29063089 28629074 28228743 28140759 27807408 27542011
3353B7542011m24685k56406l97628n33056m07536l29300l23390m24411k22220
$$ 27542011 27117326 26860920 26463292 25930236 25522700 25193400 24870010 24445599 24223379
3344B4223379l69330m50816l64940m82435l56608n71695m33545m28636m68017
$$ 24223379 23854049 23403233 23038293 22555858 22199250 21627555 21194010 20765374 20297357
3335B0297357n33235k61105j37847l53948k74206j02613j34773j61133o1441j60538
$$ 20297357 19764122 19503017 19365170 19011222 18737016 18634403 18499630 18338497 18277056 18116518
3325A8116518j2000k33804l32707o508j16581o8964k38540j52481j22033j67571
$$ 18116518 18104518 17870714 17538007 17531499 17414918 17345954 17107414 16954933 16832900 16665329
3315A6665329k33304k22690j18220q1663p6227o8330l8632J08339k062K1173l6952
$$ 16665329 16432025 16209335 16091115 16009452 15933225 15864895 15826263 15934602 15932540 15953713 15916761
3304A5916761M3380r8839p0982j50216k51026n1574k13702k08230k09494L2145
$$ 15916761 15960141 15861302 15790320 15640104 15389078 15337504 15123802 14915572 14706078 14738223
3294A4738223j51916p1146m843l7336J54647R7876N3163P1399J96417L06036L27732
$$ 14738223 14586307 14515161 14510318 14472982 14627629 14725505 14778668 14850067 15046484 15352520 15680252
3283A5680252N56934L53153M15752O07036Q26254Q87209R35030J140690J327831
$$ 15680252 16237186 16590339 17006091 17613127 18439381 19326590 20261620 21402310 22730141
3274B2730141J580192J636004J834202J590669P21434n59930j571211k035543
$$ 22730141 24310333 25946337 27780539 29371208 30092642 29532712 27961501 25925958
3266B5925958j987922j674829j382285j145265j080326p63378q06097m77354n31741
$$ 25925958 23938036 22263207 20880922 19735657 18655331 17891953 17085856 16608502 16076761
3257A6076761l06842k89896l72358k84220j68474j46132P8682J17521J0047J34035
$$ 16076761 15769919 15480023 15107665 14823445 14654971 14508839 14587521 14705042 14715089 14849124
3247A4849124J83459l0399J05229l917j41508P2228J51035K75294L36560L24919
$$ 14849124 15032583 15002184 15107413 15103496 14961988 15034216 15185251 15460545 15797105 16122024
3237A6122024m4740J8278R3411N2588O7636l8206K00302Q1841J87941J30392L60406
$$ 16122024 16077284 16095562 16188973 16241561 16309197 16270991 16471293 16553134 16741075 16871467 17231873
3226A7231873L47036L04251M46019L91040L05329K46510M5453P852K254k54205
$$ 17231873 17578909 17883160 18329179 18720219 19025548 19272058 19317511 19325363 19327617 19073412
3216A9073412O3366q0609M344L11102M28764P34726P58110R11476J227493J506795
$$ 19073412 19136778 19056169 19060513 19371615 19800379 20535105 21293215 22204691 23432184 24938979
3206B4938979J788635J336291Q27030l01854j139706j676305j665467j369110
$$ 24938979 26727614 28063905 28890935 28589081 27449375 25773070 24107603 22738493
3198B2738493j133181j007971q75343l52724k84633j12128j03570M2396K7227
$$ 22738493 21605312 20597341 19721998 19369274 19084641 18972513 18868943 18911339 18938566
3189A8938566j13281O260K64769J32410J41538M05477L16039M80183N62353R01070
$$ 18938566 18825285 18831545 19096314 19228724 19370262 19775739 20091778 20571961 21134314 22035384
3179B2035384J180515J105905J260022J724639J929258J348078O27207k34031
$$ 22035384 23215899 24321804 25581826 27306465 29235723 30583801 31211008 30976977
3171C0976977j414852j990190j983796j620992j334895j113876q46998n40750
$$ 30976977 29562125 27571935 25588139 23967147 22632252 21518376 20671378 20130628
3163B0130628m54865n06352j77074k79188k87214k30691k31680j34566k79654
$$ 20130628 19675763 19169411 18992337 18713149 18425935 18195244 17963564 17828998 17549344
3154A7549344j09088k41966n9138j67540j25420J88881k58237k35086L2942K25994
$$ 17549344 17440256 17198290 17139152 16971612 16846192 17035073 16776836 16541750 16574692 16800686
3144A6800686p9587k8181J99943M6403n8947L1597J56967J12462J88256K1333
$$ 16800686 16721099 16692918 16892861 16939264 16880317 16911914 17068881 17181343 17369599 17390932
3134A7390932J50093O8151N642J21777J38118J57711O757N4904K54384J88758
$$ 17390932 17541025 17609176 17614818 17736595 17874713 18032424 18039181 18094085 18348469 18537227
3124A8537227K21248M81117M62918M00045N10485K66554K49325L09044N59527
$$ 18537227 18758475 19239592 19702510 20102555 20613040 20879594 21128919 21437963 21997490
3115B1997490N60887L18240L95216J68931K73584N00863N28036Q99995R65972
$$ 21997490 22558377 22876617 23271833 23440764 23714348 24215211 24743247 25643242 26609214
3106B6609214J063851J432095J478026J321850J317856Q88721K01336k49456n40248
$$ 26609214 27673065 29105160 30583186 31905036 33222892 34111613 34312949 34063493 33523245
3097C3523245o80702q36307p11799m31390K491r1588q3475K60326N70487N57108
$$ 33523245 32842543 32006236 31294437 30863047 30865538 30773950 30690475 30950801 31521288 32078396
3087C2078396O62631R65317J094079J376733J468910J608057J930972K221742
$$ 32078396 32741027 33706344 34800423 36177156 37646066 39254123 41185095 43406837
3079D3406837K319002K924607L187849L292522L460081L208819K910499K361661
$$ 43406837 45725839 48650446 51838295 55130817 58590898 61799717 64710216 67071877
3071F7071877J466263J001199l3142j084489k060414k767979k850558k476642
$$ 67071877 68538140 69539339 69506197 68421708 66361294 63593315 60742757 58266115
3063E8266115k224366j613242j169251q18387l73809K40565P44112R06204J601616
$$ 58266115 56041749 54428507 53259256 52440869 52067060 52307625 53051737 53957941 55559557
3054E5559557K021819K435111K862760L263655L310123L585217L638047L867126
$$ 55559557 57581376 60016487 62879247 66142902 69453025 73038242 76676289 80543415
3046H0543415M642316M993172M227869K577631J031875J03376q95716k089072
$$ 80543415 85185731 90178903 94406772 96984403 98016278 98119654 97223938 95134866
3038I5134866l420217m962224n273008n450658m937859m595152l862282l117589
$$ 95134866 91714649 86752425 81479417 76028759 71090900 66495748 62633466 59515877
3030E9515877k810006k007178j581391r93699p32921k47385m57625J8206J65802
$$ 59515877 56705871 54698693 53117302 52123603 51390682 51143297 50685672 50703878 50869680
3021E0869680N14863P58220J122540J493612J877703K413128K537798K465868
$$ 50869680 51384543 52142763 53265303 54758915 56636618 59049746 61587544 64053412
3013F4053412K033688J038365k10377j209919j742851k093407k531126k930200
$$ 64053412 66087100 67125465 66915088 65705169 63962318 61868911 59337785 56407585
3005E6407585l168678l368904l248295k791889k347364k097556j741298j374970
$$ 56407585 53238907 49870003 46621708 43829819 41482455 39384899 37643601 36268631
2997C6268631j075653r40086n85334n55810m37320n62983l99401l65629j54345
$$ 36268631 35192978 34252892 33667558 33111748 32674428 32111445 31712044 31346415 31192070
2988C1192070q9906q2766P5298J90712M26518M07903N81405Q3688j95835n84269
$$ 31192070 31102164 31019398 31094696 31285408 31711926 32119829 32701234 32784922 32589087 32004818
2978C2004818j216637j344089j465875j429590j249828j203241r55260q82203
$$ 32004818 30788181 29444092 27978217 26548627 25298799 24095558 23140298 22258095
2970B2258095o90263p84555n65680m09296m35566o24939m84816l20595l65904
$$ 22258095 21567832 20783277 20217597 19808301 19372735 18747796 18262980 17942385 17576481
2961A7576481l87760j65152j44694l24137k82733N292k47830k96307j72012j14761
$$ 17576481 17188721 17023569 16878875 16554738 16272005 16277297 16029467 15733160 15561148 15446387
2951A5446387j76771j3846k22540k60052k89734k29962k6069j02850j09582j79989
$$ 15446387 15269616 15255770 15033230 14773178 14483444 14253482 14227413 14124563 14014981 13834992
2941A3834992k9969q0388j63057j34862p794n93o0325n5581r1788j89087k52315
$$ 13834992 13805023 13724635 13561578 13426716 13418922 13418329 13358004 13302423 13210635 13021548 12769233
2930A2769233k18949q2852j25326m6683j23892J25796p8384q8033M1633K8656
$$ 12769233 12550284 12467432 12342106 12295423 12171531 12297327 12218943 12130910 12172543 12201199
2920A2201199j06575r5317R5440q8090Q0642K0599J77554K7699k71529j59057
$$ 12201199 12094624 11999307 12094747 12006657 12087299 12107898 12285452 12313151 12041622 11882565
2910A1882565q3919K3510o5329K9983j53810r6348q5883q0914J2027j50313n6513
$$ 11882565 11798646 11822156 11756827 11786810 11633000 11536652 11450769 11369855 11381882 11231569 11175056
2899A1175056j50954j59298k89288j8853K3685k17794o5770r6283j15659j70087
$$ 11175056 11024102 10864804 10575516 10556663 10580348 10362554 10296784 10200501 10084842 9914755
2889I914755n387K51446l4102J50443N5582K67013J8245R4121J47752j71446J68482
$$ 9914755 9909368 10160814 10126712 10277155 10332737 10599750 10617995 10712116 10859868 10688422 10856904
2878A0856904J56373o9197p4494j47547l70560k35798l43562j64722j96767k61161
$$ 10856904 11013277 10944080 10869586 10722039 10351479 10115681 9772119 9607397 9410630 9149469
2868I149469j10647k05603o6000j86263k03205j77580n2422m3156q4822n4633
$$ 9149469 9038822 8833219 8767219 8580956 8377751 8200171 8147749 8104593 8019771 7965138
2858G965138r6748j32670j66210j75764r3995k20092j10312L2981r0083K0005
$$ 7965138 7868390 7735720 7569510 7393746 7299751 7079659 6969347 7002328 6912245 6932250
2848F932250J2968j0617m2388n0152K8629J7433j45827m038k52422N7256j30734
$$ 6932250 6945218 6934601 6892213 6842061 6870690 6888123 6742296 6738258 6485836 6543092 6412358
2837F412358q1860J34394q1697j2801r2521L8773j36784j54706p6015P0446j22270
$$ 6412358 6330498 6464892 6383195 6370394 6277873 6316646 6179862 6025156 5949141 6019587 5897317
2826E897317p4942K469j41418j26542r389J31838N2732l4283K4244q436K4083
$$ 5897317 5822375 5824844 5683426 5556884 5547495 5679333 5732065 5697782 5722026 5713590 5737673
2815E737673R1585J4021J6142j06465o5937J60985l480j58947J03007m5421j3805
$$ 5737673 5829258 5843279 5859421 5752956 5687019 5848004 5844524 5685577 5788584 5743163 5729358
2804E729358j50021m3399K51231J1675j43662j28609r2522j0482k9982q0004O5609
$$ 5729358 5579337 5535938 5787169 5798844 5655182 5526573 5434051 5423569 5393587 5313583 5379192
2793E379192j31484k87829N3343l5508N4990L9298K56529K08840k72198n1732
$$ 5379192 5247708 4959879 5013222 4977714 5032704 5072002 5328531 5537371 5265173 5213441
2783E213441O2533k02547m5243j21666J44110j16547j75442l6411J8080p6924
$$ 5213441 5275974 5073427 5028184 4906518 5050628 4934081 4758639 4722228 4740308 4663384
2773D663384q6113J86904k8516r8387j57321j32750j9705m7880l6217N8118P1475
$$ 4663384 4577271 4764175 4735659 4637272 4479951 4347201 4327496 4279616 4243399 4301517 4372992
2762D372992j37899K6889K69207k7109l1176J85585q3404j03326k1983J17011
$$ 4372992 4235093 4261982 4531189 4504080 4472904 4658489 4575085 4471759 4449776 4566787
2752D566787m2272l06554P5385q0173k03036j83607J77519L5904q0336N366J69921
$$ 4566787 4524515 4217961 4293346 4213173 4010137 3826530 4004049 4039953 3959617 3964983 4134904
2741D134904m1252j78443O8348J37249j44962j64541n520J38618m6871k14468
$$ 4134904 4093652 3915209 3983557 4120806 3975844 3811303 3805783 3944401 3897530 3683062
2731C683062O640N2106N1266J3572m1184L340j54687N2183K93256j09171j30116
$$ 3683062 3689702 3741808 3793074 3806646 3765462 3768802 3614115 3666298 3959554 3850383 3720267
2720C720267j68857m9473j87691k53920J05500J96820K239k1154J38161j75717
$$ 3720267 3551410 3501937 3314246 3060326 3165826 3362646 3364885 3343731 3481892 3306175
2710C306175j78544j2519J16308m3369k24863l0952J23564J44994Q9901K1730
$$ 3306175 3127631 3115112 3231420 3188051 2963188 2932236 3055800 3200794 3290695 3312425
2700C312425o9948j09415J2376J07357q226J8715J826q4479j55986m1209O5426
$$ 3312425 3242477 3133062 3145438 3252795 3244569 3263284 3265110 3180631 3024645 2983436 3048862
2689C048862K2228m1127l1081J12239L0525J9759J15450M266m4434L50K2802J27324
$$ 3048862 3071090 3029963 2998882 3111121 3141646 3161405 3276855 3281121 3236687 3237037 3259839 3387163
2677C387163n3888K0054K03129R9623j34884o6995K6278N8544M5724Q3217J31455
$$ 3387163 3333275 3353329 3556458 3656081 3521197 3454202 3480480 3539024 3584748 3667965 3799420
2666C799420p997j77349j25898j0242K1686k0496K07346Q7183j12927M3585K39822
$$ 3799420 3791423 3614074 3488176 3477934 3499620 3479124 3686470 3773653 3660726 3704311 3944133
2655C944133P9492o7301J18574K37106P3315p0113j08020J08112J41604R2867
$$ 3944133 4023625 3956324 4074898 4312004 4385319 4315206 4207186 4315298 4456902 4549769
2645D549769L5275O3518O4789j57218J56551K12939k2573j10688O2073j43713
$$ 4549769 4585044 4648562 4713351 4556133 4712684 4925623 4903050 4792362 4854435 4710722
2635D710722l52165N5382O6842J36613j8245j9295J11055L8739J07613K0997O7306
$$ 4710722 4358557 4413939 4480781 4617394 4599149 4579854 4690909 4729648 4837261 4858258 4925564
2624D925564K1775M1116J46061J3987j1697P0593Q0469p2844j70988Q1264o2099
$$ 4925564 4947339 4988455 5134516 5148503 5136806 5207399 5287868 5215024 5044036 5125300 5063201
2613E063201M440j00399R9922q2812M4765o3770k48384j02371k4307Q2059M2565
$$ 5063201 5067641 4967242 5067164 4984352 5029117 4965347 4716963 4614592 4590285 4672344 4714909
2602D714909j25902j1650p1663O60O2013R4670K6825j58801r4228K5611r4186
$$ 4714909 4589007 4577357 4505694 4506354 4568367 4663037 4689862 4531061 4436833 4462444 4368258
2591D368258m3498q559n2569J37403m1662j75039j10937j67897p3702J4616L5478
$$ 4368258 4324760 4316201 4263632 4401035 4359373 4184334 4073397 3905500 3831798 3846414 3881892
2580C881892J9456j17789k08861M0101K0460j4176J3438j34476m2562M5954q0808
$$ 3881892 3901348 3783559 3574698 3614799 3635259 3621083 3634521 3500045 3457483 3503437 3422629
2569C422629j1656Q079Q0106J06722j07066O4429j25413n8889L2912o2460j09044
$$ 3422629 3410973 3419052 3499158 3605880 3498814 3563243 3437830 3378941 3411853 3349393 3240349
2558C240349n9908o3246N399j26620o3528J1825J05786j74790r3540J18318J7946
$$ 3240349 3180441 3117195 3122594 2995974 2932446 2944271 3050057 2875267 2781727 2900045 2917991
2547B917991j62792N7439N621j59941j48348m6135Q7571O7198o2648j91712K13441
$$ 2917991 2755199 2812638 2818259 2658318 2509970 2463835 2551406 2618604 2555956 2364244 2577685
2536B577685j09959n4760J48801p3038L142j3531n2212n2740j87885q490J05000
$$ 2577685 2467726 2412966 2561767 2488729 2491871 2478340 2426128 2373388 2185503 2177013 2282013
2525B282013o8975J1805j27151l9009R2077p9842L3631J36989N2482k5470P71
$$ 2282013 2213038 2224843 2097692 2058683 2150760 2070918 2104549 2241538 2294020 2268550 2269321
2514B269321J8382j31782r9696O2239m22j5964j34794n6729N2404p3295J62782
$$ 2269321 2287703 2155921 2056225 2118464 2118042 2102078 1967284 1910555 1962959 1889664 2052446
2503B052446N5089q9896r1079R2278Q7586o5454j48135J6271n1038J618O9472
$$ 2052446 2107535 2017639 1926560 2018838 2106424 2040970 1892835 1909106 1858068 1859686 1929158
2492A929158M9606j17496N1862K25744q2381j34244n4835Q6134j01777j73757
$$ 1929158 1978764 1861268 1913130 2138874 2056493 1922249 1867414 1953548 1851771 1678014
2482A678014j08006J26338R8637m9772r9184m396J64212k4608m6203O7203Q317
$$ 1678014 1570008 1696346 1794983 1745211 1646027 1641631 1805843 1781235 1735032 1802235 1810552
2471A810552j50279K9799J12528J1666j010M0677k0761j78733J64002M1714P2506
$$ 1810552 1660273 1690072 1802600 1814266 1813256 1853933 1833172 1654439 1818441 1860155 1932661
2460A932661n0536q7521n006m6747m3246J17038m1410q6716L3383K3433j22445
$$ 1932661 1882125 1794604 1789598 1742851 1699605 1816643 1775233 1688517 1721900 1745333 1622888
2449A622888P24J5137Q5752K10769O1417o2322j20728n5435M1836N7224r2922
$$ 1622888 1623612 1638749 1724501 1935270 1996687 1934365 1813637 1758202 1800038 1857262 1764340
2438A764340j63971q2931K46727k8858J26424Q6535Q2693r6379j77729J29800
$$ 1764340 1600369 1517438 1764165 1735307 1861731 1948266 2030959 1934580 1756851 1886651
2428A886651K7347j86043j08118J24651j90660N6021J88135N7786j17501p9473
$$ 1886651 1913998 1727955 1619837 1744488 1553828 1609849 1797984 1855770 1738269 1658796
2418A658796J11160k485K8400o1902L1461j10422K590M2938R7411q8333q3665
$$ 1658796 1769956 1767471 1795871 1733969 1765430 1655008 1657598 1700536 1797947 1709614 1625949
2407A625949O2054q1933J25588K289J60938l1515r8206j93690K0931K60922k37679
$$ 1625949 1688003 1606070 1731658 1733947 1894885 1863370 1765164 1571474 1592405 1853327 1615648
2396A615648l8409k0588L6067l7363r943O4175n9313J00244J40612M9229j97977
$$ 1615648 1577239 1556651 1592718 1555355 1545412 1609587 1550274 1650518 1791130 1840359 1642382
2385A642382p9034R1593P6121j46602J4595J8626K5920m33o7577J28122J5946
$$ 1642382 1563348 1654941 1731062 1584460 1599055 1617681 1643601 1643168 1575591 1703713 1719659
2374A719659r4399J29594j6945m3586K0739p4023L8628j78700j40581P2515R5654
$$ 1719659 1625260 1754854 1737909 1694323 1715062 1641039 1679667 1500967 1360386 1432901 1528555
2363A528555j01622P1870J92199l9648R096N0628O6789m8937k290O1481L0352
$$ 1528555 1426933 1498803 1691002 1651354 1660450 1711078 1777867 1728930 1726640 1788121 1818473
2352A818473m8890j23842k7173R0393j4860J30228q1579j27799p290N4931J26471
$$ 1818473 1769583 1645741 1618568 1708961 1694101 1824329 1742750 1614951 1607661 1662592 1789063
2341A789063l3055K4159J4911j68608p5083P8318P1232m7535j42098N4045J0997
$$ 1789063 1756008 1780167 1795078 1626470 1551387 1629705 1700937 1653402 1511304 1565349 1576346
2330A576346J56625J7204M1741n9278l3947q639J40570n5657l3943o6821P0619
$$ 1576346 1732971 1750175 1791916 1732638 1698691 1690052 1830622 1774965 1741022 1674201 1744820
2319A744820J6744l5681N2158J6734r9893l7995J92591Q0230M0554n3289j7190
$$ 1744820 1761564 1725883 1778041 1794775 1694882 1656887 1849478 1929708 1970262 1916973 1899783
2308A899783o9938O0839K0187M1437j8769k4265R6752l3245k6606J62394K12724
$$ 1899783 1829845 1890684 1910871 1952308 1933539 1909274 2006026 1972781 1946175 2108569 2321293
2297B321293K0497j21404m3431j27685j14479L5667J00025J25736R1147j86498
$$ 2321293 2341790 2220386 2176955 2049270 1934791 1970458 2070483 2196219 2287366 2100868
2287B100868J49298O9307J35964P2763j12072Q2679p7978J31131O8190j10323
$$ 2100868 2250166 2319473 2455437 2528200 2416128 2498807 2420829 2551960 2620150 2509827
2277B509827O7307Q9565J27929l4496j2648J49460j09244m9041J53777R017q8489
$$ 2509827 2577134 2666699 2794628 2760132 2747484 2896944 2787700 2738659 2892436 2901453 2812964
2266B812964O0059L3458J87231N0331k7492Q1440N6266m7372J31260J10005J01024
$$ 2812964 2873023 2906481 3093712 3144043 3116551 3197991 3254257 3206885 3338145 3448150 3549174
2255C549174o169q0412J41211m2551m6980J12967L02429R552K5784J20302n3101
$$ 3549174 3543005 3462593 3603804 3561253 3514273 3627240 3929669 3939221 3965005 4085307 4032206
2244D032206r7138J72777J39595R4863J46251J03182O0712K7229J030J71576J91165
$$ 4032206 3935068 4107845 4247440 4342303 4488554 4591736 4652448 4679677 4680707 4852283 5043448
2233E043448q5666M8755J56876J79632m1370j0630J33468J82071l9328N189L24854
$$ 5043448 4957782 5006537 5163413 5343045 5301675 5291045 5424513 5606584 5567256 5572445 5897299
2222E897299J98190J51029J51399K9759n819J19126J70710K42529n5652P5544
$$ 5897299 6095489 6246518 6397917 6427676 6421857 6540983 6711693 6954222 6898570 6974114
2212F974114K08791J28536O8374J95246J86150K18001K83789J55157J58434K14514
$$ 6974114 7182905 7311441 7379815 7575061 7761211 7979212 8263001 8418158 8576592 8791106
2202H791106J80733J57567K52645K88848L40066L95847K46638L06669N92243O54574
$$ 8791106 8971839 9129406 9382051 9670899 10010965 10406812 10653450 10960119 11552362 12206936
2192A2206936N33184K51234O63933P37988N80271Q71114P45901Q72686J261377
$$ 12206936 12740120 12991354 13655287 14393275 14973546 15844660 16590561 17463247 18724624
2183A8724624J211003J096066J276899J280010J486827J457176J558758J770794
$$ 18724624 19935627 21031693 22308592 23588602 25075429 26532605 28091363 29862157
2175B9862157J004987R23704N19386k0771m00654r84357j528929j599867j565453
$$ 29862157 30867144 31790848 32310234 32289463 31888809 30904452 29375523 27775656 26210203
2166B6210203j268395j212358j078091r29694j025156q11657p93800p46433p42032
$$ 26210203 24941808 23729450 22651359 21721665 20696509 19884852 19091052 18344619 17602587
2157A7602587m67968l00655l87003m42365k79576j25798k41112j53287k12849
$$ 17602587 17134619 16833964 16446961 16004596 15725020 15599222 15358110 15204823 14991974
2148A4991974j96282j28198k8747j21034J28744K07234K75148M79027k2518l57074
$$ 14991974 14795692 14667494 14638747 14517713 14646457 14853691 15128839 15607866 15585348 15228274
2138A5228274q38997o69840m86608o22329n00650m37407l74520l09226j82749
$$ 15228274 14389277 13719437 13232829 12610500 12109850 11672443 11297923 10988697 10805948
2129A0805948k07312l43168k35620k66916k37299j06128n7203j47214j83381n7181
$$ 10805948 10598636 10255468 10019848 9752932 9515633 9409505 9352302 9205088 9021707 8964526
2119H964526L2218q3371q542J46203J91977j48430O0360K84434K39482N09811
$$ 8964526 8996744 8913373 8904831 9051034 9243011 9094581 9154941 9439375 9678857 10188668
2109A0188668R15491J225171J030342J05125j025825j206611j152123q21605n50738
$$ 10188668 11104159 12329330 13359672 13464797 12438972 11232361 10080238 9258633 8707895
2100H707895m96090l88719l69073l58250k26450r2674j64976j51173o2292j91545
$$ 8707895 8211805 7823086 7454013 7095763 6869313 6776639 6611663 6460490 6398198 6206653
2090F206653j30702Q9271k665j96222l2927P013j2924r5023p9027O5649r7512
$$ 6206653 6075951 6165222 6162557 5966335 5933408 5940421 5927497 5832474 5753447 5819096 5721584
2079E721584J35453L46022J79937L13396L09782M04699L43084R8604n19305o91476
$$ 5721584 5857037 6203059 6382996 6696392 7006174 7410873 7753957 7852561 7333256 6641780
2069F641780n52172k39070k65470l96241k54908j64188k3452j63455j07243k15952
$$ 6641780 6089608 5850538 5585068 5188827 4933919 4769731 4746279 4582824 4475581 4259629
2059D259629J2810P7055p2573j09593j52784l9502o4127k3045j38148O6336O2936
$$ 4259629 4272439 4349494 4276921 4167328 4014544 3975042 3910915 3887870 3749722 3816058 3878994
2048C878994j42323j77214q9112J3333m3735k8543N5692P6839k05305m8909M1918
$$ 3878994 3736671 3559457 3470345 3483678 3439943 3411400 3467092 3543931 3338626 3289717 3331635
2037C331635M9042M7661j58430p6121J30265j88062L1152k548l6805K7018P9871
$$ 3331635 3380677 3428338 3269908 3193787 3324052 3135990 3167142 3164594 3127789 3154807 3234678
2026C234678j12170m8569k7565n5014O4390q438R9642j16635j64897P7247j03833
$$ 3234678 3122508 3073939 3046374 2991360 3055750 3047312 3146954 3030319 2865422 2942669 2838836
2015B838836o5064o6148M1996M7549J09710k4304k8920L310j33870K3633p3264
$$ 2838836 2773772 2707624 2749620 2797169 2906879 2882575 2853655 2856965 2723095 2746728 2673464
2004B673464o5930o7723N7365J15805j2625M7555l4574m3046j7570j34422k8929
$$ 2673464 2607534 2539811 2597176 2712981 2700356 2747911 2713337 2670291 2652721 2518299 2489370
1993B489370J672p4094n3747L1791j31167k1059J3939M7259j05069j09535P5014
$$ 2489370 2491042 2416948 2363201 2394992 2263825 2242766 2256705 2303964 2198895 2089360 2164374
1982B164374N9053J3328J37730M0611j29407M3337j09855m9481Q0009k1261K4894
$$ 2164374 2223427 2236755 2374485 2415096 2285689 2329026 2219171 2169690 2249699 2228438 2253332
1971B253332j23175p7910j63220O6030J80337J8083L7255n641k4582j58061r9009
$$ 2253332 2130157 2052247 1889027 1955057 2135394 2153477 2190732 2185091 2160509 2002448 1903439
1960A903439J7362k1978L2239o1578j03973L8730j6779j12983J0641M8009M2674
$$ 1903439 1920801 1898823 1931062 1869484 1765511 1804241 1787462 1674479 1685120 1733129 1775803
1949A775803l1207j50948J3933l9859O9668J28710q5502m0004M4010M0925p3830
$$ 1775803 1744596 1593648 1607581 1567722 1637390 1766100 1680598 1640594 1684604 1725529 1651699
1938A651699Q9315j25838N9047P7929l8287P7502n0507n3119o3026J4098q8985
$$ 1651699 1741014 1615176 1674223 1752152 1713865 1791367 1740860 1687741 1624715 1638813 1549828
1927A549828j04977P0738O6486J22171n8519j32959R8858k8261j39979J08473
$$ 1549828 1444851 1515589 1582075 1704246 1645727 1512768 1611626 1583365 1443386 1551859
1917A551859m9631j3795j4980r5173J58935O8803j19030j9809K7907O5956Q8450
$$ 1551859 1502228 1488433 1473453 1378280 1537215 1606018 1486988 1467179 1495086 1561042 1649492
1906A649492L148m0691j478J95072N3071k45249j48355Q2369n892P0039N0953
$$ 1649492 1652640 1611949 1610471 1805543 1858614 1613365 1465010 1547379 1541487 1611526 1662479
1895A662479Q9826J33205m1661j8521R3665M0932j23268j11157n8892K268k7850
$$ 1662479 1752305 1885510 1843849 1825328 1918993 1959925 1836657 1725500 1666608 1668876 1641026
1884A641026O907M3132m7926q1923K32265P0698J237N3772n8237J68829j11496
$$ 1641026 1647933 1691065 1643139 1561216 1793481 1864179 1865416 1919188 1860951 2029780 1918284
1873A918284m2967J27249n8537l4608n3106O4240J62131j4238K0576Q5296J80983
$$ 1918284 1875317 2002566 1944029 1909421 1856315 1920555 2082686 2068448 2089024 2174320 2355303
1862B355303l4912O0550k1519J1030K32958M7147l5035m5264L1236J69095Q2811
$$ 2355303 2320391 2380941 2359422 2370452 2603410 2650557 2615522 2570258 2601494 2770589 2853400
1851B853400l1954Q0943J99930P3580J83964J40095K71355m4587Q9279J15273
$$ 2853400 2821446 2902389 3102319 3175899 3359863 3499958 3771313 3726726 3816005 3931278
1841C931278r216N4548M6808L33545M825j6125J64147J19059o1449J3088M357
$$ 3931278 3922062 3976610 4023418 4356963 4361788 4345663 4509810 4628869 4567420 4580508 4584865
1830D584865R6930L1894K2027o763J98909J51242Q5610K01699P5862R9751L99376
$$ 4584865 4681795 4713689 4735716 4728953 4927862 5079104 5164714 5366413 5442275 5542026 5941402
1819E941402J34446K4930L01787L33440L88695K31772L40886K99931M07088J95897
$$ 5941402 6075848 6100778 6402565 6736005 7124700 7356472 7697358 7997289 8404377 8600274
1809H600274M3539N8392k5268j22942l29936k80094l00125l10813j72295o3890
$$ 8600274 8643813 8702205 8676937 8553995 8224059 7943965 7643840 7333027 7160732 7096842
1799G096842k5863j38727J00946n690m1179K38079J30319J92917K25850J79592
$$ 7096842 7070979 6932252 7033198 7027508 6986329 7224408 7354727 7547644 7773494 7953086
1789G953086K89338K83007M8164K07472J80148K17040J29919M8879L16224N6621
$$ 7953086 8242424 8525431 8573595 8781067 8961215 9178255 9308174 9357053 9673277 9729898
1779I729898j13502j93857j16557k03550j70217k04950j99590n58549m76324j53099
$$ 9729898 9616396 9422539 9305982 9102432 8932215 8727265 8527675 7969126 7492802 7339703
1769G339703k59775m0955n8487j51331J1884j0545R3277O4959l4254J7873j1865
$$ 7339703 7079928 7038973 6980486 6829155 6841039 6830494 6923771 6988730 6954476 6972349 6960484
1758F960484J27618P0741j16814l0429r6276k26592r2682j61683k32304m61254
$$ 6960484 7088102 7158843 7042029 7011600 6915324 6688732 6596050 6434367 6202063 5740809
1748E740809k56081j30340j71559k87017k32788m1503j31662k72216j18259q5654
$$ 5740809 5484728 5354388 5182829 4895812 4663024 4621521 4489859 4217643 4099384 4013730
1738D013730j91439k42754O6147r1222k71847q8521o7347K963P4821r3030p0823
$$ 4013730 3822291 3579537 3645684 3554462 3282615 3194094 3126747 3129710 3204531 3111501 3040678
1727C040678l4159j75908j20584n0076j32114p741m3066P5748k82342J0089R3754
$$ 3040678 3006519 2830611 2710027 2659951 2527837 2520096 2477030 2552778 2270436 2280525 2374279
1716B374279m4441q0672j77528P3230n3596L4113n5875j53113n1292o6763J08317
$$ 2374279 2329838 2249166 2071638 2144868 2091272 2125385 2069510 1916397 1865105 1798342 1906659
1705A906659n1568j54993J9532O1588o651k53125n6393J846J98971p8840L0589
$$ 1906659 1855091 1700098 1719630 1781218 1774567 1521442 1465049 1466895 1665866 1587026 1617615
1694A617615n0624q6822J8074M9973j3766O3229j22322r7746l8623O8308p2785
$$ 1617615 1566991 1480169 1498243 1548216 1534450 1597679 1475357 1377611 1338988 1407296 1334511
1683A334511m5511N246k57639Q6875Q4450j43643r4565J72738Q9539O268m6333
$$ 1334511 1289000 1294246 1036607 1123482 1207932 1064289 969724 1142462 1232001 1238269 1191936
1672A191936m6225k00882q0069j40676P5978J35989r3263q1408P7480O1071j51360
$$ 1191936 1145711 944829 864760 724084 800062 936051 842788 761380 838860 899931 748571
1661G48571R7882J40791j80982P8679K16472k47182j44977m8508P0160j0975j58234
$$ 748571 846453 987244 806262 884941 1101413 854231 709254 660746 730906 719931 561697
1650E61697J06134R1806O0423j52347J04256K0341j51022j32127P9814J57541
$$ 561697 667831 759637 820060 667713 771969 792310 641288 509161 588975 746516
1640G46516o7390o3179M0049m7555k02172P3295L4156r3500l2084P9912J44031
$$ 746516 679126 615947 655996 608441 406269 479564 513720 420220 388136 468048 612079
1629F12079L5503j53623P5446J38380j56691o6250Q8249k5461j16915j3054R8188
$$ 612079 647582 493959 569405 707785 551094 484844 573093 547632 430717 417663 515851
1618E15851L847k7738n3523P0480j0051n3508J9605J5544l2993J9453j13564j5156
$$ 515851 519698 491960 438437 508917 498866 445358 464963 480507 447514 466967 353403 338247
1606C38247q4455L620P7384M7860J6946l8172k7779O172l590J26399Q6545j45962
$$ 338247 253792 257412 334796 382656 399602 361430 333651 339823 336233 462632 549177 403215
1594D03215J5336J1925o4202j20779J61689k7056j34698J06381n4985p2272M0053
$$ 403215 418551 430476 366274 245495 407184 380128 245430 351811 296826 224554 264607
1583B64607Q2672K8286J71844j08217O614N5113p2809j57647j57190M2629K7934
$$ 264607 347279 375565 547409 439192 445806 500919 428110 270463 113273 155902 183836
1572A83836J27085o2314J06035l9835O2188J17031L8504J37j1148j9225j35782
$$ 183836 310921 248607 354642 314807 376995 494026 532530 532667 521519 502294 366512
1561C66512k634j8005J61431j99309j67252J53819J1187p4773Q5774M514K0328
$$ 366512 363878 345873 507304 307995 140743 294562 305749 230976 316750 321264 341592
1550C41592O5765p8299R1366j0897j63071m4809Q4072L0075o8503m8905R3221
$$ 341592 407357 329058 420424 409527 246456 201647 285719 315794 247291 198386 291607
1539B91607j308N9942J89521j76505j46929O3594n9145p5745P4650n5603K6774
$$ 291607 290299 350241 539762 363257 216328 279922 220777 145032 219682 164079 190853
1528A90853N8814o1110K3298N167K7791j2359P0080J17921M5119q0001n8924j48762
$$ 190853 249667 188557 211855 217022 244813 232454 302534 420455 465574 385573 326649 177887
1516A77887j23062J40254J50636o3544j08423P6658P0582M2996j1119j28206L1206
$$ 177887 54825 195079 345715 282171 173748 250406 320988 363984 352865 224659 255865
1505B55865r0320J10138k6552L968j61086J6784P3405p4987J5215J42181J31679
$$ 255865 165545 275683 249131 253099 92013 108797 182202 107215 122430 264611 396290
1494C96290K9822k3200j20638Q57N9166j07553r1860J59330J9543k22648j20705
$$ 396290 426112 402912 282274 283131 342297 234744 142884 302214 321757 99109 -21596
1483b1596L6348n4136J29793K91106O3258j29979Q0469l9982j46451j30410j67200
$$ -21596 14752 -39384 90409 381515 444773 314794 395263 355281 208830 78420 -88780
1472h8780R5190J231J04662N9231Q8556k1487j17843K670J93678l8027o3035J26194
$$ -88780 6410 7641 112303 171534 260090 238603 120760 123430 317108 279081 216046 342240
1460C42240l5902L6105p4865k6545l8319m6759J06113O4160m7663k3579n5367
$$ 342240 306338 342443 267578 241033 202714 155955 262068 326228 278565 254986 199619
1449A99619o1231p4033L117J18755R8499j15958o7469n1661N5070j6741l7703
$$ 199619 138388 64355 67472 186227 284726 168768 101299 49638 104708 87967 50264
1438E0264J78187J03895j30733q0033R4864L5923j41190Q6519J34349j87330j09169
$$ 50264 228451 332346 201613 121580 216444 252367 111177 197696 332045 144715 35546
1427C5546M7851m1116M5638j11907J24516n170J02287N1310l1139n4197L6079
$$ 35546 83397 42281 87919 -23988 100528 95358 197645 248955 217816 163619 199698
1416A99698l7391J9757r9109p1692J08288J24077j46431q99K33226j68444m8540
$$ 199698 162307 182064 82955 11263 119551 243628 97197 96298 329524 161080 112540
1405A12540m3247J68130K08525k18683j27927L000q5845Q7433J44431o0267j22664
$$ 112540 69293 237423 445948 227265 99338 102338 16493 103926 248357 188090 65426
1394F5426Q0117K2248R2394l9633K3170J30321l5265l4627j84025O7852N217j22621
$$ 65426 145543 167791 260185 220552 243722 374043 338778 304151 120126 187978 193195 70574
1382G0574J22595M4951J04623M391q6996J7526J6333n5099Q7228q116k8163j23888
$$ 70574 193169 238120 342743 347134 260138 277664 293997 238898 326126 318010 289847 165959
1370A65959j0639p1392j09230R6804M9323o0851K7859m1428J2212P3903n7491
$$ 165959 155320 83928 -25302 71502 120825 59974 87833 46405 58617 132520 75029
1359G5029q443M8411l1200K05176L0294p6469N5590p5218o0884J7667K2424o1413
$$ 75029 66586 114997 83797 288973 319267 242798 298388 223170 162286 179953 202377 140964
1347A40964j22866J22599J97771j20766n018J23977r0798k5255M597k1187m1993
$$ 140964 18098 140697 338468 217702 212684 336661 245863 220608 225205 204018 162025
1336A62025p0040J2047J20276J09567J6473q8081j18906r4462l6994k2446K5817
$$ 162025 91985 104032 224308 333875 350348 262267 143361 48899 11905 -10541 15276
1325A5276N6272r3526M970J24925n085k1221R6537L5214m4160j27478J59211p1908
$$ 15276 71548 -21978 -17008 107917 102832 81611 178148 213362 169202 41724 200935 129027
1313A29027j78676J09680m5622j0089k5684J09991J22628l576P600P4872j98752
$$ 129027 -49649 60031 14409 4320 -21364 88627 211255 207679 215279 290151 91399
1302I1399j34851O2558N41J8966j21578K77750M9121j27842j16693J21786m897
$$ 91399 -43452 19106 19647 38613 -82965 194785 243906 116064 -629 121157 116260
1291A16260r3098J25146n873k7036l6980R034l5439k7745j32762R9837Q7830n7419
$$ 116260 23162 148308 142435 115399 78419 87453 52014 24269 -108493 -8656 79174 21755
1279B1755o2047J47273l1643j3642m574l2585j7794j15906J17687J45369o4445
$$ 21755 -40292 106981 75338 61696 57122 24537 6743 -109163 8524 153893 89448
1268H9448O0060j8790M156o1488n8822Q4661J01122N0901p4375O2283p2793j15190
$$ 89448 149508 130718 134874 73386 14564 99225 200347 251248 176873 239156 166363 51173
1256E1173L6082N1539n7508m1922K9424J59590O494J07687k0790J37262P5044
$$ 51173 87255 138794 81286 39364 68788 228378 234872 342559 321769 459031 534075
1245E34075j3165J53054N6637j24728p1804N1481j59758j31154j44635L6490N4364
$$ 534075 520910 673964 730601 605873 534069 585550 425792 294638 150003 186493 240857
1234B40857Q5838n2259j9452o8686k15758J04166Q4341J11021j04744J3626k9047
$$ 240857 326695 274436 254984 186298 -29460 74706 159047 270068 165324 178950 149903
1223A49903r7816M9663L827M8405j07329n0920J78350M0973p4019n4164o3820
$$ 149903 52087 101750 105577 153982 46653 -4267 174083 215056 141037 86873 23053
1212B3053J67187j4259j95073M7516P3863o8340O6360M4191r7186k3592r8684
$$ 23053 190240 175981 -19092 28424 102287 33947 100307 144498 47312 23720 -74964
1201g4964j4121J74880J79006L6833n1788k19403p4524J6158J09682J77342M0178
$$ -74964 -89085 85795 264801 301634 249846 30443 -44081 -27923 81759 259101 299279
1190B99279r9q1111j43568J02439j8915j38689j0792K00831k9220q8419J44300
$$ 299279 299180 218069 74501 176940 158025 19336 8544 209375 180155 91736 236036
1179B36036k7229k9629O622q9181j8929O7673O6594n0103j88481k0445J43159
$$ 236036 208807 179178 185800 96619 77690 145363 211957 161854 -26627 -47072 96087
1168I6087R7341j12889o1143N2978J00348m408o1780J2426M7295p1641m8930m097
$$ 96087 193428 80539 19396 72374 172722 168314 106534 118960 166255 94614 45684 41587
1156D1587O6518j7703J5701K2417Q5956J41918m8379k2999r322K7079j52308r5382
$$ 41587 108105 90402 106103 128520 214476 356394 308015 285016 275694 302773 150465 55083
1144E5083J46320j5028R9204q7524J5633K9852o893n5222P2431J7976j61464R2314
$$ 55083 201403 186375 285579 198055 213688 243540 236647 181425 253856 271832 110368 202682
1132B02682K9694j77247J2416m19j7028K2869J18489J62396n6917k43823L1297
$$ 202682 232376 55129 67545 67126 50098 72967 191456 353852 296935 53112 84409
1121H4409O5855k8654q0071r0381O2871m5217Q9933J2625K4121P4666k5125J52511
$$ 84409 150264 121610 41539 -48842 14029 -31188 58745 71370 95491 170157 145032 297543
1109B97543j34745j34861J23871J80946j12248p7662L9214J3151j8202k12854
$$ 297543 162798 27937 151808 332754 220506 142844 182058 195209 177007 -35847
1099c5847J61231R1115j38515q6401K08427J15721l3989m4663P3696l0341q3137
$$ -35847 125384 216499 77984 -8417 200010 315731 281742 237079 310775 280434 197297
1088A97297k2766O0173N2936O8279R1353J17182l5527j24366N9888J52810N7715
$$ 197297 174531 234704 287640 355919 447272 564454 528927 404561 464449 617259 674974
1077F74974L5340j30265j14779p399q9416J78940J051j04701J09343r926o1183
$$ 674974 710314 580049 465270 457871 368455 547395 548446 443745 553088 543162 481979
1066D81979J01258M782k7418k7097j33178J32895L6793j80524l6958J76392M9224
$$ 481979 583237 588019 560601 533504 400326 533221 570014 389490 352532 528924 578148
1055E78148o6525K138J05956k7296j3117q2510O7987M50K826l5567M1411J03573
$$ 578148 511623 513761 619717 592421 579304 496794 564781 565231 568057 532490 573901 677474
1043F77474j985Q9137l6646J27311K22354J62310j00045M1976J19011m0308j12444
$$ 677474 675489 764626 727980 855291 1077645 1239955 1139910 1181886 1300897 1260589 1148145
1032A148145p8206P8795M5456P6047J77943J11511J05772N2027J01578J45206
$$ 1148145 1069939 1148734 1194190 1270237 1448180 1559691 1665463 1717490 1819068 1964274
1022A964274N4633J79381J82437J95412n1590j1628j93217k8154R538j42214J23059
$$ 1964274 2018907 2198288 2380725 2576137 2524547 2512919 2319702 2291548 2301086 2158872 2281931
1011B281931j4016n6425K30453J9964K3371P4204K8963L5233N9190r5890l4318
$$ 2281931 2267915 2211490 2441943 2461907 2485278 2559482 2588445 2623678 2682868 2586978 2552660
1000B552660K17700J05889N1340K02870J11478R7455L39944J89704N4428R1792
$$ 2552660 2770360 2876249 2927589 3130459 3241937 3339392 3679336 3869040 3923468 4015260
990D015260K37265L6684L48248L54751L25067M14917M70398L81567O01721O13091
$$ 4015260 4252525 4289209 4637457 4992208 5317275 5732192 6202590 6584157 7185878 7798969
980G798969N01348O23292P94493Q90831J335428J028245Q08567P05959J029346
$$ 7798969 8300317 8923609 9718102 10608933 11944361 12972606 13781173 14487132 15516478
971A5516478J436395J895336K427494K860071L384577M005604M942668O365990
$$ 15516478 16952873 18848209 21275703 24135774 27520351 31525955 36468623 42834613
963D2834613Q840873J2449114J8505340K3848173J3520102p513941k1743990k1092393
$$ 42834613 51675486 64124600 82629940 106478113 119998215 112484274 90740284 69647891
955F9647891j4025653r628185o993592o085367m737854l559728k549394k025215
$$ 69647891 55622238 45994053 39000461 32915094 28177240 24617512 22068118 20042903
947B0042903j379903j110314o85519n14504n20486r47971j408838j003013r26927
$$ 20042903 18663000 17552686 16867167 16352663 15832177 14884206 13475368 12472355 11545428
938A1545428q48909p70295o59695m57571l71820k02902n69987k93250l26302k72735
$$ 11545428 10696519 9926224 9266529 8808958 8437138 8234236 7664249 7370999 7044697 6771962
928F771962k40780k22210k83073k07869k44536j32409j88763p0887j28016k53648
$$ 6771962 6531182 6308972 6025899 5818030 5573494 5441085 5252322 5181435 5053419 4799771
918D799771j61799k81765j84357j20886k86793l9515J46780j69239q2441j33j59783
$$ 4799771 4637972 4356207 4171850 4050964 3764171 3724656 3871436 3702197 3619756 3619623 3459840
907C459840n1576q3983j43016r3366j68851j53569q9084j34033j29705j9813l5910
$$ 3459840 3408264 3324281 3181265 3087899 2919048 2765479 2676395 2542362 2412657 2392844 2356934
896B356934K5527J2474M841p9102o6178N270J22064j16816k05543l979k943k2754
$$ 2356934 2382461 2394935 2399776 2320674 2254496 2259766 2381830 2265014 2059471 2055492 2052549 2029795
884B029795j92892J2188m518J05189l3669K6110n4922m0123K552j57294j17697
$$ 2029795 1836903 1849091 1844573 1949762 1916093 1942203 1887281 1847158 1849710 1692416 1574719
873A574719r3194o9490M1270R3861m5980N9776J098p2025k1714r4153o7000l9471
$$ 1574719 1481525 1412035 1453305 1547166 1501186 1560962 1562060 1490035 1468321 1374168 1307168 1267697
861A267697j3528n7820k0066j5428o1844P3095J3824K3220n4354L8822j84690
$$ 1267697 1254169 1196349 1176283 1160855 1099011 1172106 1185930 1209150 1154796 1193618 1008928
850A008928q6923J42084n6740n3601j05432k9213J13504k0159o9135J30484N4753
$$ 1008928 922005 1064089 1007349 953748 848316 819103 932607 912448 843313 973797 1028550
839A028550k16984k1671j04780N9998j46726O0501J37022j34977r933Q871J32640
$$ 1028550 811566 789895 685115 745113 598387 658888 795910 660933 651000 659871 792511
828G92511O056j21735j0106j0838j72401J30563J72843j32991r1125M6462R5986
$$ 792511 798567 676832 666726 655888 483487 614050 786893 653902 562777 609239 705225
817G05225K9578j43843m240J41637k01174p9951J54608J06861m370j69612k2331
$$ 705225 734803 590960 586720 728357 527183 447232 601840 708701 704331 534719 512388
$$ [...]
##END NTUPLES=NMR SPECTRUM
##END=
