##TITLE=1H_CA-8667-3
 CDCl3, 8 sc, 
 19.11.2019
##JCAMPDX= 6.0         $$ Bruker NMR JCAMP-DX V2.0
##DATA TYPE= NMR FID
##DATA CLASS= NTUPLES
##ORIGIN= UXNMR, Bruker Analytische Messtechnik GmbH
##OWNER= root
$$ XWIN-NMR		Version 3.5
$$ Tue Nov 19 14:10:09 2019 Russian Standard Time (UT+4h)  she@DPX200
##.OBSERVE FREQUENCY= 200.1315
##.OBSERVE NUCLEUS= ^1H
##.DELAY= (6, 6)
##.ACQUISITION MODE= SIMULTANEOUS
##.ACQUISITION SCHEME= undefined
##.AVERAGES= 8
##.DIGITISER RES= 18
##SPECTROMETER/DATA SYSTEM= spect
##.PULSE SEQUENCE= zg30
##.SOLVENT NAME= D2O
##.SHIFT REFERENCE= (INTERNAL, D2O, 0, 15.7039)
##AUDIT TRAIL= $$ (NUMBER, WHEN, WHO, WHERE, WHAT)
$$ ##TITLE= Audit trail, XWIN-NMR		Version 3.5
$$ ##JCAMPDX= 5.01
$$ ##ORIGIN= Bruker BioSpin GmbH
$$ ##OWNER= she
$$ F:/spectra/data/she/nmr/H-F/1/audita.txt
$$ ##AUDIT TRAIL=  $$ (NUMBER, WHEN, WHO, WHERE, WHAT)
(   1,<2019-11-19 14:08:32.43 +0400>,<she>,<DPX200>,
      <created by zg, POWCHK disabled, PULCHK disabled
       configuration hash MD5:
       00 E9 B6 7A A2 85 ED C7 34 08 36 98 17 FE 4E 26
       data hash MD5: 16K
       6B 8F 74 8A B9 B7 9F 68 EC 7F 7E 57 54 81 9C AB>)
$$ ##END=
$$ 
$$ hash MD5
$$ 09 68 CC F8 03 6E 08 60 18 CD 22 FF 21 A7 0C DE
##$RELAX= 
##$RELAX= 
##$RELAX= 
##$RELAX= 
##$RELAX= 
##$RELAX= 
$$ Bruker specific parameters
$$ --------------------------
##$DU= <F:/spectra>
##$EXPNO= 1
##$NAME= <H-F>
##$PROCNO= 1
##$TYPE= <nmr>
##$USER= <she>
##$AMP= (0..31)
100 100 100 100 100 100 100 100 100 100 100 100 100 100 100 100 100 100 
100 100 100 100 100 100 100 100 100 100 100 100 100 100 
##$AQSEQ= 0
##$AQ_mod= 1
##$AUNM= <au_zg>
##$AUTOPOS= <>
##$BF1= 200.13
##$BF2= 200.13
##$BF3= 200.13
##$BF4= 200.13
##$BF5= 200.13
##$BF6= 200.13
##$BF7= 200.13
##$BF8= 200.13
##$BYTORDA= 1
##$CFDGTYP= 0
##$CFRGTYP= 5
##$CHEMSTR= <none>
##$CNST= (0..31)
1 1 145 1 1 1 1 1 1 1 1 1 1 1 1 1 1 1 1 1 1 1 1 1 1 1 1 1 1 1 1 1 
##$CPDPRG= <>
##$CPDPRG1= <>
##$CPDPRG2= <>
##$CPDPRG3= <>
##$CPDPRG4= <mlev>
##$CPDPRG5= <mlev>
##$CPDPRG6= <mlev>
##$CPDPRG7= <mlev>
##$CPDPRG8= <mlev>
##$CPDPRGB= <>
##$CPDPRGT= <>
##$D= (0..31)
0 1.2 0 0 0 0 0 0 0 0.06 0 0.03 0 0 0 0 0.0002 0 0 0 0 0 0 0 0 0 0 0 0 
0 0 0 
##$DATE= 1574158111
##$DBL= (0..7)
120 120 120 120 120 120 120 120 
##$DBP= (0..7)
150 150 150 150 150 150 150 150 
##$DBP07= 0
##$DBPNAM0= <>
##$DBPNAM1= <>
##$DBPNAM2= <>
##$DBPNAM3= <>
##$DBPNAM4= <>
##$DBPNAM5= <>
##$DBPNAM6= <>
##$DBPNAM7= <>
##$DBPOAL= (0..7)
0.5 0.5 0.5 0.5 0.5 0.5 0.5 0.5 
##$DBPOFFS= (0..7)
0 0 0 0 0 0 0 0 
##$DE= 6
##$DECBNUC= <off>
##$DECIM= 24
##$DECNUC= <off>
##$DECSTAT= 4
##$DIGMOD= 1
##$DIGTYP= 9
##$DL= (0..7)
0 120 120 120 120 120 120 120 
##$DP= (0..7)
150 150 150 150 150 150 150 150 
##$DP07= 0
##$DPNAME0= <>
##$DPNAME1= <>
##$DPNAME2= <>
##$DPNAME3= <>
##$DPNAME4= <>
##$DPNAME5= <>
##$DPNAME6= <>
##$DPNAME7= <>
##$DPOAL= (0..7)
0.5 0.5 0.5 0.5 0.5 0.5 0.5 0.5 
##$DPOFFS= (0..7)
0 0 0 0 0 0 0 0 
##$DQDMODE= 0
##$DR= 18
##$DS= 0
##$DSLIST= <SSSSSSSSSSSSSSS>
$$ [...]
##$SUBNAM2= <"">
##$SUBNAM3= <"">
##$SUBNAM4= <"">
##$SUBNAM5= <"">
##$SUBNAM6= <"">
##$SUBNAM7= <"">
##$SUBNAM8= <"">
##$SUBNAM9= <"">
##$SW= 24.9337058887773
##$SWIBOX= (0..15)
0 0 2 0 0 0 0 0 0 0 0 0 0 0 0 0 
##$SW_h= 4990.01996007984
##$TD= 16384
##$TD0= 1
##$TE= 0
##$TE2= 300
##$TE3= 300
##$TEG= 300
##$TL= (0..7)
0 120 120 120 120 120 120 120 
##$TP= (0..7)
150 150 150 150 150 150 150 150 
##$TP07= 0
##$TPNAME0= <>
##$TPNAME1= <>
##$TPNAME2= <>
##$TPNAME3= <>
##$TPNAME4= <>
##$TPNAME5= <>
##$TPNAME6= <>
##$TPNAME7= <>
##$TPOAL= (0..7)
0.5 0.5 0.5 0.5 0.5 0.5 0.5 0.5 
##$TPOFFS= (0..7)
0 0 0 0 0 0 0 0 
##$TUNHIN= 0
##$TUNHOUT= 0
##$TUNXOUT= 0
##$USERA1= <user>
##$USERA2= <user>
##$USERA3= <user>
##$USERA4= <user>
##$USERA5= <user>
##$V9= 5
##$VALIST= <valist>
##$VCLIST= <CCCCCCCCCCCCCCC>
##$VD= 0
##$VDLIST= <DDDDDDDDDDDDDDD>
##$VPLIST= <PPPPPPPPPPPPPPP>
##$VTLIST= <TTTTTTTTTTTTTTT>
##$WBST= 1024
##$WBSW= 4
##$XGAIN= (0..3)
0 0 0 0 
##$XL= 0
##$YL= 0
##$YMAX_a= 396247
##$YMIN_a= -241027
##$ZGOPTNS= <>
##$ZL1= 120
##$ZL2= 120
##$ZL3= 120
##$ZL4= 120
##$ABSF1= 10
##$ABSF2= 0
##$ABSG= 5
##$ABSL= 3
##$ALPHA= 0
##$AQORDER= 0
##$ASSFAC= 0
##$ASSFACI= 0
##$ASSFACX= 0
##$ASSWID= 0
##$AUNMP= <proc_1d>
##$AZFE= 0.1
##$AZFW= 0.1
##$BCFW= 1
##$BC_mod= 2
##$BYTORDP= 1
##$COROFFS= 0
##$CY= 11.3945322036743
##$DATMOD= 1
##$DC= 2
##$DFILT= <>
##$DTYPP= 0
##$F1P= 16.9975609425685
##$F2P= -3.02152046262296
##$FCOR= 0.5
##$FTSIZE= 0
##$FT_mod= 4
##$GAMMA= 1
##$GB= 0.15
##$INTBC= 1
##$INTSCL= 1
##$ISEN= 128
##$LB= 0.24
##$LEV0= 0
##$LPBIN= 0
##$MAXI= 10000
##$MC2= 0
##$MEAN= 0
##$ME_mod= 0
##$MI= 1.114404
##$NCOEF= 0
##$NC_proc= 0
##$NLEV= 6
##$NOISF1= 3.799351
##$NOISF2= 2.8
##$NSP= 1
##$NTH_PI= 0
##$NZP= 0
##$OFFSET= 15.70392
##$PC= 1
##$PHC0= -9786.574
##$PHC1= 13.20086
##$PH_mod= 1
##$PKNL= yes
##$PPARMOD= 0
##$PSCAL= 0
##$PSIGN= 0
##$REVERSE= no
##$SF= 200.130013532006
##$SI= 16384
##$SIGF1= 3
##$SIGF2= 2
##$SINO= 400
##$SIOLD= 16384
##$SREGLST= <1H.CDCl3>
##$SSB= 0
##$STSI= 0
##$STSR= 0
##$SW_p= 3612.71676300578
##$SYMM= 0
##$S_DEV= 0
##$TDeff= 0
##$TDoff= 0
##$TI= <>
##$TILT= no
##$TM1= 0
##$TM2= 0
##$TOPLEV= 0
##$USERP1= <user>
##$USERP2= <user>
##$USERP3= <user>
##$USERP4= <user>
##$USERP5= <user>
##$WDW= 1
##$XDIM= 8192
##$YMAX_p= 0
##$YMIN_p= 0
$$ End of Bruker specific parameters
$$ ---------------------------------
##NTUPLES= NMR FID
##VAR_NAME=  TIME,          FID/REAL,        FID/IMAG
##SYMBOL=    X,             R,               I
##VAR_TYPE=  INDEPENDENT,   DEPENDENT,       DEPENDENT
##VAR_FORM=  AFFN,          ASDF,            ASDF
##VAR_DIM=   8192,          8192,            8192
##UNITS=     SECONDS,       ARBITRARY UNITS, ARBITRARY UNITS
##FACTOR=    0.0002004,     1,               1
##FIRST=     0,             0,               0
##LAST=      1.6414764,     0,               0
##MIN=       0,             -241027,         0
##MAX=       1.6414764,     396247,          0
$$ Real data points
##PAGE= N=1
##DATA TABLE= (X++(R..R)), XYDATA
$$ plain form
0 0 0 0 0 0 0 0 0 8 -8 8 -14 16 -16 24 -32 33 -40 49 -58 70 -81 97 -110 127 -150 169 -192 223 -249 281
30 281 -320 360 -401 449 -503 559 -624 694 -768 852 -945 1046 -1158 1283 -1419 1575 -1748
47 -1748 1945 -2170 2433 -2738 3104 -3549 4105 -4820 5781 -7149 9268 -13013 21591 -84508
61 -84508 107358 288878 16106 -187830 -173626 91599 314174 209023 -120965 -160413 67579
72 67579 185969 96734 -13775 -63667 33278 147625 28405 -197294 -153867 50023 101014
83 101014 1030 -112006 -161090 -33541 134817 64177 -131534 -134479 -3962 87374 130396
94 130396 81074 -51535 -66965 27525 40208 23012 70541 48787 -33869 -18241 28940 12410
106 12410 14277 4617 -73221 -66233 46432 62898 2971 4074 -8906 -60314 -36420 7766 7815
$$ packed form
0@%%%%%%%Qj6J6k2L0l2M0n6O5p3Q9j07J28j51J78k07K37k77L19l61M15m72N30
30B81o01O80p61Q50r52J062j183J318j462J620j797J991k204K441k702K994l323
47a748L693m115M603n171N842o653P654q925J0601j2930J6417k2281L4604j06099
61h4508J91866J81520k72772k03936J4204K65225K22575j05151l29988l9448K27992
72F7579J18390q9235j10509m9892R6945J14347j19220k25699M3427K03890N0991
83A01014r9984j13036m9084J27549J68358p0640j95711k945J30517R1336M3022
94A30396m9322j32609j5430R4490J2683j7196M7529k1754q2656J5628M7181j6530
106A2410J867r660p7838O988J12665J6466n9927J103j2980n1408K3894M4186M9
$$ plain form
119 7815 57009 84493 -40905 -130002 -22781 89690 69901 -13536 -112163 -111962 75225 197406
131 197406 41244 -143567 -113858 19506 116894 109262 -29180 -99165 48571 151365 13423
142 13423 -118957 -65095 53826 115219 43113 -138842 -162776 62772 177673 -8786 -209262
153 -209262 -190907 -5122 187665 156104 -114312 -241027 -37316 165598 125893 -17133
163 -17133 -103501 -52654 117073 167939 823 -105532 -11183 67601 33661 -17189 -52515
174 -52515 -24744 72657 53187 -111622 -153754 -22921 59131 38462 -18538 -94043 -84494 43721
186 43721 88207 -7462 -51226 -18438 -3435 37854 89478 47756 -12091 -7791 -20828 -27062
198 -27062 54717 89433 -2325 -57480 -26202 -6638 16142 30187 -37617 -79652 -3721 36324
$$ packed form
119G815M9194K7484j25398q9097J07221J12471j9789q3437r8627K01J87187J22181
131A97406j56162j84811K9709J33364R7388p632j38442o9985J47736J02794j37942
142A3423j32380N3862J18921O1393p2106j81955k3934K25548J14901j86459k00476
153b09262J8355J85785J92787l1561k70416j26715K03711K02914l9705j43026
163a7133q6368N0847J69727N0866j67116j06355R4349P8784l3940n0850l5326
174e2515K7771R7401j9470j64809m2132J30833Q2052k0669n7000p5505R549J28215
186D3721M4486r5669m3764L2788J5003M1289N1624m1722n9847M300j3037o234
198b7062Q1779L4716r1758n5155L1278J9564K2780J4045o7804m2035P5931M0045
$$ plain form
210 36324 -14324 -14915 16500 -8059 -26751 -27143 -43590 13233 115219 64669 -80675 -88801 16099
223 16099 86250 86044 -5694 -114375 -47474 120838 117605 -25327 -84911 -44274 27622 80336
235 80336 20971 -80450 -27336 89836 43686 -77640 -85752 -6861 77644 91681 -36881
246 -36881 -151524 -39714 134223 104705 -47493 -125916 -78328 69398 166333 49252 -119887
257 -119887 -86691 46654 77227 31404 -24267 -54047 7411 77252 13241 -67417 -16653 42005
269 42005 10851 -26601 -40495 -30784 43191 76952 -25334 -100910 -36543 32942 38050 31124
281 31124 -10960 -56266 -12144 39273 8141 -6150 19620 -11999 -42054 7108 42530 26179
293 26179 13395 -29840 -78638 -15038 76732 42546 -31219 -35974 -23177 -2046 34983 4014
$$ packed form
210C6324n0648n91L1415k4559j8692l92j6447N6823J01986n0550j45344q126J04900
223A6099P0151k06r1738j08681O6901J68312l233j42932n9584M0637P1896N2714
235H0336n9365j01421N3114J17172m6150j21326q112P8891Q4505J4037j28562
246c6881j14643J11810J73937k9518j52198p8423M7588J47726R6935j17081j69139
257a19887L3196J33345L0573m5823n5671k9780O1458O9841o4011q0658N0764N8658
269D2005l1154l7452j3894R711P3975L3761j02286p5576O4367O9485N108o926
281C1124m2084m5306M4122N1417l1132j4291K5770l1619l0055M9162L5422j6351
293B6179j2784m3235m8798O3600R1770l4186p3765m755J2797K1131L7029l0969
$$ plain form
305 4014 -50857 -10331 37109 -9083 -35153 8921 25887 13370 -7634 -60961 -54655 62320
317 62320 104772 -6762 -88458 -54129 15608 72976 56133 -57149 -94254 19949 86700
328 86700 18869 -41439 -40056 -10459 40057 33995 -47898 -45546 60440 72136 -27808 -76164
340 -76164 -39297 35693 98485 41957 -95480 -93902 46927 101373 27168 -53851 -83837 -26766
352 -26766 81835 77615 -37097 -66204 1090 24595 10317 4525 -12979 362 46317 17015
364 17015 -49163 -14702 52058 34362 -8357 -23922 -29438 13002 68242 23251 -54264 -36342
376 -36342 5652 2729 13924 21849 -13677 -20995 1345 -16926 -14715 41023 31958 -36612 -38444
389 -38444 8180 32436 46903 18243 -58094 -52685 39733 57557 1316 -17853 -15121 -12116 17519
$$ packed form
305D014n4871M0526M7440m6192k6070M4074J6966j2517k1004n3327O306J16975
317F2320M2452j11534q1696L4329O9737N7368j6843j13282l7105J14203O6751
328H6700o7831o0308J383K9597N0516o062q1893K352J05986J1696r9944m8356
340g6164L6867P4990O2792n6528j37437J578J40829N4446p4205q1019k9986N7071
352b6766J08601m220j14712k9107O7294K3505j4278n792j7504J3341M5955k9302
364A7015o6178L4461O6760j7696m2719j5565n516M2440N5240m4991p7515J7922
376c6342M1994k923J1195P925l5526p318K2340j8271K211N5738r065o8570j832
389c8444M6624K4256J4467k8660p6337N409R2418J7824n6241j9169K732L005K9635
$$ plain form
402 17519 13264 -34568 -13361 43853 10620 -46908 -25363 17468 35289 29906 -33646 -86162
414 -86162 -8622 89372 50229 -41787 -64249 -33493 26327 64588 247 -75385 -26617 48565
426 48565 24676 -21060 -22996 -8165 25844 38059 -25561 -57304 27379 83377 19251 -51069
438 -51069 -55965 -13207 60838 71050 -34767 -99321 -25671 45937 27966 -14621 -51247 -55138
450 -55138 8001 46358 -6880 -35784 8270 18626 -6739 -704 8542 16611 49730 36512 -30881
463 -30881 -25988 41101 45353 6199 -11905 -28788 -21262 26161 21479 -35064 -34231 -5500 -24508
476 -24508 -28936 4568 7820 -1508 2319 -24905 -36731 30530 70752 15246 -28175 -8922 19098
489 19098 52122 57902 -9038 -50472 6321 45837 10838 -11215 -7718 -12907 49 2622 -38554
$$ packed form
402A7519m255m7832K1207N7214l3233n7528K1545M2831J7821n383o3552n2516
414h6162P7540R7994l9143r2016k2462L0756N9820L8261o4341p5632M8768P5182
426D8565k3889m5736j936J4831L4009J2215o3620l1743Q4683N5998o4126p0320
438e1069m896M2758P4045J0212j05817o4554P3650P1608j7971m2587l6626l891
450e5138O3139L8357n3238k8904M4054J0356k5365O035R246Q069L3119j3218o7393
463c0881M893O7089M252l9154j8104j6883P526M7423m682n6543Q33K8731j9008
476b4508m428L3504L252r328L827k7224j1826O7261M0222n5506m3421J9253K8020
489A9098L3024N780o6940m1434N6793L9516l4999k2053L497n189J2956K573m1176
$$ plain form
502 -38554 -34417 32472 33507 -32786 -48287 -11491 26000 53126 17455 -61381 -47214 49196
514 49196 70256 10830 -27633 -31224 -4168 44504 30661 -36200 -29051 30002 22202 -19777 -21808
527 -21808 -7353 16830 38195 -7244 -63089 -14452 62234 43025 -18654 -45666 -38639 13588
539 13588 62622 14380 -60832 -39841 14576 13577 -1191 -11671 -28872 -9125 23060 -4412
551 -4412 -26377 17346 36424 -1818 -17311 -4762 7802 41227 45106 -18391 -44747 7731
563 7731 32476 5301 -9406 -21048 -30872 -2282 9359 -27581 -28046 7975 -7652 -39568 -19858
576 -19858 7129 17975 28390 -2506 -46274 -6983 62343 48060 -3544 -15552 -7140 19696
588 19696 50987 17991 -37914 -17594 22537 2224 -20508 -11297 -9311 -2647 2965 -34123 -51785
$$ packed form
502c8554M137O6889J035o6293j5501L6796L7491K7126l5671p8836J4167R6410
514D9196K1060n9426l8463l591K7056M8672j3843o6861P149N9053p800m1979k031
527b1808J4455K4183K1365m5439n5845M8637P6686j9209o1679k7012P027N2227
539A3588M9034m8242p5212K0991N4417r99j4768j0480j7201J9747L2185k7472
551d412k1965M3723J9078l8242j5493J2549J2564L3425L879o3497k6356N2478
563G731K4745k7175j4707j1642r824K8590J1641l6940m65L6021j5627l1916J9710
576a9858K6987J0846J0415l0896m3768L9291O9326j4283n1604j2008Q412K6836
588A9696L1291l2996n5905K0320M0131k0313k2732R211J986O664N612l7088j7662
$$ plain form
601 -51785 9631 47376 1323 -38160 -27443 1684 43625 50564 -13527 -47092 11318 54130
613 54130 27927 1549 -8157 -9753 18954 28011 -17089 -26369 22696 26724 -18217 -31168 -16674
626 -16674 4984 33981 13237 -51755 -44983 27326 44080 5602 -20418 -31783 -12535 37742
638 37742 34863 -19797 -21592 16471 12360 -3877 3709 1337 5942 23568 -1086 -33450 3225
651 3225 43964 15795 -18802 -21350 -14724 14718 40862 279 -44564 -15974 16192 969 -7932
664 -7932 -5627 -15576 -4257 9031 -18335 -24322 20117 25657 -17100 -26822 -5910 13105 36675
677 36675 25240 -32231 -37127 23617 41353 7780 -10148 -16089 -11041 19237 18241 -24501 -22467
690 -22467 14212 3885 -24470 -16903 -3778 5858 18064 -10964 -49806 -14894 42090 27322
$$ packed form
601e1785O1416L7745m6053l9483J0717K9127M1941O939o4091l3565N8410M2812
613E4130k6203k6378r706j596K8707R057m5100r280M9065M028m4941j2951J4494
626a6674K1658K8997k0744o4992O772P2309J6754l8478k6020j1365J9248N0277
638C7742k879n4660j795L8063m111j6237P586k372M605J7626k4654l2364L6675
651C225M0739k8169l4597k548O626K9442K6144m0583m4843K8590L2166j5223q901
664g932K305r949J1319J3288k7366n987M4439N540m2757r722K0912J9015K3570
677C6675j1435n7471m896O0744J7736l3573j7928n941N048L0278r96m2742K034
690b2467L6679j0327k8355P567J3125R636J2206k9028l8842L4912N6984j4768
$$ plain form
702 27322 -14231 -24494 -17028 13055 43959 12814 -34723 -11903 26958 14347 -2351 -1799 -6273
715 -6273 4642 17349 -14602 -34063 10711 35403 -2229 -29622 -25181 -8891 25491 32798 -21881
728 -21881 -48193 252 32281 14249 -1557 -12646 -16879 13790 28923 -5738 -13323 20398
740 20398 18189 -9255 -7328 2054 9197 27075 10051 -34694 -21627 28208 25704 -6235 -16724
753 -16724 -20774 -6870 25874 15294 -25163 -15319 14633 2663 -10061 1702 3249 7590 17098
766 17098 -7726 -27800 11598 41238 8981 -19825 -15488 -3624 22719 34915 -8143 -39904
778 -39904 -4428 24195 5761 -6824 -8080 -12250 4383 13320 -16974 -22585 16780 20905 -13933
791 -13933 -21202 -7334 6630 28631 15985 -34047 -32282 21737 33451 3519 -12107 -18062 -8923
$$ packed form
702B7322m1553j0263P466L0083L0904l1145m7537K2820L8861j2611j6698N52m474
715f273J0915J2707l1951j9461M4774K4692l7632k7393M441J6290L4382P307n4679
728b1881k6312M8445L2029j8032j5806j1089m233L0669J5133l4661p585L3721
740B0398k209k7444J927R382P143J7878j7024m4745J3067M9835k504l1939j0489
753a6724m050J3904L2744j0580m0457R844K9952j1970j2724J1763J547M341R508
766A7098k4824k0074L9398K9640l2257k8806M337J1864K6343J2196m3058l1761
778c9904L5476K8623j8434j2585j256m170J6633Q937l0294n611L9365M125l4838
791a3933p269J3868J3964K2001j2646n0032J765N4019J1714k9932j5626n955R139
$$ plain form
804 -8923 23338 19388 -21592 -18205 15515 8229 -11668 -7522 -4162 3340 18384 -5242 -38637
817 -38637 -10290 32154 16409 -13631 -20807 -19638 5185 33308 5649 -33475 -13219 15919
829 15919 7228 -77 227 -10131 -311 15571 -6895 -20298 12574 22913 -6807 -17270 -8596
842 -8596 -1924 18710 20846 -19526 -31659 8236 22419 1991 -5284 -8442 -10285 10940 16285
855 16285 -12686 -10547 19128 10130 -15357 -8365 2657 10034 21519 1168 -33738 -12646 31699
868 31699 21998 -9560 -16419 -13875 4706 30152 10275 -26930 -10272 20479 8451 -6150 -1178
881 -1178 -1588 7745 18521 -8509 -28889 7156 32613 5420 -17860 -16683 -7081 19453 30149
894 30149 -11709 -36716 -930 24471 8837 -2325 -7808 -12030 10004 20866 -9429 -18171 14462
$$ packed form
804h923L2261l950m0980L387L3720p286j9897M146L360P502J5044k3626l3395
817c8637K8347M2444j5745l0040p176J169K4823K8123k7659l9124K0256K9138
829A5919q691p305L04j0358R820J5882k2466j3403L2872J0339k9720j0463Q674
842h596O672K0634K136m0372j2133L9895J4183k0428p275l158j843K1225N345
855A6285k8971K139K9675q998k5487O992J1022P377J1485k0351l4906K1092M4345
868C1699r701l1558o859K544J8581K5446j9877l7205J6658L0751j2028j4601M972
881a178m10R333J0776k7030k0380L6045K5457k7193k3280J177R602K6534J0696
894C0149m1858k5007L5786K5401j5634j1162n483m222K2034J0862l0295q742L2633
$$ plain form
907 14462 18124 -5996 -9973 -5588 64 21047 13741 -27111 -25204 15338 21003 -384 -8525 -16477
921 -16477 -11279 17971 16201 -16786 -12891 11519 3463 -7274 944 -1047 227 12617 -3949
934 -3949 -25457 472 25732 4043 -15624 -12026 -9088 6589 21732 -3967 -28179 -2580 17149
947 17149 216 -6782 -1418 -4362 5037 11284 -13552 -18147 16148 21277 -11051 -19644 -8848 1952
961 1952 20191 13656 -27174 -29548 13297 23588 -1200 -11612 -12716 -5682 19200 16595 -17669
974 -17669 -13323 19310 14440 -7483 -6497 -2352 6285 22870 3594 -31218 -13163 24266 16274
987 16274 -7587 -15151 -17483 168 26548 7294 -27289 -12143 15136 8061 -55 657 -6555
1000 -6555 3443 19894 -440 -18361 7209 23212 3576 -7333 -6487 -6496 12145 22249 -9038
$$ packed form
907A4462L662k4120l977M385N652K0983p306m0852J907M0542N665k1387q141p952
921a6477N198K9250j770l2987L895K4410q056j0737Q218j991J274J2390j6566
934c949k1508K5929K5260k1689j9667L598K938J5677J5143k5699k4212K5599J9729
947A7149j6933o998N364k944R399O247k4836m595L4295N129l2328q593J0796J0800
961A952J8239o535m0830k374M2845J0291k4788j0412j104P034K4882k605l4264
974a7669M346L2633m870k1923R86M145Q637J6585j9276l4812J8055L7429p992
987A6274k3861p564k332J7651K6380j9254l4583J5146K7279p075q116P12p212
1000f555R998J6451k0334j7921K5570J6003j9636j0909Q46rJ8641J0104l1287
$$ plain form
1013 -9038 -25933 1249 14692 1412 -728 -4221 -11708 4424 13502 -7740 -9390 14531 9506
1026 9506 -9113 -3220 3582 4508 15837 6602 -21315 -9528 22263 13924 -8295 -8039 -7400 -1049
1040 -1049 16068 4071 -21070 -6436 16293 1248 -12841 -4061 -722 5562 13117 -9712 -27104
1053 -27104 4277 27407 3263 -16800 -13303 -5824 13688 23209 -9282 -30370 142 21104
1065 21104 4096 -7098 -8235 -8608 9932 17120 -12387 -21684 10850 18741 -4044 -12018 -10116
1078 -10116 -3083 18616 15838 -21862 -26012 9195 18341 1467 -7081 -15012 -10984 15536 15437 -15416
1092 -15416 -15048 9302 7029 -3569 -546 -4342 -1747 15198 4859 -20468 -6373 17342 7426
1105 7426 -5131 -5113 -10326 -655 18551 3703 -19284 -4231 10943 -426 -2566 3121 -4198 355
$$ packed form
1013i038j6895K7182J3443j3280k140l493p487J6132R078k1242j650K3921n025
1026I506j8619N893O802R26J1329r235k7917J1787L1791q339k2219K56O39O351
1040a049J7117j1997k5141J4634K2729j5045j4089Q780L339O284P555k2829j7392
1053b7104L1381K3130k4144k0063L497P479J9512R521l2491k1088L0512K0962
1065B1104j7008j1194j137l73J8540P188k9507r297L2534P891k2785p974J902
1078a0116P033K1699k778l7700m150L5207R146j6874q548p931M028K6520r9l0853
1092a5416L68K4350k273j0598L023l796K595J6945j0339k5327J4095K3715r916
1105G426j2557J8n213R671J9206j4848k2987J5053J5174j1369k140N687p319M553
$$ plain form
1119 355 10485 -4971 -12264 12122 16823 -5652 -8538 56 1522 12389 13284 -13416 -16587 13075
1133 13075 16393 -3855 -5824 -2884 -2749 10495 8599 -15931 -9693 18189 10179 -11782 -8894 -1204
1147 -1204 5864 17878 2560 -25970 -9148 24320 15568 -7370 -10778 -9285 4635 23247 5642
1160 5642 -23407 -7597 17812 7808 -5488 -5743 -7120 4984 18454 -3988 -24556 161 20738
1173 20738 5056 -8491 -10346 -9689 9845 22870 -5603 -25514 -1345 15119 4909 -863 -6417
1186 -6417 -12150 5458 15885 -7512 -15814 5632 8618 -4651 -3813 -4619 -6237 9846 10120 -15755
1200 -15755 -15284 9397 8767 -3011 -2240 -7218 -7857 10249 8415 -12650 -6349 10237 116 -7255
1214 -7255 1968 -468 -750 9236 -2797 -17544 2070 17567 -108 -10478 -4397 -3512 5009 14211
$$ packed form
1119C55J0130j5456p293K4386M701k2475k886Q594J466J0867Q95k6700l171K9662
1133A3075L318k0248j969K940J35J3244j896k4530O238K7882q010k1961K888P690
1147a204P068J2014j5318k8530J6822L3468q752k2938l408J493J3920J8612j7605
1160E642k9049J5810K5409j0004j3296k55j377J2104J3470k2442k0568K4717K0577
1173B0738j5682j3547j855O57J9534J3025k8473j9911K4169J6464j0210n772n554
1186f417n733J7608J0427k3397q302K1446K986j3269Q38q06j618J6083K74k5875
1200a5755M71K4681o30j1778P71m978o39J8106j834k1065O301J6586j0121p371
1214g255R223k436k82R986j2033j4747J9614J5497j7675j0370O081Q85Q521R202
$$ plain form
1228 14211 -5323 -19483 3119 15540 -1865 -7280 -1100 -2428 6883 10905 -11060 -15381 12679
1241 12679 17523 -5538 -11211 -4795 976 15978 12689 -17973 -18948 13093 17790 -1269 -7670 -8282
1255 -8282 -3786 16034 12192 -15994 -12887 13850 11495 -4013 -5044 -5357 1233 18325 6632 -20561
1269 -20561 -8652 17686 12015 -2069 -5667 -10025 1028 20295 6657 -18548 -6464 11324
1281 11324 4963 -684 -405 -8119 284 14285 -1324 -15814 2258 12858 -353 -4097 -2323
1294 -2323 -6488 5994 15245 -5639 -15984 3943 9954 -1529 -169 -1236 -7591 4103 9677
1307 9677 -9135 -9180 9991 4850 -8872 -3350 -147 -1658 8906 3140 -17349 -7591 14921 6566
1321 6566 -7989 -4766 -4525 -436 12098 2649 -17035 -3387 14325 1402 -8795 -2473 -2177 3411
$$ packed form
1228A4211j9534j4160K2602J2421j7405n415O180j328R311M022k1965m321K8060
1241A2679M844k3061n673O416N771J5002l289l0662r75L2041M697j9059o401o12
1255h282M496J9820l842k8186L107K6737k355j5508j031l13O590J7092j1693k7193
1269b0561J1909K6338n671j4084l598m358J1053J9267j3638k5205J2084J7788
1281A1324o361n647K79p714Q403J4001j5609j4490J8072J0600j3211l744J774
1294b323m165J2482R251k0884j0345J9927O011j1483J360j067o355J1694N574
1307I677j8812m5J9171n141j3722N522L203j511J0564n766k0489R758K2512q355
1321F566j4555L223K41M089J2534r449j9684J3648J7712j2923j0197O322K96N588
$$ plain form
1335 3411 11798 -5547 -20049 2325 18151 1030 -10688 -7592 -5368 7760 15381 -7853 -21546
1348 -21546 1571 14905 832 -5499 -5605 -6534 7659 13748 -9707 -15945 7932 13550 -2261
1361 -2261 -5835 -5801 -3234 13341 12912 -13358 -15901 9291 12562 257 -2881 -7807 -6175 12774
1375 12774 11443 -11962 -9364 9134 5695 -2308 234 -4341 -1677 13071 4836 -14829 -3683
1388 -3683 13218 4673 -2724 -1174 -6533 142 14689 2642 -14120 -822 10402 -158 -1107
1401 -1107 2190 -3886 1710 10350 -3896 -11495 7678 11574 -4057 -4746 -574 -2062 7749 10032
1415 10032 -10470 -12813 8872 10020 -4094 -3638 -2475 -3278 7908 7461 -12134 -7707 12644 7208
1429 7208 -6955 -4072 -1627 1426 12458 3144 -17853 -6428 14862 6957 -6484 -6249 -7250 135
$$ packed form
1335C411Q387j7345j4502K2374J5826j7121j1718L096K224J3128P621k3234j3693
1348b1546K3117J3334j4073o331j06r29J4193O089k3455o238K3877N618j5811
1361b261l574L4K567J6575m29k6270k543K5192L271j2305l138m926J632J8949
1375A2774j331k3405K598J8498l439q003K542m575K664J4748q235j9665J1146
1388c683J6901q545p397J550n359O675J4547j2047j6762J3298J1224j0560r49
1401a107L297o076N596Q640j4246p599J9173L896j5631o89M172j488R811K283
1415A0032k0502k343K1685J148j4114M56J163q03J1186m47j9595M427K0351n436
1429G208j4163K883K445L053J1032r314k0997J1425K1290p905j3441K35j001P385
$$ plain form
1443 135 13722 1558 -18231 -5076 12222 3226 -5240 -3701 -5994 2550 13407 -3064 -17521
1456 -17521 871 14404 2078 -5684 -6015 -7005 5598 14534 -5999 -18469 566 10057 150
1469 150 -2415 -4648 -8006 5393 11747 -7280 -11531 6976 8196 -2507 -1525 -2846 -4138 9262
1483 9262 8993 -11866 -10668 7811 5836 -3208 -1737 -6159 -5728 8622 5884 -11619 -5216 9633
1497 9633 1864 -3804 2020 -1127 383 11317 1872 -11781 2261 13976 1710 -4236 -778 -3274
1511 -3274 2948 11127 -3358 -14751 1491 9751 -2884 -5170 -1312 -3976 3951 9319 -7006 -11098
1525 -11098 9294 12723 -2267 -3845 -585 207 11489 11308 -9726 -10964 10260 11312 -2222 -3489
1539 -3489 -4765 -3393 9793 6989 -13147 -9521 9609 6038 -5125 -3704 -4641 -453 12822 4083
$$ packed form
1443A35J3587j2164j9789J3155J7298q996q466J539k293Q544J0857j6471j4457
1456a7521J8392J3533j2326p762l31r90J2603Q936k0533j2470J9035R491r907
1469A50k565k233l358J3399O354j9027m251J8507J220j0703R82j321j292J3400
1483I262k69k0859J198J8479j975r044J471m422M31J4350k738j7503O403J4849
1497I633p769n668N824l147J510J0934r445j3653J4042J1715j2266n946L458k496
1511c274O222Q179j4485j1393J6242Q260j2635k286L858k664P927N368j6325m092
1525a1098K0392L429j4990j578L260P92J1282j81k1034j238K1224J052j3534j267
1539c489j276J372J3186k804k0136L626J9130l571j1163J421r37M188J3275q739
$$ plain form
1553 4083 -14988 -5674 12758 6592 -2241 -2932 -6795 388 14128 3045 -14277 -3538 9503
1566 9503 2199 -2424 -1381 -6801 682 10957 -2586 -14016 946 8725 -1183 -3267 -3360 -7122
1580 -7122 3107 11014 -5989 -13177 2603 6156 -2302 -667 -2190 -6765 4947 8568 -6814 -7546
1594 -7546 7918 5107 -4143 -45 -806 -2246 7714 5271 -11102 -6037 9156 3077 -5513 -2619
1608 -2619 -4549 -3480 7510 1002 -13840 -3537 9457 -78 -6065 -1332 -1939 1959 10221 -1642
1622 -1642 -12499 3010 13593 1904 -3921 -1569 -2536 6076 12832 -3388 -13421 3588 11085
1635 11085 -245 -3896 -2923 -4539 5230 9349 -8360 -12446 6024 8960 -2355 -3882 -3991 -3473
1649 -3473 9672 9976 -9759 -10270 8931 9550 644 222 -3455 -2171 11731 9295 -8719 -5486 9030
$$ packed form
1553D083j9071R314J8432o166q833o91l863P183J3740j1083j7322J0739J3041
1566I503p304m623J043n420P483J0275j3543j1430J4962P779r908k084r3l762
1580g122J0229P907j7003p188J5780L553q458J635j523m575J1712L621j5382p32
1594g546J5464k811r250M098p61j440R960k443j6373N065J5193o079q590K894
1608b619j930J069J0990o508j4842J0303J2994r535n987M733o07L898Q262j1863
1622a642j0857J5509J0583j1689n825K352r67Q612O756j6220j0033J7009P497
1635A1085j1330l651R73j616R769M119j7709m086J8470K936j1315j527j09N18
1649c473J3145L04j9735n11J9201O19q906m22l677J284J3902k436j8014L233J4516
$$ plain form
1664 9030 4998 -1420 24 -4732 -2275 9594 3030 -13493 -5138 7244 895 -3123 -2132 -7118
1678 -7118 -1848 10265 1338 -10941 -107 8387 984 681 2719 -2762 2948 10791 -1017 -8107
1692 -8107 5569 8158 -2271 -2335 -1459 -4852 2482 5929 -9068 -11764 3292 3422 -6185 -3612 -2804
1707 -2804 -4854 4301 5072 -9217 -5566 9675 5275 -4115 -745 -165 514 9686 3594 -11489 -3854
1722 -3854 10341 3600 -5036 -3626 -5129 -1564 8511 -510 -14461 -3569 8370 43 -5072 -2599
1736 -2599 -5020 1884 10313 -2374 -13202 1310 10652 1363 -2546 -2793 -4760 4792 12168 -3312
1750 -3312 -12072 2644 8573 1173 -393 -2289 -5004 5697 10334 -5475 -9408 5221 6422 -1471
1764 -1471 -781 -3536 -5390 6193 7262 -8951 -8557 4953 3863 -1404 -122 -4065 -3710 8167 6798
$$ packed form
1664I030m032o418J444m756K457J1869o564j6523Q355J2382o349m018R91m986
1678g118N270J2113q927j2279J0834Q494p403l03K038n481N710P843j1808p090
1692h107J3676K589j0429o4Q76l393P334L447j4997k696J5056J30r607K573Q08
1707b804k050R155P71j4289L651J5241m400r390L370N80O79R172o092j5083P635
1722c854J4195o741q636J410j503L565J0075r021j3951J0892J1939q327n115K473
1736b599k421O904Q429j2687j0828J4512R342r289l909k47j967R552P376j5480
1750c312q760J4716N929p400j566j896k715J0701M637j5809l933J4629J201p893
1764a471O90k755j854J1583J069j6213L94J3510j090n267J282l943L55J1877j369
$$ plain form
1779 6798 -6637 -2060 8519 3373 78 3712 -513 484 9748 3043 -8282 226 8040 -100
1793 -100 -3148 -945 -5092 -1304 6594 -3330 -10975 268 5568 -2880 -2417 340 -2844 3383 7912
1808 7912 -3730 -6631 7807 9128 -1263 -1022 655 -900 7055 7262 -7935 -8252 6354 5130
1822 5130 -4182 -3664 -4376 -4343 5163 3207 -11096 -7178 6773 3145 -4591 -2506 -3879 -999 9237
1837 9237 2979 -11341 -3638 9351 4515 -1976 -1623 -4896 -37 10500 1460 -11491 -2395 7172
1851 7172 1140 -2296 -1789 -6120 129 8432 -2577 -11241 -330 6029 -600 -1912 -2835 -6099 2344
1866 2344 8712 -3298 -9089 2481 5607 -296 1157 -632 -4459 4191 8041 -4422 -5803 5288
1880 5288 3540 -2561 423 -1782 -3392 5206 4425 -7806 -4708 5796 1647 -2733 368 -2340 -2095
$$ packed form
1779F798j3435M577J0579n146l295L634m225R97R264o705j1325Q508P814q140
1793a00l048K203m147L788P898r924p645J1243N300q448M63K757l184O227M529
1808G912j1642k901J4438J321j0391K41J677j555P955K07j5197l17J4606j224
1822E130r312N18p12L3R506j956j4303L918J3951l628p736K085j373K880J0236
1837I237o258j4320P703J2989m836o491L53l273M859J0537r040j2951R096R567
1851G172o032l436N07m331O249Q303j1009q664J0911O359o629j312r23l264Q443
1866B344O368j2010n791J1570L126n903J453j789l827Q650L850j2463j381J1091
1880E288j748o101K984k205j610Q598p81j2231L098J0504m149m380L101k708K45
$$ plain form
1895 -2095 6729 2998 -7332 -459 7647 1011 -1989 1529 -896 1080 7849 -503 -8650 1614
1909 1614 8364 -137 -2787 -774 -2801 2766 8247 -3144 -9009 3467 7594 -539 -1684 -617
1923 -617 -2824 4655 7280 -5149 -7660 5488 6535 -1848 -2080 -2640 -2813 6460 6246 -7704 -7859 5784
1939 5784 5446 -874 -1042 -3388 -2552 7923 5693 -7945 -4324 6085 3135 -1366 -367 -3870 -2081
1954 -2081 7224 2196 -10192 -3909 5127 607 -1999 -1392 -5696 -1478 7897 584 -8749 -837 4873
1969 4873 145 -114 707 -4035 339 7067 -1987 -7319 2032 4359 -2031 -1355 -1222 -4766 1410 5181
1985 5181 -5380 -7072 3354 3192 -2818 -273 -750 -3393 4165 5003 -5439 -3795 5965 2372 -3193
2000 -3193 -564 -1764 -1914 5410 1961 -8772 -3113 6361 1412 -3023 -1059 -2476 -146 7353 1156
$$ packed form
1895b095Q824l731j0330O873Q106o636l000L518k425J976O769q352q147J0264
1909A614O750q501k650K013k027N567N481j1391n865J2476M127q133j145J067
1923f17k207P479K625j2429k511J3148J047q383k32n60j73R273k14j3950j55J3643
1939E784l38o320j68k346Q36J0475k230j3638L621J0409k950m501R99l503J789
1954b081R305n028j2388O283R036m520k606O07m304M218R375p313r333P912N710
1969D873m728k59Q21m742M374O728r054n332R351K327o390O76J33l544O176L771
1985E181j0561j692J0426j62o010K545m77k643P558Q38j0442J644R760l593n565
2000c193K629j200j50P324l449j0733N659R474m949m435J964j417K330P499o197
$$ plain form
2015 1156 -8126 -170 7721 1735 -1547 453 -2048 2385 7807 -1424 -8793 869 6821 -3 -2627
2030 -2627 -2312 -4097 2579 7749 -3315 -8654 2096 6164 455 186 -681 -2994 4919 8067 -3058
2045 -3058 -5395 5401 5461 14 701 -1590 -2834 5676 5626 -6326 -5659 3997 2546 -1429 -2 -3479
2061 -3479 -3646 5010 3678 -6921 -3050 4475 903 -1055 1033 -2201 -1346 6630 1850 -6001 136
2076 136 6257 723 -575 931 -3118 449 6273 -715 -7219 679 3913 -2352 -1731 -640 -4457
2091 -4457 50 3898 -4819 -7240 2615 3087 -3219 -1940 -1180 -2668 3634 5113 -4829 -4703 5584
2106 5584 4473 -1034 272 -746 -1716 5342 3867 -6381 -3886 4645 1196 -3670 -2051 -3817 -2991
2121 -2991 4536 341 -9300 -3609 4955 1393 -2051 -1053 -3353 148 7693 2241 -6323 428 6267
$$ packed form
2015A156r282P956P891n986l282K000k501M433N422r231p369R662N952o824k624
2030b627L15j785O676N170j1064n339J0750M068n709k69q67k313P913L148j1125
2045c058k337J0796O0n447O87k291j244Q510n0j1952O67R656j451l975J427l477
2061c479j67Q656j332j0599L871P525l572j958K088l234Q55P976m780p851O137
2076A36O121n534j298J506m049L567N824o988o504P898L234o265O21J091l817
2091d457M507L848q717k421R855M72o306J279P60j488O302J479r942J26J0287
2106E584j111n507J306j018r70P058j475j0248K495Q531l449m866J619j766Q26
2121b991P527m195r641N691Q564l562l444R98k300L501P545n452q564O751N839
$$ plain form
2136 6267 1675 1 665 -3116 852 7194 -985 -7268 594 4310 -626 -1137 -1735 -4398 1919 6324
2152 6324 -2789 -6615 2051 3690 -432 829 -817 -3399 3691 5957 -3688 -3947 3960 2496 -1179
2167 -1179 808 -784 -1926 4968 4601 -5019 -1895 5949 2566 -254 2043 -1029 -900 5999 2434
2182 2434 -5976 -1331 3892 -943 -3028 -359 -3524 -1948 3815 -1941 -7714 44 4322 -1059 -1291
2197 -1291 460 -1633 2417 7959 342 -3820 4111 6492 779 948 587 -2233 2104 4711 -4740
2212 -4740 -6725 1612 1168 -4605 -3439 -4278 -4856 1682 2471 -6779 -5564 3341 2861 -845 886 -522
2228 -522 -788 6747 5420 -3788 -1214 5880 2437 -1058 155 -2680 -2227 4045 -158 -8374 -3415 2321
2244 2321 -1311 -2812 -2296 -4986 -1625 5113 114 -6279 245 4430 162 698 1558 -2080 1424 6329
$$ packed form
2136F267m592j674O64l781L968O342q179o283P862L716m936n11n98k663O317M405
2152F324r113l826Q666J639m122J261j646k582P090K266r645k59P907j464l675
2167a179J987j592j142O894l67r620L124P844l383k820K297l072J29O899l565
2182B434q410M645N223m835k085K669l165J576N763n756n773P758M278n381k32
2197a291J751k093M050N542p617m162P931K381n713J69l61k820M337K607r451
2212d740j985Q337m44n773J166q39n78O538P89r250J215Q905m80l706J731j408
2228e22k66P535j327r208K574P094l443l495J213k835M53O272m203q216M959N736
2244B321l632j501N16k690L361O738m999o393O524M185m268N36Q60l638L504M905
$$ plain form
2260 6329 -780 -4986 2474 3893 -1205 -284 -603 -3558 1889 4663 -3341 -5127 2765 2528 -1463 650
2276 650 -596 -2782 3310 4107 -3784 -2867 4042 1533 -2247 356 -1167 -1699 4356 2057 -5605 -1996
2292 -1996 4846 1785 -645 1251 -1177 173 6300 2517 -4270 756 5131 568 -566 609 -2253
2307 -2253 -238 4384 -1496 -6591 125 3583 -1713 -1959 -1117 -3383 1187 5573 -1691 -5140 2758
2322 2758 4462 358 1492 1009 -1464 3442 6060 -2369 -3377 3741 2531 -1670 -787 -2275 -3227 2569
2338 2569 1917 -6239 -4835 2384 332 -2463 -522 -3006 -2846 3610 2527 -4817 -1618 4419 987
2353 987 -720 1277 -1561 -383 5131 845 -5288 -35 4246 -222 -1490 -221 -3375 -746 4287
2368 4287 -1377 -6368 38 2407 -1878 -1126 -347 -3246 439 3907 -2526 -4348 2791 2708 -1177 -36
$$ packed form
2260F329p109m206P460J419n098R21l19k955N447K774q004j786P892k37l991K113
2276F50j246k186O092P97p891R17O909k509l780K603j523n32O055k299p662L609
2292a996O842l061k430J896k428J350O127l783o787N026M375m563j134J175k862
2307b253K015M622n880n095O716L458n296k46Q42k266M570M386p264l449P898
2322B758J704m104J134m83k473M906K618q429j008P118j210m201Q83j488r52N796
2338B569o52q156J404P219k052k795J941k484J60O456j083p344L199O037l432
2353I87j707J997k838J178N514m286o133N253M281m468j268J269l154K629N033
2368D287n664m991O406K369m285P52P79k899L685L468o433j822P139q3l885J141
$$ plain form
2384 -36 72 -1877 2974 4554 -2785 -3221 3487 2229 -825 801 -703 -2602 3353 2719 -4451 -2212
2400 -2212 3296 500 -2395 -144 -1734 -1751 4087 1442 -5332 -857 4365 603 -443 1224 -1545
2415 -1545 27 5418 1345 -4299 1040 4194 0 -195 884 -1787 610 4405 -1168 -4933 1570
2430 1570 3567 -1305 -1050 -239 -2486 2060 4584 -2427 -4419 2484 2749 -688 410 -336 -2218 2616
2446 2616 3871 -3149 -2971 3531 1794 -1827 357 -1024 -1661 3702 2624 -4631 -2309 3674 1345
2461 1345 -1390 667 -2160 -1744 3836 1567 -4979 -1001 3077 -981 -939 439 -2294 -1006 3879 -650
2477 -650 -5188 340 3617 -676 -840 -75 -2958 383 4419 -1325 -4805 1182 2228 -1372 -400 -177
2493 -177 -2814 722 3048 -2898 -3896 2327 1635 -2237 -100 -945 -2212 2418 2840 -4352 -3219 3342
$$ packed form
2384c6J08j949M851J580p339m36O708j258l054J626j504j899N955o34p170K239
2400b212N508k796k895K251j590j7N838k645o774M475N222l762j046J667k769
2415a545J572N391m073n644N339L154m194j95J079k671K397L795n573l765O503
2430A570J997m872K55Q11k247M546K524p011j992O903K65l437J098p46j882M834
2446B616J255p020J78O502j737l621K184j381o37N363j078p255K322N983k329
2461A345k735K057k827M16N580k269o546L978M078m058M2J378k733J288M885m529
2477f50m538N528L277m293j64P65k883L341M036n744l480N987J046l600R72K23
2493a77k637L536K326n946r98O223o92l872K137q45j267M630M22p192J133O561
$$ plain form
2509 3342 1228 -1557 351 -1363 -2291 3041 2220 -4563 -1559 3364 293 -1718 431 -1441 -746 4276
2525 4276 709 -4674 -16 3884 228 -625 71 -2089 -122 4423 98 -4686 773 2981 -606
2540 -606 -463 464 -2213 930 4077 -1499 -3847 2255 3291 -765 19 -8 -1958 2374 4292 -2481
2556 -2481 -3525 2637 2405 -895 780 -853 -2467 2685 3120 -3007 -2251 3397 842 -1543 934 -643
2572 -643 -1576 3852 1904 -4128 -1229 3613 398 -1157 433 -2237 -1249 3648 908 -4747 -229 2913
2588 2913 -828 -517 990 -1473 156 4051 -357 -3619 1754 3386 -745 -28 62 -2223 898 3467
2604 3467 -2608 -4946 1118 1203 -2494 -1017 -1187 -3494 892 2449 -3238 -3162 3253 1661 -993 930
2620 930 -189 -848 3481 2993 -3637 -1901 3233 1115 -1353 -92 -2181 -2780 2380 629 -5220 -2500
$$ packed form
2509C342k114k785J908j714r28N332q21o783L004M923l071k011K149j872O95N022
2525D276l567n383M658L900l656q53O96k160J967M545m325m784N459K208l587
2540f06J43R27k677L143L147n576k348O102J036m056P84k7j950M332J918o773
2556b481j044O162k32l300J675j633j614N152M35o127P56N648k555k385K477j577
2572f43r33N428j948o032K899M842l215j555J590k670R88M897k740n655M518L142
2588B913l741L11J507k463J629L895m408l262N373J632m131P17R0k285L121K569
2604C467o075k338O064Q5l697J477j70k307M386J557n687P6O415j592k654J923
2620I30j119o59M329m88o630J736N134k118k468J261k089n99N160j751n849K720
$$ plain form
2636 -2500 1772 -1234 -1944 48 -2285 -944 3849 531 -3978 826 4179 475 513 1136 -1336 853
2652 853 4752 -10 -3932 638 2118 -1392 -361 -350 -3022 -193 3169 -2533 -3660 1919 1969 -943
2668 -943 571 128 -1509 2893 4227 -2036 -2099 3327 1907 -545 942 -736 -2177 2597 2261 -3569
2684 -3569 -1629 2897 -135 -1248 1300 -735 -924 3828 1805 -3783 -89 3736 540 -496 880
2699 880 -1629 -632 3684 43 -4593 -343 1921 -1455 -770 424 -2269 -194 3348 -881 -3429 1991
2715 1991 3240 -413 843 805 -1361 2253 4475 -1585 -3200 2057 1586 -1463 -65 -1418 -3490 671
2731 671 1848 -4000 -3508 1640 -26 -2030 151 -1086 -1362 3022 2523 -3145 -806 3972 1521 65
2747 65 1358 -1262 -1414 3415 1351 -4340 -1283 1671 -1546 -1659 -316 -3179 -1687 2190 -1053 -4645
$$ packed form
2636b500M272l006p10J992k333J341M793l318m509M804L353l704L8O23k472K189
2652H53L899m762l922M570J480l510J031J1k672K829L362n702j127N579N0k912
2668i43J514m43j637M402J334o263o3N426j420k452J487j678j441M774l36n830
2684c569J940M526l032j113K548k035j89M752k023n588L694L825l196j036J376
2699H80k509R97M316l641m636M250K264l376O85J194k693K075L542m229k548N420
2715A991J249l653J256l8k166L614K222o060j615N257m71l049J398j353k072M161
2731F71J177n848M92N148j666k004K181j237k76M384m99n668K339M778k451j456
2747F5J293k620j52M829k064n691L057K954l217j13J343k863J492L877l243l592
$$ plain form
2763 -4645 209 2308 -787 74 771 -1925 917 4454 -247 -2564 1892 2198 -1030 766 277 -2279
2779 -2279 720 2733 -2355 -2808 1553 605 -2072 123 -371 -2195 2197 2383 -3087 -2122 3056 987
2795 987 -802 1289 -645 -1610 2900 2015 -3151 -825 2982 -154 -1296 1165 -647 -848 3438 1020
2811 1020 -3367 689 3399 -57 -220 1052 -1557 138 3861 119 -3914 999 2418 -933 250
2826 250 90 -2424 455 2897 -1484 -3266 2077 1841 -1113 420 233 -1527 2213 3729 -1824 -2426
2842 -2426 2662 1649 -547 956 -404 -1981 1514 2101 -2963 -2247 1966 -112 -1874 613 -1326
2857 -1326 -1931 2299 1143 -3924 -1101 2645 246 -469 990 -1499 -807 3562 759 -3300 183 2122
2873 2122 -839 -387 724 -2082 -812 2778 -727 -3397 854 1554 -1721 -495 -190 -2552 399 3339
$$ packed form
2763d645M854K099l095Q61O97k696K842L537m701k317M456L06l228J796m89k556
2779b279K999K013n088m53M361r48k677K195m94j824M392J86n470R65N178k069
2795I87j789K091j934r65M510q85n166K326L807l136j142K461j812k01M286k418
2811A020m387M056K710l456j63J272k609J695L723l742m033M913J419l351J183
2826B50j60k514K879K442m381j782N343k36k954J533j87j760L740J516n553o02
2842b426N088j013k196J503j360j577L495N87n064P16M213k078j762K487j939
2857a326o05M230j156n067K823L746k399p15J459k489O92M369k803m059L483J939
2873B122k961M52J111k806J270L590l505k670M251P00l275J226L05k362K951K940
$$ plain form
2889 3339 -1689 -3370 1484 1433 -1330 547 232 -1984 1260 2765 -2175 -1622 2617 712 -1562 468
2905 468 -311 -1472 2329 1825 -3322 -1272 2749 222 -1170 1049 -1513 -1664 2419 1007 -3186 -420
2921 -420 2671 -836 -750 1196 -753 -273 3099 354 -3133 1049 3146 -374 -38 643 -1463 521
2937 521 3461 -803 -3163 1063 1821 -900 383 300 -2375 648 2630 -1736 -2540 2168 1521 -1107
2953 -1107 709 -183 -1635 2109 3019 -2544 -1819 2524 1218 -407 1172 -540 -1619 2254 1961 -2499
2969 -2499 -1030 2077 -127 -924 1099 -926 -1479 2399 848 -3474 -248 2227 -512 -986 716 -1618
2985 -1618 -1108 2905 45 -3294 405 2017 -1082 -270 970 -1815 -156 2506 -1332 -2756 1594
3000 1594 1418 -1786 -156 -223 -2039 438 2462 -2531 -3003 1846 1014 -1262 377 -396 -2068 1377
$$ packed form
2889C339n028j681M854n1k763J877l15k216L244J505m940N53M239j905k274K030
2905D68p79j161L801n04n147K050M021k527j392K219k562j51M083j412m193K766
2921d20L091l507Q6J946j949M80L372k745l487M182K097l520L36O81k106J984
2937E21K940m264k360M226P58k721J283q3k675L023J982m366q04M708o47k628
2953a107J816q92j452L744R10n563P25M343j306j625J579j712j079L873k93m460
2969b499J469L107k204p97K023k025n53L878j551m322L226K475k739m74J702k334
2985a618N10M013k860l339L699J612l099Q12J240k785J659K662l838j424M350
3000A594j76l204J630o7j816K477K024m993m72M849q32k276J639p73j672L445
$$ plain form
3016 1377 2270 -2644 -1532 2235 213 -1419 514 -829 -1501 2079 1099 -3510 -1173 2470 -121 -990
3032 -990 426 -1431 -1003 2950 926 -3065 -191 2414 -151 -295 818 -1531 -418 2782 -455 -3332
3048 -3332 840 2212 -795 -353 -38 -2175 320 3442 -774 -2731 1001 1825 -630 1018 497 -1611
3064 -1611 1238 3143 -1370 -1900 2396 569 -945 774 -37 -1761 1820 2376 -2524 -1651 2114 186
3080 186 -323 1303 -798 -1753 2246 1724 -1940 11 2694 -125 -559 1565 -672 -701 2567 513 -2802
3097 -2802 617 2220 -1015 -657 208 -1773 -294 2634 -519 -2733 896 1689 -732 84 730 -1400
3113 -1400 631 2602 -1406 -2599 1730 1349 -1466 -19 -607 -1672 1149 2098 -2644 -2608 1553 576
3129 576 -939 552 -822 -1927 1862 1940 -2328 -1152 2406 470 -891 487 -878 -1127 2173 1093
$$ packed form
3016A377Q93m914J112L767k022j632J933j343o72L580r80m609K337L643k591q69
3032i90J416j857M28L953k024l991K874K605k565j44J113k349J113L200l237k877
3048c332M172J372l007M42L15k137K495L122m216j957L732Q24k455J648n21k108
3064a611K849J905m513n30M296j827j514J719q11j724L581N56m900Q73L765j928
3080A86n09J626k101r55L999n22l664J951K683k819m34K124k237k9L268k054l315
3097b802L419J603l235L58Q65j981J479K928l153k214L629P93k421Q16O46k130
3113a400K031J971m008j193M329l81k815J447n88j065K821R49m742L6M161r77
3129E76j515J491j374j105L789P8m268J176L558j936j361J378j365k49L300j080
$$ plain form
3145 1093 -3301 -1094 1808 -561 -1081 96 -1974 -1604 2518 353 -3067 348 1734 -620 209 929
3161 929 -1560 59 2843 171 -2372 1280 1536 -802 -23 239 -1745 238 2689 -1502 -2641 1250
3177 1250 473 -1023 866 191 -1803 1046 2264 -1370 -1050 2543 480 -1057 1265 -132 -1047 1932
3193 1932 1544 -2272 -467 2287 373 -598 516 -900 -1274 2292 1225 -2320 -5 2175 -169 -420
3209 -420 1022 -954 -192 2809 339 -2803 1022 1985 -471 82 293 -1847 382 2480 -633 -2899
3225 -2899 785 1399 -715 562 537 -1858 656 2498 -1440 -1929 1852 1070 -795 427 -111 -1504
3241 -1504 1315 2133 -2221 -1887 1670 20 -722 344 -834 -2083 1773 1708 -2395 -948 1244 -225
3257 -225 -459 949 -1079 -961 2272 673 -2507 -355 2011 -793 -309 542 -1333 -713 2186 -22
$$ packed form
3145A093m394K207K902k369n20J177k070L70M122k165l420L415J386k354Q29P20
3161I29k489J619K784k672k543L652K56k338P79K62j984J983K451m191j139L891
3177A250p77j496J889o75j994K849J218l634L20L593k063j537K322j397r15K979
3193A932l88l816J805K754j914r71J114j416l74L566j067l545K315K180k344k51
3209d20J442j976P62L001k470l142L825R63k456N53K11k140K229K098l113k266
3225b899L684O14k114J277k5k395K514J842l938m89L781p82j865J222n38j393
3241a504K819Q18m354L34L557j650p42J066j178j249L856o5m103J447K192j469
3257b25k34J408k028J18L233j599l180K152K366k804M84Q51j875O20K899k208
$$ plain form
3273 -22 -2444 39 1071 -1014 -145 599 -1601 -311 2068 -883 -1997 1394 1178 -1157 238 233 -1395
3290 -1395 880 2175 -1665 -1908 1365 849 -1019 624 -90 -1500 915 1852 -1937 -1100 2123 15
3306 15 -726 487 -339 -846 2144 1424 -2324 -491 2545 232 -132 659 -773 -869 2507 834 -2445
3323 -2445 105 1699 -266 34 1024 -1221 -268 2411 -170 -2287 926 1830 -201 95 187 -1743 305
3340 305 2478 -443 -1796 1054 995 -697 442 60 -1576 764 2286 -1217 -1480 1435 411 -595
3356 -595 706 -269 -1396 1281 1396 -1799 -1048 1624 -9 -651 1059 -930 -1331 1590 841 -2089 -394
3373 -394 1400 -924 -729 502 -1098 -594 1988 242 -2612 459 1458 -797 -458 207 -1445 -285
3389 -285 2141 -505 -2287 430 1196 -777 -79 364 -1946 6 1807 -1401 -2083 1525 656 -966
$$ packed form
3273b2k422K483J032k085Q69P44k200J290K379k951j114L391k16k335J395nj628
3290a395K275J295l840k43L273n16j868J643p14j410K415R37l789Q37L223k108
3306A5p41J213q26n07K990p20l748J833L036k313l64P91j432r6L376j673l279
3323b445K550J594j965L00R90k245R53K679k581k117L213R04k031K96R2j930K048
3340C05K173k921j353K850n9j692J139l82j636K340J522l503k63K915j024j006
3356e95J301r75j127K677J15l195P51K672j633o42J710j989m01K921p49k930J695
3373c94J794k324J95J231j600N04K582j746k854L071R99k255L39O65j652J160
3389b85K426k646j782K717P66j973O98M43k310J952J801l208o82L608q69j622
$$ plain form
3405 -966 -21 -334 -1307 830 1669 -1913 -1601 1447 434 -606 808 -746 -1632 1310 974 -2032 -832
3422 -832 1279 120 -860 522 -673 -1002 1947 570 -2289 -221 1403 -2 -191 702 -967 -530
3438 -530 2626 678 -1996 190 1055 -135 174 1148 -1027 -186 2051 -207 -1727 1520 1156 -844
3454 -844 518 369 -1136 359 2264 -793 -1566 1315 710 -679 952 131 -1225 531 1659 -1529
3470 -1529 -1073 1559 839 -1018 803 -213 -1223 1540 1226 -1887 -689 1636 203 -457 1093 -650
3486 -650 -1248 1619 763 -2064 -110 1370 -523 -36 608 -979 -717 1971 -157 -2292 214 1292
3502 1292 -388 -376 -193 -1435 50 2154 -585 -2324 691 665 -1099 108 99 -1756 145 1556 -1327
3519 -1327 -1850 1121 533 -1046 679 -380 -1727 943 1510 -2017 -1550 1404 381 -456 747 -839
$$ packed form
3405i66R45l13r73K137Q39l582L12L048j013j040J414j554q86K942l36l006J200
3422h32K111j159r80J382j195l29K949j377k859K068J624j405j89Q93j669M37
3438e30L156j948k674K186Q65j190L09R74k175Q41K237k258j520L247l64k000
3454h44J362j49j505J495J905l057p73K881o05j389J631q21j356J756J128l188
3470a529M56K632p20j857J821j016j010K763l14l113J198K325j433o60J550j743
3486f50n98K867q56k827J954J480j893M87O44j587K62K688k128k135K506J078
3502A292j680J2J83j242J485K104k739j739L015k6j764J207rj855J901J411k883
3519a327n23K971n88j579J725j059j347K670N67l527M67K954j023q37J203j586
$$ plain form
3535 -839 -1495 1410 1032 -1680 -744 1225 -461 -696 390 -921 -852 1695 556 -2097 -262 1376 -183
3552 -183 -61 483 -1420 -329 1998 -58 -1981 479 1074 -430 531 625 -925 27 2000 -601 -1499
3569 -1499 1165 844 -580 369 377 -1362 693 1599 -1140 -1457 1185 408 -446 1060 -140 -1351 1028
3586 1028 1634 -1195 -831 1714 291 -673 972 18 -998 1435 847 -1714 -271 1689 113 -298
3602 -298 586 -1039 -528 1482 454 -2038 137 1348 -516 4 746 -1125 -365 1572 -109 -1713
3618 -1713 993 1280 -548 -31 330 -1327 61 1544 -894 -1737 660 498 -645 483 -279 -1494
3634 -1494 387 1595 -1012 -1178 1139 98 -731 310 -172 -1157 1061 1316 -1799 -832 1273 -285
3650 -285 -935 381 -1090 -1341 1166 758 -1868 -417 1088 -490 -409 909 -719 -895 1686 318 -1700
$$ packed form
3535h39o56K905l78k712R36J969j686k35J086j311O9K547j139k653J835J638j559
3552a83J22N44j903J091K327k056j923K460N95j504R61R4j550R52J973k601q98
3569a499K664l21j424R49Qj739K055R06k739l17K642p77q54J506j200j211K379
3586A028O06k829L64K545j423r64J645r54j016K433n88k561J443J960j576m11
3602b98Q84j625N11K010j028k492K175J211j864N20P42j871P60J937j681j604
3618a713K706K87j828N17L61j657J388J483k438q43K397j62j143J128p62j215
3634a494J881J208k607j66K317j041q29J041m82r85K218K55l115R67K105j558
3650b85o50J316j471k51K507m08k626J451J505j578Q1J318j628j76K581j368k018
$$ plain form
3667 -1700 242 1218 -637 -256 672 -1245 -417 1456 -224 -1768 393 911 -533 243 450 -1134 -394
3684 -394 1757 -840 -1232 1117 629 -750 381 302 -1308 712 1474 -1346 -1079 863 130 -379 736
3701 736 -147 -1027 1041 856 -1575 -531 1490 -342 -420 632 -236 -578 1649 1123 -1441 -3 1593
3718 1593 26 -33 453 -848 -766 1868 405 -1565 123 657 -382 185 680 -1243 234 1867 -2
3735 -2 -1462 746 1125 -461 436 184 -1041 458 2059 -760 -1430 869 142 -515 357 22 -1694 628
3753 628 1321 -1233 -899 986 -10 -425 604 -363 -1166 1076 827 -1718 -432 1204 -2 -381 761
3770 761 -965 -1536 1201 712 -1857 -225 793 -793 -146 569 -910 -461 1192 -250 -1438 440
3786 440 986 -514 -7 661 -1132 127 1743 -764 -1495 568 595 -774 50 143 -934 162 985 -1046
$$ packed form
3667a700J942R76j855L81R28j917Q28J873j680j544K161N18j444P76K07j584P40
3684c94K151k597l92K349m88j379J131p9j610K020P62k820K67J942p33n09J115
3701G36q83q80K068j85k431J044K021j832p8J052q68l42K227n26k564J438J596
3718A593j567n9M86j301Q2K634j463j970J688N34j039N67M95j923J477J633j869
3735bj460K208L79j586Q97k52j225J499J601k819o70K299p27o57Q72l35j716K322
3753F28O93k554L34J885r96m15J029r67q03K242k49k545J286J636j206l79J142
3770G61j726n71K737m89k569J632J018j586O47P15j479M49J653j442j188J878
3786D40N46j500N07O68j793J259J616k507p31K063K7j369Q24R3j077J096Q23k031
$$ plain form
3804 -1046 -1152 791 431 -740 820 -209 -951 916 1259 -1407 -688 1152 347 -157 547 -177 -919
3821 -919 1231 1106 -1159 -645 1060 -224 -199 734 -807 -662 1671 287 -1706 279 1101 -308 72
3838 72 630 -718 -468 1602 117 -1276 650 880 -490 512 723 -643 209 1323 -363 -1314 966
3855 966 728 -708 446 261 -1207 673 1290 -898 -1258 836 -140 -546 542 -202 -1226 903 1104
3872 1104 -1069 -411 1175 381 -494 794 -309 -628 1176 621 -1353 -355 1315 -403 -310 643 -742
3889 -742 -687 1422 512 -1749 13 708 -650 -183 441 -1191 -508 1424 -269 -1525 327 831 -825
3906 -825 86 228 -1134 197 1461 -584 -1369 629 456 -817 486 -10 -1131 377 1544 -933
3922 -933 -1172 844 -160 -650 445 -129 -1102 853 935 -1495 -968 910 -146 105 682 -506 -703 1358
$$ packed form
3804a046j06J943l60j171J560j029p42J867L43k666P19J840q05n04P04p24p42
3821i19K150j25k265N14J705j284K5R33j541J45K333j384j993J985Q22j409L80
3838G2N58j348K50K070j485j393J926K30j370J002K11j366Q52J114j686r51K280
3855I66k38j436J154j85j468J880O17k188l60K094r76m06J088p44j024K129K01
3872A104k173O58J586p94q75J288j103l19J804n55j974R98J670j718R3R53j385
3889g42N5K109r10k261J762O95j358M67O24j632O83J932j693j256J852N04j656
3906h25R11J42j362J331J264k045p85J998j73j273J303m96j121J508J167k477
3922i33k39K016j004m90J095n74r73J955Q2k430N27J878j056K51N77j188j97K061
$$ plain form
3940 1358 660 -1224 -392 940 -370 -151 805 -459 -587 1436 334 -1204 528 983 -431 29 261
3957 261 -1130 -194 1542 -344 -1059 332 638 -373 396 573 -1086 119 1428 -413 -796 957 818
3974 818 -387 623 15 -688 810 1232 -1147 -838 1177 377 -406 778 -76 -1243 963 616 -1177
3991 -1177 -537 1019 -74 -411 491 -325 -1044 1210 586 -1196 -254 636 -348 36 685 -905 -256 1626
4009 1626 523 -1150 553 1070 -471 -14 635 -935 -159 1507 -439 -1449 979 346 -1026 170
4025 170 -112 -978 286 1151 -671 -1254 693 234 -757 713 96 -1268 339 860 -1399 -915 999
4042 999 -362 -674 590 -435 -1164 493 369 -1335 -533 799 -165 -100 716 -641 -836 1152 588 -1275
4060 -1275 -4 1088 -315 -205 562 -535 -574 1275 -79 -1254 219 822 -512 -26 231 -891 -74
$$ packed form
3940A358o98j884Q32J332j310K19R56j264j28K023j102j538J732M55j414M60K32
3957B61j391R36J736j886p15J391L06j011P69J77j659J205J309j841l83J753j39
3974H18j205J010o08p03J498M22k379L09K015q00p83J184q54j167K206l47j793
3991a177O40J556j093l37R02q16p19K254o24j782R42Q90r84L84O49j590O49J882
4009A626j103j673J703N17j541M57O49j570P76J666j946j010K428o33j372J196
4025A70k82q66J264Q65j822n83J947m59r91J470o17j364J607N21k259M84J914
4042I99j361l12J264j025p29J657j24j704Q02J332r64O5Q16j357j95J988n64j863
4060a275J271J092j403J10P67j097l9J849j354j175J473O03j334M86K57j122Q17
$$ plain form
4077 -74 1280 -109 -830 671 439 -422 416 574 -944 316 1243 -554 -671 883 468 -792 171 -126
4095 -126 -798 382 925 -919 -464 1028 134 -2 749 -2 -689 1390 943 -1128 296 1319 -209
4112 -209 -299 787 -357 -1019 1122 -96 -1593 4 402 -620 56 526 -857 -355 1198 -85 -894
4129 -894 422 734 -186 589 772 -546 89 1351 -496 -1199 430 59 -702 195 166 -1525 161 819
4147 819 -869 -1124 857 174 -728 614 -10 -1015 841 1135 -983 -96 903 -114 -702 344 -307
4164 -307 -837 865 330 -1312 -139 735 -358 -480 577 -641 -638 924 72 -1094 110 656 -454
4181 -454 367 735 -736 -68 1525 177 -1259 648 393 -738 -43 90 -1303 -207 1308 -922 -1111
4198 -1111 796 333 -773 375 231 -1096 480 1275 -435 -305 1081 439 -365 581 16 -1024 890
$$ packed form
4077g4J354j389p21J501k32q61Q38J58j518J260R27j797j17J554m15j260R63k97
4095a26o72J180N43j844M55J492q94j36P51p51o87K079m47k071J424J023j528
4112b09r0J086j144o62K141j218j497J597L98j022O76M70j383N02J553j283q09
4129h94J316L12r20P75J83j318O35J262j847p03J629l71p61Q97k9j691J686O58
4147H19j688k55J981o83r02J342o24j005J856K94k118Q87R99j017n88J046o51
4164c07n30J702n35j642J173Q74j093j22J057j218LJ562q52j166J204N46j110
4181d54Q21L68j471O68J593j348j436J907k55j131O95J33j393J096J515k230j89
4198a111J907m63j106J148j44j327J576P95j710J30J386o42q04R46n65j040J914
$$ plain form
4215 890 1086 -1030 -681 970 -20 -210 650 -445 -751 1044 837 -975 124 969 -342 314 1017 -474
4233 -474 -234 1589 208 -1074 205 770 -251 -91 479 -718 -64 1205 -101 -1367 547 390 -537
4250 -537 326 58 -728 52 1230 -460 -889 793 352 -818 458 -56 -777 421 966 -1166 -821 791
4268 791 67 -562 422 -55 -817 610 880 -1231 -243 830 -342 -548 886 -273 -880 759 399 -1537
4286 -1537 -260 651 -577 -345 488 -727 -665 1118 -4 -1371 -47 444 -649 -138 428 -890 114
4303 114 1050 -464 -1258 477 669 -577 34 175 -1076 -109 1100 -785 -1122 576 284 -565 522
4320 522 -18 -1185 211 784 -702 -479 845 -195 -393 615 -160 -888 925 859 -1141 -120 814
4337 814 -167 -308 581 -607 -599 988 721 -1136 239 882 -462 83 673 -467 -445 1410 151 -1292
$$ packed form
4215H90J96k116L49J651r90j90Q60j095l06J795k07j812J099Q45j311O56P03j491
4233d74K40J823j381j282J279N65j021J60N70j197O54J269j306j266J914j57r27
4250e37Q63k68p86P80J178j690m29J682m41j170J276n14p21J198N45k132L45J612
4268G91p24o29R84m77p62J427K70k111R88J073j172k06J434j159o07J639l60j936
4286a537J277R11j228K32Q33j215O2J783j122j367J324M91j093N11N66j318J004
4303A14R36j514p94J735J92j246O11J41j251R67J209j885l37J698k92q49J087
4320E22n40j167J396N73j486K23J324j040j98J008p75p28J813o6k000J021R34
4337H14r81j41Q89j188QJ587k67j857J375O43j344N45N90j140K2J855j259j443
$$ plain form
4355 -1292 514 685 -540 100 691 -583 93 1773 -125 -765 875 578 -713 827 485 -818 369
4372 369 1051 -647 -1014 1051 309 -875 421 125 -1062 840 935 -690 -444 751 -271 -280 631 9
4390 9 -823 1117 857 -848 -358 623 -461 -314 907 -329 -825 1019 16 -1422 128 776 -478
4407 -478 -174 422 -1036 -399 851 64 -1280 162 515 -633 83 142 -880 -186 487 -529 -766 716
4425 716 316 -733 357 167 -869 141 1002 -973 -814 799 181 -641 662 -187 -913 526 896
4442 896 -930 -366 507 -90 -574 840 -253 -998 863 421 -1180 -86 904 -576 -310 726 -418
4459 -418 -534 991 343 -1069 100 522 -599 40 788 -595 -300 1202 79 -1071 541 581 -417
4476 -417 326 661 -835 -38 1275 -442 -886 808 177 -522 338 354 -865 -17 825 -715 -453 535
$$ packed form
4355a292J806J71j225O40N91j274O76J680j898o40J640k97j291J540l42j303J187
4372C69O82j698l67K065p42j184J296k96j187J902R5j625K46J195j022rR11o22
4390Iq32J940k60j705M90R81j084J47J221j236m96J844j003j438J550O48j254
4407d78L04N96j458O37J250p87j344J442L53j148P16N9j022O94O73j016k37J482
4425G16m00j049J090j90j036J010Q61j975J59J613o18q22J303q49p26J439L70
4442H96j826N64Q73n97m84J414j093p45J861m42j601J094R90j480K66J036j144
4459d18j16J525o48j412J169M22j121O39P48j383K95J502j123j150J612M0r98
4476d17P43L35j496P97J313j717m44J694o31o99Q60J6j219Q48Q42j540K62R88
$$ plain form
4494 535 104 -458 711 -78 -836 436 650 -1059 -416 994 -163 -187 860 -209 -820 1037 667 -890
4512 -890 -304 699 -375 65 613 -634 -300 1031 291 -835 188 698 -380 316 658 -568 -324
4529 -324 1196 -309 -929 370 160 -610 136 181 -1518 -129 698 -742 -638 803 177 -430 585 -129
4547 -129 -939 112 1221 -412 -316 682 -279 -416 418 104 -917 488 766 -1078 -427 638 -284 -365
4565 -365 655 -446 -769 648 574 -1161 195 840 -160 50 499 -543 -695 974 294 -911 608
4582 608 504 -677 264 542 -753 -142 1174 -395 -1025 645 125 -523 520 437 -831 229 1284
4599 1284 -208 -385 627 274 -393 396 226 -997 363 616 -657 -492 764 -64 -600 656 -99
4616 -99 -834 715 714 -932 -242 1113 195 -184 634 -243 -312 1101 740 -1053 157 579 -357 -62 464
$$ packed form
4494E35m31n62J169p89p58J272K14j709O43J410j157k4J047j069o11J857l70j557
4512h90N86J003j074M40N48j247L34J331p40j126J023N10j078O96L42j226K44
4529c24J520j505o20J299k10p70P46M5j699J389Q27j440J04J441o26o07J015p14
4547a29q10J051J109j633R6R98r61j37Q34l14j021J405K78j844O51J065r22q1
4565c65J020j101l23J417p4j735J356O45j000K10M49j042j52J669o80j205J519
4582F08j04j181R41K78j295O11J316j569o30J670n20o48J043q3j268J060J055
4599A284j492j77J012l53o67P89j70j223J360K53j273J65J256q28n36J256p55
4616i9p35J549jj646O90J355r18l79Q18q77o9J413l61j793J210M22r36K95N26
$$ plain form
4635 464 -614 -100 794 124 -1036 235 1063 -374 125 704 -752 -171 1344 28 -1034 633 300
4652 300 -398 306 514 -1019 27 894 -605 -805 678 -15 -681 456 -16 -851 -25 877 -442 -346
4670 -346 575 -211 -174 630 -367 -540 433 673 -801 -216 439 -406 -455 523 -313 -850 457 116 -998 93
4690 93 416 -323 -284 690 -550 -516 977 -31 -838 331 382 -753 114 673 -823 -175 1125 -510 -927
4709 -927 321 282 -660 609 -61 -694 294 848 -612 -608 653 24 -355 902 109 -692 471 1262 -662
4728 -662 -608 860 -447 -193 558 -44 -392 599 531 -532 19 644 -462 74 575 -23 -689 1000 555
4747 555 -1152 396 770 -357 167 907 -394 -512 1029 326 -735 520 279 -420 151 409 -563 -266
4765 -266 855 -145 -617 377 256 -470 475 220 -729 412 965 -515 -455 928 36 -339 680 52
$$ packed form
4635D64j078N14Q94o70j160J271Q28j437M99N79j456N81J515j316j062J667l33
4652C00o98P04K08j533J046Q67j499k00J483o93o66J137m72q35Q26R02j319R6
4670c46R21p86L7Q04r97j73R73K40j474N85O55q45m9R78q36n37J307l41j114J091
4690I3L23p39L9R74j240L4J493j008q07J169N1j135Q67N59j496O48J300j635m17
4709i27J248l9r42J269o70o33R88N54j460MJ261o29l79J257p93q01J163P91j924
4728f62N4J468j307K54P51o02l48R91o8j063N51O25j106N36N01n98o66J689m45
4747E55j707J548L74j127N24P40j301j18J541p03j061J255k41o99N71K58r72K97
4765b66J121j000m72R94j21p26R45k55r49J141N53j480O0J383q92l75J019o28
$$ plain form
4783 52 -859 639 594 -592 -449 646 -248 -378 280 -155 -818 543 482 -948 -376 424 -428 -136 470
4802 470 -613 -545 783 292 -905 106 314 -286 -78 530 -729 -547 971 -143 -938 112 151 -755
4820 -755 110 198 -894 168 1040 -468 -835 275 216 -669 241 301 -501 82 958 -395 -701 300 -103
4839 -103 -662 348 -336 -946 265 598 -666 -176 490 -192 -347 633 -515 -806 700 506 -603 38
4857 38 507 -476 55 811 -611 -361 652 180 -465 265 569 -477 286 517 -370 -422 901 -16 -494
4876 -494 509 831 -567 388 389 -654 147 862 -392 -597 575 100 -431 448 534 -602 227 616 -359
4895 -359 -200 554 -221 -210 470 -361 -826 637 733 -513 -220 819 -219 -126 756 -411 -567 533 464
4914 464 -882 -207 348 -580 -91 520 -640 -595 719 -41 -857 443 331 -381 142 290 -402 -519 812
$$ packed form
4783E2r11J498m5j186J43J095q94j30O58m35o63J361o1j430N72Q00q52K92O06
4802D70j083O8J328m91j197J011K08o00K08O08j259J82J518j114p95J050L9r06
4820g55Q65Q8j092J062Q72j508l67J110n9q85R10O0q02N83Q76j353l06J001m03
4839a03n59J010o84o10J211L33j264M90O66o82j55R80j148k91J506j94j109O41
4857C8M69r83N31P56j422K50J013m72o45P30L04j046P63K31q87n2J323r17m78
4876d94J003L22j398R55Jj043Q01P15j254k05J172m75n31Q79Q6j136Q29L89r75
4895c59J59P54p75J1O80q31m65J463R6j246K93J039j038R3Q82j167j56J100o9
4914D64j346O75N55r28M89O11j160M5J314p60q16J300j12p12N23J48o92j17J331
$$ plain form
4933 812 237 -837 475 73 -381 300 235 -977 -86 759 -342 -497 428 61 -848 593 369 -712
4951 -712 485 679 -453 -664 573 -340 -554 655 -297 -1027 739 310 -723 -189 539 -191 -485 585
4969 585 -322 -832 650 428 -566 -30 289 -196 -84 486 -543 -124 838 59 -789 155 408 -552 182
4988 182 383 -553 -28 742 -361 -524 455 370 -143 598 310 -929 -67 660 -384 -459 785 -116 -642
5007 -642 723 261 -966 433 802 -494 -328 765 17 -34 754 -33 -893 767 506 -965 -167 464
5025 464 -216 -216 612 -522 -429 515 324 -607 -100 308 -153 453 383 -549 -249 806 -174 -676 265 257 -683
5046 -683 413 405 -846 -134 686 -292 -867 192 -192 -393 381 -154 -925 186 632 -574 -397 608 206
5065 206 -196 310 120 -449 223 346 -676 -301 524 -613 -176 308 -256 -776 319 59 -936 -198 459
$$ packed form
4933H12n75j074J312m02m54O81o5j212Q91Q45j101j55R25l67r09J441k24j081
4951g12J197J94j132k11J237r13k14J209r52p30J766m29j033N34P28p30k94J070
4969E85r07n10J482k22r94N36L19m85J12N70j029M19R62p79q48R44K53r60P34
4988A82K01r36N25P70j103j63R79q5n13P41k88j239Q62P27j044p5J244r01n26
5007f42J365m62j227J399L69j296J66J093p48n1P88p87q60J660k61j471P98O31
5025D64o80%Q28j134R3R44j91r31N07M08m61O06p0r32L00J055r80n02R41qr40
5046f83J096qj251P12Q20r78n75J059l84k01P74n35p71J111M46j206J77J005m02
5065B06m02N06j90n69O72J23j022L75Q25j137M37M84n64n20J095k60r95P38O57
$$ plain form
5084 459 -252 -173 647 -456 -410 665 441 -951 331 583 -267 -132 492 -807 -408 786 51 -683 280
5103 280 46 -547 118 535 -993 -145 588 93 -386 407 52 -442 399 234 -659 336 1111 -208 -264 413
5123 413 -255 -208 407 74 -556 594 663 -107 -284 445 -135 -325 607 -223 -556 490 257 -414 -211 719
5143 719 -284 -34 574 -276 -297 772 386 -731 7 424 114 0 454 -301 -32 622 -6 -570 372
5162 372 251 -265 447 444 -375 5 470 -439 -616 484 353 -494 202 55 -664 298 705 -465 -500 452
5182 452 -74 -465 340 -35 -596 427 576 -439 -314 200 -197 -280 452 -267 -522 782 474 -517 1
5201 1 327 -368 131 538 -277 -358 414 -9 -653 -45 331 -571 87 399 -609 -393 904 -310 -512 362
5221 362 14 -786 253 406 -492 170 475 -401 -388 414 -159 -413 677 340 -796 229 883 -362 -385
$$ packed form
5084D59p11P9Q20j103M6J075k24j392J282K52q50J35O24j299L99J194p35p34R63
5103B80k34n93O65M17j528Q48P33m95m79P93l55m94Q41j65q93R95P75j319n6O77
5123D13o68M7O15l33o30J150O9p70j77P29n80j90R32q30l33J046k33o71K03R30
5143G19j003K50O08q50k1J069l86j117P38M17l10j14M54p55K69O54o28n64R42
5162C72j21n16P12lq19L80M65r09j77J100j31q47O96j47p19R62M07j170l5R52
5182D52n26l91Q05l75n61J023J49j015J25N14l97q3P32p19k55J304l08r91N18
5201AL26o95M99M07q15q1P72m23o44O08L76r02O58L12j008K16J297j214k02Q74
5221C62l48q00J039J53q98O62L05q76J3Q02n73k54J090l37j136J025O54j245k3
$$ plain form
5240 -385 583 -229 27 558 -128 -686 571 520 -796 42 619 -159 -391 609 -291 -447 644 200 -399
5259 -399 174 431 -699 160 106 -362 -329 776 357 -496 525 85 -129 421 602 -693 -353 557 -100
5278 -100 -409 444 317 -533 433 244 -489 37 751 -313 -508 501 -211 -154 340 -18 -668 372 205
5297 205 -394 -52 700 -237 17 514 -225 -481 467 28 -690 -172 114 -292 -397 257 -556 -621 565 -76
5317 -76 -731 30 59 -466 20 500 -599 -230 813 175 -425 159 235 -319 -149 279 -488 -47 360 -375
5337 -375 -675 106 56 -366 188 88 -564 113 512 -359 -473 419 -479 -476 407 220 -467 129 529 -209 -238
5358 -238 432 -353 -629 85 -384 -580 403 333 -353 -107 363 -202 -119 507 -414 -522 892 215 -650 389
5378 389 371 -419 79 326 -258 -323 737 -140 -317 215 394 -154 229 480 -656 25 536 -22 -120 626
$$ packed form
5240c85R68q12K56N31o86n58J257n1j316Q38N77p78k32J000r00j56J091m44n99
5259c99N73K57j130Q59n4m68L3J105m19q53J021m40k14N50J81j295L40R10o57
5278a00l09Q53j27q50R66j89p33N26P14j064j95J009p12N7M94l58o50J040j67
5297B05n99L42P52r37K54M97p39k56R48m39p18N18K86m06j05O54q13o5J186o41
5317g6o55P61K9n25M86M80j099L69J043o38o00N84P6n54J70M28p67M41M07p35
5337c75l00P81n0m22N54j00o52O77L99q71j14Q92q98LQ83j87o87N96M00p38k9
5358b38O70p85k76P14m69j96R83p0o86K46M70n65Q3O26r21j08J414o77q65J039
5378C89j8p90M98K47n84o5J060q77j77N32J79n48L83K51j136O81N11n58r8P46
$$ plain form
5398 626 286 -183 442 549 -263 95 652 -521 -463 382 12 63 497 -161 -504 120 253 -590 -171 618
5418 618 -399 -179 543 -67 -698 95 548 -405 23 530 -229 179 648 -321 -323 389 15 -395 228 545
5438 545 -354 297 440 -423 -504 576 66 -566 198 191 -360 66 122 -837 -418 264 -253 -542 230 220 -429
5459 -429 266 244 -483 -26 81 -126 -177 392 -194 -464 407 53 -589 400 387 -267 -169 548 -354 -241 319
5480 319 -384 -478 194 -15 -410 104 304 -494 -63 777 -218 -3 444 -17 -506 306 156 -444 102 309
5500 309 -432 -247 889 -41 -511 365 387 -211 346 81 -302 -216 549 -263 -220 363 135 -81 393 222 -229
5521 -229 391 339 -234 25 626 -178 5 581 49 -681 163 658 -635 -129 645 -107 184 522 -178 -336
5541 -336 304 254 -353 252 397 -252 -299 400 -145 -253 587 -157 -651 82 398 -295 -10 256 -375 -170 709
$$ packed form
5398F26l40m69O25J07q12L58N57j173N8Q45l70N1M34o58l43O24J33q43M19P89
5418F18j017K20P22o10o31P93M53r53M28N07p59M08M69r69kP12l74m10O23L17
5438E45q99O51J43q63q1J080n10o32P64pn51M26N6r59M19O82n17k89P72j0o49
5459d29O95k2p27M57J07k07n1N69n86k70Q71l54o42R89j3o54R8P17r02J13N60
5480C19p03r4O72k09l95N14K00p98M31Q40r95K15M47m61m89Q12j50o00N46K07
5500C09p41J85J136r30m70Q76K2n98N57k65l83Q6P65q12M3N83k28k16M74j71m51
5521b29O20n2n73K59O01q04J83N76n32p30Q44M95j293N06P74p52K91L38p00j58
5541c36O40n0o07O05J45o49m7O99n45j08Q40p44m94P33L16o93K85K66o31K05Q79
$$ plain form
5562 709 -224 -460 332 -6 -366 369 144 -537 297 478 -306 -324 367 -213 -460 393 74 -901 99 397
5582 397 -562 -272 398 -323 -229 424 -264 -708 416 544 -690 21 432 -308 37 380 -50 -484 701
5601 701 202 -1030 237 313 -702 89 104 -471 -466 648 -44 -529 23 661 -389 118 269 -492 -25 398
5621 398 -161 -688 492 -163 -351 443 238 -409 -144 526 -433 -171 428 -86 -107 366 8 -449 473 545
5641 545 -482 -67 740 -101 -117 543 -389 -499 630 364 -566 168 196 -297 32 563 -299 -653 714 230
5661 230 -367 135 563 -352 60 506 -409 -256 451 457 -418 163 -48 -619 410 263 -414 -58 522 -285
5681 -285 -394 318 -16 -141 20 366 -477 182 291 -430 -384 362 -10 -229 296 -101 -703 209 605 -282
5701 -282 -455 350 -309 -367 374 -354 -469 485 110 -543 39 305 -655 123 461 -284 -418 510 -23 -522
$$ packed form
5562G09r33k36P92l38l60P35k25o81Q34J81p84j8O91n80k47Q53l19r75J000K98
5582C97r59K90O70p21R4O53o88m44J124J28j234P11M11p40L45L43m30m34J185
5601G01m99j232J267P6j015P91J5n75NJ114o92m85N52O38j050N07J51p61M67M23
5621C98n59n27J180o55j88P94k05o47K65O70r59K62N99n14k1M73l58m57R22P2
5641E45j027M15Q07q41j6O60r32j10J129k66r30P34K8m93L29N31q62l54J367m84
5661B30n97N02M28r15M12M46r15J53P07Oq75N81k11n71J029j47o77L56N80q07
5681b85j09P12l34j25J61L46q43O59J09p21M6P46l72k19N25l97o02R12L96q87
5701b82j73Q05o59n8P41p28j15R54l75o53N82K66r60P78L38p45j34R28n33m99
$$ plain form
5721 -522 179 87 -293 -155 357 -184 -309 311 -258 -344 417 33 -345 151 370 -387 -17 486 -394 65 175
5742 175 171 -161 452 -4 -496 308 492 -62 -227 251 -217 -375 306 196 -473 331 490 -694 -206 131
5762 131 -141 58 523 -121 -391 434 122 -352 313 263 51 162 277 -127 21 650 88 -294 193 496
5782 496 -236 -185 293 -274 -272 323 -89 -583 258 35 -473 479 104 -436 145 429 -225 -181 368 -23 -133
5803 -133 306 269 -598 373 631 -257 -453 631 -109 -104 463 -175 -270 211 220 -426 -150 371 -503 -234 467 -177
5825 -177 -483 543 176 -614 43 -165 -410 21 482 -386 -228 458 41 -685 230 40 -630 194 269 -902
5845 -902 -39 478 -292 -580 415 -432 -369 262 152 -176 124 527 -197 -109 588 -118 -390 218 -271 -717 318
5866 318 399 -445 -35 298 -398 -335 549 60 -186 417 200 -589 -197 348 -258 102 442 -341 -298 525 165
$$ packed form
5721e22P01r2l80J38N12n41j25O20n69q6P61l84l78M96K19p57L70N03q80M59J10
5742A75ml32O13m56m92Q04J84n54j65M78m68j58O81j10o69Q04J59j184M88L37
5762A31k72J99M65o44k70Q25l12m74O65n0k12J11J15m04J48O29n62l82M87L03
5782D96p32N1M78n67KN95m12m94Q41k23n08R52l75n40N81K84o54M4N49l91j10
5803a33M39l7q67R71K58q88j96J084p40NN67o38r5M81Ro46K76N21q74K69P01o44
5825a77l06J026l67p90O57k08k45M31M61q68J58O86m17p26R15j90o70Q24P5j171
5845i02Q63N17p70k88R95q47O3O31j10l28L00M03p24Q8O97p06k72O08m89m46J035
5866C18Q1q44M10L33o96O3Q84m89k46O03k17p89L92N45o06L60L40p83M3Q23l60
$$ plain form
5887 165 -377 506 257 -264 -3 604 -468 -329 774 -124 -373 504 422 -212 266 248 -173 100 867 -132
5907 -132 -284 528 365 -59 232 222 -378 242 563 -265 -384 541 -31 -15 819 327 -743 369 296 -501
5927 -501 -124 73 -378 -13 398 2 -497 361 270 -389 -76 384 -370 -33 153 -560 -324 363 110 -173
5947 -173 62 275 -309 448 736 -119 -84 557 -51 -597 15 88 -538 78 590 -545 38 483 -164 93
5967 93 240 -61 -679 544 287 -477 -4 708 -668 -664 545 -41 20 539 -66 -323 258 156 -365 -6
5987 -6 176 -353 140 174 -183 -515 254 -28 -304 316 477 -499 -1 308 -392 -299 403 327 -347 278 168 -185
6009 -185 199 407 -703 43 575 -264 -346 222 98 -295 432 345 -365 -49 277 -261 -101 187 118 -329 551
6030 551 -66 -461 97 493 -503 -109 474 -109 -95 364 275 -254 43 165 -334 -70 205 -251 -221 125 -194
$$ packed form
5887A65n42Q83k49n21K61O07j072J39J103q98k49Q77q2o34M78j8m21K73P67r99
5907a32j52Q12j63m24K91j0o00O20L21q28j19R25n72J6Q34m92j070J112p3p97
5927e01L77J97m51L65M11l96m99Q58r1o59L13M60p54L37J86p13K36O87k53k83
5947a73K35K13n84P57K88q55L5O41o08n46O12P3o26O16N12j135N83M45o47K57
5967I3J47l01o18J223k57p64M73P12j376MJ209n86O1N19o05k57N81j02n21L59
5987fJ82n29M93L4l57l32P69k82k76O20J61r76M98L09p00R3P02p6o74O25j10l53
6009a85L84K08j110P46N32q39q2N68j24l93P27q7p10L16L26n38J60K88o9m47Q80
6030E51o17l95N58L96r96L94N83n83J4M59q9n29K97J22m99K64K75m56L0L46l19
$$ plain form
6051 -194 -541 356 320 -409 -48 311 -305 296 366 -361 -76 480 35 -546 163 394 -177 -99 451 -91 155
6072 155 517 -129 -210 333 -97 -367 225 206 -805 82 286 -449 -232 400 -92 -218 247 176 -540 57 191
6093 191 -580 -317 264 17 -131 523 -33 -582 31 -43 -452 68 324 -333 -342 526 -560 -368 393 16 -509
6114 -509 76 266 -398 255 461 -575 -266 582 -237 -450 196 412 -661 292 388 -413 -242 362 -186 -185
6134 -185 470 -27 -409 132 202 -590 -91 681 -273 -194 300 -108 -144 274 239 -585 133 423 -314 44 438
6155 438 -400 -263 661 41 -374 435 87 -632 -105 623 -80 -18 556 -195 -158 538 70 -344 245 151 -265
6176 -265 -51 622 -209 173 753 -11 -524 441 144 -313 317 350 -500 250 706 -449 -44 509 38 -396
6196 -396 473 294 -605 86 221 -364 60 190 -8 -438 129 174 -470 401 348 -255 -44 -8 -148 99 527
$$ packed form
6051a94l47Q97l6p29L61L59o16O01P0p27K85N56m45n81P09K31n71P8N50n42K46
6072A55L62o46q1N43m30k70N92j9j011Q87K04p35K17O32m92j26M65p1p16N97J34
6093A91p71K63N81k47j48O54n56n49O13p4m09N20K56o57rQ68j086J92P61l77n25
6114e09N85J90o64O53K06j036L09Q48q19k13O46K16j073R53R6q01J71O04n48J
6134a85O55m97l82N41P0p92M99P72r54P9M94m08l6M18l5q24P18K90p37L58L94
6155D38q38J37R24o20m15Q09l48p19N27P28p03O2N74p51L7O96m68m14N89r4m16
6176b65K14O73q31L82N80p64n13R65k97m57O30L3q50P50M56j155M05N53m71m34
6196c96Q69j79q99O91J35n85M24J30j98m30N67M5o44Q71n3o03K11L6j40K47M28
$$ plain form
6217 527 -472 -458 222 127 -639 -40 303 -210 -99 362 -102 -303 206 -120 -610 48 -331 -387 272 235 -322
6238 -322 151 402 -154 -271 466 36 -353 -160 16 -262 41 475 -611 -14 606 -121 -324 -82 -120 -495
6258 -495 42 438 -437 -207 275 -194 -340 105 175 -427 639 252 -199 64 411 -247 -256 628 -398 -734
6278 -734 199 182 -375 -58 433 -209 -45 354 -65 -218 563 -140 -513 177 199 -32 221 292 -469 -114 731
6299 731 -317 -634 272 16 -262 245 88 -382 292 574 -138 -279 260 -71 104 593 -74 -261 247 602
6319 602 -597 -22 562 28 -50 315 53 -255 231 261 -480 232 335 -365 32 251 -107 -209 597 9
6339 9 -197 167 209 -381 -161 426 -194 -339 398 -24 -399 181 406 -607 193 184 -530 -128 364 65 -204
6360 -204 128 156 -271 13 -41 -537 -13 577 -84 -177 340 -98 -142 268 -135 -507 165 19 -395 -104 454
$$ packed form
6217E27r99J4O80r5p66N99L43n13J11M61m64k01N09l26m90O58l79n6O59l7n57
6238c22M73K51n56j17P37m30l89J93J76k78L03M34j086N97O20p27k03K42l8l75
6258d95N37L96q75K30M82m69j46M45P0o02J066l87m51K63L47o58rQ84j026l36
6278g34R33j7n57L17M91o42J64L99m19j53P81p03l73O90K2k31K53P1p61L55Q45
6299G31j048l17R06k56k78N07j57m70O74K82p12j41N39l31J75M89o67j87N08L55
6319F02j199N75N84n34p8L65k62l08M86L0p41P12J03p00L97K19l58j02Q06n88
6339Ik06L64M2n90K20N87o20j45P37m22l75N80K25j013Q00rp14M02M92k99k69
6360b04L32K8m27K84n4m96N24N90o61r3N17m38m4M10m03l72O72j46m14K91N58
$$ plain form
6381 454 -517 -255 706 -284 -502 285 176 -337 -183 586 -292 -7 230 -134 -20 499 -34 -363 91 283
6401 283 -444 1 286 -604 -436 230 -9 -386 49 184 -251 205 225 -382 -35 118 -179 -403 373 7
6421 7 -147 92 171 -184 122 433 -160 -422 113 259 -167 180 -39 -473 367 446 -404 119 278 39 -238
6442 -238 395 -165 -502 300 278 -160 -133 63 -271 -268 359 -227 -279 721 65 -321 346 661 -328 26 312
6463 312 -116 -230 573 63 -372 296 -4 -341 192 166 -867 -202 387 -162 -437 182 27 -153 -58 11 -560
6484 -560 400 372 -138 261 -110 220 -291 197 123 -487 147 491 -357 130 262 -235 -149 326 70 -427 455
6505 455 75 -463 -137 235 -216 -135 164 -364 -280 93 -51 -568 392 225 -292 211 486 -204 -438 314 -122
6526 -122 -353 252 72 -135 3 144 -235 121 447 -162 -453 247 91 -86 361 269 -346 404 446 76 7
$$ packed form
6381D54r71K62R61r90k18P87j09n13J54P69q78K85K37l64J14N19n33l29M54J92
6401B83p27M45K85q90J68O66k39l77M35J35m35M56K0o07L47J53k97k24P76l66
6421Gj54K39P9l55L06L11n93k62N35J46m26L47k19m34Q40P9q50N23J59k39k77
6442b38O33n60l37Q02k2m38K7J96l34LO27n86n2J000o56l86O67L15r89L54K86
6463C12m28j14Q03n10m35O68l00l37N33k6j033O65N89n49k75O19j55j80R5O9n71
6484e60R60k8n10L99l71L30n11M88p4o10O34L44q48M87J32m97Q6M75k56m97Q82
6505D55l80n38L26L72m51Q1K99n28Q4L73j44n17R60j67n17N03K75o90k34P52m36
6526a22k31O05j80k07J38J41l79L56L26o09k91P00j56j77M47r2o15P50M2l70o9
$$ plain form
6547 7 151 -149 -266 264 222 -395 171 248 -280 104 293 -236 5 337 -111 -134 322 105 -176 138 353 -190
6569 -190 -48 250 -332 -178 293 94 -290 332 122 -182 44 230 -74 -82 602 -137 -434 436 195 -405 195
6590 195 10 -218 83 490 -52 71 212 69 -512 406 145 -593 139 161 -303 -71 195 -115 -120 190 -162
6611 -162 -374 310 363 -105 35 517 -87 -307 240 -262 -515 452 -2 -269 -292 250 -205 -88 121 -559 -85
6632 -85 349 -171 -487 298 18 -183 -97 70 -195 -209 308 -15 -401 150 21 -159 23 506 -588 -259 111
6653 111 -552 35 402 287 -121 428 295 -316 312 642 -137 102 192 201 -174 349 106 -251 259 389 -72
6674 -72 120 299 -259 155 538 -76 -272 534 223 -14 186 415 -379 125 333 -16 -279 166 -60 -237
6694 -237 211 66 -401 199 690 -205 105 201 37 -68 160 5 -73 236 -192 -303 112 380 -71 -450 379
$$ packed form
6547GJ44l00j17N30m2o17N66P7n28L84J89n29K41L32m48k3M56k17k81L14K15n43
6569a90J42K98n82J54M71j99l84O22k10l04K26J86l04qO84p39k97Q70k41o00O00
6590A95j85k28L01M07n42J23J41j43n81R18k61p38P32K2m64K32K66l10nL10l52
6611a62k12O84N3m68J40M82o04k20N47n02k53R67m54k67k3N42m55J17K09o80M74
6632h5M34n20l16P85k80k01Q6J67k65j4N17l23l86N51j29j80J82M83j094L29L70
6653A11o63N87L67j15m08N49j33o11O28L30p79K39R0Rl75N23k43l57N10J30m61
6674g2J92J79n58M14L83o14j96Q06l11k37K00K29p94N04K08l49k63M45k26j77
6694b37M48j45m67O00M91q95L10R6j64j05K28j55p8L09m28j11M15K68m51l79Q29
$$ plain form
6715 379 -309 -18 476 123 -425 -155 301 -392 -239 52 -207 -347 507 -52 -536 235 113 -354 44 99
6735 99 -311 -118 66 -299 -30 332 19 -325 61 303 -259 202 -65 -384 -444 119 -386 -218 239 -14 -290
6756 -290 245 153 -495 -97 302 -139 -317 365 188 -470 147 11 -383 5 178 -381 -242 421 -323 -152
6776 -152 -190 134 -180 165 205 -398 181 135 -307 -1 269 -70 -184 290 302 -382 -85 72 -410 171 83 -72
6798 -72 -163 433 322 -250 75 163 -63 24 375 -288 102 401 116 -412 -27 114 -239 243 12 -552 -235
6819 -235 163 -100 -397 79 -195 -295 520 227 -299 73 460 -124 194 345 28 -118 148 14 -87 127
6839 127 121 -199 -68 182 21 -253 164 -209 -494 502 178 -301 337 21 -332 11 44 -119 -172 407 -22
6860 -22 -269 143 72 -110 -39 244 -271 -134 317 -158 -179 102 40 -63 193 153 -116 -180 413 -395 -164 146
$$ packed form
6715C79o88K91M94l53n48K70M56o93J53K91k59j40Q54n59m84P71j22m67L98N5
6735I9m10J93J84l65K69L62l13l44L86K42n62M61k67l19o0N63n05J68M57k53k76
6756b90N35r2o48L98L99m41j78O82j77o58O17j36l94L88J73n59J39O63p44J71
6776a52l8L24l14L45M0o03N79m6m42L06K70l39j14M74J2o84K97J57m82N81q8j55
6798g2r1N96j11n72L25Q8k26Q7L51o63L90K99k85n28L85J41l53M82k31n64L17
6819b35L98k63k97M76k74j00Q15k93n26L72L87n84L18J51l17j46K66j34j01K14
6839A27ol20J31K50j61k74M17l73k85R96l24m79O38l16l53L43L3j63n3N79m29
6860b2k47M12p1j82P1K83n15J37M51m75k1K81o2j03K56m0k69o4N93q08K31L10
$$ plain form
6882 146 94 -367 326 327 -526 -184 256 -205 -68 294 -133 -457 -97 -331 -212 118 223 -351 -1 571 -207
6903 -207 -354 402 -115 -105 558 119 -275 32 330 -16 -72 480 7 -246 285 -25 -292 -40 -254 -336 151
6924 151 214 -398 -151 498 165 -117 744 164 18 138 315 -91 -17 463 -199 -309 59 -30 -131 187 -111
6945 -111 -389 319 42 -235 254 322 42 -23 590 517 -193 497 204 -242 -36 446 -65 159 285 -161 -313
6966 -313 559 -49 -196 95 -216 -208 1 137 -72 31 249 -140 -228 154 92 -242 -42 219 -248 -168 144 -195
6988 -195 -200 218 365 -112 251 130 -357 126 91 -58 -43 459 -244 -168 337 -258 -498 363 142 -393 -46 186
7010 186 -29 -154 290 -68 -383 192 -112 -429 116 274 -191 75 343 -614 -69 320 -167 -211 428 175
7030 175 -111 70 386 -246 -188 207 126 -92 319 110 -237 25 116 -279 3 816 107 6 179 -192 -202
$$ packed form
6882A46n2m61O93Jq53L42M40m61J37L62m27l24L60k34J19L30J05n74L50N72p78
6903b07j47P56n17J0O63m39l94L07K98l46n6N52m73k53N31l10k67K52k14q2M87
6924A51O3o12K47O49l33k82Q61n80j46J20J77m06P4M80o62j10L68q9j01L18k98
6945a11k78P08k77k77M89O8k80o5O13p3p10O90k93m46K06M82n11K24J26m46j52
6966c13Q72o08j47K91l11QK09J36k09J03K18l89q8L82o2l34K00K61m67Q0L12l39
6988a95nM18J47m77L63j21m87M83l5j49J5N02p03P6N05n95k40Q61k21n35L47K32
7010A86k15j25M44l58l15N75l04l17N45J58m65K66K68r57N45L89m87m4O39k53
7030A75k86J81L16o32N8L95q1k18M11k09l47K62R1l95K82Q13p09j01J73l71j0
$$ plain form
7051 -202 230 -122 -387 145 328 -119 -43 388 -50 -72 29 -244 -107 123 343 -327 27 172 -187 -170 422
7072 422 -176 -357 -11 -67 -163 173 132 -242 -2 124 -251 -87 414 35 -157 293 -199 -346 191 173 12
7093 12 -39 174 69 -400 264 204 -31 288 103 -442 34 423 -115 -90 304 -398 -252 274 -299 -212 -86 139
7115 139 -276 -215 -82 -177 -312 248 -293 -115 183 -28 -470 -201 -84 -336 -237 378 -101 -381 -31 -32 -91 -203
7137 -203 343 -220 16 126 -528 -180 -95 -109 -185 202 -73 -388 131 236 -306 -110 349 -110 -484 152 -155
7158 -155 -101 155 118 -451 277 -108 31 -88 154 73 -74 432 72 -203 -5 343 -235 -32 205 -251 10
7179 10 84 284 -176 328 389 -326 69 -53 -83 120 375 -175 -194 598 50 -316 343 324 -278 272 66 -408
7201 -408 -5 316 -21 -13 348 -102 -49 62 338 -307 -85 437 -36 -377 82 -142 -259 231 -95 -531 73
$$ packed form
7051b02M32l52k65N32J83m47P6M31m38k2J01k73J37K30K20o70L54J45l59J7N92
7072D22n98j81L46n6r6L36m1l74K40J26l75J64N01l79j92M50m92j47N37j8j61
7093A2n1K13j05m69O64o0k35L19j85n45M76L89n38K5L94p02J46N26n73Q7J26K25
7115A39m15O1J33r5j35N60n41J78K98k11m42K69J17k52R9O15m79k80L50jn9j12
7137b03N46n63K36J10o54L48Q5j4p6L87k75l15N19J05n42J96M59m59l74O36l07
7158a55N4K56l7n69P28l85J39j19K42q1j47N06l60k75J98L48n78K03K37m56K61
7179A0P4K00m60N04O1p15L95j22l0K03K55n50j9P92n48l66O59j9o02N50k06m74
7201d08M03L21l37QL61m50N3J11K76o45K22N22m73l41M59k24j17M90l26m36O04
$$ plain form
7222 73 245 -166 -35 410 104 -102 187 -196 -222 -11 174 -111 54 502 -200 -180 124 143 -102 100 -23
7243 -23 -511 103 255 -242 34 -12 -62 -172 608 -178 -215 283 81 -386 40 200 -295 -123 -61 -155 -332 120
7265 120 122 -465 -33 219 -434 78 107 -133 -353 92 -145 -97 392 6 -165 -102 269 -228 35 351 -84 -74
7287 -74 80 -110 -533 106 -127 -164 200 116 -204 -171 184 -179 -201 378 -20 -399 327 467 -390 87 492 -274
7309 -274 -338 327 -329 -162 73 123 -38 112 125 -393 -22 686 -19 -274 272 118 -266 115 218 -427 306
7330 306 359 -10 -186 219 -89 -208 359 -131 -355 237 273 -399 87 451 8 -218 727 -373 -230 202
7350 202 151 45 -270 -107 -142 -164 51 -268 36 364 -96 -505 16 127 -283 -248 193 -447 -255 344 -241
7371 -241 -127 217 -56 -169 139 377 -418 -211 257 35 193 32 3 -341 187 5 -360 361 -211 -632
$$ packed form
7222G3J72m11J31M45l06k06K89l83k6K11J85k85J65M48p02K0L04J9k45K02j23
7243b3m88O14J52m97K76m6n0j10P80p86l7M98k02m67M26J60m95J72O2r4j77M52
7265A20Kn87M32K52o53N12K9k40k20M45k37M8M89l86j71O3L71m97K63L16m35J0
7287g4J54j90m23O39k33l7L64q4l20L3L55l63k2N79l98l79P26J40q57M77M05p66
7309b74o4O65o56J67K35N0j61J50J3n18L71P08p05k55N46j54l84L81J03o45P33
7330C06N3l69j76M05l08j19N67m90k24N92L6o72M86L64m43k26R45j100J43M32
7350B02n1j06l15J63l5k2K15l19L04L28m60m09N21J11m10L5M41o40J92N99n85
7371b41J14L44k73j13L08K38p95K07M68k22J58j61k9l44N28j82l65P21n72m21
$$ plain form
7391 -632 -266 -148 -141 -277 89 77 -333 157 406 -252 -155 262 51 -62 173 -173 -312 22 -84 -340 65
7412 65 -184 -265 -107 280 -216 83 299 -272 -523 319 76 -189 366 356 -247 -196 228 -189 -20 331 -233
7433 -233 -257 307 127 -269 273 237 -59 16 363 -233 -92 398 -74 122 13 282 -106 -128 251 42 -255
7454 -255 450 -129 -226 232 28 -319 -28 237 -187 221 139 150 -319 160 -69 -294 100 17 -345 -78 392
7475 392 -205 -274 283 -34 -62 193 139 -175 -54 244 -355 -89 196 -135 -32 412 -39 -181 496 90 -97
7496 -97 155 231 -160 -173 151 -100 -119 158 11 -396 28 321 -186 -18 183 -415 -389 325 -181 -200 11 -82
7518 -82 -189 -5 150 -200 -91 327 -185 -171 273 -204 131 191 50 -485 50 627 -344 -5 6 -47 88 396
7540 396 -86 -158 269 51 -438 -319 200 -371 -15 151 -207 -353 288 -179 -433 60 99 -230 -185 -152 28
$$ packed form
7391f32L66J18Pj36L66j2m10M90K49o58R7M17k11j13K35l46j39L34j06k56M05
7412F5k49q1J58L87m96K99K16n71k51Q42k43k65N55j0o03N1M24m17J69L51n64
7433b33k4N64j80l96N42l6k96P5L47n96J41M90m72J96j09K69l88k2L79k09k97
7454b55P05n79r7M58k04l47K91K65m24M08q2J1m69M79k29k25L94q3l62K67M70
7475C92n97o9N57l17k8K55n4l14J21K98n99K66K85l31J03M44m51j42O77m06j87
7496i7K52P6l91j3L24k51j9K77j47m07M24K93n07J68K01n98K6P14n06j9K11r3
7518h2j07J84J55l50J09M18n12J4M44m77L35O0j41n35N35N77r71L39J1n3J35L08
7540C96m82p2M27k18m89J19N19n71L56J66l58j46O41m67k54M93L9l29M5L3J80
$$ plain form
7561 28 -267 319 4 -222 338 97 -295 -120 437 -280 -74 -159 -51 -377 262 268 0 153 67 -237 -214 507
7583 507 -53 -258 103 38 -39 140 -170 -201 -28 448 -286 -294 278 69 -450 307 309 -210 22 402 -89 -61 96
7606 96 -83 -253 433 -91 -166 118 -147 -352 375 385 -239 -90 285 254 -241 71 -137 -328 -54 406 -108
7627 -108 -21 137 -352 -124 251 -215 -166 127 106 -175 175 441 -191 -190 150 -152 -37 374 14 -148 125 -45
7649 -45 -89 -22 277 -163 -27 277 -50 -13 199 50 -260 396 4 -220 -79 181 -49 35 -13 -47 -181 275
7671 275 155 -89 -3 251 -41 -19 125 -101 -244 40 5 -460 297 110 -331 -146 206 -47 -186 117 -69
7692 -69 17 268 122 -241 -16 389 160 -12 278 -161 240 292 156 -226 72 217 -139 -51 21 -423 -116 523
7714 523 -107 -112 134 259 -311 259 398 71 -40 338 -157 -104 41 229 -77 362 179 40 -127 -30 -147
$$ packed form
7561B8k95N86l15k26N60k41l92J75N57p17K06q5J08l26O39Ok68J53q6l04K3P21
7583E07n60k05L61o5p7J79l10l1J73M76p34qN72k09n19P57Kn19K32L80m91K8J57
7606I6j79j70O86n24p5K84k65k05P27J0o24J49L75l1m95L12k08j91K74M60n14
7627a08Q7J58m89K28L75m66M9K93k1k81L50K66o32JL40l02J15M11l60j62K73j70
7649d5m4O7K99m40J36L04l27L7K12j49l10O56l92k24J41K60k30Q4m8l4j34M56
7671B75j20k44Q6K54k92K2J44k26j43K84l5m65P57j87m41J85L52k53j39L03j86
7692f9Q6K51j46l63K25M05k29j72K90m39M01N2j36l82K98J45l56Q8P2m44L07O39
7714E23o30nK46J25n70N70J39l27j11L78m95N3J45J88l06M39j83j39j67R7j17
$$ plain form
7735 -147 46 22 -159 0 86 149 -266 465 215 -390 51 221 22 15 286 -176 -41 459 32 -286 314 189
7757 189 -223 84 233 -256 81 -36 100 -144 314 8 -231 295 161 -220 -43 244 -235 -175 227 100
7777 100 -307 299 -224 -259 -49 256 -172 -127 562 -186 -199 289 8 -72 -27 181 -171 78 53 -288 -123 107
7799 107 99 -57 288 -70 -190 -84 18 -368 -67 -97 -373 -345 359 -25 -366 115 15 -117 148 -41 -268
7820 -268 -150 486 -9 -170 228 126 162 -299 111 -28 -78 250 44 -301 175 -76 -98 230 211 -111 10
7841 10 121 -340 -45 394 -105 -336 120 228 112 125 213 -204 152 159 -419 -15 257 196 -196 184 50 -120
7863 -120 -69 136 137 -144 234 -123 -55 297 -342 -457 412 78 -667 200 417 -202 93 236 -78 -230 -56
7884 -56 -10 -386 -55 133 -177 133 65 -50 -235 74 -289 -305 -112 9 -24 42 215 -164 -225 381 90 -297
$$ packed form
7735a47J93k4j81J59Q6O3m15P31k50o05M41J70j99pK71m62J35N00m27l18O00j25
7757A89m12L07J49m89L37j17J36k44M58l06k39N26j34l81J77K87m79O0M02j27
7777A00m07O06n23l5K10L05m28M5O89p48j3M88k81q0M5K08l52K49k5l41J65K30
7799A07qj56L45l58j20J06J02l86L01l0k76K8P04l84l41M81j00j32K65j89k27
7820b68J18O36m95j61L98j02L6m61M10j39n0L28k06l45M76k51k2L28j9l22J21
7841A0J11m61K95M39m99k31M56J08j16J3Q8m17L56Pn78M04K72o1l92L80j34j70
7863a20N1K05Jk81L78l57O8L52o39j15Q69l34p45Q67K17o19K95J43l14j52J74
7884e6M6l76L31J88l10L10o8j15j85L09l63j6J93J21l3O6J73l79o1O06k91l87
$$ plain form
7906 -297 117 -128 -32 -38 261 -263 -311 148 -353 48 61 -248 -169 149 -92 -61 73 -49 -162 352 173 -320
7928 -320 -303 175 62 22 9 -11 -359 147 104 -162 12 136 145 -394 238 152 -96 357 183 -174 96 98 -196
7951 -196 -258 220 -15 -370 273 199 -198 -5 196 -247 155 392 33 186 232 -212 -79 218 -135 35 275
7972 275 -12 -274 177 165 9 -90 262 232 -74 37 1 -105 -283 325 41 -92 282 5 88 313 -122 -111
7994 -111 247 37 -72 -41 362 81 -52 412 113 -409 158 31 -281 64 85 -363 -179 19 12 -169 124
8015 124 -66 -349 240 302 -211 -25 325 -53 -125 20 14 -164 -170 144 -286 -189 57 -230 83 186 -30 -324
8037 -324 141 87 -136 51 78 -75 179 200 -127 -92 320 34 -95 116 328 -42 -134 9 -173 -18 528 -145
8059 -145 -192 122 -11 93 364 87 13 -15 116 -37 -56 73 -319 70 355 -103 -61 62 -76 -112 -238 207
$$ packed form
7906b97M14k45R6oK99n24m8M59n01M01J3l09P9L18k41L1J34j22j13N14j79m93
7928c20J7M78j13m0j3k0l48N06m3k66J74J24Rn39O32q6k48M53j74l57K70Kk94
7951a96o2M78k35l55O43p4l97J93K01m43M02K37l59J53M6m44J33K97l53J70K40
7972B75k87k62M51j2j56r9L52l0l06J11l6j06j78O08k84j33L74k77Q3K25m35J1
7994a11L58k10j09L1M03k81j33M64k99n22N67j27l12L45K1m48J84J98pj81K93
8015A24j90k83N89O2n13J86L50l78p2J45oj78oL14m30R7K46k87L13J03k16k94
8037c24M65n4k23J87K7j53K54K1l27L5M12k86j29K11K12l70r2J43j82J55N46o73
8059a45m7L14j33J04K71k77p4k8J31j53j9J29l92L89K85m58M2J23j38l6j26M45
$$ plain form
8081 207 70 -152 -66 -201 -35 331 -249 -239 59 76 -41 223 203 -2 -183 451 259 -490 373 89 -148
8102 -148 318 345 131 -3 80 169 -142 166 236 -279 102 260 -183 183 271 -172 -99 110 18 168 -62 -194
8124 -194 -277 240 -134 -443 52 466 -81 -224 213 -277 -105 57 153 -305 268 149 -213 -124 191 86 -408
8145 -408 216 132 -419 179 275 -5 -47 -96 -22 -192 20 303 -181 186 154 -355 -135 156 -183 -187 368 -191 -66
8168 -66 187 106 -99 233 19 -211 127 150 52 105 445 158 -204 337 -22 -217 16 -147 -168 -26 379 -190
8190 -190 100
$$ packed form
8081B07j37k22Q6j35J66L66n80J0K98J7j17K64k0k05j81O34j92p49Q63k84k37
8102a48M66K7k14j34Q3Q9l11L08P0n15L81J58m43L66Q8m43P3K09r2J50k30j32
8124a94q3N17l74l09M95M14n47j43M37m90J72J62R6m58N73j19l62Q9L15j05m94
8145d08O24q4n51N98R6k80m2m9P4j70K12K83m84L67l2n09K20K91l39mN55n59J25
8168f6K53q1k05L32k14k30L38K3r8N3L40k87l62N41l59j95K33j63k1J42M05n69
8190a90K90
8191A00
$$ Imaginary data points
##PAGE= N=2
##DATA TABLE= (X++(I..I)), XYDATA
$$ plain form
0 0 0 0 0 0 8 0 8 -8 8 -16 20 -24 25 -34 41 -49 64 -72 88 -104 120 -138 161 -185 214 -242 277 -317 357
29 357 -405 458 -509 572 -642 715 -796 887 -983 1088 -1208 1339 -1482 1641 -1815 2013
45 2013 -2234 2482 -2766 3093 -3474 3926 -4470 5136 -5986 7100 -8640 10911 -14611 21675
59 21675 -40056 187062 396247 -42884 -231938 -118913 169879 296246 139018 -164817
69 -164817 -143140 107461 164158 -35594 -161698 -142003 -9297 97279 3900 -180376 -109078
80 -109078 91154 81336 -78990 -140540 -80043 82417 214643 105066 -113256 -102868 55668
91 55668 112387 82882 28264 -55198 -34838 76752 72403 -15273 -21595 -33907 -89816 -42153
103 -42153 53220 44921 9538 -10631 -77414 -81014 26228 51765 -15571 -6484 21955 -14484
$$ packed form
0@%%%%QqQj6J6k4L6m4M9n9P5r0J13j36J60j92K24k58K99l46L99m56N19n94O74
29C57p62Q63r67J081j214J357j511J683j870K071k296K547k821L123l456L828
45B013m247M716n248N859o567P400q396R606j1122J3086j5740J9551k5522L6286
59B1675o1731K27118K09185m39131j89054J13025K88792J26367j57228l03835
69a64817K1677K50601N6697j99752j26104J9695J32706J06576r3379j84276P1298
80a09078K00232r818j60326o1550O0497J62460J32226j09577k18322J0388J58536
91E5668N6719k9505n4618q3462K0360J11590m349q7676o322j2312n5909M7663
103d2153R5373q299l5383k0169o6783l600J07242K5537o7336R087K8439l6439
$$ plain form
115 -14484 -9755 24721 -1330 -3734 19192 -52226 -89857 45767 143662 51670 -76226 -128067
127 -128067 -75187 96220 182382 14002 -147021 -58643 92089 109629 24176 -101612 -126390
138 -126390 39335 144299 -1497 -134521 -54247 53908 41987 -55785 -165142 -114181 119872
149 119872 196024 -31710 -211933 -112835 91405 192098 90747 -138542 -174638 84332
159 84332 255340 110787 -94548 -136595 -36124 112451 131037 -37919 -127242 -6819 70234
170 70234 -12324 -85403 -82574 -30306 54504 43307 -88898 -103829 43944 100134 16366 -52490
182 -52490 -67504 -12307 113108 136712 7719 -58671 -7323 19119 31043 61204 23903 -35505
194 -35505 -15394 1717 -15641 21725 33828 -58649 -95987 -15081 36415 34026 23325 -38626
$$ packed form
115a4484M729L4476k6051k404K2926p1418l7631J35624R7895r1992j27896n1841
127a28067N2880J71407Q6162j68380j61023Q8378J50732J7540q5453j25788k4778
138a26390J65725J04964j45796j33024Q0274J08155j1921r7772j09357N0961K34053
149A19872P6152k27734j80223R9098K04240J00693j01351k29289l6096K58970
159H4332J71008j44553k05335m2047J00471J48575J8586j68956q9323J20423P7053
170G0234q2558p3079K829N2268Q4810j1197j32205j4931J47773N6190q3768o8856
182e2490j5014N5197J25415K3604j28993o6390N1348K6442J1924L0161l7301n9408
194c5505K0111J7111j7358L7366J2103r2477l7338Q0906N1496k389j0701o1951
$$ plain form
206 -38626 -80381 -6147 48002 -779 -6810 42649 26722 -8523 -3910 -9036 17289 80377 30190
219 30190 -89246 -56082 79408 110291 37897 -62379 -125590 -36148 122364 96682 -63400
230 -63400 -97139 -10075 48343 48378 -21262 -98756 -33259 90512 44720 -78851 -62039 33988
242 33988 71418 33016 -73682 -128339 13124 172277 93024 -90514 -127260 -27218 93692
253 93692 126019 -7289 -143447 -61375 98440 92487 -11993 -68388 -67717 -3420 61135 7316
265 7316 -66654 -9207 53968 1036 -54689 -43507 -12155 42602 62986 -26953 -86518 -2732
277 -2732 69119 32625 -9122 -32464 -46501 8029 66902 26209 -18968 -1571 -18876 -45838
289 -45838 5490 49171 17520 -8150 -26442 -50387 1126 70823 17976 -67016 -44428 9544
$$ packed form
206c8626m1755P4234N4149m8781o031M9459j5927l5245M613n126K6325O3088n0187
219C0190j19436L3164J35490L0883p2394j00276o3211Q9442J58512k5682j60082
230f3400l3739Q7064N8418L5o9640p7494O5497J23771m5792j23571J6812R6027
242C3988L7430l8402j06698n4657J41463J59153p9253j83538l6746J00042J20910
253I3692L2327j33308j36158Q2072J59815n953j04480n6395O71O4297O4555n3819
265G316p3970N7447O3175n2932n5725J1182L1352N4757K0384q9939n9565Q3786
277b732P1851l6494m1747k3342j4037N4530N8873m0693m5177J7397j7305k6962
289d5838N1328M3681l1651k5670j8292k3945N1513O9697n2847q4992K2588N3972
$$ plain form
301 9544 28704 41722 8293 -50260 -20141 33972 -3694 -31931 23316 45874 9997 -16303
313 -16303 -41521 -28524 61233 81422 -35464 -94925 -13398 66729 73170 18989 -77796 -89081
325 -89081 36331 100368 11495 -54450 -22611 16912 37014 17579 -49715 -41572 61115 68591
337 68591 -38283 -69811 -1136 57708 65011 -5786 -108283 -69898 84877 115230 -3304
348 -3304 -83052 -65884 5952 83684 57502 -56571 -68719 27670 54744 10045 -9160 -15780
360 -15780 -8780 28219 13176 -40862 -6306 59403 23223 -41424 -42566 -21460 14049 52207
372 52207 8452 -62951 -33311 26176 13689 -3140 3318 -19960 -23768 13805 12396 548 32952
385 32952 19372 -49602 -42468 25014 43054 27147 -2917 -55273 -41599 45164 50341 -27359
$$ packed form
301I544J9160J3018l3429n8553L0119N4113l7666k8237N5247K2558l5877k6300
313a6303k5218J2997Q9757K0189j16886n9461Q1527Q0127O441n4181r6785j1285
325h9081J25412O4037q8873o5945L1839L9523K0102j9435o7294Q143J02687P476
337F8591j06874l1528O8675N8844P303p0797j02497L8385J54775L0353j18534
348c304p9748J7168P1836P7732k6182j14073j2148R6389K7074m4699j9205o620
360a5780P000L6999j5043n4038L4556O5709l6180o4647j142K1106L5509L8158
372E2207m3755p1403K9640N9487j2487j6829O458k3278l808L7573j409j1848L2404
385C2952j3580o8974P134O7482J8040j5907l0064n2356J3674Q6763N177p7700
$$ plain form
397 -27359 -45486 -11356 2818 19157 15493 -28879 -21853 29761 2687 -51251 -15034 41309
409 41309 36936 6240 -41032 -67378 7564 88439 28946 -69763 -57655 8395 51059 53006
421 53006 -16219 -79206 -19155 65189 32653 -26593 -14764 11992 25048 21223 -29996 -51076
433 -51076 29148 75587 -4400 -71928 -42126 15223 53630 34423 -60956 -97775 3072 80572
445 80572 33751 -28293 -42260 -23911 31898 60708 5154 -28133 23061 42893 4816 400
457 400 15602 12660 22467 10997 -40639 -30243 38882 33886 -28787 -45514 -35562 -19733 19787
470 19787 18518 -34548 -32100 12482 3129 -11280 19653 26148 5503 9473 4163 -2249 45763
483 45763 68076 -2923 -49440 -10089 29184 37429 23374 -34162 -64560 -3423 37687 -10670
$$ packed form
397b7359j8127L4130J4174J6339l664m4372P026N1614k7074n3938L6217N6343
409D1309m373l0696m7272k6346P4942Q0875n9493r8709J2108O6050M2664J947
421E3006o9225o2987O0051Q4344l2536n9246J1829K6756J3056l825n1219k1080
433e1076Q0224M6439p9987o7528K9802N7349L8407j9207r5379l6819J00847P7500
445H0572m6821o2044j3967J8349N5809K8810n5554l3287N1194J9832l8077m416
457D00J5202k942R807j1470n1636J0396O9125m996o2673j6727R952J5829L9520
470A9787j269n3066K448M4582r353j4409L0933O495k0645L970n310o412M8012
483D5763K2313p0999m6517L9351L9273Q245j4055n7536l0398O1137M1110m8357
$$ plain form
495 -10670 -40918 -19332 -9427 -1676 5477 -21611 -21485 33879 31692 -36108 -38804 20419 49668
508 49668 42339 -106 -59092 -34654 58730 63193 -19025 -50820 -22523 10577 38120 14907
520 14907 -48516 -38894 27495 22533 -26399 -20491 8606 18712 18818 -18605 -57703 -5676 65911
533 65911 30294 -44113 -49608 -14650 26557 48234 -5406 -71053 -32418 39633 31629 -3158
545 -3158 -9867 -14124 752 29313 8472 -16817 20978 41148 -4780 -24863 135 12845 21341
558 21341 15332 -36194 -52471 8607 35234 -9087 -32022 -26255 -23481 1738 19161 -10849 -16138
571 -16138 22391 14078 -19685 2247 35762 31446 22773 1709 -26386 10386 68262 34940 -33841
584 -33841 -35401 -4604 16513 28959 -4676 -53913 -29532 19561 -600 -31330 -12405 2007
$$ packed form
495a0670l0248K1586R905P751P153k7088J26N5364k187o7800k696N9223K9249
508D9668p329m2445n8986K4438R3384M463q2218l1795K8297L3100K7543k3213
520A4907o3423R622O6389m962m8932N908K9097J0106J06l7423l9098N2027P1587
533F5911l5617p4407n495L4958M1207K1677n3640o5647L8635P2051q004l4787
545c158o709m257J4876K8561k0841k5289L7795K0170m5928k0083K4998J2710Q496
558B1341o009n1526j6277O1078K6627m4321k2935N767K774K5219J7423l0010n289
571a6138L8529q313l3763K1932L3515m316q673k1064k8095L6772N7876l3322o8781
584c3841j560L0797K1117J2446l3635m9237K4381M9093k0161l0730J8925J4412
$$ plain form
596 2007 1645 6092 -13953 -23924 28886 58052 1505 -37345 -4320 34259 50212 36028 -23495
609 -23495 -48626 14348 54809 10272 -26947 -19763 -9841 9396 14426 -25161 -36334 12579 20040
622 20040 -27238 -32790 722 18927 24990 1534 -48110 -30879 44063 51313 -7036 -30650 -17888
635 -17888 5540 38807 27382 -29312 -29272 19585 19586 -7419 -1677 2487 -2238 7277 -6985 -31551
649 -31551 1755 40432 4014 -37669 -25275 -3868 13241 23757 -12860 -49892 -12769 29576
661 29576 7138 -14616 -6475 -7995 -1833 13268 -3674 -11769 25277 29751 -17974 -25545 9275
674 9275 24719 25984 9140 -34833 -32084 29527 40548 -11035 -32102 -18553 -5627 15078 13461
687 13461 -25176 -25150 15424 8568 -23692 -11020 12550 13759 13640 -5622 -31642 2824 53412
$$ packed form
596B007l62M447k0045r971N2810K9166n6547l8850L3025L8579J5953j4184n9523
609b3495k5131O2974M0461m4537l7219P184R922J9237N030l9587j1173M8913P461
622B0040m7278n552L3512J8205O063k3456m9644J7231P4942P250n8349k3614J2762
635a7888K3428L3267j1425n6694M0M8857Jk7005N742M164m725R515j4262k4566
649c1551L3306L8677l6418m1683J2394K1407J7109J0516l6617l7032L7123M2345
661B9576k2438k1754Q141j520O162J5101j6942q095L7046M474m7725p571L4820
674I275J5444J265j6844m3973K749O1611J1021n1583k1067J3549J2926K0705j617
687A3461l8637K6M0574o856l2260J2672K3570J209j19j9262k6020L4466N0588
$$ plain form
700 53412 26135 -26097 -23584 3461 25576 37740 3504 -40700 -14455 30789 12960 -14858
712 -14858 -8232 -3152 886 9773 -12605 -29298 11567 34398 -8750 -34427 -10218 14203 29545
725 29545 23977 -23645 -41022 14593 47504 13339 -11921 -9855 -5319 16408 27094 -6789 -20166
738 -20166 14634 16623 -15433 -12614 6471 6990 9503 -3695 -35895 -19258 32259 24176 -19918
751 -19918 -25177 -10756 2727 23722 12498 -26271 -15355 22128 11080 -10335 2362 8252
763 8252 2944 7120 -6971 -21484 12897 37329 -2653 -34979 -16132 5709 17671 18357 -19068
776 -19068 -42994 -1488 30554 2437 -19237 -10575 -6622 3967 13032 -10353 -18089 17833 21673
789 21673 -17866 -21977 4965 16872 20527 5549 -32966 -25417 29543 34881 -10217 -25353 -13001
$$ packed form
700E3412k7277n2232K513K7045K2115J2164l4236m4204K6245M5244j7829k7818
712a4858O626N080M038Q887k2378j6693M0865K2831m3148k5677K4209K4421J5342
725B9545n568m7622j7377N5615L2911l4165k5260K066M536K1727J0686l3883j3377
738b0166L4800J989l2056K819J9085N19K513j3198l2200J6637N1517q083m4094
751a9918n259J4421J3483K0995j1224l8769J0916L7483j1048k1415J2697N890
763H252n308M176j4091j4513L4381K4432l9982l2326J8847K1841J1962O86l7425
776a9068k3926M1506L2042k8117k1674Q662L953J0589R065k3385p736L5922L840
789B1673l9539m111K6942J1907L655j4978l8515P549N4960N338m5098j5136J2352
$$ plain form
802 -13001 648 21417 14903 -24622 -22361 16154 10916 -15704 -8182 3819 4950 10601 -5472
815 -5472 -30745 -2355 37783 14154 -24326 -18932 -1447 15651 29861 1775 -34810 -10076
827 -10076 26549 13074 -5825 -1479 -4599 -233 13577 -2885 -17614 11250 23086 -10188 -20313
840 -20313 -25 9013 15304 12355 -20509 -27323 15873 31120 -705 -12816 -4607 -2938 10819
853 10819 16192 -9800 -12281 17872 11756 -17296 -8146 10946 10048 9429 -4962 -28997 -6426 36388
867 36388 19072 -21713 -20971 -2354 10988 24346 4753 -29179 -10637 25155 9902 -13539
879 -13539 -4672 1960 3546 9648 -8530 -24625 8230 31288 -3200 -28853 -12788 5259 18822
892 18822 19897 -16559 -35926 4817 32216 5732 -13827 -9042 -5498 9150 17708 -9738 -20707
$$ packed form
802a3001J3649K0769o514l9525K261L8515n238k6620P522J2001J131N651j6073
815e472k5273K8390M0138k3629l8480N394J7485J7098J4210k8086l6585K4734
827a0076L6625j3475j8899M346l120M366J3810j6462j4729K8864J1836l3274j0125
840b0313K0288R038O291k949l2864o814M3196J5247l1825j2111Q209J669J3757
853A0819N373k5992k481L0153o116k9052R150J9092q98o19j4391k4035K2571M2814
867C6388j7316m0785P42J8617J3342J3358j9593l3932J8542L5792j5253k3441
879a3539Q867O632J586O102j8178j6095L2855K3058l4488k5653J6065J8047J3563
892A8822J075l6456j9367M0743K7399k6484j9559M785L544J4648Q558k7446j0969
$$ plain form
905 -20707 11072 16361 -13099 -15936 -351 4302 12293 4779 -27995 -22760 20710 23104 -9587
918 -9587 -16371 -9268 -2044 18003 14802 -18333 -16204 13383 7706 -9650 -314 3546 -1557 5745
932 5745 -3763 -20704 1830 26452 989 -22678 -9049 3130 9732 16268 -5723 -26763 643
945 643 24545 2583 -10866 -10 1205 2604 8122 -9107 -14622 16315 20819 -15003 -21851 1422
959 1422 11946 15162 6241 -24576 -21836 23171 30539 -5134 -16428 -4486 4397 18894 14599
972 14599 -16355 -13764 20639 14950 -13438 -10063 3411 6368 11940 -2461 -29208 -9320 28753
985 28753 14746 -18272 -17751 -5479 9244 25299 5640 -26638 -8884 23798 12922 -4953
997 -4953 -1011 -1508 2874 14926 -573 -18856 4904 21134 -3678 -17523 -6242 -694 8525
$$ packed form
905b0707L1779N289k9460k837J5585M653P991p514l2774N235M3470K394l2691
918i587o784P103P224K0047l201l3135K129K9587n677j7356R336L860n103P302
932E745r508j6941K2534K4622k5463k3667J3629J2179O602O536k1991k1040K7406
945F43K3902k1962j3449J0856J215J399N518j7229n515L0937M504l5822o848K3273
959A422J0524L216q921l0817K740M5007P368l5673j1294J1942Q883J4497m295
972A4599l0954K591L4403n689k8388L375J3474K957N572j4401k6747J9888L8073
985B8753j4007l3018N21J2272J4723J6055j9659l2278J7754L2682j0876j7875
997d953L942m97M382J2052j5499j8283K3760J6230k4812j3845J1281N548R219
$$ plain form
1010 8525 13802 -12818 -27810 3957 20762 -4 -8186 -2782 -5919 4549 14172 -4914 -10914
1023 -10914 12066 10061 -12401 -5834 7747 4003 5473 -752 -21394 -10035 21401 10532 -18348
1036 -18348 -14132 -1729 1211 10163 1188 -21189 -7673 17908 2960 -16041 -2902 6099 4039
1049 4039 5950 -8559 -21146 7619 28625 -815 -24130 -9221 5576 14015 15218 -12344 -28940
1062 -28940 4611 27386 2287 -14365 -6752 -1223 8778 13310 -11317 -20027 12277 20508 -8536
1075 -8536 -17025 -3387 4255 14425 9810 -21560 -22632 16509 23700 -3952 -12748 -8235 -1781 17296
1089 17296 16169 -14844 -15337 13931 12354 -5737 -2375 583 164 10923 4063 -17922 -4832 20234
1103 20234 7346 -11712 -6277 -2201 3168 16392 3448 -19438 -3821 16317 3186 -4859 3685
$$ packed form
1010H525N277k6620j4992L1767J6805k0766q182N404l137J0468R623j9086o000
1023a0914K2980k005k2462O567J3581l744J470o225k0642J1359L1436j0869k8880
1036a8348M216J2403K940Q952q975k2377J3516K5581j4948j9001J3139R001k060
1049D039J911j4509j2587K8765K1006k9440k3315J4909J4797Q439J203k7562j6596
1062b8940L3551K2775k5099j6652P613N529J0001M532k4627q710L2304Q231k9044
1075h536q489J3638P642J0170m615l1370j072L9141P191k7652q796M513O454J9077
1089A7296j127l1013m93K9268j577j8091L362K958m19J0759o860k1985J3090K5066
1103B0234j2888j9058N435M076N369J3224j2944k2886J5617K0138j3131q045Q544
$$ plain form
1116 3685 343 -216 9384 -981 -10305 10378 15891 -8934 -12325 4239 6064 6716 5933 -14163
1130 -14163 -16711 13778 17279 -9355 -12099 209 933 5643 5553 -14073 -9858 17170 9603 -16170
1144 -16170 -9616 6264 7649 9788 -2109 -23306 -5959 26689 13160 -16714 -14470 -1437 7337
1157 7337 16449 28 -25596 -7976 20655 7412 -13318 -7641 -2140 4009 11917 -5732 -23177
1170 -23177 1464 23101 1485 -16629 -8986 -965 10270 16781 -8855 -26153 1223 20756
1182 20756 2873 -8712 -6591 -7209 5029 14290 -7194 -17145 6017 11906 -6907 -7409 -12 -1553
1196 -1553 7072 8175 -13553 -13186 13197 12875 -6142 -5318 -1660 -2693 9637 9479 -11219 -7358 12290
1211 12290 3194 -8304 2055 4423 -1024 5052 -436 -13621 3172 19270 -740 -14958 -1777
$$ packed form
1116C685l342n59R600j0365r324K0683N513k4825l391J6564J825O52p83k0096
1130a4163k548L0489L501k6634k744J2308P24M710r0j9626M215K7028p567k5773
1144a6170O554J5880J385K139j1897k1197J7347L2648j3529k9874K244J3033Q774
1157G337R112j6421k5624J7620K8631j3243k0730N677N501O149P908j7649j7445
1170b3177K4641K1637k1616j8114P643Q021J1235O511k5636j7298K7376J9533
1182B0756j7883j1585K121o18J2238R261k1484r951K3162N889j8813n02P397j541
1196a553Q625J103k1728L67K6383l22j9017Q24L658j033J2330j58k0698L861J9648
1211A2290r096j1498J0359K368n447O076n488j3185J6793J6098k0010j4218J3181
$$ plain form
1224 -1777 4546 5379 10225 -4791 -17246 5203 19567 -1967 -10922 1392 3284 4617 7595 -8272
1238 -8272 -12886 13686 18323 -9248 -14879 1289 7248 11509 6414 -17632 -16676 16473 19876 -6933
1252 -6933 -12877 -3331 1911 13474 9056 -16368 -12663 16270 13089 -8796 -7610 -49 3832 12463
1266 12463 2533 -20430 -7704 20338 10876 -10591 -9934 -4989 2649 15571 2804 -21233 -8036
1279 -8036 14900 5438 -7085 -3276 -4961 -674 11077 -739 -16108 1370 14397 -2143 -9377
1292 -9377 -1800 -1895 3926 10957 -6370 -17658 4347 12964 -3532 -6067 -1044 -4948 2043 8425
$$ packed form
1224a777O323Q33M846j5016j2455K2449J4364k1534q955J2314J892J333K978j5867
1238h272m614K6572M637k7571n631J6168N959M261n095k4046R56L3149L403k6809
1252f933n944R546N242J1563m418k5424L705K8933l181k1885J186P561L881Q631
1266A2463r930k2963J2726K8042r462k1467O57M945P638J2922j2767k4037J3197
1279h036K2936r462j2523L809j685M287J1751j1816j5369J7478J3027j6540p234
1292i377P577r5N821P031j7327j1288K2005Q617j6496k535N023l904O991O382
$$ [...]
8191B30
##END NTUPLES=NMR FID
##END=
