##TITLE=1H_CA-DMSO-per2
 DMSO-d6
 8 sc, 
 27.12.2024
##JCAMPDX= 6.0         $$ Bruker NMR JCAMP-DX V2.0
##DATA TYPE= NMR SPECTRUM
##DATA CLASS= NTUPLES
##ORIGIN= UXNMR, Bruker Analytische Messtechnik GmbH
##OWNER= root
$$ XWIN-NMR		Version 3.5
$$ Fri Dec 27 13:52:55 2024 Russian Standard Time (UT+4h)  she@DPX200
##.OBSERVE FREQUENCY= 200.1315
##.OBSERVE NUCLEUS= ^1H
##.ACQUISITION MODE= SIMULTANEOUS
##.ACQUISITION SCHEME= undefined
##.AVERAGES= 8
##.DIGITISER RES= 18
##SPECTROMETER/DATA SYSTEM= spect
##.PULSE SEQUENCE= zg30
##.SOLVENT NAME= D2O
##.SHIFT REFERENCE= (INTERNAL, D2O, 0, 19.1786)
##AUDIT TRAIL= $$ (NUMBER, WHEN, WHO, WHERE, WHAT)
$$ ##TITLE= Audit trail, XWIN-NMR		Version 3.5
$$ ##JCAMPDX= 5.01
$$ ##ORIGIN= Bruker BioSpin GmbH
$$ ##OWNER= she
$$ F:/spectra/data/she/nmr/H-F/1/pdata/1/auditp.txt
$$ ##AUDIT TRAIL=  $$ (NUMBER, WHEN, WHO, WHERE, WHAT)
(   1,<2024-12-27 13:51:46.65 +0400>,<she>,<DPX200>,
      <created by zg, POWCHK disabled, PULCHK disabled
       configuration hash MD5:
       00 E9 B6 7A A2 85 ED C7 34 08 36 98 17 FE 4E 26
       data hash MD5: 16K
       57 60 F3 03 01 30 81 AC 7E 2B 84 1D AD 3E A2 4E>)
(   2,<2024-12-27 13:51:48.93 +0400>,<she>,<DPX200>,
      <Start of raw data processing
       efp BC_mod = 2 LB = 0.24 FT_mod = 6 PKNL = 1 PHC0 = -26573.49 PHC1 = 16.58744 SI = 16K 
       data hash MD5: 16K
       59 15 A1 77 B4 54 81 E2 EF F6 AB F7 9F AF 79 D4>)
(   3,<2024-12-27 13:52:06.54 +0400>,<she>,<DPX200>,
      <pk PHC0 = -10.86648 PHC1 = 5.799999 
       data hash MD5: 16K
       DB BC 0B AE 35 FD 5D 41 6F AC 52 7E D5 8C 34 D4>)
(   4,<2024-12-27 13:52:09.85 +0400>,<she>,<DPX200>,
      <abs ABSG = 5 
       data hash MD5: 16K
       4F AF 01 5C EE 13 27 7F C7 5F 53 41 03 8F 3B D2>)
$$ ##END=
$$ 
$$ hash MD5
$$ 0C 6F E7 ED 12 6B DE 0A F8 1F EA A5 1F 7D A5 0D
##$RELAX= 
##$RELAX= 
##$RELAX= 
##$RELAX= 
##$RELAX= 
##$RELAX= 
$$ Bruker specific parameters
$$ --------------------------
##$DU= <F:/spectra>
##$EXPNO= 1
##$NAME= <H-F>
##$PROCNO= 1
##$TYPE= <nmr>
##$USER= <she>
##$AMP= (0..31)
100 100 100 100 100 100 100 100 100 100 100 100 100 100 100 100 100 100 
100 100 100 100 100 100 100 100 100 100 100 100 100 100 
##$AQSEQ= 0
##$AQ_mod= 1
##$AUNM= <au_zg>
##$AUTOPOS= <>
##$BF1= 200.13
##$BF2= 200.13
##$BF3= 200.13
##$BF4= 200.13
##$BF5= 200.13
##$BF6= 200.13
##$BF7= 200.13
##$BF8= 200.13
##$BYTORDA= 1
##$CFDGTYP= 0
##$CFRGTYP= 5
##$CHEMSTR= <none>
##$CNST= (0..31)
1 1 145 1 1 1 1 1 1 1 1 1 1 1 1 1 1 1 1 1 1 1 1 1 1 1 1 1 1 1 1 1 
##$CPDPRG= <>
##$CPDPRG1= <>
##$CPDPRG2= <>
##$CPDPRG3= <>
##$CPDPRG4= <mlev>
##$CPDPRG5= <mlev>
##$CPDPRG6= <mlev>
##$CPDPRG7= <mlev>
##$CPDPRG8= <mlev>
##$CPDPRGB= <>
##$CPDPRGT= <>
##$D= (0..31)
0 1.2 0 0 0 0 0 0 0 0.06 0 0.03 0 0 0 0 0.0002 0 0 0 0 0 0 0 0 0 0 0 0 
0 0 0 
##$DATE= 1735293106
##$DBL= (0..7)
120 120 120 120 120 120 120 120 
##$DBP= (0..7)
150 150 150 150 150 150 150 150 
##$DBP07= 0
##$DBPNAM0= <>
##$DBPNAM1= <>
##$DBPNAM2= <>
##$DBPNAM3= <>
##$DBPNAM4= <>
$$ [...]
##$SUBNAM3= <"">
##$SUBNAM4= <"">
##$SUBNAM5= <"">
##$SUBNAM6= <"">
##$SUBNAM7= <"">
##$SUBNAM8= <"">
##$SUBNAM9= <"">
##$SW= 24.0689530833862
##$SWIBOX= (0..15)
0 0 2 0 0 0 0 0 0 0 0 0 0 0 0 0 
##$SW_h= 4816.95568400771
##$TD= 16384
##$TD0= 1
##$TE= 0
##$TE2= 300
##$TE3= 300
##$TEG= 300
##$TL= (0..7)
0 120 120 120 120 120 120 120 
##$TP= (0..7)
150 150 150 150 150 150 150 150 
##$TP07= 0
##$TPNAME0= <>
##$TPNAME1= <>
##$TPNAME2= <>
##$TPNAME3= <>
##$TPNAME4= <>
##$TPNAME5= <>
##$TPNAME6= <>
##$TPNAME7= <>
##$TPOAL= (0..7)
0.5 0.5 0.5 0.5 0.5 0.5 0.5 0.5 
##$TPOFFS= (0..7)
0 0 0 0 0 0 0 0 
##$TUNHIN= 0
##$TUNHOUT= 0
##$TUNXOUT= 0
##$USERA1= <user>
##$USERA2= <user>
##$USERA3= <user>
##$USERA4= <user>
##$USERA5= <user>
##$V9= 5
##$VALIST= <valist>
##$VCLIST= <CCCCCCCCCCCCCCC>
##$VD= 0
##$VDLIST= <DDDDDDDDDDDDDDD>
##$VPLIST= <PPPPPPPPPPPPPPP>
##$VTLIST= <TTTTTTTTTTTTTTT>
##$WBST= 1024
##$WBSW= 4
##$XGAIN= (0..3)
0 0 0 0 
##$XL= 0
##$YL= 0
##$YMAX_a= 108254
##$YMIN_a= -129717
##$ZGOPTNS= <>
##$ZL1= 120
##$ZL2= 120
##$ZL3= 120
##$ZL4= 120
##$ABSF1= 19.17861
##$ABSF2= -4.890514
##$ABSG= 5
##$ABSL= 3
##$ALPHA= 0
##$AQORDER= 0
##$ASSFAC= 0
##$ASSFACI= 0
##$ASSFACX= 0
##$ASSWID= 0
##$AUNMP= <proc_1d>
##$AZFE= 0.1
##$AZFW= 0.1
##$BCFW= 0
##$BC_mod= 2
##$BYTORDP= 0
##$COROFFS= 0
##$CY= -3
##$DATMOD= 1
##$DC= 0
##$DFILT= <>
##$DTYPP= 0
##$F1P= 0
##$F2P= 0
##$FCOR= 1
##$FTSIZE= 16384
##$FT_mod= 6
##$GAMMA= 0
##$GB= 0
##$INTBC= 1
##$INTSCL= 2.524811e-10
##$ISEN= 128
##$LB= 0.24
##$LEV0= 0
##$LPBIN= 0
##$MAXI= 10000
##$MC2= 0
##$MEAN= 0
##$ME_mod= 0
##$MI= 1.114404
##$NCOEF= 0
##$NC_proc= -8
##$NLEV= 6
##$NOISF1= 3.799351
##$NOISF2= 2.8
##$NSP= 0
##$NTH_PI= 0
##$NZP= 0
##$OFFSET= 19.17861
##$PC= 1
##$PHC0= -26584.36
##$PHC1= 22.38744
##$PH_mod= 1
##$PKNL= yes
##$PPARMOD= 0
##$PSCAL= 0
##$PSIGN= 0
##$REVERSE= no
##$SF= 200.130070260643
##$SI= 16384
##$SIGF1= 3
##$SIGF2= 2
##$SINO= 5.538805
##$SIOLD= 16384
##$SREGLST= <1H.CDCl3>
##$SSB= 0
##$STSI= 16384
##$STSR= 0
##$SW_p= 4816.95568400771
##$SYMM= 0
##$S_DEV= 0
##$TDeff= 16384
##$TDoff= 0
##$TI= <>
##$TILT= no
##$TM1= 0
##$TM2= 0
##$TOPLEV= 0
##$USERP1= <user>
##$USERP2= <user>
##$USERP3= <user>
##$USERP4= <user>
##$USERP5= <user>
##$WDW= 1
##$XDIM= 16384
##$YMAX_p= 288889475
##$YMIN_p= -6612703
$$ End of Bruker specific parameters
$$ ---------------------------------
##NTUPLES= NMR SPECTRUM
##VAR_NAME=  FREQUENCY,     SPECTRUM/REAL,   SPECTRUM/IMAG
##SYMBOL=    X,             R,               I
##VAR_TYPE=  INDEPENDENT,   DEPENDENT,       DEPENDENT
##VAR_FORM=  AFFN,          ASDF,            ASDF
##VAR_DIM=   16384,         16384,           16384
##UNITS=     HZ,            ARBITRARY UNITS, ARBITRARY UNITS
##FACTOR=    0.29402158847633, 1,            1
##FIRST=     3838.2165363862, 0,             0
##LAST=      -978.739147621515, 0,           0
##MIN=       -978.739147621515, -6612703,    0
##MAX=       3838.2165363862, 288889475,     0
$$ Real data points
##PAGE= N=1
##DATA TABLE= (X++(R..R)), XYDATA
$$ [...]
8641A9203342N074797O356498M720321l760895q806139n987236n046372l005914
8633H748402k006663j784778l44931j74030k89781p66031m10758m9839l41135
8624B580456j41751n73916k58605j52011M58402R2122o57258j22145o1300K88103
8614A452097m09059K86297J61881K93220q31518j16638L38735l36543M0819r1829
8604G87462j67613m1673L73605K00198L57026p52289K01730J81185l16928Q1444
8594I04147n07239n96995K00429N72518O92139o66728p41607j79164J68664N4117
8584i9719J04951K1111k8864L80832K86586N2376l6969l99992K26169k53292n55808
8573c02619o2916M7363O20564O98780j050734p4014L51062N5903M53500J32731
$$ y = [19203342, 24278139, 30634637, 35354958, 31594063, 22787924, 16800688, 11754316, 8748402, 6741739, 4956961, 4612030, 4438000, 4148219, 3382188, 2971430, 2921591, 2580456, 2438705, 1864789, 1606184, 1454173, 1912575, 2004697, 1347439, 1225294, 1163994, 1452097, 1043038, 1329335, 1491216, 1784436, 952918, 836280, 1175015, 838472, 879291, 787462, 619849, 578176, 951781, 1151979, 1509005, 756716, 958446, 1139631, 822703, 904147, 396908, -200087, 342, 572860, 1264999, 598271, -143336, -322500, -153836, -99719, 5232, 26343, -2521, 378311, 664897, 717273, 680304, 280312, 506481, 253189, -302619, -365535, -318172, 302392, 1001172, -49562, -123576, 227486, 283389, 736889, 869620]
8563H69620n21267J90473j58536k36847r4750r8723O95644L27783n93733l86972
8553g308O29160j2752k00595o4893J70625l49652n283m59276j87J13374Q62584
8542F75797l24041j81539j87594J64363L60823K93873L92526n7530P521l27474
8532H16725k05699o08190m3920P22269K96450K14274j51646n77596N08074M61682
8522A432423N25388J17466j49424K3634O23664L58575q2617L3141L87665K37787
8512C507702J20469k24424q51435J48130J84088q61626m01973L70480q86082o19016
8502D86313Q1960J125640Q0803l17004n34343k33461L23517K80032r0664l25013
8492H77780k16000M0101j01741K3227J77831J82138r41696K03236Q15419m38410
$$ y = [869620, 348353, 538826, 380290, 143443, 48693, -50030, 645614, 973397, 379664, -7308, 621852, 609100, 408505, 343612, 514237, 164585, 159302, -299974, -300161, -186787, 675797, 351756, 170217, -17377, 146986, 507809, 801682, 1194208, 1136678, 1144199, 816725, 611026, 2836, -41084, 681185, 977635, 1191909, 1040263, 462667, 970741, 1432423, 1957811, 2075277, 1925853, 1949487, 2573151, 2931726, 2849109, 2882250, 3269915, 3507702, 3628171, 3403747, 2552312, 2700442, 2884530, 2022904, 1620931, 1991411, 1105329, 486313, 568273, 1693913, 1774716, 1457712, 923369, 689908, 1013425, 1293457, 1202793, 877780, 661780, 701881, 600140, 623367, 801198, 983336, 41640, 244876, 1060295, 621885]
8482F21885k66799J08734J93778L16758o01368L7958R7684j14198L22730j26521
8472E90641N92104l20843k97262k35386j23354O15552m11202q81944j7930L14866
8462a74758N56728q7472M09566j07825o44431p1732p81210N27229M01J62374m70774
8451f81904K30262O6080L19457M85685m50449k12236n48200P84690o8600J66815
8441I1600r303j40085k62578O74274j45999l6581k83310j10767k53785m3264k12666
8430g32464R94826j23779j46507K71916L64004o88871O6376O51625k9862n32252
8420I5012j66073j24003j19611p7203m18862J16449k99528L84193J20214N91311
8410A01899k43602J20577P23924j18086o98653O68085o77740m11355L06969K53681
$$ y = [621885, 355086, 463820, 657598, 974356, 372988, 410946, 508630, 394432, 717162, 590641, 1182745, 861902, 564640, 329254, 205900, 821452, 410250, -471694, -489624, -174758, 381970, 294498, 704064, 596239, -48192, -119924, -901134, -373905, -373504, -211130, -681904, -451642, -385562, -66105, 419580, -30869, -243105, -791305, -6615, -75215, 91600, 82297, -57788, -320366, 353908, 207909, 171328, -111982, -222749, -476534, -519798, -732464, 262362, 138583, -7924, 263992, 627996, -60875, 5501, 657126, 627264, 95012, -71061, -195064, -314675, -391878, -810740, -694291, -993819, -609626, -489412, 101899, -141703, -21126, 702798, 584712, -113941, 554144, -123596, -534951, -227982, 25699]
8400B5699O4746O8564m4427J50703k98847k82482l9919j55975K91729M2386O6282
8389a11541j17255L03471k19112k17786N8589O48422l68916R5145L22632L8876
8379D32525J21797q09572o4306Q49948j92416k63133J08933R6288l01590l32373
8369c53899J11483J46217R5382n5089j49130M95259J65655j5950l83028k50896
8359a93996J16666j81481m2769O32412J3339k44110J72874m1072m4588J18437
8349C05712k5089l92051L82635l5592j52346n56379K03016j38023N16244l74706
8339b66579N60883p18002J45108J97221j06443k27141J65861M04059P7548l83247
8329a50732m48997P76597J88723J56431q92157J74907N81832n2029n73704L49719
$$ y = [25699, 90445, 159009, 114582, 265285, -33562, -316044, -355963, -511938, -220209, -177823, -111541, -228796, 74675, -144437, -362223, -303634, 344788, -24128, 71017, 393649, 432525, 554322, -255250, -319556, 530392, 337976, 74843, 183776, 280064, -21526, -353899, -242416, -96199, -817, -55906, -205036, 290223, 455878, 439928, 56900, -193996, -77330, -258811, -301580, 330832, 344171, 100061, 272935, 231863, 187275, 305712, 280623, -111428, 271207, 235615, 83269, -473110, -270094, -408117, 108127, -266579, 294304, -423698, -278590, -81369, -187812, -414953, -249092, 154967, 232515, -150732, -599729, 176868, 365591, 522022, -370135, -195228, 386604, 334575, -239129, 110590]
8319A10590l58547M4881O28658K02623j93782j38354J26565L04820q4729K56657
8309H99382L66329m86974n70328j11936q44517k8615O45971Q6391K86140m14108
8299a72265K59213l97916p3730J37251R50784j32879n42686P39420o80310N25931
8289F12813l21466l6731M02908J92377n237N92660R0182q45258o74098J70780
8279A78930K15585J06868m1110n05106P1230j62523k95385J48471L4031j90720
8269d39729R44561q20079J2374K52499K73451M27049R8020n82298l79680Q50460
8259F36628P23908r97186k83870R8139k20388k47733N60244m9715L69092m69684
8249A19435J52786n85391n99613P95365j08353p5593k9679m3271J07923L21537
$$ y = [110590, -247957, -203076, 425582, 628205, 434423, 296069, 422634, 727454, 642725, 899382, 1265711, 778737, 208409, 96473, -748044, -776659, -130688, -44297, 241843, -172265, 86948, -310968, -384698, -247447, 703337, 570458, 27772, 767192, 86882, 612813, 291347, 254616, 657524, 849901, 844664, 1437324, 1527506, 682248, 8150, 178930, 394515, 501383, 460273, -44833, 26397, -136126, -431511, -283040, -249009, -439729, 504832, -315247, -302873, -50374, 223077, 650126, 748146, 165848, -213832, 636628, 1360536, 363350, 79480, 177619, -42769, -290502, 269742, 220027, 589119, 119435, 272221, -313170, -912783, -117418, -225771, -301364, -331043, -374314, -266391, 55146]
8239E5146l15265J51901j95113l22903M7410K72125o4860L35141n81315R62830
8229C45097P8132p84952n8787N14101j63023r9047j79057N4245L29944L6344l51927
8218b78930Q06200m41697k53994N4649k62752J81534j67011m92105O6393n0871
8208h38584J26557J88264L33314n60585J88463m1205m47152l28770J163260m45838
8198f62276P20178n03487p9498o33185M45302l831500k068237P676813l41345
8189G22765k9609l26053o4911o23934J016113n31715J68604L50069n76749r2129
8179A2451M16481j55502Q2357J33664p32613R08090k99275P1427k09881J0604
8169B37803N64444j1587m59459j45522N28866j47545k72493K21514K0687j05544
$$ y = [55146, -260119, -108218, -303331, -626234, -578824, -306699, -371559, -36418, -617733, 345097, 423229, -361723, -420510, 93591, -69432, -168479, -347536, -293291, 36653, 72997, -278930, 527270, 85573, -168421, -113772, -376524, -194990, -362001, -854106, -787713, -838584, -712027, -523763, -190449, -751034, -562571, -603776, -1050928, -1379698, -216438, -662276, 57902, -445585, -525083, -1158268, -712966, -4544466, -6612703, 1064110, 722765, 693156, 367103, 302192, -321742, 694371, 162656, 331260, 681329, 104580, 12451, 428932, 273430, 355787, 489451, -243162, 664928, 365653, 437080, 227199, 237803, 802247, 790660, 331201, 185679, 714545, 567000, 294507, 516021, 536708, 431164]
8159D31164j08531m77677J02004N60722m36350p4737j59240M12735L32614j20405
8149D62299j53100K38654l9054J13916M71529n63304m00274J98489m33366O6850
8139c7361K30445k80663q692N6560J03453K18814l93887K36312L38685k92659
8129A71007J01159o54931p0343j44907N02640M88812Q6231Q6527q0474L64709
8119H50430j16919J22440k72279K30658o77133l96961L1696P83660J6204m58353
8109A13443L30038k0240k14938L27942k54309m2732j63777n53871K64142K37498
8099B3196n209K59925n0937j01379J72508k43217J71051j23737P36508k53763
8089E84946k47794K3861n21470j27943M27513k60737K79715p736K5015L5096m7227
$$ y = [431164, 322633, -155044, -53040, 507682, 71332, -3405, -162645, 250090, 582704, 462299, 309199, 547853, 508799, 622715, 1094244, 530940, 130666, 329155, -104211, -37361, 193084, -87579, -96271, -39711, 63742, 282556, -111331, 124981, 463666, 171007, 272166, -382765, -453108, -598015, -95375, 393437, 479668, 566195, 485721, 850430, 733511, 855951, 583672, 814330, 137197, -259764, -228068, 555592, 571796, 113443, 443481, 423241, 208303, 536245, 281936, 239204, 75427, -478444, -214302, 23196, 17987, 277912, 226975, 125596, 298104, 54887, 225938, 102201, 838709, 584946, 337152, 361013, -160457, -288400, 139113, -121624, 158091, 150355, 175370, 210466, 163239]
8078A63239J98451k19246p7390j05005J9321l45643J18073L50358l67371J076752
8068H11539l75094N84923l41743m09032M68987o24431M48473M63024m11055m93782
8058A21809J35088l10928R5912J58520n17508k35995J028123m59600j19066J84876
8048H1231l62996P88252J42735n50212l08453R3343M80773l17547j09488l87122
8038d49484j88177K98832J151854j51558p57785O93562q69510N08581L12656m74673
8028G4298L85350k05102m4214L34401j35314k1779p40574Q72351K24540j1709
8018G32248j00158m87502J02088p72080O68569N89031M28010n65000n28668j37260
8008g0722J51950J55894k22661j93829O64016m46089o84121O07150j66693l32601
$$ y = [163239, 361690, 142444, 65054, -39951, -20630, -366273, -248200, 102158, -265213, 811539, 436445, 1021368, 679625, 270593, 739580, 115149, 563622, 1026646, 615591, 121809, 256897, -54031, 41881, 200401, -317107, -553102, 475021, 15421, -103645, 81231, -281765, 506487, 649222, 99010, -209443, -116100, 364673, 47126, -62362, -449484, -637661, -338829, 813025, 661467, -96318, 597244, -272266, 236315, 548971, 74298, 459648, 254546, 210332, 544733, 409419, 387640, -352934, 519417, 743957, 732248, 632090, 144588, 246676, -525404, 143165, 732196, 1160206, 595206, 66538, -70722, 81228, 237122, 14461, -179368, 484648, 38559, -645562, -38412, -205105, -537706]
7998e37706j05302J11361O48028j970L14468l6789k6739n19699K88647m2500K2694
7987A14493l02855N04109J590k26552o45951K27832L22309k26387P82310l13855
7977B37043J55337L29126o12710K74842o2574n96764L28306j54845N17976k50174
7967A65563l04987L96744k51435n50598L14726O81136j95454k87435k14544M9016
7957a97268N05191m32443R49635K16564k79407j90285j2897k87935l5513m7703
7947A87939J97090M71357k33369l05820K23990j2659k55943J37411j87383J00718
7937C23331j55381l92502L18696l94718O0282K95908n5691M61972n00089R3556
7927E5364J61402k94564L81393m09034K3906M06676p47276O83394m98328J30998
$$ y = [-537706, -643008, -531647, 116381, 114411, 428879, 392090, 365351, -154348, 134299, 91799, 114493, -188362, 315747, 317337, 90785, -555166, -327334, -5025, -231412, 550898, 237043, 392380, 721506, 108796, 383638, 321064, -275700, 52606, -102239, 415737, 165563, -139424, 257320, 5885, -544713, -229987, 451149, 255695, -31740, -246284, -197268, 307923, -124520, 825115, 1041679, 762272, 571987, 559090, 271155, 235642, 187939, 385029, 856386, 623017, 317197, 541187, 528528, 272585, 409996, 222613, 323331, 167950, -224552, 94144, -300574, -240292, 55616, -75, 461897, -38192, 55364, 216766, -77798, 303595, -105439, -81533, 325143, -422133, 261261, -237067, -106069]
7917a06069K38233m04860m58644Q5764N22070m18418J10715o4658N42859J22229
7907A69221m30947K67128M8532J53225l93638M83832M39585q09044l32942Q4276
7897c20772J81985O5388N79505j77469k53225J95884l44343j69741j56901K68790
7887a30899R4241k75401N4985j42463P0121j26520M30010m81946K40461P4996
7877a92415O89764N27704n38667p16990Q6109j48879M83660M49876K63505q60937
7867D2730L25958l2329n70612L53286L61751l10460P552k55086N22706K70976
7857G16472m69726m81382j24360N22555o00819K51084J9880R36986o72403J96388
7847B94675J41224k48035m44744o3188M37367J41863j87136K99178k8983L7076
$$ y = [-106069, 132164, -272696, -731340, -645576, -123506, -541924, -431209, -495867, 46992, 169221, -261726, 5402, 53934, 207159, -186479, 297353, 736938, -72106, -405048, -320772, -138787, -73399, 506106, 328637, 75412, 271296, -73047, -242788, -399689, -130899, -36658, -312059, -257074, -399537, -329416, -455936, -25926, -507872, -267411, -192415, 497349, 1025053, 486386, -230604, -144495, -293374, 190286, 640162, 903667, 42730, 368688, 336359, -234253, 119033, 480784, 170324, 177876, -77210, 445496, 716472, 246746, -234636, -358996, 163559, -437260, -186176, -166296, 770690, 98287, 294675, 435899, 187864, -256880, -320068, 117299, 259162, 72026, 371204, 342221, 379297]
7837C79297l57381O0874k58704Q7442J84908l88751K27796J05154K67262q75012
7827e67115j7911M51201l67828Q2363J58140N90278m033m7150l3072J53255m87234
7816h9106J34057j1373m79809j84578j20998P67340j84747n71358M27192J71258
7806a42122P2110k33257M62304k67691k89549M87734K53145L00154l3009j28345
7796D81474m41476q8968J17149K89168k83254J89247K96095n1448j95513J92771
7786E05245o0209o6980J11871j26975m22495J5567J43658N013l80365J82353k5359
7775a18676p4538J61580L88893l94030k3083n61385L46688N92007j72620m17253
7765b72417N73752K72993m39794p6682L40938N9823k89058r882l22990N46659
$$ y = [379297, 21916, 82790, -175914, -88472, 96436, -292315, -64519, 40635, 307897, -567115, -585026, -133825, -501653, -419290, -261150, 329128, 325095, 277945, 244873, 398128, -89106, 44951, 33578, -446231, -630809, -751807, 15533, -169214, -740572, -313380, -142122, -70012, -303269, 159035, -108656, -398205, 89529, 342674, 642828, 609819, 481474, 39998, -48970, 68179, 357347, 74093, 263340, 559435, 507987, 312474, 505245, 445036, 378056, 489927, 362952, -59543, -43976, 99682, 104695, -275670, -93317, -118676, -193214, -31634, 357259, -36771, -59854, -621239, -274551, 317456, 144836, -272417, 301335, 574328, 134534, 57852, 398790, 458613, 169555, 159673, -163317, 383342]
7755C83342k45814K83832j72601k07813m25707n0888N0595j63912O33502J73618
7745B58154K3507k04162j81466J60773k15547j94069k593R90274O4060l96081
7735C02850k53831K5191K3969m95064J16623l1883J21595J57232k05913m19953
7725f59184j10888N60387m27655N44885P8876l076N01352n32888l85163M926o2492
7714d90920L86562L70655R9524k1295k23709l96680r5368J81190l9065J71417
7704e7689J25159k5250o57308M36419N52519k6757J40898l86849N09740l49845
7694B61037O777o59986k92503O14786J5339J54581l65213N05607P2100j58023
7684A54502M32957k45017k9032K24508k39351m76163k7549L50805j29127n61113
$$ y = [383342, 137528, 421360, 248759, 40946, -384761, -435649, -385054, -548966, 84536, 258154, 281661, 77499, -103967, 56806, -158741, -352810, -355403, 634871, 698931, 302850, 49019, 74210, 98179, -396885, -280262, -312145, -190550, -33318, -239231, -659184, -770072, -209685, -637340, -92455, -13579, -16655, 484697, -48191, -433354, -428428, -490920, -104358, 266297, 365821, 344526, 120817, -275863, -371231, -190041, -229106, -57689, 67470, 42220, -615088, -178669, 373850, 347093, 487991, 101142, 610882, 261037, 267814, -392172, -684675, -69889, -54550, 100031, -265182, 240425, 312525, 154502, 587459, 342442, 313410, 537918, 298567, -177596, -205145, 145660, 16533, -544580]
7674e44580L60671P50122k20715p62028n9145P05018j55940k49451q75911P46974
7664c04985R76979J39605m33223j08125o77671M11159O3678k40798M94779L13731
7654F35129j69741p91435J64598j0162P37761j63070m46913L81627o16003J52319
7644a25890m38297m3969R68290N8513n01077k15814j72959M92703j83751o10497
7634g72748j47894J61021L49748O04289K54723l49699l97726J98208K99457j58866
7624D0513j88559J51293k13439j95095N08762k02212K27586K23484o69693J4572
7614c02788K62288j01403q7676j28587J80300n4711K36577j78363j01138l51840
7604f27341j88890K24348N63020j48623L30602M24396q6031m11117m4315K01480
$$ y = [-544580, -183909, 566213, 345498, -416530, -475675, 229343, 73403, -176048, -1051959, -304985, 671994, 811599, 378376, 270251, -407420, 3739, 67417, -173381, 321398, 635129, 465388, -326047, -161449, -171611, 566150, 403080, -43833, 337794, -278209, -125890, -564187, -608156, 360134, 418647, -82430, -298244, -471203, 21500, -162251, -772748, -920642, -759621, -409873, 194416, 449139, 99440, -298286, -100078, 199379, 40513, -148046, 3247, -210192, -405287, 103475, -98737, 128849, 352333, -317360, -302788, -40500, -141903, -229579, -358166, -177866, -232577, 4000, -174363, -275501, -627341, -816231, -591883, -28863, -177486, 153116, 577512, 491481, 80364, 36049, 237529]
7594B37529n41713K82403k34627m9795K57844l37472M5624j26011J00739M49277
7584H3798L15914j17610q583k60337k10104m09110L87619M071L5819J52635J87910
7573A62022q0779k14007K77583n16606n99837Q35966M99866j94762k31966k32853
7563b95373J22823N727J74609k36747k12805M61751K82872o8645M0111J13957
7553C88280j92729o7734O05759n93096N7818J55898q74744N3192J74860O18376
7543C25880J6760l17822l16902J74927j33194n5645K43160j39440k43238Q9076
7533c56438K75287K39488M62810j52312m46376k9522j88468L08925K09364N2882
7523C75640K3880J08321K3723r70604N75750L33517J72003n1442K43803k20208
$$ y = [237529, -304184, -21781, -256408, -306203, -48359, -385831, -340207, -466218, -365479, 83798, 399712, 282102, 273519, 13182, -196922, -606032, -218413, -214342, -178523, -25888, 162022, 81243, -132764, 144819, -371787, -971624, -135658, 364208, 169446, -62520, -295373, -172550, -166823, 7786, -228961, -441766, 19985, 302857, 234212, 274323, 388280, 195551, 127817, 733576, 140480, 198298, 354196, -520548, -467356, -292496, 325880, 342640, 24818, -292084, -117157, -250351, -305996, -62836, -202276, -445514, -356438, -81151, 158337, 621147, 468835, 22459, -7063, -195531, 113394, 322758, 375640, 399520, 507841, 531564, -439040, 136710, 470227, 642230, 590788, 834591, 614383]
7513F14383p11379M22212j64914m20360L48631j78091r5437m96358O46686O65540
7503F30913m60161m53724J45724N0620n87838J66559M70874k35249o046r4228
7493c72556J44305L35153K27630M5443M17283l50297l38971M14065J12148r45487
7483c11284m5613Q16068N362n89483K00049J66369o5005k28914M1299k94505k01535
7472e07192K48010J97069L65586j14480J61427m11176K37151o1254r4557m2700
7462b2116L83189J03865J15568j57018n67390k8219K16748N11282m26925m86452
7452c57468L45552j572m60874K99654L35904K0060q6557J02484N39597o73963
7442F2817m30663M23736L75313L93791m51120m25068K21241k37105N66673q53171
$$ y = [614383, -96996, 325216, 160302, -260058, 88573, -89518, -184955, -681313, -34627, 630913, 170752, -282972, -137248, -86628, -674466, -507907, -37033, -272282, -278328, -372556, -228251, 106902, 334532, 379975, 797258, 446961, 107990, 522055, 634203, -311284, -356897, 459171, 464533, -124950, 75099, 241468, 176463, -52451, -11152, -305657, -507192, -259182, -62113, 303473, 188993, 350420, -60756, 176395, 115141, 20584, -22116, 361073, 464938, 580506, 423488, -143902, -172121, 44627, 555909, 128984, -357468, -11916, -13488, -474362, -174708, 161196, 181256, 94699, 197183, 736780, 62817, -367846, 55890, 431203, 824994, 373874, -51194, 170047, -67058, 499615, -353556]
7432c53556q0991L04309K7986O9743r6957k21930N22348K3966J13795J81448r39011
7421d48850P5538K72831j37726M59472l50846o0272K30205q19896O79350L10884
7411B10690m96807j73030P26678j17810m2388L367m09224J72752L0061k93332
7401c89043k43874O3380J42834O83350n09561J11435M1725N8212j12275j41517
7391b95334O70221L48652j92194M2445L5540p3202l86582L92421r87364k3959
7381d69356L05305P87566k17270p02625l77433k8913R59759K4402k98228j18922
7371a35715K32549L12505k86587p88286J076844q52628j53121k15490J086512
7362B76583R9855M63561k89777k43229n98913J60560K8149o08910K01619M10535
$$ y = [-353556, -434547, -130238, -102252, -32509, -129466, -351396, 170952, 194918, 308713, 490161, -448850, -373312, -100481, -238207, 221265, -129581, -189853, 40352, -779544, -100194, 210690, -286117, -459147, 267531, 149721, 107333, 110700, -298524, -125772, -95711, -389043, -632917, -569537, -426703, 256647, -252914, -141479, -99754, -41542, -153817, -295334, 374887, 723539, 531345, 573790, 609330, 536128, 149546, 541967, -445397, -469356, -164051, 623515, 406245, -296380, -673813, -702726, 257033, 281435, -16793, -135715, 96834, 409339, 122752, -665534, 411310, -441318, -594439, -809929, 276583, 376438, 839999, 550222, 306993, -291920, -131360, -103211, -712121, -510502, -99967]
7352i9967P39917L02174r63557p756J74784l92972m57315M32204M97517l84290
7342a59261K89604N64180m02693n15951K0377M39280J39291K24833p7801j10621
7332D11238o5772o7145N60968l60814j77721l38835M11881o47723k6498K13134
7322h7287K64883m23402k63469L43541N36063l260l57458N3519l24437p6935O49485
7311C11243l80485l23339j882K06740P42982l45190j81837L31886K88331k35734
7301D12715j158101J000417k18182j70422K95329k90039M71501q73754l96913
7292i27449N57437K98378j34244J12288o19156Q209M78562O3344K93199l21525
7282a90957J47819K5834l04619L12667P21543J80880n9457k12658r35748L01922
$$ y = [-99967, 639950, 942124, -21433, -29189, 145595, -247377, -704692, -272488, 225029, -159261, 130343, 694523, 291830, -224121, -203744, 235536, 374827, 599660, 521859, 411238, 345466, 278321, 839289, 478475, 300754, -38081, 373800, -273923, -300421, -87287, 177596, -245806, -509275, -165734, 370329, 367069, 9611, 63130, -261307, -338242, 311243, -69242, -392581, -394463, -187723, 555259, 210069, 28232, 360118, 648449, 412715, -745386, 255031, 36849, -133573, 161756, -128283, 343218, -530536, -927449, -370012, -71634, -205878, -93590, -712746, -704537, -225975, -162631, 130568, -190957, -43138, -17304, -321923, -9256, 712287, 893167, 833710, 621052, -314696, -12774]
7272a2774N82556l77553m83401M9726O76539j6926L5380K71087k86928K48401
7262F86107L85577o83366K53632J88837q45964Q28996o66147K68804M19744j013869
7252a77649K14021o91563k90367N29310M70520J48146j7963N1165l039K1945L0969
7241B85495J26277k48304K36040k69932n974m90512J75550K47647M03169k22390
7231B37066j70818K66663p33404N29976k66020O05319R1403j06005l15230j00185
7221C8765j14927L40263K83734n01852K38227J57274M04113K97237j555903M51392
7211C8323l56631K15839k53356r7717P57617M1799R2619r87275L64057K22272
7201C7547K65889J94545J12901M34903n75935l56455Q2570L01585k05634k40346
$$ y = [-12774, 569782, 192229, -291172, -241446, 435093, 418167, 453547, 724634, 437706, 686107, 1071684, 388318, 641950, 830787, -15177, 813819, 147672, 416476, 836220, -177649, 36372, -655191, -945558, -416248, 54272, 202418, 184455, 235620, 232581, 254526, 285495, 411772, 163468, 399508, 129576, 123602, -366910, -191360, 56287, 459456, 237066, 66248, 332911, -400493, 129483, -136537, 468782, 560185, 454180, 138950, 38765, -76162, 264101, 547835, 45983, 284210, 441484, 845597, 1142834, -413069, 38323, -318308, -102469, -355825, -453542, 304075, 345874, 438493, -548782, -184725, 37547, 303436, 497981, 610882, 1045785, 469850, 113395, 195965, 497550, 291916, 51570]
7191E1570R15976j96976n19919m28519j89035L12547N38315m88469q0643L02104
7181B16951q2965k92902J313J44644R3953J71208L30335n72667R3199l91899O31738
7170C42908M09742m40753j86884k47326n1658J16195O20047M5624n8718n34898
7160A4279R5895j00041n541o12634N23513R7399K60584j82053O0308M16537o41920
7149g3674N57398k32208L17918j21833n7547P6446q1423n10107O64596n71786
7139c2220k97495L14976L03932O82121m75689m9309Q2026k42116K06904R5012
7129E88142P6972q34731J85503J91274J80590n41798R470R09460m30045k22867
7119A11970j64817l45775K09278M31187L08325j59669J41649L50581n93137k9204
$$ y = [51570, 967546, 770570, 250651, -177868, -366903, -54356, 483959, -4510, -85153, 216951, 133986, -158916, -157603, -12959, 80994, 252202, 582537, 9870, 103069, -288830, 342908, 752650, 311897, 125013, -122313, -173971, -57776, 562271, 607895, 549177, 14279, 110174, 10133, 4592, -608042, -84529, 12870, 273454, 91401, 151709, 568246, -73674, 483724, 251516, 569434, 447601, 390054, 466500, 385077, -125030, 539566, -32220, -329715, -14739, 289193, 971314, 495625, 446316, 528342, 286226, 493130, 588142, 665114, -169617, 15886, 207160, 387750, -154048, -144578, 764882, 334837, 111970, -52847, -398622, -189344, 241843, 550168, 390499, 532148, 882729, 289592, 260388]
7109B60388K06322m97740j17191K1777O61015o4782n89272O87863L59884L73815
7099A302079r43610O0737j4469K45955J01501r85380O1364N69473J25174R6385
7089F19209J31809j13576q4798O5135K68663K12207j107744M01954J89541j20222
7079D62178J46111M03852Q0737m45641j45900J18471Q5075J00172o13308N50603
7069G42350l06956K81927N17249m04019j74099j33832n2466J68257K46572p5055
7059H09928p01318R9026M85848L9962N35734m52872k07453m1114q8901m67642
7049A1198O13592M23241l20890O2010M6111j02069k53784k93561M66583R09722
7039A562153l73139m61548Q07030k00919Q6689k92009M8563P49615M04852j095099
$$ y = [260388, 466710, -31030, -148221, -126444, 534571, 469789, -119483, 568380, 928264, 1302079, 358469, 419206, 404737, 650692, 752193, -233187, -171823, 397650, 522824, 619209, 751018, 637442, 552644, 617779, 886442, 1098649, -9095, 392859, 582400, 462178, 608289, 1012141, 1092878, 647237, 501337, 619808, 704883, 805055, 191747, 742350, 435394, 717321, 1234570, 830551, 656452, 522620, 470154, 638411, 884983, 809928, 108610, 207636, 693484, 733446, 1269180, 816308, 608855, 567741, 478840, 11198, 624790, 1048031, 727141, 789151, 835262, 733193, 479409, 185848, 652431, 1562153, 1189014, 727466, 1534496, 1333577, 1420266, 1128257, 1176820, 1926435, 2331287, 1236188]
7029A236188N48483N10443J12424N78404J181496J067644J270905J757859L94154
7020H658000j683427k197934j920834r12974J87526J07234l5834o49477K12709
7011A764989l46305m26230l23545L29858M75649n5735l25039K53782n42986k24909
7001E79529m82048O74077Q45078p48994j58800k72420J36532N0981j10198p5752
6991D37985Q0723K05333j11465j75599J50484J76484J74845p98922l02486L32468
6981A69850J80159L77723l63294J79597K38019o5982k47427m12169R7486k14565
6971f0603K28471K68803k87938O81333j85780L37837n56724L69290O11181k69820
6961A136050l85278o00794o0782k8108L39495l88609k72345L72517o4493K39732
$$ y = [1236188, 1784671, 2295114, 2407538, 2985942, 4167438, 5235082, 6505987, 8263846, 8658000, 6974573, 4776639, 2855805, 1942831, 2130357, 2237591, 2201757, 1552280, 1764989, 1418684, 992454, 668909, 998767, 1474416, 1418681, 1093642, 1347424, 804438, 579529, 97481, 771558, 1616636, 867642, 708842, 436422, 572954, 623935, 513737, 437985, 518708, 724041, 612576, 436977, 587461, 763945, 938790, 139868, -162618, 169850, 350009, 727732, 364438, 544035, 782054, 716072, 468645, 56476, 153962, -60603, 167868, 436671, 148733, 830066, 644286, 982123, 425399, 794689, 1405870, 1136050, 750772, 149978, 89196, 61088, 400583, 11974, -260371, 112146, 47653, 287385]
6951B87385P8444N84909O70943l35789n48083L41981n82329j053897O53734L08479
6941D05777k81964k00924M89648J28266L63017o32113m02091Q495O79940L9594
6931E97645J05605M8533J6689J41228L8705r17262J31828M38453n64340M13062
6921D50146J69499R768L85907J00114q2701n8481m88157K65738m3565l79238M72556
6910H01586K22856j15335k09304o1373L896o8127M04771l5174Q059M40248J13646
6899A505749j6909j84792m05263k73601N2763j8985J27397P2871K54074l28660
6889G84644q2028j49117l03870l10124K2722L41244j58691M85984M3245l12486
6879C61523J4565L46531k80278N81356l95742j08856M08913J0390l03474O3442
$$ y = [287385, 365829, 950738, 1621681, 1285892, 737809, 1079790, 497461, -556436, 97298, 405777, 123813, -77111, 412537, 540803, 903820, 271707, -130384, -121889, 558051, 597645, 703250, 751783, 768472, 909700, 948405, 31143, 162971, 601424, 37084, 450146, 619645, 629413, 1015320, 1115434, 1032733, 974252, 486095, 751833, 708268, 329030, 801586, 1024442, 909107, 699803, 638430, 642326, 574199, 978970, 943796, 951855, 1392103, 1505749, 1488840, 1304048, 898785, 625184, 677947, 658962, 786359, 859230, 1113304, 784644, 702616, 553499, 249629, -60495, -37773, 303471, 144780, 630764, 674009, 361523, 376088, 722619, 442341, 1023697, 627955, 519099, 928012, 938402, 634928, 698370]
6869F98370j08319k48296J39004L01988L34134l78978O9195l60521M32750r0140
6859G89187l84816N31489j84696K2841J13111r1986m3825r57884J57280L87461
6849C38162M8805o00842L04382J20591J43089j736j46158K85037O37735j08088
6839A020977n42026m66302N2659R04009k60228k64524J14005j36422l47836P12130
6829G86442q2739K28763k63253l48564Q4925m8699M9866L75315j31678M0164J13507
6818H04049P4936j65059N40602n02674k44154K65153R5505J88983k04848O33744
6808A486237k21730m01926o2196J69075l67466k01101m3953j90916O53085K10990
6798A030099k35812k50086m14707J76271M94126K55206k46554l92211O23043M15103
$$ y = [698370, 590051, 341755, 480759, 782747, 1116881, 737903, 807098, 446577, 879327, 789187, 404371, 935860, 751164, 774005, 887116, 795130, 751305, -206579, -49299, 338162, 386967, -213875, 90507, 211098, 354187, 352451, 206293, 491330, 1129065, 1020977, 478951, 12649, 65308, 969317, 709089, 444565, 558570, 422148, 74312, 786442, 703703, 932466, 669213, 320649, 405574, 356875, 406741, 782056, 650378, 690542, 804049, 878985, 713926, 1254528, 751854, 507700, 772853, 868358, 1057341, 852493, 1486237, 1264507, 862581, 800385, 969460, 601994, 400893, 356940, 166024, 819109, 1030099, 794287, 544201, 129494, 305765, 799891, 1055097, 808543, 416332, 1039375, 1454478]
6788A454478k89985n4919n1917k81829N45026k23679L96780P8481p53158M43101
6778A262379n86815l62128K94039K99893J94480r8894K73578l40602o79355L17342
6768E73917K79668K63862K31797k5373m02514l12326j81527L33342j56411k42490
6758C61945O46663l6414n60991N12173M95097l56724q0115Q7293m93647j76073
6748C99207M33758l93869Q0989L98932K76855k96917K6595R3305K3070k66452
6738G75473K09280O11187j52401n93023L14649k49438j80033J65833m81855J78269
6728E97941N91342J60263q84820M46762n17992j32063N81763L42948m92939k26280
6718D66925j61215P94414j49286K94253j23438l80027L7092J28573N25965k62079
$$ y = [1454478, 1164493, 1109574, 1057657, 775828, 1320854, 1097175, 1493955, 1572436, 819278, 1262379, 675564, 313436, 607475, 907368, 1101848, 1002954, 1276532, 935930, 256575, 573917, 853585, 1117447, 1349244, 1323871, 921357, 609031, 427504, 760846, 604435, 361945, 1008608, 972194, 411203, 923376, 1418473, 1061749, 981634, 1068927, 575280, 399207, 832965, 439096, 520085, 919017, 1195872, 898955, 925550, 1018855, 1041925, 775473, 984753, 1595940, 1443539, 850516, 1165165, 915727, 735694, 901527, 419672, 597941, 1189283, 1349546, 464726, 911488, 393496, 261433, 843196, 1186144, 693205, 466925, 305710, 1100124, 950838, 1245091, 1121653, 741626, 778718, 907291, 1433256, 1171177]
6708A171177j37303J73201O9839m65477L11209j3000j24045q3598M07006J16298
6698A425307n40457p1189j59821L66161K9347K79923k70798p7243L94954k2024
6688A354160L14611K81275k96162m10666J48698q92091P28302J26394q6293K53428
6678A521656J73485j64442l49866l23833q2059K14486N1645J83439l8844j15274
6668A070393K81835n9900j86031J11398M12778j13127j41411J23089k32849k41435
6658A024740J34775L54849o11600K67140m32758k41133R04821q2520p3392k6604
6648A218318l67015J7549M9932K18768l19473J55718o554J81160M7688L46035
6638A542126K6269n33926p7720P54334n57620J32351L34780M32658R8074m65611
$$ y = [1171177, 1033874, 1207075, 1276914, 811437, 1122646, 1109646, 985601, 902003, 1309009, 1425307, 884850, 813661, 653840, 1020001, 1049348, 1329271, 1058473, 981230, 1376184, 1354160, 1668771, 1950046, 1653884, 1243218, 1391916, 499825, 1228127, 1354521, 1268228, 1521656, 1695141, 1530699, 1180833, 857000, 774941, 989427, 1041072, 1224511, 1185667, 1070393, 1352228, 1292328, 1106297, 1217695, 1630473, 1517346, 1375935, 1499024, 1266175, 1024740, 1159515, 1514364, 902764, 1169904, 737146, 496013, 1400834, 1318314, 1244922, 1218318, 851303, 868852, 918784, 1137552, 818079, 973797, 967243, 1148403, 1196091, 1542126, 1568395, 1034469, 956749, 1711083, 1153463, 1285814, 1620594, 2053252, 2151326, 1685715]
6628A685715m04359j5813K28970O4441j92405L28164M01862p72141M06613o73668
6618A057379P11749r6058m37475J61585p78888R5057J018171k71937j47098J46122
6608A458607l17332k80303M46928K33124M17225j38186q86915l97729M48911K70755
6598A255085M3966M13922O2972k93799k1682m4023M53203L92107j25980p85120
6588A350651N05905Q6950p76088r6018N07321j57024K04323n85223O64090m16188
6578A288699J4496K55260k02976k45509K27899n116M1056K08193j70590J18643
6568A530055k85936j74363L61185j69283k01593Q37359l92670M48908J66231l94059
6558A725834O9723P3626n04257N3414K995J54197p09655Q93954K78394j56708
$$ y = [1685715, 1281356, 1265543, 1494513, 1558954, 1366549, 1694713, 2096575, 1324434, 1731047, 1057379, 1769128, 1673070, 1235595, 1397180, 618292, 713349, 1731520, 1459583, 1312485, 1458607, 1141275, 860972, 1307900, 1541024, 1958249, 1820063, 933148, 535419, 984330, 1255085, 1299051, 1712973, 1775945, 1482146, 1460464, 1416441, 1869644, 2261751, 2135771, 1350651, 1856556, 1943506, 1167418, 1071400, 1578721, 1421697, 1626020, 1040797, 1704887, 1288699, 1303195, 1558455, 1355479, 1109970, 1337869, 1332753, 1373809, 1582002, 1411412, 1530055, 1244119, 1069756, 1430941, 1261658, 1060065, 1897424, 1504754, 1953662, 2119893, 1725834, 1795557, 1869183, 1364926, 1418340, 1421335, 1575532, 865877, 1759831, 2038225, 1881517]
6548A881517j49394L44673m80090q526n3268J56589J88178m40769J43978K99908
6538A882796L8296j76809J62649n2198j14989j486o36502m03931j95813L25940
6528H27953M90303l2913j46269O40043P4278j36959O2730k38376K35731k29020
6518A547501l24238N55401n4813j98902j25643P03915j51053m42297N73796q9309
6508A994358r04045M24365Q1042K54808L43095k76746l75094k52563J05330M25499
6498A820049K71909p21572l45685L99794j56014R4113j68290P09225o34149j67648
6488A101732k798K39336K02744K98196N91313o41781M24698k15140k95071l62635
6478A340594M56845j73296K32090m09603J74144o5883J69578l07733L83963K28417
$$ y = [1881517, 1732123, 2076796, 1596706, 1588180, 1534912, 1691501, 1879679, 1438910, 1582888, 1882796, 1921092, 1744283, 1906932, 1854734, 1739745, 1738259, 1101757, 697826, 502013, 827953, 1318256, 1285343, 1139074, 1779117, 1853395, 1716436, 1779166, 1540790, 1776521, 1547501, 1223263, 1778664, 1723851, 1524949, 1399306, 2103221, 1952168, 1509871, 2083667, 1994358, 1090313, 1514678, 1595720, 1850528, 2193623, 1916877, 1541783, 1289220, 1394550, 1820049, 2091958, 1370386, 1024701, 1424495, 1268481, 1362594, 1194304, 1903529, 1269380, 1101732, 1098934, 1338270, 1541014, 1839210, 2430523, 1788742, 2213440, 1998300, 1703229, 1340594, 1797439, 1624143, 1856233, 1446630, 1620774, 1554891, 1724469, 1416736, 1800699, 2029116]
6468B029116p5842n15452L16736j88328o3018p0995J12778O83950n40699k1204
6458A667042R0657j02575K43505j1760o07920P39752O1077n53317M17894K73023
6448B217378J13427K8831p0365o54966L19438N74288r6366k61033r4878m0871
6438B034883k05964N78764o12767M4820M3998O84891k95345J78831J20047r22284
6428A649874M80817K26908l7969j09039M71762k62704J60602p18754J27921o7387
6418A922031M86114j10457o146k66221N16290J38462k27815n16207M03898L96182
6408B736131m75756L73061n50746K41978p1220n69446L09682O18453K86518J32022
6398C030677o0244r7776l48165j7144O36198m61666l73065K69106K55105r4680
$$ y = [2029116, 1953274, 1437822, 1754558, 1566230, 1503212, 1432217, 1544995, 2228945, 1688246, 1667042, 1757699, 1655124, 1898629, 1886869, 1278949, 2018701, 2079778, 1526461, 1944355, 2217378, 2330805, 2359636, 2289271, 1634305, 1953743, 2528031, 2431665, 2170632, 2075754, 2034883, 1828919, 2407683, 1794916, 1839736, 1883734, 2568625, 2273280, 2452111, 2572158, 1649874, 2130691, 2357599, 2319630, 2210591, 2682353, 2419649, 2580251, 1861497, 1989418, 1922031, 2408145, 2297688, 2291542, 2025321, 2541611, 2680073, 2452258, 1936051, 2339949, 2736131, 2260375, 2633436, 2082690, 2324668, 2253448, 1684002, 1993684, 2612137, 2898655, 3030677, 2970433, 2872657, 2524492, 2507348, 3143546, 2681880, 2308815, 2577921, 2833026, 2738346]
6388B738346j47049n42385r314Q35910K99678n33990K50944K75412o7631J09857
6378C209778r7024o0101j18757N94551K89610q74798k61509L169K49889P32601
6368C667409q32753P3073J32857k60778j00181P10257l71543j22735o09729K38081
6358B523958K45079j65212N15043k36712J82172o36709n27456R66122j43649k60783
6348B461853K6929k54743M79623Q1494m80741O68776M61926m30197q7725n44505
6338B382690L35913L93295o71496O20402p0966M22341q5280n02783n17017L06500
6328B613599N74300k64083o6213k9236K02651O15998j84981M20468m00567l21519
6318C160417m24453M83749l94473j48168L9607K31906j1482J11374N12024o78760
$$ y = [2738346, 2591297, 2048912, 2039598, 2875508, 3175186, 2641196, 2892140, 3167552, 3099921, 3209778, 3112754, 3052653, 2933896, 3528447, 3818057, 2943259, 2681750, 2684919, 2934808, 3667409, 2834656, 2907729, 3040586, 2779808, 2679627, 3389884, 3018341, 2895606, 2285877, 2523958, 2769037, 2603825, 3118868, 2882156, 3064328, 2427619, 1900163, 2866285, 2722636, 2461853, 2488782, 2234039, 2713662, 2795156, 2314415, 2983191, 3445117, 3014920, 2927195, 2382690, 2718603, 3111898, 2440402, 3060804, 2989838, 3412179, 3326899, 2824116, 2307099, 2613599, 3187899, 2923816, 2857603, 2828367, 3031018, 3647016, 3462035, 3882503, 3481936, 3160417, 2735964, 3219713, 2825240, 2677072, 2716679, 2948585, 2937103, 3048477, 3560501, 2881741]
6308B881741k30833K57683K4638J61246J43766m48339q3036M86090L76365j41489
6298C427832o63735K00203L69326K54590l17958m6317J75190R7064K00582J44504
6288C841281k50052m27124N09995k84881K56626K8178L65717m56269j82352K83360
6278C684479J59962p96710L46610j50442j9292K69450J19082M66336l28039n84467
6268C166969O21131Q0748j83341N55886o69150R723L64602m1156q012R0082O0894
6257D048376j32513J17356n79310L27880p3703J88176m76301K7639O84758L39075
6247D471433m41460j06648o7081k66644K21507p0900L26861M85120n34390j17113
6237C900685k4167J88259k9126J20125p8854M44616L80218j98392L4686M78806
$$ y = [2881741, 2650908, 2908591, 2933229, 3094475, 3238241, 2789902, 2706866, 3192956, 3569321, 3427832, 2764097, 2964300, 3333626, 3588216, 3270258, 3223941, 3399131, 3496195, 3696777, 3841281, 3591229, 3164105, 3674100, 3389219, 3645845, 3674023, 4039740, 3583471, 3401119, 3684479, 3844441, 3047731, 3394341, 3243899, 3224607, 3494057, 3613139, 4079475, 3751436, 3166969, 3788100, 3868848, 3685507, 4241393, 3572243, 3581966, 3946568, 3905412, 3897400, 3987482, 4048376, 3915863, 4033219, 3453909, 3781789, 3708086, 3896262, 3419961, 3447600, 4132358, 4471433, 4029973, 3923325, 3856244, 3589600, 3811107, 3740207, 4067068, 4552188, 4017798, 3900685, 3876518, 4064777, 4035651, 4155776, 4076922, 4521538, 4901756, 4703364, 4738050, 5216856]
6227E216856k58155k21528m43381n29795k04495Q81990L05805m30527k10897L47452
6217D453325R1597p42272p3216N34927O75777k82548n45060K4245M26645j68870
6207D394550J02321l62149R900M56683r4621K06018m08141K03322L40217O8456
6197D916556L13594P464r5686k07606R67701m53273n80620N7938J92697L71504
6187E490269l06261L92035n02770r7040L96252n40042K76461R3546L69041j07898
6177E463593R01682j36542J82845k5562j76411l82015M3982j4620l79143L81607
6167E859416l16830J52126K82918m41904K10175M0803p4386M95891k7781K46485
6157F426913O9172l94822L6847p66608r6839M88812K15555j84404N86965J46768
$$ y = [5216856, 4958701, 4737173, 4293792, 3763997, 3559502, 4441492, 4747297, 4316770, 4105873, 4453325, 4544922, 3802650, 3729434, 4264361, 4940138, 4657590, 4112530, 4136775, 4563420, 4394550, 4496871, 4134722, 4144622, 4601305, 4506684, 4712702, 4304561, 4507883, 4848100, 4916556, 5230150, 5237614, 5141928, 4934322, 5902023, 5448750, 4868130, 4926068, 5118765, 5490269, 5184008, 5576043, 5073273, 4976233, 5372485, 4832443, 5108904, 5202450, 5571491, 5463593, 6365275, 6228733, 6411578, 6386016, 6209605, 5827590, 5871572, 5856952, 5477809, 5859416, 5542586, 5694712, 5977630, 5535726, 5745901, 5786704, 5712318, 6208209, 6180428, 6426913, 6496085, 6101263, 6138110, 5371502, 5274663, 5763475, 5979030, 5794626, 6381591, 6528359]
6147F528359l96559P1529k87578L45080o07389m30643L79356j1039K05202M26219
6137F222537K99628L75943n9838j42524J1961k04292J9331j0980J42349k37960
6127F416155r296J08731J05547J83005j04041j65664M25933J52068K42248m45236
6117F909450j23743k59197M37350L7224j61373K86017J7632J61139J23979k49809
6107G178669l98090K28069q842K13014J67121K6642p1541p90055q1232J299730
6097G763485N8822m09189k1523N01648j01481K77910N77279o67315J35620L87906
6087H503162m00189j28504k74670P04380o9805k47530K35405J39543N7094j72867
6077H346019m42075j41010M91867k66204M01237J3273l52660J55444K19395L75471
$$ y = [6528359, 6131800, 6203329, 5915751, 6260831, 5653442, 5222799, 5602155, 5591116, 5796318, 6222537, 6522165, 6898108, 6838270, 6695746, 6707707, 6503415, 6522746, 6511766, 6654115, 6416155, 6406859, 6515590, 6621137, 6804142, 6700101, 6534437, 6960370, 7112438, 7354686, 6909450, 6785707, 6526510, 6963860, 7001084, 6839711, 7125728, 7143360, 7304499, 7428478, 7178669, 6780579, 7008648, 6999806, 7212820, 7379941, 7406583, 7335042, 6544987, 6463755, 7763485, 7822307, 7413118, 7391595, 7893243, 7791762, 8069672, 8646951, 7979636, 8115256, 8503162, 8102973, 7974469, 7699799, 8404179, 8334374, 8086844, 8322249, 8461792, 8518886, 8346019, 7903944, 7762934, 8254801, 7988597, 8389834, 8403107, 8050447, 8205891, 8425286, 8800757]
6067H800757j2517M23642J65197j87111Q8743k72234M74020j43218K81729K00173
6057I819181r95461L97283L0043P02534j89535l01483Q19084N1048n04950O3902
6047I891646J27448J97918j97852L53453p2435p0560l41657Q7795J32454R3621
6037A0201831l15489O32033N25045k16528R8078l00605l73917J61563N38336k94065
6027A0656282M69467P44898J16313r2578K58793n56284l3600J73769O25949K07986
6017A2570995m15996n54054K24877J32274P40395j63923M21322K48496o35991
6008A2568395P5123j25607N80768K07962n90157M05292M20803m64666O53699J74253
5998A3905865o03336j718N90252j31049K79438k73886K30899N21593j16812L35930
$$ y = [8800757, 8788240, 9211882, 9377079, 9189968, 9278711, 9006477, 9480497, 9337279, 9619008, 9819181, 8823720, 9221003, 9251046, 9953580, 9764045, 9462562, 10281646, 10332694, 9827744, 9891646, 10019094, 10217012, 10019160, 10372613, 10300178, 10229618, 9887961, 9975756, 10108210, 10201831, 9886342, 10518375, 11043420, 10826892, 10924970, 10624365, 10250448, 10412011, 10950347, 10656282, 11125749, 11870647, 11986960, 11894382, 12153175, 11596891, 11563291, 11737060, 12363009, 12570995, 12154999, 11600945, 11825822, 11958096, 12698491, 12534568, 12955890, 13204386, 12568395, 12643518, 12517911, 13098679, 13306641, 12716484, 13121776, 13542579, 13077913, 13731612, 13905865, 13302529, 13300811, 13891063, 13760014, 14039452, 13765566, 13996465, 14518058, 14401246, 14737176]
5988A4737176m27431O0230M51348k30652K5587M33957P66565k29977K60532J10112
5978A5957447J8952k06390K87935l31890J074315m30590k83840J61910N4666Q08953
5968A7111468m27082K16544K39669J45664l25918M74995J49778P7094K36867M5784
5958A7944863M11327M44739L7407k99055r2041K90102O0667L93667M52970j02884
5948A9541762l29114O68597L21144o5340k37496K25564J04342M16054J23200J60989
5938B0929702J71801M59761L51588l18960J88515M06590l04547P56596K58097
5929B2899143Q81594n75811J42536K55103K8470O36590M5314l7598q5954R2088
5919B4281475P76317L71645J4255L95228M10799K54076j71863L54538K71558N31367
$$ y = [14737176, 14309745, 14369975, 14821323, 14590671, 14616258, 15050215, 15816780, 15586803, 15847335, 15957447, 15976399, 15770009, 16057944, 15726054, 16800369, 16369779, 16085939, 16247849, 16302515, 17111468, 16684386, 16900930, 17140599, 17286263, 16960345, 17435340, 17585118, 17662212, 17899079, 17944863, 18356190, 18800929, 18838336, 18539281, 18447240, 18737342, 18798009, 19191676, 19644646, 19541762, 19212648, 19881245, 20202389, 20137049, 19899553, 20125117, 20229459, 20645513, 20768713, 20929702, 21101503, 21561264, 21912852, 21593892, 21782407, 22188997, 21884450, 22641046, 22899143, 23780737, 23204926, 23347462, 23602565, 23631035, 24267625, 24312939, 24275341, 24189387, 24281475, 25057792, 25429437, 25443692, 25838920, 26249719, 26503795, 26331932, 26686470, 26958028, 27489395]
5909B7489395P12109L90331k72181O9074K9604P21045P3235o1598N64798M1784
5899B9757596L60339O42372k49177P99102M15319K88179L28360L30822N0895O13790
5889C3337597P84869M2449O1450j0414L0526P36909K79900P37148K20322M97714
5879C6718470M57884N39109K18706J2935J57869J97051O72434K52526J344813
5870D0571797J604N36909P91822O9404M38469R83328L79688O62533k0000J85251
5860D4600805N86565O84947N72808P202R29774O70295R70540J23577K34714J241583
5850E0622810J326658L32604K14273O38608P07977Q37111L24897L64772L79113
5841E5748823J236142Q87542L34459O44167O39878Q51284O95576P30038O13534
$$ y = [27489395, 28201504, 28591835, 28319654, 28388728, 28418332, 29139377, 29212612, 29151014, 29715812, 29757596, 30117935, 30760307, 30511130, 31310232, 31725551, 32013730, 32342090, 32672912, 32723807, 33337597, 34122466, 34164915, 34226365, 34215951, 34246477, 34983386, 35263286, 36000434, 36220756, 36718470, 37176354, 37715463, 37934169, 37947104, 38104973, 38302024, 38974458, 39226984, 40571797, 40573401, 41110310, 41902132, 41971536, 42410005, 43393333, 43773021, 44435554, 44415554, 44600805, 45187370, 45872317, 46445125, 46452327, 47382101, 48052396, 49022936, 49146513, 49381227, 50622810, 51949468, 52282072, 52496345, 53134953, 53842930, 54680041, 55004938, 55369710, 55748823, 56984965, 57872507, 58206966, 58851133, 59491011, 60342295, 61037871, 61767909, 62381443]
5832F2381443J186016Q74285Q79110L89039P79702J248198O92896N50554Q05535
5823F9786778J259964J563388L23138J624192R41639O23964J152691J359031O53363
5814G9288148J92715K097937R51483J014602Q94355J149891P96202J615289J653886
5805H9654508R18194J277086J561754J038190J448946J218602J221844K385271
5797A00724395J343738P93174J942543J353796J618425J824444J427839J871792
5789A12900146J748408J185206J658031K021184K541511J680306J878071J681688
5781A27294551K193697J972284J956831K211528J263603K081838J855194K110848
5773A42940374K328188K550840K528113K328506K441700J610974L073521K473647
$$ y = [62381443, 63567459, 64441744, 65320854, 65709893, 66489595, 67737793, 68430689, 68981243, 69786778, 71046742, 72610130, 72933268, 74557460, 75499099, 76123063, 77275754, 78634785, 79288148, 79480863, 81578800, 82530283, 83544885, 84439240, 85589131, 86385333, 88000622, 89654508, 90572702, 91849788, 93411542, 94449732, 95898678, 97117280, 98339124, 100724395, 102068133, 102861307, 104803850, 106157646, 107776071, 109600515, 111028354, 112900146, 114648554, 115833760, 117491791, 119512975, 122054486, 123734792, 125612863, 127294551, 129488248, 131460532, 133417363, 135628891, 136892494, 138974332, 140829526, 142940374, 145268562, 147819402, 150347515, 152676021, 155117721, 156728695, 159802216, 162275863]
5765A62275863J778136K409948L366793K359124K312190K901643K069576K726979
5757A82200252K838389K638572K480205L010135L367075L370704K521274K607406
5749B05034012K244237K909350L124403K518109L186996K787369K963289L340428
5741B28108193K370705K554893K813370K887545K396804K579613L256933K755325
5733B49723381K169810L091754K382893K766500J809955K198628J698767K538582
5725B68380270K203945J781168K652162Q22869J729888K050009J711013J057970
5717B82389294J287663R55512J020185J013961M46209P78883R10238Q7530l84005
5708B88505470n0757k53851j72317l4053j074276r29682m51020p22024j185738
$$ y = [162275863, 164053999, 166463947, 169830740, 172189864, 174502054, 177403697, 179473273, 182200252, 185038641, 187677213, 190157418, 193167553, 196534628, 199905332, 202426606, 205034012, 207278249, 210187599, 213312002, 215830111, 219017107, 221804476, 224767765, 228108193, 230478898, 233033791, 235847161, 238734706, 241131510, 243711123, 246968056, 249723381, 251893191, 254984945, 257367838, 260134338, 261944293, 264142921, 265841688, 268380270, 270584215, 272365383, 275017545, 275840414, 277570302, 279620311, 281331324, 282389294, 283676957, 284632469, 285652654, 286666615, 287112824, 287891707, 288801945, 288889475, 288505470, 288454713, 288200862, 288028545, 287994492, 286920216, 285990534, 285539514, 284817490, 283631752]
5699B83631752k029870j121799j604427j645314j525442j702561k044719j892925
5691B70064695j806281l019870k332343j844999k919181k901688l125406k026902
5683B50088025l022967k328655l303724k445063k949982l078715k758537l288879
5675B26911503l022344k821082k991326k555394k461726k988165l169695l234642
5667B03667129k363045l086973l501193k510073k105221l199651k890325k518199
5659A81492449k384091l493250k618869k992607j938821k364642k302715l066853
5651A60330601k387623k708108k416589j907301k631080k416089k570146k077246
5643A41216419k336152k007807k018274k209442j955197k521355k214203j541432
$$ y = [283631752, 281601882, 280480083, 278875656, 277230342, 275704900, 274002339, 271957620, 270064695, 268258414, 265238544, 262906201, 261061202, 258142021, 255240333, 252114927, 250088025, 247065058, 244736403, 241432679, 238987616, 236037634, 232958919, 230200382, 226911503, 223889159, 221068077, 218076751, 215521357, 213059631, 210071466, 206901771, 203667129, 201304084, 198217111, 194715918, 192205845, 190100624, 186900973, 184010648, 181492449, 179108358, 175615108, 172996239, 170003632, 168064811, 165700169, 163397454, 160330601, 157942978, 155234870, 152818281, 150910980, 148279900, 145863811, 143293665, 141216419, 138880267, 136872460, 134854186, 132644744, 130689547, 128168192, 125953989, 124412557]
5635A24412557j820656j792622k027735k101351j776766o86005k033042k158167
5627A10016213j680250j783785j551863j574057j581279j800069j281727j519844
5619I7243339j565448j119905j234480j559236j148613j375107j441268j056080
5611H6743202j423567j409923r73865k075921q47389q72627r23214n83590j303843
5602G6329263j573115j251139q58949j038828j229176p76967j285443q34534o09232
5593F6871880o88803j076727n52885j003706r82341j219306m55408j106839j251495
5584E8534370l73140M84655j361408j311634k89647o63155r03957p92807m83825
5575E2839452j038426j057708n10662m07488l78081l29819j566745k66621L22858
$$ y = [124412557, 122591901, 120799279, 118771544, 116670193, 114893427, 114207422, 112174380, 110016213, 108335963, 106552178, 105000315, 103426258, 101844979, 100044910, 98763183, 97243339, 95677891, 94557986, 93323506, 91764270, 90615657, 89240550, 87799282, 86743202, 85319635, 83909712, 82935847, 80859926, 80012537, 79139910, 78216696, 77633106, 76329263, 74756148, 73505009, 72646060, 71607232, 70378056, 69601089, 68315646, 67481112, 66871880, 66183077, 65106350, 64553465, 63549759, 62567418, 61348112, 60892704, 59785865, 58534370, 58161230, 58645885, 57284477, 55972843, 55683196, 55020041, 54116084, 53323277, 52839452, 51801026, 50743318, 50232656, 49825168, 49447087, 49117268, 47550523, 47283902, 47606760]
5566D7606760j110993q89460N4982p56762o0068o42231r76182j196204j55251
5557D1874591k17534n47755o32596k25079J632n35011m37251q08654k01887j68878
5547C8101578r19322k94586j52024M575q68493l97778o95941M33163J44315j123783
5537C4231704p02871k79222n4548p87049R5305l73104m11183M70964r59606r42862
5527C0287528m15527k70199O4516l41808o21012j015904j89327O45646m80307
5518B7663606J15188q3797l19738p13679l56559n22159k35815K99614k45357k03502
5508B5397802p71487N2210j32535m93961l49607J17601n44567q3035j85776p00771
5498B2305874N49596m36521k70513k89467n61659l96258K07718q99318P7612M3372
$$ y = [47606760, 46495767, 45606307, 45661289, 44904527, 44844459, 44202228, 43226046, 42029842, 41874591, 41657057, 41109302, 40476706, 40251627, 40253259, 39718248, 39280997, 38472343, 38270456, 38101578, 37182256, 36887670, 36735646, 36740221, 35871728, 35473950, 34778009, 35211172, 35355487, 34231704, 33528833, 33249611, 33195063, 32408014, 32503319, 32130215, 31719032, 32189996, 31230390, 30287528, 29872001, 29601802, 29666318, 29324510, 28703498, 27687594, 27498267, 28143913, 27663606, 27778794, 27694997, 27375259, 26661580, 26305021, 25782862, 25547047, 25846661, 25601304, 25397802, 24626315, 24678525, 24545990, 24052029, 23702422, 23820023, 23275456, 23192421, 23006645, 22305874, 22855470, 22418949, 22148436, 21858969, 21297310, 20901052, 21108770, 20209452, 20287064, 20330436]
5488B0330436L09759M42536o17309o94822j56391K29674o70308J9146k98361P3936
5478A8968296n1357q88535K5429O35982k92273q79177P5456J02588J72763l80967
5468A7488205l0730k0979k59257Q7068n48972K52572n33647L37995J54441n63955
5458A6362741L25958N5958n57687n21939j73346K60121J11306l51740m21483j53840
5448A4936049M95164j59664p2026m32101m80956K01494L15563l74574m03351l65863
5438A3659735j57895L25000J19659m98395p95527N99498O86757o64626l54101
5429A2920105r2734N769k16609J68264k37995j48850j79556j01412q3466j71625
5419A1861891K23717J77069L973l01686P55399j21141j217013J75720k3063j24994
$$ y = [20330436, 20640195, 21082731, 20465422, 19770600, 19614209, 19843883, 19173575, 19192721, 18894360, 18968296, 18916939, 18028404, 18053833, 18689815, 18397542, 17518365, 17593821, 17696409, 17869172, 17488205, 17457475, 17436496, 17177239, 17264307, 16715335, 16967907, 16434260, 16772255, 16926696, 16362741, 16688699, 16744657, 16186970, 15665031, 15491685, 15751806, 15863112, 15511372, 15089889, 14936049, 15431213, 15271549, 15199523, 14767422, 14286466, 14487960, 14803523, 14428949, 14025598, 13659735, 13501840, 13826840, 13946499, 13448104, 12652577, 13252075, 13938832, 13274206, 12920105, 12827371, 12833140, 12616531, 12784795, 12546800, 12397950, 12218394, 12116982, 12033516, 11861891, 12085608, 12262677, 12266650, 11964964, 12720363, 12599222, 11382209, 11557929, 11534866, 11409872]
5409A1409872j68085l41001N03180p32367n2477M20473J0063k21595L0972o45687
5399A0213348P79869K61562m34750j28550O4819n1238j40027n05005J41417J50628
5389A0352073l03013P13607O3654n79731k62128k99702j59963K10141n49046k20838
5379H965054R05565m13514L62246j3354P9193j74928k32465L18782k60060l5197
5369I501322j30622n41824N41229m69543q8984M28315k2667j22354j281669L41096
5359H154299K22509j47565k0606j25453J07610K50348J24182j53555K76255j31707
5349H556317K64433n6182q25995j60404M1856n17528K63617m54927j6834K66346
5339G360699p91581J66896L31338Q4035L31036n08436k72202k41855K50340j21353
$$ y = [11409872, 11241787, 10900786, 11403966, 10671599, 10619122, 11039595, 11049658, 10828063, 10859035, 10213348, 10993217, 11254779, 10820029, 10691479, 10756298, 10705060, 10565033, 10060028, 10201445, 10352073, 10049060, 10762667, 10826321, 10246590, 9984462, 9684760, 9524797, 9734938, 9185892, 8965054, 9870619, 9457105, 9819351, 9805997, 9885190, 9710262, 9477797, 9796579, 9536519, 9501322, 9370700, 8828876, 9370105, 8900562, 8811578, 9239893, 9217226, 9094872, 7813203, 8154299, 8376808, 8229243, 8208637, 8083184, 8190794, 8441142, 8565324, 8411769, 8688024, 8556317, 8820750, 8764568, 7938573, 7778169, 7820025, 7302497, 7566114, 7111187, 7094353, 7360699, 6569118, 6736014, 7067352, 7151387, 7482423, 6973987, 6701785, 6459930, 6710270, 6588917]
5329F588917O5360M28821N57541j2484n98248j62364K22287l86360o11303M72976
5319F565143k9446L95162l0664P6859p89597m6775j81900j8899K632N38704J53119
5308F634338l83402r10142P50107O8962l76648j79170R5109N54994k81350j59736
5298E813062M57107l51991M97786j4146r38073K21549N6744L52613l5364m76841
5288E582446J23045n91524k86997K42189J13321K28810r9597l0579L59811k38654
5278E402271L40376M83669L20073n68621l75147Q0371M0315k69619j25557l71015
5268D957116l19199O51687l37424J22419N3446J19896j69381p3231j58476K84197
5258E131050K03445k0833J26153J13733m65414N03492q9514k00994J20164m39176
$$ y = [6588917, 6654277, 7083098, 7640639, 7628155, 7029907, 6867543, 7089830, 6703470, 6092167, 6565143, 6535697, 6930859, 6900195, 6977054, 6187457, 6140682, 5958782, 5939883, 5942515, 6481219, 6634338, 6250936, 5340794, 6090901, 6159863, 5783215, 5604045, 5699154, 6254148, 5972798, 5813062, 6270169, 5918178, 6415964, 6401818, 5463745, 5685294, 5742038, 6094651, 6059287, 5582446, 5705491, 5113967, 4826970, 5069159, 5182480, 5411290, 5311693, 5281114, 5640925, 5402271, 5742647, 6226316, 6546389, 5977768, 5602621, 5682992, 5723307, 5453688, 5328131, 4957116, 4637917, 5289604, 4952180, 5074599, 5128045, 5247941, 5078560, 5005329, 4846853, 5131050, 5334495, 5313662, 5439815, 5553548, 5088134, 5591626, 5502112, 5301118, 5421282, 4982106]
5248D982106l60782l8679P77898l1351J8459o46984k24263k36056J40629N82354
5238D963331l19756Q6421l90466L44758o22815M82122J31071l44229q6783K81347
5228D525001K16767k97451J40231k74792L35001l83892l96256O66412k46940k65091
5218D018990L226K4663K21734n62232Q8916k23077K73512j73048J52109m3856
5208C780937k09999L57636N5556j12000j79182P7398j53984k66637P68486J2291
5198D130502l9108m14427l49945N36192N56469m57047K15336r6634l03674K54863
5188D032527n0566J06241j02860L32638l37699k89274j82652q53727M46474N74943
5178C676045o366K7323j57716j79676j82159Q28636k31372k10826O37430J62650
$$ y = [4982106, 4621324, 4582645, 5360543, 5329192, 5347651, 4700667, 4476404, 4240348, 4380977, 4963331, 4643575, 4729996, 4339530, 4684288, 4061473, 4543595, 4674666, 4330437, 4243654, 4525001, 4741768, 4444317, 4584548, 4309756, 4644757, 4260865, 3864609, 4531021, 4284081, 4018990, 4022216, 4046879, 4268613, 3706381, 3795297, 3572220, 3845732, 3672684, 3824793, 3780937, 3570938, 3928574, 3984130, 3872130, 3692948, 3770346, 3616362, 3349725, 4118211, 4130502, 4091394, 3676967, 3327022, 3863214, 4419683, 3962636, 4177972, 4081338, 3777664, 4032527, 3981961, 4088202, 3985342, 4317980, 3980281, 3691007, 3508355, 2654628, 3101102, 3676045, 3669679, 3697002, 3539286, 3359610, 3177451, 4006087, 3774715, 3563889, 4201319, 4363969]
5168D363969j86875k48111n47474J17492L7168n04478j28813M36561M79071j04998
5158C713512n35789P55527n177n284k7474K22142k51387j4052K47465o6290p01850
5147C331343j5160L81850j63120L53679M53123j38021j34757n27266K73772J75688
5137C991131n84753J81603J47623p3472J13240k32589N40783j6037l56949k5068
5127C685512M1365N4405o76968N94262N266l6072j38593L26784J56681j39932
5117C872710m06897m74846J26O11191O43649R908l16941O86172j29131p70662
5107C725279L52313r2459j80445Q1926j11781k02038M96976J08087n32187k29436
5097C416235Q141J68847k82529J91176j50626N50863L34915p63632P4448M94167
$$ y = [4363969, 4177094, 3928983, 3381509, 3499001, 3536169, 3031691, 2902878, 3339439, 3818510, 3713512, 3177723, 3933250, 3928073, 3922789, 3895315, 4117457, 3866070, 3852018, 4099483, 4033193, 3331343, 3316183, 3698033, 3534913, 3888592, 4341715, 4203694, 4068937, 3541671, 3815443, 3991131, 3406378, 3587981, 3735604, 3662132, 3775372, 3542783, 4083566, 4067529, 3710580, 3685512, 3726877, 3781282, 3104314, 3698576, 3703842, 3667770, 3529177, 3855961, 4012642, 3872710, 3465813, 2990967, 2991093, 3602284, 4245933, 4255841, 3938900, 4625072, 4495941, 3725279, 4077592, 3985133, 3804688, 3886614, 3774833, 3572795, 4069771, 4177858, 3645671, 3416235, 3424376, 3593223, 3310694, 3501870, 3351244, 3902107, 4237022, 3473390, 3547838, 4042005]
5087D042005J67773j62816P2350J08349p6485J69230J00270L39438M74585M79775
5077E714474M07757O33942R18968Q3545J838990Q75687L141779L453193K572297
5068A9640632K37513j778777j961720l547607k275970j999135j150183p05409
5060F459344o67685O2881N89032l72168j077536J40463m60609j14681O96983K25549
5050E481573o5967j45660k23736k24740r77L91043k78770j144477M77000j33577
5040D131712J65490K12183Q6066M00362l33439o57658J04640L08886N37151p33158
5030D222235j289404M86526M19964j34838l13196m84497J156416l57567l16790
5021C388849k72191L00753l10056m84340K98891O02805k61475l20480N98211K08671
$$ y = [4042005, 4209778, 4046962, 4119312, 4227661, 4151176, 4320406, 4420676, 4760114, 5234699, 5714474, 6122231, 6756173, 7675141, 7758686, 9597676, 10473363, 13615142, 17068335, 19640632, 19878145, 18099368, 16137648, 12590041, 10314071, 8314936, 7164753, 6459344, 5791659, 5854540, 6443572, 6071404, 4993868, 5134331, 4673722, 4559041, 5256024, 5481573, 5415606, 5269946, 5046210, 4821470, 4820493, 5211536, 4932766, 3788289, 4265289, 4131712, 4297202, 4509385, 4595451, 4995813, 4662374, 4004716, 4109356, 4418242, 4955393, 4222235, 2932831, 3419357, 3839321, 3704483, 3391287, 2906790, 4063206, 3705639, 3388849, 3116658, 3417411, 3107355, 2623015, 2921906, 3524711, 3263236, 2942756, 3540967, 3749638]
5011C749638o19552j45908m21901O0951L4641k42439L5688L02289L14425l48571
5001B719261K5997L51273K790L84903K8928m79544q5659P3715M70148k71570l40993
4990B879249O7386R7672j82014O95890o5473l26047j69323O87054Q4271K85134
4980D053799n55072N61682o03201K49916n5485N96539L08426l77496J8972J82887
4970D380967J317459J08014K19606J018886K39381R82925J386547J352133K534619
4961A3540537K100143J003826R85522k48207l643341k373025j293499j929037
4953H142919j199283j39606l51270o20636k55175L44389n06855o0090o52587l977
4943D697829K93959j96937P0800j9355N1571J209093J45886k25777M78696m38365
$$ y = [3749638, 3130086, 2984178, 2562277, 2623228, 2657869, 2415430, 2451118, 2753407, 3067832, 2719261, 2745258, 3096531, 3099321, 3484224, 3513152, 3033608, 2947949, 3021664, 3491812, 3220242, 2879249, 2946635, 3044307, 2862293, 3558183, 3492710, 3166663, 2997340, 3684394, 3768665, 4053799, 3498727, 4060409, 3457208, 3707124, 3651639, 4248178, 4556604, 4179108, 4198080, 4380967, 5698426, 5806440, 6026046, 7044932, 7284313, 8267238, 9653785, 11005918, 13540537, 15640680, 16644506, 17630028, 17381821, 13738480, 11365455, 10071956, 8142919, 6943636, 6804030, 6452760, 5832124, 5576949, 5921338, 5414483, 5354393, 4701806, 4697829, 4991788, 4794851, 4865651, 4846296, 4897867, 6106960, 6252846, 6027069, 6505765, 6067400]
4933F067400n84776j15005m79863o61179J6319q1793m61397J53977J74619N25231
4923D553533L94025j50321l94244K30962K88768m31404N0796m92968L48812O19071
4913E017030k0501n87158J8144Q9565P08431q43603K69115M8869l91593N47653
4903D855952k65984j12039q6892M12688Q281M34886J8444M89942K18995j2706
4893E961567Q88771k49564J01246R7361n07270L26325J33393J91789J04129M60593
4883G508340N74716N3921m58312K37783P58314M92406L02110J175019p83051J13937
4873I975183N19126M51695O49858K98219J47424L90191J132562P80986o4428M50630
4863A4731446J035240K78001R88949J132604K84648P84772M02063J062916K71308
$$ y = [6067400, 5482624, 5367619, 4887756, 4226577, 4242896, 4161103, 3699706, 3853683, 4028302, 4553533, 4947558, 4797237, 4402993, 4633955, 4922723, 4491319, 4542115, 4049147, 4397959, 5017030, 4996529, 4409371, 4427515, 4517080, 5225511, 4381908, 4651023, 4699892, 4308299, 4855952, 4589968, 4477929, 4391037, 4803725, 4812006, 5246892, 5265336, 5755278, 5974273, 5961567, 6850338, 6600774, 6702020, 6799381, 6292111, 6618436, 6751829, 6943618, 7047747, 7508340, 8083056, 8136977, 7678665, 7916448, 8674762, 9167168, 9469278, 10644297, 9861246, 9975183, 10494309, 10946004, 11595862, 11894081, 12041505, 12431696, 13564258, 14345244, 14280816, 14731446, 15766686, 16044687, 17033636, 18166240, 18450888, 19235660, 19637723, 20700639, 20971947]
4854B0971947J303637J432139J84090J062456J177934J917384J522835R64034
4846C0536456J763350J529173J771927L252926K926423L966687M769857N850247
4838E6367046Q312584J1859155J4969102J9102285K1473926J3400633j1588811
4831A33895920k1278842j6842290r610339m349982j774720J548339K806332N282381
4823H9676799P520449J0187838J1595540J2221547J2653259R163206Q795694J0452317
4815A72266649J4496220J8751412J6714362Q713517J117049J751980P654021J2897557
4807B54362767J2762321K152731j2064120j7387729j2900922o435910k154629
4800B18334509o427252j4689918k0528024j9398010j2845840r573752j0241035
$$ y = [20971947, 22275584, 23707723, 23891813, 24954269, 26132203, 28049587, 29572422, 30536456, 32299806, 33828979, 35600906, 38853832, 41780255, 45746942, 50516799, 56367046, 64679630, 76538785, 91507887, 110610172, 132084098, 145484731, 133895920, 112617078, 95774788, 86164449, 81814467, 80039747, 81588086, 84394418, 89676799, 97197248, 107385086, 118980626, 131202173, 143855432, 153018638, 161814332, 172266649, 186762869, 205514281, 222228643, 230942160, 232059209, 233811189, 241465210, 254362767, 267125088, 269277819, 257213699, 239825970, 226925048, 220489138, 218334509, 211907257, 197217339, 176689315, 157291305, 144445465, 134871713, 124630678]
4793A24630678j1150171j4003557j4406228j2004570r182796o787164o139247
4786E0956945m165138l882391k131660l362415k870672k394000j446923j485468
4778B9218278j817207j530682j079668r54182j073026q15335j177508j044049
4770A9726621p38401p81497q9463j125632j255258n82558j08881j139060m24552
4761A3481319k37817n13765m06282q18373n6926m16945l38401k76091j114065
4752I302654k71741K73947N8645n72663o75389j70900J3131p26111l28262P11932
4742G615243k18613j74661n09357N7039J77322m18480q02309q5626O84041m42540
4732E882059k36439R1917K77039j92406J73675N94326l80720j45115r26919m53512
$$ y = [124630678, 113480507, 99476950, 85070722, 73066152, 63883356, 57096192, 50956945, 46791807, 42909416, 40777756, 37415341, 34544669, 32150669, 30703746, 29218278, 27401071, 25870389, 24790721, 23836539, 22763513, 21948178, 20770670, 19726621, 18988220, 18206723, 18117260, 16991628, 15736370, 15153812, 15044931, 13905871, 13481319, 13243502, 12729737, 12323455, 11505082, 11448156, 11031211, 10692810, 10416719, 9302654, 9030913, 9304860, 9363505, 8790842, 8115453, 7944553, 7957684, 7231573, 6903311, 7615243, 7396630, 7221969, 6712612, 6769651, 6946973, 6528493, 5726184, 5640558, 6324599, 5882059, 5645620, 5737537, 6014576, 5822170, 5995845, 6590171, 6209451, 6064336, 5137417, 4683905]
4722D683905j56143K34777K39983K50478k1698o88163j64911k10897J79103m043
4712D342391o99884M53120O44397j45950K78070q03087l0343m94520M7967l40585
4702C251576L44067J25181n8747m54583q7593O4855P9221k48212o16922K88736
4692B687579K81043L3504o4604k94379L03965r6919J72779J35650l07119l62762
4682B488737j61565L18668p69023K43365m9251l34012M90786L65321q19289N2798
4672A826535L64312M50750j51246m92663m75518R609P10043k75536l74617N67364
4662B159033j96540j92983K99674m61193m81489K95833L74668o17560O37240O16274
4652B432957o15218o8106K33115r2311j13185q1837j007L57845l30870L34499
$$ y = [4683905, 4527762, 4762539, 5002522, 5253000, 5231302, 4543139, 4378228, 4167331, 4346434, 4342391, 3642507, 4095627, 4740024, 4594074, 4872144, 4069057, 4038714, 3544194, 3592161, 3251576, 3595643, 3720824, 3662077, 3207494, 3119901, 3184756, 3263977, 3015765, 2398843, 2687579, 2968622, 3002126, 2937522, 2643143, 2947108, 2850189, 3022968, 3158618, 2851499, 2488737, 2327172, 2645840, 1876817, 2120182, 2070931, 1736919, 2227705, 2593026, 1773737, 1826535, 2190847, 2641597, 2490351, 1997688, 1522170, 1531779, 2241822, 1966286, 1591669, 2159033, 1962493, 1769510, 2069184, 1607991, 1126502, 1422335, 1797003, 1179443, 1816683, 2432957, 1817739, 1749633, 1982748, 1890437, 1777252, 1695415, 1694408, 2052253, 1721383, 2055882]
4642B055882M9300J85151J07833j68585o2952l41498r5707j91027l19565k07273
4632A011559N52557K43071k3353M2987j8049p1858m12168N43966J51138j12179
4622A907671j160819Q99459o0401j50707O603Q2031J24375J25989L53758K41940
4612B369899m21279l41668J22237J31230J70169k40537l1293j6467O32075n41381
4602A832985L64449L73783j118778L16669O88830l88412o34236O84933M54013
4593B574236j0121n06457K41319K58562L20365N14698n77798J3956K98051l40793
4583B786018K5415M16503K0984J1310M08061J70848m11592N20468k07934J40630
4573C880711k91693n1110j65639l44694k29434L95742J61795m54681l68202j51945
$$ y = [2055882, 2105182, 2290333, 2398166, 2229581, 2166629, 1825131, 1729424, 1538397, 1218832, 1011559, 1564116, 1807187, 1783834, 1826821, 1808772, 1736914, 1324746, 1868712, 2019850, 1907671, 746852, 1646311, 1585910, 1435203, 1441806, 1523837, 1648212, 1774201, 2127959, 2369899, 1948620, 1606952, 1729189, 1860419, 2030588, 1790051, 1758758, 1742291, 2374366, 1832985, 2197434, 2571217, 1452439, 1769108, 2457938, 2069526, 1435290, 2120223, 2574236, 2564115, 2057658, 2298977, 2557539, 2877904, 3392602, 2814804, 2828760, 3126811, 2786018, 2811433, 3227936, 3248920, 3260230, 3668291, 3839139, 3427547, 3948015, 3740081, 3880711, 3589018, 3537908, 3372269, 3027575, 2798141, 3193883, 3355678, 2900997, 2532795, 2380850]
4563B380850m07034K60606J29887L06708K00105l39242m47451j17775o9701q00478
4553A096475M13273J53436o6598J53957N49336l38891l99881o23696O36464J39368
4543A713243n52060L0458K73676K8573q14975O91332K84183M0385j36023p2060
4533A486732l5188k60227j53506K47856L02632O21177N16355k90011K18962J210066
4523C864848L03611q32344n69376k10783m2974l79027p298p55892J94400M59723
4513B024888J49078N49316q40026m17433N72793O11015k65751q46872K15572p94367
4503I58213p6404k5977p5940J165227m65746M26336j91260l10497l0444J30091
4493A503599l16469K38032K5393M26401l78911M34383N11115J41328m39327l64547
$$ y = [2380850, 1973816, 2234422, 2364309, 2671017, 2871122, 2531880, 2084429, 1966654, 1896953, 1096475, 1509748, 1663184, 1596586, 1750543, 2299879, 1960988, 1561107, 937411, 1573875, 1713243, 1161183, 1191641, 1465317, 1493890, 678915, 1370247, 1654430, 1694815, 1558792, 1486732, 1451544, 1191317, 1037811, 1285667, 1588299, 2209476, 2725831, 2435820, 2654782, 3864848, 4168459, 3336115, 2766739, 2555956, 2512982, 2133955, 2126657, 1370765, 1565165, 2024888, 2173966, 2723282, 1883256, 1465823, 2038616, 2649631, 2383880, 1537008, 1752580, 958213, 881809, 855832, 779892, 1945119, 1479373, 1905709, 1714449, 1403952, 1373508, 1503599, 1187130, 1425162, 1450555, 1876956, 1498045, 1932428, 2443543, 2584871, 2145544, 1780997]
4483A780997Q28950k48045n56967J49025k83592l66868l6186J14529N74515J57355
4473B113713j44078J32701l97417L67364k77138n18570P37051n7887M5589L93989
4463B395317k2960j011338r7311J95562m07373J085033k53220k92830K60373m75964
4453A375289O94888k63275L18985J42480K63128L19769m15324N3489k03527j02101
4443B183801M65489m38912M00308M44288Q03210k36247J06252M35157n37221l06872
4433C319253K16084P07596l40805M04015K19615J80967p3135J18896j3121N01102
4423E240467K61843j25706M78815P94501M54198P80145J38016J17691M71012R10975
4413I521957J013388O38223J201135J399117K120746J810011L406832M321475
$$ y = [1780997, 2609947, 2361902, 1804935, 1953960, 1670368, 1303500, 1267314, 1381843, 1956358, 2113713, 1969635, 2102336, 1704919, 2072283, 1795145, 1276575, 2013626, 1955739, 2001328, 2395317, 2372357, 1361019, 1263708, 1459270, 1051897, 2136930, 1883710, 1590880, 1851253, 1375289, 2070177, 1806902, 2125887, 2268367, 2531495, 2851264, 2435940, 2489429, 2285902, 2183801, 2649290, 2210378, 2610686, 3054974, 3858184, 3621937, 3728189, 4163346, 3626125, 3319253, 3535337, 4242933, 3902128, 4306143, 4525758, 4706725, 4633590, 4752486, 4739365, 5240467, 5502310, 5376604, 5855419, 6649920, 7104118, 7884263, 8022279, 8139970, 8610982, 9521957, 10535345, 11173568, 12374703, 13773820, 15894566, 17704577, 21111409, 25432884]
4405B5432884O218878Q854597J1795334J2663266J0560609m112970j4958210j3420884
4397D3033504r614305n893408l877627k366365j243393p38796j814340j378775
4389A6106495j163895r58217q5043m09126q99585p48545j364328j084211j271544
4380H122001m77639j58693r68096M1759l47333o44278k02471l96552j76626k58483
4370D533589n39286J66341J025K2985K35790r50029K32854l37910J33414o3059
4360C435714p33640K96386p19357J20796K64324p4292o37196j10569M9083N61219
4350B452468N0004q67488R9110O33625p0927K0911M3222k26135l3651L3078q1702
4339B052515M53L22516o23765Q7978m55993M0385l3268L59373m51887J59291O1358
$$ y = [25432884, 31651762, 40506359, 52301693, 64964959, 75525568, 71412598, 56454388, 43033504, 33419199, 27525791, 23648164, 21281799, 20038406, 19299610, 17485270, 16106495, 14942600, 13984383, 13899340, 13490214, 12590629, 11842084, 10477756, 9393545, 8122001, 7644362, 7485669, 6517573, 6559332, 6211999, 5567721, 5365250, 4968698, 4792072, 4533589, 3994303, 4160644, 4161669, 4184654, 4420444, 3470415, 3703269, 3365359, 3498773, 3435714, 2702074, 2998460, 2279103, 2399899, 2664223, 2589931, 1952735, 1842166, 1891249, 2452468, 2502472, 1634984, 1734094, 2367719, 2296792, 2317703, 2360925, 2134790, 2101139, 2134217, 2052515, 2052968, 2375484, 1751719, 1839697, 1383704, 1424089, 1390821, 1750194, 1298307, 1457598, 1518956]
4328A518956j16700R6410n91361M23448r5631m4127l4524N79617J07333R7916
4318A941337o34345n22135k5387M52610j58053l16986K53466L71690L33354n95209
4308A100342l7015J54889m33982j41816l57672L53640M33079K4693o23371J91693
4298F64480O11591J40829n34117o99108L65441M45912J29328m96418K82127m15044
4288D95021l06907N90629L77101K54376L8665q06712p89237R92111J17518k09208
4278G53357M86490l38703n3840l64993j647j19898O31287l94746m79376P77912
4268H95843k52638N4067O35559M49560n96960o82712q66622L18091L32050K97661
4258E83899M59978o42951l39767J033717N8770k58435O9599k99414o6172M88677
$$ y = [1518956, 1402256, 1498666, 907305, 1330753, 1235122, 1190995, 1156471, 1736088, 1843421, 1941337, 1306992, 784857, 759470, 1212080, 1054027, 737041, 990507, 1362197, 1695551, 1100342, 1063327, 1218216, 784234, 642418, 284746, 638386, 1071465, 1096158, 472787, 664480, 1276071, 1416900, 882783, 183675, 549116, 995028, 1124356, 627938, 910065, 495021, 188114, 778743, 1155844, 1410220, 1448885, 642173, -147064, 845047, 962565, 753357, 1239847, 901144, 847304, 482311, 480664, 360766, 992053, 597307, 117931, 895843, 643205, 697272, 1332831, 1782391, 1185431, 502719, -363903, -45812, 286238, 583899, 1043877, 400926, 61159, 1094876, 1153646, 895211, 964810, 665396, 599224, 1087901]
4248A087901l8206k99487j09195k78724m5668k10713J25300k50393J70929N5277
4238B07021R0817K32662m27250o4868k15254L08348L03307K87291k62009J36039
4228E96104L36310m91037r1367N27169m64965j40961j90407j3148O90895k33994
4218E24599p0766k49265J88605j3617L97450k13027N88074k45937m16176P1745
4208E61685p7933l43281Q28245n0803q21618j78959j9608L43983j90334M67782
4198E19159O2636n62654P55377m3045L57137m99109J33686K74660m30460k11917
4188C55470m34937q3793M49498M316M24765k84805K07444L10288N14792j27885
4178A335153j016293N1660R8141l02699O28872J16711m21554k19034O73693m28869
$$ y = [1087901, 1049695, 750208, 641013, 362289, 316621, 105908, 231208, -19185, 151744, 207021, 297838, 530500, 103250, 38382, -176872, 131476, 434783, 722074, 460065, 596104, 932414, 441377, 350010, 877179, 412214, 271253, 80846, 67698, 758593, 524599, 453833, 204568, 393173, 379556, 777006, 563979, 1152053, 906116, 489940, 561685, 483752, 140471, 968716, 917913, 96295, -82664, -102272, 241711, 51377, 519159, 581795, 19141, 774518, 731473, 1088610, 589501, 723187, 997847, 567387, 355470, -79467, -163260, 286238, 290554, 715319, 430514, 637958, 948246, 1463038, 1335153, 318860, 370520, 468661, 165962, 794834, 911545, 489991, 270957, 944650, 515781]
4168E15781l36652M88152R2433M4933j47291l11189J68689p5619q378M13483m6593
4157G97749K38944n31567K31448K91103p03578m04474M34549j69650K17612l82513
4147A9623k00626k61292J16454N59114N23957n59522n90522Q25656j62339L9952
4137C10455Q32521p8068j75918n23489q4652Q0297j88821J85148M19405k86900
4127D89978j58491o0084J229m58623J70053L33270N2700p64427P88122R4166L43797
4116H31690k32032k12742J9717j40674k82378K89621R9570j60736N860J68136
4106C86032k51213K53409K07969r4183n38853L24458J94309j98293N49788l18382
4096E15041l50711N19962m09492l63664N09273M53851j89010r2528K85179m0136
$$ y = [515781, 179129, 667281, 759714, 804647, 657356, 346167, 514856, 439237, 430859, 844342, 797749, 1036693, 505126, 736574, 1027677, 324099, -80375, 354174, 184524, 402136, 19623, -181003, -442295, -325841, 233273, 757230, 197708, -392814, 432842, 270503, 310455, 1142976, 1064908, 888990, 365501, 280849, 361146, 172325, 357473, 776878, 489978, 331487, 271403, 272632, -185991, -15938, 317332, 370032, -394395, 393727, 487893, 831690, 599658, 386916, 406633, 265959, -16419, 273202, 372772, 212036, 217896, 386032, 134819, 388228, 596197, 502014, -36839, 287619, 481928, 283635, 833423, 515041, 164330, 684292, 274800, -88864, 420409, 874260, 685250, 592722, 877901, 837765]
4086H37765r88421L03345L53597q5565J18441j25126M26079m3646m77810J50837
4076D69496j46273R1446P5253l77767m8053p383M09126j22775L63656j0501j79577
4065E16648m21264J1899N16474Q922n32352m73437J82010K70106o8677O69403
4055F79732m7183l28656M66432K19433l01052k60915L03956M2770k15288m74814
4045H4415P9195M13255O0193K53829q38063p1808O78909J07530n66088j72291
4035B9076J79231L06529k55092L5810J82430R0957L62619K0427k78365J85164
4025H58786p15501K00226J16323j20490j63052M077M82539k58575l31644M49175
4015E21864o1122Q5198m96691j50967j54311O15540l06585N28166L3911k28818
$$ y = [837765, -150656, 152689, 506286, 420721, 539162, 414036, 840115, 796469, 318659, 469496, 323223, 414669, 489922, 112155, 64102, 56719, 465845, 343070, 706726, 696225, 516648, 95384, 107283, 623757, 632679, 100327, -373110, -191100, 79006, 10329, 679732, 632549, 303893, 770325, 989758, 688706, 427791, 731747, 774517, 559229, 84415, 163610, 576865, 637058, 890887, 52824, -18984, 659925, 767455, 201367, 29076, 208307, 514836, 259744, 295554, 477984, 568941, 931560, 951987, 673622, 858786, 143285, 343511, 459834, 339344, 176292, 180369, 662908, 404333, 72689, 521864, 460742, 545940, 49249, -101718, -256029, 359511, 52926, 581092, 615003, 386185]
4005C86185m3264L61574O98597n29739k65230m48913l89256J72877N96036N19630
3995A058497p19064n30530P09952m63946Q92534J87767n32687P3741k2647K26308
3985H79925n8103K24822K66474m3959o57871k77182K88875J49200r68232L13069
3975A17018N63617J1760O1176o3786N5512k1318O71084n02419k86762O00076p75077
3964D30881O6095L81803L96961o41993P69401m85815l29144R57089m72222N67989
3954A641045j89035M09212r47961K45143r9059J44778L33560K22644Q71831K09251
3944B841409k00136q5264P7055K93793l37587l2981j52070J16399r073o76123
3934A835422J895m45467M42598l75681M38577K93600k20046P7717j194423M58459
$$ y = [386185, 342921, 704495, 1403092, 873353, 608123, 159210, -230046, -57169, 538867, 1058497, 339433, -191097, 518855, 54909, 947443, 1135210, 602523, 676264, 653617, 879925, 821822, 1046644, 1313118, 1269159, 611288, 334106, 622981, 772181, -196051, 117018, 680635, 692395, 753571, 689785, 745297, 723979, 1395063, 892644, 605882, 1205958, 430881, 496976, 878779, 1275740, 633747, 1403148, 917333, 588189, 1545278, 1073056, 1641045, 1452010, 1861222, 913261, 1158404, 1059345, 1204123, 1537683, 1760327, 2632158, 2841409, 2641273, 2556009, 2633064, 2926857, 2589270, 2556289, 2404219, 2520618, 2511545, 1835422, 1837317, 1391850, 1834448, 1458767, 1897344, 2190944, 1970898, 2048615, 854192, 1312651]
3924A312651P29715l17153n67592l94373m08395M63845L72492j52039L19816K9418
3914A388385K22947M16538p72280m33184M04577m06736N23292N53284l68727N576
3904A533672p21925N56876R27481m26697o01845L3582m94808l03415Q77895J70977
3894A551793j35448j83363M16844O5425l60266K51742L60901K45363m16082K95361
3884B092270K26597k29447J80296l5704m79839K95475K06062L24004j57739m61732
3874A960243m93476k81435K84628m49668k95139k81737k29716N63556j17451P8085
3864G37890J89221N725l68351j80380P2719j604l50407N93077P2773o6820N34452
3853A238295k60300k08534l2130J17673k054K22621j2887o12288m50475M78495
$$ y = [1312651, 2042366, 1725213, 1157621, 763248, 354853, 818698, 1191190, 1039151, 1358967, 1388385, 1611332, 2027870, 1255590, 822406, 1226983, 820247, 1343539, 1896823, 1528096, 1533672, 811747, 1368623, 2296104, 1869407, 1267562, 1301144, 806336, 502921, 1380816, 1551793, 1416345, 1232982, 1649826, 1715251, 1354985, 1606727, 1967628, 2212991, 1796909, 2092270, 2318867, 2089420, 2269716, 2234012, 1754173, 2049648, 2255710, 2579714, 2421975, 1960243, 1466767, 1185332, 1469960, 1020292, 725153, 443416, 213700, 777256, 659805, 737890, 927111, 932836, 564485, 384105, 456824, 455220, 104813, 697890, 770663, 703843, 1238295, 977995, 769461, 737331, 855004, 852950, 1075571, 1062684, 450396, -79, 478416]
3843D78416l76321J33954Q56100l36619J68792K68603k01010l23042o58084J85475
3833A96264J01327m13107P36542j29354j84469N60317k41549l73610R7626L69641
3823G19628Q86146m31097j56966j96236k81052M83106j52100J8915l76623M96291
3813A010012j98390m40865L51794n75448J62107P5212j05990j43449M62647j81156
3803D16474j50216q2714M03115n3298n75570J004087o88437K9765J91K46021k6472
3792E22946L14964J54810J23670j01762p63418l8571O3708Q2905J35484k42136
3782B52600k7508O3755K83234Q06898o80846k21066l33736J21999m48542k89097
3772d72309O91326J74139j93190j72507O69332n28255K19399R6259j62462m45384
$$ y = [478416, 102095, 236049, 1092149, 755530, 924322, 1192925, 991915, 668873, 10789, 196264, 297591, -115516, 621026, 491672, 307203, 867520, 625971, 252361, 349987, 719628, 1605774, 1174677, 1017711, 821475, 540423, 1023529, 871429, 890344, 513721, 1010012, 811622, 370757, 722551, 147103, 309210, 384422, 278432, 134983, 597630, 416474, 266258, 183544, 586659, 533361, -42209, 961878, 273441, 303206, 303397, 549418, 522946, 837910, 992720, 1116390, 1014628, 251210, 212639, 276347, 359252, 494736, 252600, 225092, 288847, 572081, 1378979, 698133, 477067, 143331, 265330, -183212, -472309, 219017, 393156, 199966, 27459, 696791, 168536, 387935, 484194, 321732, -123652]
3762a23652M35597l14196K65304M09345j57460o30177M48138L23895k16027r5728
3752C45039n27985n29095K79847M92828k48510j69987L61510O44716K24002l59813
3742E12552m34682L3871N22629o87052J55573M53251m6250L44198o02275o6390
3732A85425K97249m29215j83462J03437m52935M13038K98183K38141J25652K57568
3722H53081m37396J83654L93953n17913R7624k0154k64808J88554J23439k7825
3712E72209j35188J80934K51704j49467j92830j79112N25317J61287K3152J53354
3702A211360L36p18006m14041J58760m932R01197L80465m43198l61730P49243
3692A459454m88740Q1556R2017n77253J32881L45143N57391J42461K16846l32819
$$ y = [-123652, 311945, -2251, 263053, 672398, 514938, -115239, 332899, 656794, 440767, 345039, -182946, -712041, -432194, 60634, -187876, -357863, 3647, 648363, 872365, 512552, 77870, 111741, 634370, -52682, 102891, 556142, 509892, 854090, 251815, 185425, 482674, 53459, -130003, -26566, -479501, -66463, 231720, 469861, 595513, 853081, 415685, 599339, 993292, 475379, 573003, 552849, 288041, 476595, 600034, 572209, 437021, 617955, 869659, 720192, 527362, 348250, 873567, 1034854, 1058006, 1211360, 1211696, 493690, 79649, 238409, 233477, 1134674, 1515139, 1071941, 710211, 1459454, 970714, 1052270, 1144287, 567034, 699915, 1045058, 1602449, 1744910, 1961756, 1628937]
3682A628937j72677k93903j19990l22359Q7042N02908m81816m81800K61152M1276
3672F48770p095L07582K44534J63575m13073k94475K07327M0649J34613J31837
3662A164244J43644j59485p01462M53124p23168R30323j61458l05581M64129n06082
3652E98228L54213n41915m5530N08944n56000n23088P18251J91197j50146K01594
3642G55748j87572o29780L3503K35230R1504p9309o5159q4957J39582Q6532j72230
3631A23092K9363k94600P41612r8973l09572k28209N38514m00684k72867N17576
3621C45252J42011K57609l69663k49325m89737J07114j7982Q34649n45918l90028
3611c76018M01366K188j6645l8618K51186L9980j24541l87084K65172k01743L2029
$$ y = [1628937, 1456260, 1162357, 1042367, 720008, 807050, 1309958, 828142, 346342, 607494, 648770, 641675, 949257, 1193791, 1357366, 944293, 649818, 857145, 897794, 1032407, 1164244, 1307888, 1148403, 446941, 900065, 176897, 1107220, 945762, 640181, 1104310, 598228, 952441, 410526, 364996, 873940, 317940, -205148, 513103, 704300, 554154, 755748, 568176, -61604, -28101, 207129, 298633, 219324, 154165, 69208, 208790, 295322, 123092, 152455, -142145, 599467, 500494, 190922, -37287, 501227, 100543, -172324, 345252, 487263, 744872, 375209, 125884, -363853, -256739, -274721, 559928, 14010, -376018, 25348, 27536, 10891, -27727, 223459, 263439, 138898, -248186, 16986, -184757, -152728]
3600a52728R1883j74377j4351M90136m27157J73412j88421L63206j78400o41630
3590f58427P85597J33508l79710j8985J01391J00519j92172Q0874l91249r0398
3580e29052K85909k10014j19254M3577J056026l46617m24171r3567J9208J79010
3570a38945n7132K25755l51342L36180j7159M49050N01365p64536L36707m34706
3560H5237j76847J52086J73161k76607k53129J40630K39952J99705J37089m25604
3550d327k21258K14731L95578o85953j59405O0826L86924J38747m74432j50316
3540d98885M31124N84894n33821M2604m71826l8190p4249n0424M93440j54952
3530b70285k49266k8717K21024j16176N42748o35895m80082N74193l72272K27921
$$ y = [-152728, -60845, -235222, -249573, 240563, -186594, -13182, -201603, 161603, -16797, -658427, 127170, 260678, -119032, -138017, -36626, 63893, -128279, -47405, -438654, -529052, -243143, -453157, -572411, -528834, 527192, 180575, -243596, -337163, -317955, -138945, -196077, 29678, -321664, 14516, -2643, 446407, 947772, 183236, 519943, 85237, -91610, 60476, 233637, -42970, -296099, -155469, 84483, 284188, 421277, -4327, -225585, -10854, 384724, -301229, -460634, -399808, -12884, 125863, -348569, -498885, -67761, 517133, -16688, 25916, -445910, -484100, -558349, -608773, -115333, -270285, -519551, -548268, -327244, -443420, 99328, -536567, -1016649, -442456, -814728, -586807]
3520e86807L94843r6397l87978l91564Q89818k82760O74415K5081k52117Q1784
3510F8318n95075r0049L55555M35521k30505P11349q04534K01580L7402k70148
3500a80586M50377o36648J5526j0605l16154O39910J28708m40568O95041n4196
3490B90805j78715o05477K91340O97389L00736J81449q68528k54676m69869K78369
3480c37177m73941j75312P75222Q4065J74633J804j07453K97697P039k34604k90957
3469b78984m75064K9374J099274K24250r20380k8472O67149m22698J46093L04645
3459C45187l22769p0221L08700k44922K40707k21001J01910J88780r9142j38510
3449H8719K0032p267O3324P200o20209J82115l09236j53529M13884N36096O7507
$$ y = [-586807, -191964, -288361, -676339, -1067903, -178085, -460845, 213570, 238651, -13466, 68318, -526757, -616806, -261251, 174270, -56235, 655114, -149420, 52160, 89562, -180586, 269791, -366857, -351331, -361936, -678090, -38180, 90528, -350040, 345001, 290805, 112090, -493387, -202047, 495342, 796078, 977527, 108999, -145677, -615546, -337177, -811118, -986430, -211208, -127143, 47490, 49294, -58159, 239538, 246577, 11973, -278984, -754048, -724674, 374600, 598850, -321530, -350002, 317147, -105551, 40542, 345187, 22418, -47803, 260897, 15975, 256682, 35681, 137591, 326371, 227229, 88719, 108751, 101484, 164808, 172008, -448201, -266086, -575322, -728851, -314967, 221129, 288636]
3438B88636J51832n19967P14001m13807r9482R8351Q6151j38265K99373l31466
3428A35357n18283p3782n19682O43672Q7040L07225K52197q5093j18091J37882
3418B48442m49797j61703N29851L50600p8394j96037Q9302J3130n61676J37483
3408g8799M97807j97742k77596m17644J64963K23837K32890o45996J32102M4767
3398c21411r8503N80296o2807n09961N71701k41270m26431L2013k32584M75854
3388b33103K43113l64767J45535J3353q2174K8682q8416L19757q50837R32215
3378F3358J67750K57685k64342o0362J43648m49874R368k79543L84120M89069
3368D60877n29952m36854R6659L68445K34430K59091k76406q3140n74527L90536
$$ y = [288636, 440468, -79499, 634502, 220695, 121213, 219564, 305715, 167450, 466823, 135357, -382926, -456708, -976390, -332718, -245678, 61547, 313744, 228651, 110560, 248442, -201355, -363058, 166793, 517393, 438999, 242962, 332264, 345394, -216282, -78799, 419008, 221266, -56330, -473974, -309011, -85174, 147716, -498280, -366178, -321411, -419914, 160382, 97575, -412386, 159315, -81955, -508386, -476373, -708957, -233103, 10010, -354757, -209222, -195869, -278043, -249361, -337777, -18020, -868857, 63358, 231108, 488793, 224451, 164089, 307737, -142137, -132769, -412312, -28192, 460877, -69075, -505929, -409270, -40825, 193605, 452696, 176290, 93150, -481377, -90841]
3358i0841O88149k65731l72245P56371k21574k29588j81737j45550j3243L24588
3348B48599L94110o39138K55559j63907q5655j28402Q3386M6919l28435k66302
3338e83266O45482K80852n33112n07788J82138J54285m24724J75916M59768P6771
3328g3678J29413l54558k0277P49047p57594o30860M92291M26455j02887L67908
3318B25260q2677K25757O24089r11807p7922M31465n21049l22439J69054L29621
3308H9352k46044m09005M04919p52084K68802L06898l1099K08497J76930k20999
3298b03833J10182m01493M86261N01067J90650k32129j76168k13010k11215J00740
3288d8948M8922P45462r6249l40130p13329L36600n95401M64743k2409j53044
$$ y = [-90841, 597308, 331577, -40668, 715703, 494129, 264541, 82804, -62746, -75989, 248599, 642709, 3571, 259130, 95223, 9568, -118834, -35448, 11471, -316964, -583266, 62216, 343068, -190044, -697832, -515694, -361409, -786133, -610217, -150449, -73678, 55735, -298823, -319100, 429947, -327647, -958507, -466216, -39761, -142648, 225260, 142583, 368340, 992429, 80622, 2700, 434165, -86884, -409323, -240269, 89352, -156692, -565697, -160778, -912862, -644060, -337162, -368261, -159764, 17166, -203833, -93651, -495144, -8883, 492184, 682834, 450705, 274537, 61527, -149688, -48948, -26, 745436, 649187, 309057, -404272, -67672, -663073, -198330, -220739, -373783]
3278c73783M67118j71472J79099J36542R2444o89857Q59227o32518l63719R68670
3268D71751j43490p6851m01466N73806k15914p25768Q16705J10611M21215m49042
3258C81557o71256m81309j66750M30498Q845k52813N33251M20409j37255K18390
3248B83567j19803k26817l24186j62531L5061j6382n20639P01575r7770K61882
3238a86043L40505p42028n2937m80389M05800N68980l92435K53095l26992Q1052
3228e31392O10318m72657J79729K94566L82470o04685r2009o26961j06046L90430
3218e76237K11833O37340n64503P2700J26094N03571p4262o82098j30595M06287
3208f9870M113K95621J30190J08766j93748n02091K54282n96506L78654L01427
$$ y = [-373783, 93335, -78137, 100962, 237504, 329948, -359909, 499318, -133200, -496919, 471751, 328261, 251410, -150056, 423750, 207836, -517932, 298773, 409384, 830599, 381557, -289699, -771008, -937758, -507260, -498415, -751228, -217977, 202432, 65177, 283567, 163764, -63053, -387239, -549770, -514709, -531091, -1051730, -350155, -447925, -186043, 154462, -587566, -640503, -1120892, -715092, -146112, -538547, -285452, -612444, -531392, 78926, -393731, -214002, 80564, 463034, -141651, -233660, -860621, -966667, -576237, -364404, 272936, -291567, -218867, -92773, 410798, 336536, -345562, -476157, -69870, -65757, 229864, 360054, 468820, 275072, -227019, 27263, -569243, -190589, 110838]
3198A10838J39355M80216m14979J06862k97748k00043k25105L13039j530n88511
3188e77606N28850p3565l78574R73504K26586m42778k35685m31625j05479J11675
3178d04697N66550L8549R5864q2834K4913J52432k80623j89361K10502j55213
3168b3918m02528R9264j4710r9963N54581j57548j72511O6503N3568O022k79281
3157c70521M72412M6457j73003j80412J7636k3619K23490J54865n03155L4970
3147c00880J61759j18978l98041N19331K89553k42930l23679K89744j66554j60131
3137d50806M57111L147j20692R340N04947o87946K28215O3365K63162L16745n10722
3126G5866j35087o1152q4610J60886j91747j61380N20892m83310J99833J60477
$$ y = [110838, 250193, 730409, 315430, 422292, 124544, -75499, -300604, 12435, 10905, -577606, -48756, -122321, -500895, 472609, 699195, 256417, 20732, -410893, -516372, -404697, 161853, 200402, 296266, 213432, 238345, 390777, 110154, -79207, 131295, -23918, -426446, -327182, -341892, -441855, 112726, -44822, -217333, -150830, -97262, -91240, -370521, 101891, 148348, -24655, -205067, -187431, -211050, 12440, 167305, -335850, -300880, -139121, -258099, -656140, -136809, 152744, -90186, -413865, -124121, -290675, -450806, 6305, 9452, -111240, -101900, 403047, -284899, -56684, 6681, 269843, 586588, 75866, -59221, -120373, -204983, -44097, -235844, -397224, 123668, -359642, -159809, 668]
3116F68K17273j51102L3487K17864K3384N08027j065923k2822L77660Q806r8608
3105D8714M7161K66341l23711m91950k1777k8194p9934M30019J99805K34440L85391
3094F66305m00314k10221o03307K32535K33235K82263J67482k89253m59265r5309
3084d75849K15563o557K7375K37170M29634m34189k76273M26199m8462o78406
3074e83795O9372J16029J26801l7206K15267m32742K23319J1462j07688M20262
3064B1081J0646r7139N308L09611j65369J01132l51560O2952n25008L59020J96302
3053g3024K95881k68926n99115Q11384M82868q67821m18397K44398k10374O12965
3043I839k32400k82376P13324l8110l58461l51626K32951N7842J76411L60075
$$ y = [668, 217941, 66839, 100326, 318190, 341574, 849601, -216322, -239144, 138516, 147322, 48714, 95875, 362216, 38505, -453445, -475222, -503416, -583350, -153331, 46474, 280914, 666305, 265991, 55770, -547537, -315002, -81767, 200496, 367978, 78725, -380540, -475849, -260286, -266843, -239468, -2298, 427336, -6853, -283126, 143073, 94611, -583795, -514423, -398394, -271593, -308799, -93532, -526274, -302955, -291493, -399181, 21081, 31727, -65412, -60104, 249507, 84138, 185270, -166290, -103338, -628346, -269326, -73024, 222857, -46069, -645184, 166200, 649068, -218753, -637150, -392752, -603126, 9839, -222561, -504937, 208387, 170277, -188184, -539810, -306859, -249017, -72606, 287469]
3033B87469k30961R0495m91304o6708J41580k32325n64630K85024N23376O38855
3023C80871o69753j1872L87724l68930K36982J4908k03623Q9085K24011l0467
3013D8936m9158M60447n65260m79897K28896P48698l19016k30203k88262J90611
3003b54208P07286k16702m74223L05363M31584o26208K48201j63584R3666m5778
2993E397n05218k96870L64554J27349k74106R4986M23779J18613l20267K45505
2983a6278k71463r2654m34152M06267M54494k11681R9018j73414L82588j11466
2973C1259o13436M43461n35512K54725k01806N0335M98518L9604L144k51781K13154
2962f8335l83500j6031o23176l17334K16155O13071J43819k39188L91052k54201
$$ y = [287469, 56508, 147003, -344301, -411009, -269429, -501754, -1066384, -781360, -257984, 380871, -288882, -300754, 86970, -281960, -44978, -30070, -233693, -144608, 79403, 48936, -222, 460225, -105035, -584932, -356036, 392662, 73646, -156557, -444819, -254208, 453078, 236376, -237847, 67516, 499100, -127108, 121093, -42491, 51175, 5397, -499821, -796691, -432137, -304788, -578894, -483908, -60129, 58484, -261783, -16278, -287741, -380395, -814547, -408280, 46214, -165467, -66449, -239863, 142725, 31259, -582177, -138716, -674228, -419503, -621309, -570974, -72456, -32852, -29708, -281489, -68335, -451835, -467866, -1091042, -1408376, -1192221, -579150, -435331, -674519, -283467, -537668]
2952e37668J81474M85998q07078O70048M5034k72996N68171m26705J05620j74900
2942a63002L9096P1992j76259j08847j04813M26270l52261n16749K99557Q4452
2932e00564P43519J08777m83938K46231J74916O8955m63003J7124j34527K00136
2922b2374L65346j51640n19545j46476N82880m04329o75422K46425M22078k71405
2912e74462P2654L96535j12989l76589P95005l38015j50417J55651o3866P34269
2902E37776l10638j72802l72488R9348m68406M02456j58741K52332j58197p196
2892c56556k379J19229j13367Q18949J56945k72890q42515N05930r6290j79770
2882b62714l71846m26599O28643L05681L96337l12187k830L56955J12358O028
$$ y = [-537668, -356194, 129804, -677274, -7226, 37808, -235188, 332983, -93722, 11898, -163002, -123906, -51914, -228173, -337020, -441833, -15563, -367824, -884573, -585016, -500564, 242955, 351732, -132206, 114025, 288941, 357896, -105107, -87983, -222510, -22374, 342972, 191332, -328213, -474689, 108191, -296138, -971560, -725135, -303057, -574462, -501808, -105273, -218262, -594851, 200154, -137861, -288278, -132627, -196493, 537776, 227138, 54336, -318152, -218804, -687210, -284754, -443495, -191163, -349360, -356556, -358935, -239706, -353073, 465876, 622821, 349931, -492584, 13346, -82944, -262714, -634560, -1061159, -432516, -126835, 269502, -42685, -45515, 311440, 423798, 429826]
2872D29826k5196j079132J22712K32390K81726p55156J51750J69584K01033p0780
2862c41243N65319j6098q7358m30451M0427j7892J8853O80725j88533K22270L57360
2851H03379k05434o05141j65035k491Q0165k39657r7768j06231k6589N57319l01291
2840c08774n63670N42232j56569J63771O90772J50160n13905q64802J13234j25335
2830h72886K32771O92783K92914k20152l50254j54290k29528P92118N53163j120633
2820c83994M10435n73484J9989J3006L09475k02158j73037Q97442k44238J07980
2810A81416j09220o10099m9084R8917J81339m55711L79486M2789N24630N10868
2800F95331j40996m12863m21496m34448j28481O40786L05213L56744m30461L27251
$$ y = [429826, 404630, -674502, -551790, -319400, -37674, -792830, -641080, -471496, -270463, -341243, 224076, 207978, 120620, -309831, -269404, -287296, -268443, 412282, 223749, 446019, 803379, 597945, -7196, -172231, -174722, -94557, -334214, -431982, -538213, -564802, -7483, -308774, -872444, -330212, -486781, -323010, 367762, 517922, 4017, -860785, -747551, -872886, -640115, 52668, 345582, 125430, -224824, -379114, -608642, 183476, 736639, -383994, 26441, -547043, -527054, -514048, -204573, -406731, -579768, 317674, 73436, 181416, 72196, -537903, -586987, -488070, -306731, -762442, -382956, -340167, 184463, 695331, 554335, 141472, -280024, -714472, -842953, -202167, 103046, 459790, 29329, 356580]
$$ [...]
##END NTUPLES=NMR SPECTRUM
##END=
