##TITLE=1H_CA-DMSO-per
 DMSO-d6
 8 sc, 
 25.12.2024
##JCAMPDX= 6.0         $$ Bruker NMR JCAMP-DX V2.0
##DATA TYPE= NMR SPECTRUM
##DATA CLASS= NTUPLES
##ORIGIN= UXNMR, Bruker Analytische Messtechnik GmbH
##OWNER= root
$$ XWIN-NMR		Version 3.5
$$ Wed Dec 25 13:18:52 2024 Russian Standard Time (UT+4h)  she@DPX200
##.OBSERVE FREQUENCY= 200.1315
##.OBSERVE NUCLEUS= ^1H
##.ACQUISITION MODE= SIMULTANEOUS
##.ACQUISITION SCHEME= undefined
##.AVERAGES= 8
##.DIGITISER RES= 18
##SPECTROMETER/DATA SYSTEM= spect
##.PULSE SEQUENCE= zg30
##.SOLVENT NAME= CDCl3
##.SHIFT REFERENCE= (INTERNAL, CDCl3, 0, 19.5074)
##AUDIT TRAIL= $$ (NUMBER, WHEN, WHO, WHERE, WHAT)
$$ ##TITLE= Audit trail, XWIN-NMR		Version 3.5
$$ ##JCAMPDX= 5.01
$$ ##ORIGIN= Bruker BioSpin GmbH
$$ ##OWNER= she
$$ F:/spectra/data/she/nmr/H-F/1/pdata/1/auditp.txt
$$ ##AUDIT TRAIL=  $$ (NUMBER, WHEN, WHO, WHERE, WHAT)
(   1,<2024-12-25 13:17:18.46 +0400>,<she>,<DPX200>,
      <created by zg, POWCHK disabled, PULCHK disabled
       configuration hash MD5:
       00 E9 B6 7A A2 85 ED C7 34 08 36 98 17 FE 4E 26
       data hash MD5: 16K
       77 C6 25 8E 95 3E 09 4E 3B 9A 22 2B 53 13 3E 54>)
(   2,<2024-12-25 13:17:21.57 +0400>,<she>,<DPX200>,
      <Start of raw data processing
       efp BC_mod = 2 LB = 0.24 FT_mod = 6 PKNL = 1 PHC0 = -26734.56 PHC1 = 13.78744 SI = 16K 
       data hash MD5: 16K
       3F D1 C9 4C F5 F9 61 5B 88 DB 43 CE 4A 20 6D 4D>)
(   3,<2024-12-25 13:17:42.46 +0400>,<she>,<DPX200>,
      <pk PHC0 = 156.9612 PHC1 = 0 
       data hash MD5: 16K
       EE 42 DE 61 13 C9 65 5F 83 D0 06 18 25 F8 F9 97>)
(   4,<2024-12-25 13:17:46.32 +0400>,<she>,<DPX200>,
      <abs ABSG = 5 
       data hash MD5: 16K
       50 08 A2 D8 D9 A7 CD 38 25 29 77 B6 DD DC A7 E5>)
$$ ##END=
$$ 
$$ hash MD5
$$ 93 97 01 96 D7 8B 9F 56 B9 98 CB 2D 17 6B F1 7E
##$RELAX= 
##$RELAX= 
##$RELAX= 
##$RELAX= 
##$RELAX= 
##$RELAX= 
$$ Bruker specific parameters
$$ --------------------------
##$DU= <F:/spectra>
##$EXPNO= 1
##$NAME= <H-F>
##$PROCNO= 1
##$TYPE= <nmr>
##$USER= <she>
##$AMP= (0..31)
100 100 100 100 100 100 100 100 100 100 100 100 100 100 100 100 100 100 
100 100 100 100 100 100 100 100 100 100 100 100 100 100 
##$AQSEQ= 0
##$AQ_mod= 1
##$AUNM= <au_zg>
##$AUTOPOS= <>
##$BF1= 200.13
##$BF2= 200.13
##$BF3= 200.13
##$BF4= 200.13
##$BF5= 200.13
##$BF6= 200.13
##$BF7= 200.13
##$BF8= 200.13
##$BYTORDA= 1
##$CFDGTYP= 0
##$CFRGTYP= 5
##$CHEMSTR= <none>
##$CNST= (0..31)
1 1 145 1 1 1 1 1 1 1 1 1 1 1 1 1 1 1 1 1 1 1 1 1 1 1 1 1 1 1 1 1 
##$CPDPRG= <>
##$CPDPRG1= <>
##$CPDPRG2= <>
##$CPDPRG3= <>
##$CPDPRG4= <mlev>
##$CPDPRG5= <mlev>
##$CPDPRG6= <mlev>
##$CPDPRG7= <mlev>
##$CPDPRG8= <mlev>
##$CPDPRGB= <>
##$CPDPRGT= <>
##$D= (0..31)
0 1.2 0 0 0 0 0 0 0 0.06 0 0.03 0 0 0 0 0.0002 0 0 0 0 0 0 0 0 0 0 0 0 
0 0 0 
##$DATE= 1735118237
##$DBL= (0..7)
120 120 120 120 120 120 120 120 
##$DBP= (0..7)
150 150 150 150 150 150 150 150 
##$DBP07= 0
##$DBPNAM0= <>
##$DBPNAM1= <>
##$DBPNAM2= <>
##$DBPNAM3= <>
##$DBPNAM4= <>
$$ [...]
##$SUBNAM3= <"">
##$SUBNAM4= <"">
##$SUBNAM5= <"">
##$SUBNAM6= <"">
##$SUBNAM7= <"">
##$SUBNAM8= <"">
##$SUBNAM9= <"">
##$SW= 24.0689530833862
##$SWIBOX= (0..15)
0 0 2 0 0 0 0 0 0 0 0 0 0 0 0 0 
##$SW_h= 4816.95568400771
##$TD= 16384
##$TD0= 1
##$TE= 0
##$TE2= 300
##$TE3= 300
##$TEG= 300
##$TL= (0..7)
0 120 120 120 120 120 120 120 
##$TP= (0..7)
150 150 150 150 150 150 150 150 
##$TP07= 0
##$TPNAME0= <>
##$TPNAME1= <>
##$TPNAME2= <>
##$TPNAME3= <>
##$TPNAME4= <>
##$TPNAME5= <>
##$TPNAME6= <>
##$TPNAME7= <>
##$TPOAL= (0..7)
0.5 0.5 0.5 0.5 0.5 0.5 0.5 0.5 
##$TPOFFS= (0..7)
0 0 0 0 0 0 0 0 
##$TUNHIN= 0
##$TUNHOUT= 0
##$TUNXOUT= 0
##$USERA1= <user>
##$USERA2= <user>
##$USERA3= <user>
##$USERA4= <user>
##$USERA5= <user>
##$V9= 5
##$VALIST= <valist>
##$VCLIST= <CCCCCCCCCCCCCCC>
##$VD= 0
##$VDLIST= <DDDDDDDDDDDDDDD>
##$VPLIST= <PPPPPPPPPPPPPPP>
##$VTLIST= <TTTTTTTTTTTTTTT>
##$WBST= 1024
##$WBSW= 4
##$XGAIN= (0..3)
0 0 0 0 
##$XL= 0
##$YL= 0
##$YMAX_a= 136298
##$YMIN_a= -156535
##$ZGOPTNS= <>
##$ZL1= 120
##$ZL2= 120
##$ZL3= 120
##$ZL4= 120
##$ABSF1= 20.52928
##$ABSF2= -3.539877
##$ABSG= 5
##$ABSL= 3
##$ALPHA= 0
##$AQORDER= 0
##$ASSFAC= 0
##$ASSFACI= 0
##$ASSFACX= 0
##$ASSWID= 0
##$AUNMP= <proc_1d>
##$AZFE= 0.1
##$AZFW= 0.1
##$BCFW= 0
##$BC_mod= 2
##$BYTORDP= 0
##$COROFFS= 0
##$CY= -3
##$DATMOD= 1
##$DC= 0
##$DFILT= <>
##$DTYPP= 0
##$F1P= 0
##$F2P= 0
##$FCOR= 1
##$FTSIZE= 16384
##$FT_mod= 6
##$GAMMA= 0
##$GB= 0
##$INTBC= 1
##$INTSCL= 2.524811e-10
##$ISEN= 128
##$LB= 0.24
##$LEV0= 0
##$LPBIN= 0
##$MAXI= 10000
##$MC2= 0
##$MEAN= 0
##$ME_mod= 0
##$MI= 1.114404
##$NCOEF= 0
##$NC_proc= -8
##$NLEV= 6
##$NOISF1= 3.799351
##$NOISF2= 2.8
##$NSP= 0
##$NTH_PI= 0
##$NZP= 0
##$OFFSET= 19.50735
##$PC= 1
##$PHC0= -26577.6
##$PHC1= 13.78744
##$PH_mod= 1
##$PKNL= yes
##$PPARMOD= 0
##$PSCAL= 0
##$PSIGN= 0
##$REVERSE= no
##$SF= 200.130004473067
##$SI= 16384
##$SIGF1= 3
##$SIGF2= 2
##$SINO= 5.538805
##$SIOLD= 16384
##$SREGLST= <1H.CDCl3>
##$SSB= 0
##$STSI= 16384
##$STSR= 0
##$SW_p= 4816.95568400771
##$SYMM= 0
##$S_DEV= 0
##$TDeff= 16384
##$TDoff= 0
##$TI= <>
##$TILT= no
##$TM1= 0
##$TM2= 0
##$TOPLEV= 0
##$USERP1= <user>
##$USERP2= <user>
##$USERP3= <user>
##$USERP4= <user>
##$USERP5= <user>
##$WDW= 1
##$XDIM= 16384
##$YMAX_p= 393206505
##$YMIN_p= -1824304
$$ End of Bruker specific parameters
$$ ---------------------------------
##NTUPLES= NMR SPECTRUM
##VAR_NAME=  FREQUENCY,     SPECTRUM/REAL,   SPECTRUM/IMAG
##SYMBOL=    X,             R,               I
##VAR_TYPE=  INDEPENDENT,   DEPENDENT,       DEPENDENT
##VAR_FORM=  AFFN,          ASDF,            ASDF
##VAR_DIM=   16384,         16384,           16384
##UNITS=     HZ,            ARBITRARY UNITS, ARBITRARY UNITS
##FACTOR=    0.29402158847633, 1,            1
##FIRST=     3904.00622720367, 0,            0
##LAST=      -912.949456804039, 0,           0
##MIN=       -912.949456804039, -1824304,    0
##MAX=       3904.00622720367, 393206505,    0
$$ Real data points
##PAGE= N=1
##DATA TABLE= (X++(R..R)), XYDATA
$$ [...]
$$ plain form
8647 7292041 8140018 9273501 11351862 13009313 15766271 20487415 26053726 33691650
8639 33691650 38779357 38040283 31223499 22261406 16594340 12879007 10195648 8245227
8631 8245227 6999438 5718802 5255173 4258904 3368933 2974028 3463087 3183579 3007850
8622 3007850 3315801 3104081 2158112 2142447 2021233 1993183 2127050 1909085 1775838 1697180
8612 1697180 1794310 1779051 1097780 1005577 1013687 1248122 1189275 1001915 1026966 925553 866662
8601 866662 950790 754323 739073 969838 1194849 277874 398883 894088 840426 538469
8591 538469 537612 708222 496847 638316 676611 813093 465577 -191371 327975 829727
8581 829727 810559 503740 -313977 558579 290249 -165899 -36815 204497 799191 715595
$$ packed form
8647G292041Q47977J133483K078361J657451K756958M721144N566311P637924
8639C3691650N087707p39074o816784q962093n667066l715333k683359j950421
8631H245227j245789j280636m63629r96269q89971l94905M89059k79508j75729
8622C007850L07951k11720r45969j5665j21214k8050J33867k17965j33247p8658
8612A697180R7130j5259o81271r2203Q110K34435n8847j87360K5051j01413n8891
8601H66662Q4128j96467j5250K30765K25011r16975J21009M95205n3662l01957
8591E38469q57J70610k11375J41469L8295J36482l47516o56948N19346N01752
8581H29727j9168l06819q17717Q72556k68330m56148J29084K41312N94694q3596
$$ plain form
8571 715595 113210 399439 490497 580982 666328 386540 20715 -134929 -541845 -64082
8561 -64082 -32289 206876 -324631 108728 626160 746980 817787 756789 1236481 1476652
8551 1476652 577216 156655 13815 11065 277648 147204 355830 591036 824141 924753
8541 924753 783080 512434 231510 206746 944798 447098 752332 1167257 749948 958233
8531 958233 1209516 1426983 1052495 1021419 1279415 1360827 1470393 740538 1512564 1817707
8521 1817707 2058923 1946154 1606151 1911547 2132329 3150282 3832975 4376956 4985280
8512 4985280 4762300 4343050 4588117 4345181 3366360 3075256 2730647 2306801 2556787 1816804
8502 1816804 1061826 1474951 1730830 755312 1074504 1175692 1201515 740938 1144737 891160
$$ packed form
8571G15595o02385K86229R1058R0485Q5346k79788l65825j55644m06916M77763
8561f4082L1793K39165n31507M33359N17432J20820P0807o0998M79692K40171
8551A476652q99436m20561j42840k750K66583j30444K08626K35206K33105J00612
8541I24753j41673k70646k80924k4764P38052m97700L05234M14925m17309K08285
8531I58233K51283K17467l74488l1076K57996Q1412J09566p29855P72026L05143
8521A817707K41216j12769l40003L05396K20782J017953O82693N43981O08324
8512D985280k22980m19250K45067k42936r78821k91104l44609m23846K49986p39983
8502A816804p54978M13125K55879r75518L19192J01188K5823m60577M03799k53577
$$ plain form
8492 891160 793107 717908 837491 602152 552399 262722 590283 -151584 560934 1488857
8482 1488857 463916 1193305 1195754 1018413 1052833 872253 680332 1026662 790395 1535434
8472 1535434 1259568 1119855 345103 230652 496603 401216 680237 666234 1425144 817206
8462 817206 473648 495092 -90236 232351 16503 -37443 -245534 -207786 44766 274785
8452 274785 692356 549657 258448 700203 863351 18334 -144444 349996 453630 1101938
8442 1101938 782090 213172 184569 710802 980395 1064857 472752 193573 137460 844541
8432 844541 131869 98224 307707 348946 546834 215804 778342 467414 65886 298869
8422 298869 403945 1214516 923641 761557 1068635 336915 323174 -125837 676860 280682
$$ packed form
8492H91160r8053p5199J19583k35339m9753k89677L27561p41867P12518R27923
8482A488857j024941P29389K449j77341L4420j80580j91921L46330k36267P45039
8472A535434k75866j39713p74752j14451K65951r5387K79021j4003P58910o07938
8462H17206l43558K1444n85328L22587k15848n3946k08091L7748K52552K30019
8452B74785M17571j42699k91209M41755J63148q45017j62778M94440J03634O48308
8442A101938l19848n68918k8603N26233K69593Q4462n92105k79179n6113P07081
8432H44541p12672l3645K09483M1239J97888l31030N62538l10928m01528K32983
8422B98869J05076Q10571k90875j62084L07078p31720j3741m49011Q02697l96178
$$ plain form
8412 280682 300837 287441 434388 348259 719477 519053 220130 387782 131401 314157
8402 314157 736016 1012338 615247 1159379 827008 282975 259230 391359 -141838 -57034
8392 -57034 323803 354944 496899 1238152 1101478 788946 753660 18818 158889 387840
8382 387840 672269 324621 352727 956347 489188 181758 24072 250659 166101 -156430
8372 -156430 -838094 -405611 668740 616678 202062 72542 317532 281026 112960 323561
8362 323561 -476654 66917 369444 390850 853813 678458 252129 -166630 -2185 71091
8352 71091 524232 640782 502468 22915 494557 81852 -98722 -33372 322767 -813446
8342 -813446 -595741 101163 485417 594100 452618 515634 417056 -33761 -266392 153084
$$ packed form
8412B80682K0155j3396J46947q6129L71218k00424k98923J67652k56381J82756
8402C14157M21859K76322l97091N44132l32371n44033k3745J32129n33197Q4804
8392e7034L80837L1141J41955P41253j36674l12532l5286p34842J40071K28951
8382C87840K84429l47648K8106O03620m67159l07430j57686K26587q4558l22531
8372a56430o81664M32483J074351n2062m14616j29520K44990l6506j68066K10601
8362C23561q00215N43571L02527K1406M62963j75355m26329m18759J64445P3276
8352G1091M53141J16550j38314m79553M71642m12705j80574O5350L56139j136213
8342h13446K17705O96904L84254J08683j41482O3016r8578m50817k32631M19476
$$ plain form
8332 153084 171298 354718 123682 196685 180409 427838 522683 -146241 379900 1043139
8322 1043139 -68674 -46202 175339 184363 483353 276129 -104576 -152899 568247 954983
8312 954983 923712 1078802 965921 1202579 1219333 1255596 783208 218507 955065 34404
8302 34404 81538 481639 126408 43033 40508 272012 282471 -218633 101591 498249 415787
8291 415787 343163 199038 493193 402183 644649 1352915 1184640 690969 373385 769541
8281 769541 931378 128535 457022 263194 219066 713772 690427 187870 460136 131382
8271 131382 -374719 -85922 -169232 645749 1445413 1346585 1266167 701663 914789 776988
8261 776988 1267034 1027905 1052416 578874 817917 753826 438078 1226522 1320355 708854
$$ packed form
8332A53084J8214J83420k31036P3003j6276K47429R4845o68924N26141O63239
8322A043139j111813K2472K21541R024K98990k07224l80705m8323P21146L86736
8312I54983l1271J55090j12881K36658J6754L6263m72388n64701P36558r20661
8302C4404M7134M00101l55231q3375k525K31504J0459n01104L20224L96658q2462
8291D15787p2624j44125K94155r1010K42466P08266j68275m93671l17584L96156
8281G69541J61837q02843L28487j93828m4128M94706k3345n02557K72266l28754
8271A31382n06101K88797q3310Q14981P99664r8828q0418n64504K13126j37801
8261G76988M90046k39129K4511m73542K39043o4091l15748P88444R3833o11501
$$ plain form
8251 708854 311403 707383 760207 386039 585958 482341 393314 87488 411552 787328
8241 787328 220470 409355 315468 303306 68292 191148 -73964 -27638 -82554 67344
8231 67344 274647 36311 124146 6934 357924 623527 753500 452357 498628 137307
8221 137307 -736838 278832 658042 434762 95952 317542 211007 600756 515604 989217
8211 989217 425545 -31347 -296182 -128168 170880 192417 63265 658360 612002 156173
8201 156173 744987 323455 358391 565443 1428202 1260816 1409415 1438267 2966174 3508480
8191 3508480 -382924 98426 530547 -285182 -348667 182222 287861 -364835 231571 419892
8181 419892 391225 498735 158791 320542 482861 669036 719407 405382 791381 942421
$$ packed form
8251G08854l97451L95980N2824l74168J99919j03617q9027l05826L24064L75776
8241G87328n66858J88885r3887j2162k35014J22856k65112M6326n4916J49898
8231F7344K07303k38336Q7835j17212L50990K65603J29973l01143M6271l61321
8221A37307q74145J015670L79210k23280l38810K21590j06535L89749q5152M73613
8211I89217n63672m56892k64835J68014K99048K1537j29152N95095m6358m55829
8201A56173N88814m21532L4936K07052Q62759j67386J48599K8852J527907N42306
8191C508480l891404M81350M32121q15729o3485N30889J05639o52696N96406J88321
8181D19892k8667J07510l39944J61751J62319J86175N0371l14025L85999J51040
$$ plain form
8171 942421 282226 353579 1139408 360812 525226 510798 310617 -358459 138416 575861
8161 575861 374785 645691 1224662 650614 626522 446424 330296 827879 834472 529060
8151 529060 884702 886711 1065634 1054900 1899347 1559558 1534654 1780002 1974475 1781539
8141 1781539 1558519 1733486 1594921 1647721 1245697 1455253 1597841 1958500 2018843 2477483
8131 2477483 2469763 2768773 2467449 2347068 2905744 3112771 3462065 3474320 2983297 2944915
8121 2944915 1926402 2493312 1841554 1943032 1522890 1106957 1613387 1545183 957036 838898
8111 838898 945445 773296 85763 744001 1235052 -13932 444717 -160359 -132302 145554
8101 145554 280722 318812 358093 260306 165863 254012 208484 332366 546881 -24806 205840
$$ packed form
8171I42421o60195P1353P85829p78596J64414j4428k00181o69076M96875M37445
8161E75861k01076K70906N78971n74048k4092j80098j16128M97583O593l05412
8151E29060L55642K009J78923j0734Q44447l39789k4904K45348J94473j92936
8141A781539k23020J74967j38565N2800m02024K09556J42588L60659O0343M58640
8131B477483p720K99010l01324j20381N58676K07027L49294J2255m91023l8382
8121B944915j018513N66910o51758J01478m20142m15933N06430o8204n88147j18138
8111H38898J06547j72149o87533O58238M91051j248984M58649o05076K8057K77856
8101A45554J35168L8090L9281r7787r4443Q8149m5528J23882K14515n71687K30646
$$ plain form
8090 205840 954856 246941 291055 304853 139218 260102 170853 296819 12949 210982
8080 210982 334206 83567 383151 -112355 -344353 18746 -172823 414820 100797 746725
8070 746725 39967 -293962 668794 374984 563631 741267 254977 -14239 -539 -199937
8060 -199937 463356 362931 -119715 86943 374392 189809 117666 -322823 -240356 643168
8050 643168 340442 541611 146723 71035 543173 741521 913257 834519 708480 -1766
8040 -1766 48254 402915 -302302 -164001 -455663 -639356 -316315 -103997 -261949 -664259
8030 -664259 -112928 25087 112548 -386839 -385018 396846 360037 378855 -3893 -527815 -1551
8019 -1551 571959 28355 23851 -510108 64460 41451 311385 607727 229831 238588 339042
$$ packed form
8090B05840P49016p07915M4114J3798j65635J20884q9249J25966k83870J98033
8080B10982J23224k50639K99584m95506k31998L63099j91569N87643l14023O45928
8070G46725p06758l33929R62756k93810J88647J77636m86290k69216J3700j99398
8060a99937O63293j00425m82646K06658K87449j84583p2143m40489Q2467Q83524
8050F43168l02726K01169l94888p5688M72138J98348J71736p8738j26039p10246
8040a766N0020L54661p05217J38301k91662j83693L23041K12318j57952m02310
8030f64259N51331J38015Q7461m99387J821P81864l6809J8818l82748n23922N26264
8019a551N73510n43604m504n33959N74568k3009K69934K96342l77896Q757J00454
$$ plain form
8008 339042 1164540 1532863 1123970 488712 546237 743907 837391 474573 231584 426783
7998 426783 312590 572666 451200 468004 591456 1072399 1041969 111693 184129 272095
7988 272095 850753 1157276 664989 842891 1150989 234969 1035088 800693 1193368 939783
7978 939783 1152353 6246 674846 924578 727236 1272012 1567145 1112665 1322793 1804205
7968 1804205 1756132 1518500 1191226 1315316 1395598 1561438 2112698 1680482 1010277 2225669
7958 2225669 1926307 1876324 1892410 2076784 1861372 1758628 2407064 3158992 3759018 2967981
7948 2967981 3089648 1959572 1596222 1214677 435902 148992 671448 718112 714808 928320
7938 928320 566782 883243 685336 500618 279287 460631 522189 798198 328822 190897
$$ packed form
8008C39042Q25498L68323m08893o35258N7525J97670R3484l62818k42989J95199
7998D26783j14193K60076j21466J6804J23452M80943l0430r30276P2436Q7966
7988B72095N78658L06523m92287J77902L08098r16020Q00119k34395L92675k53585
7978I39783K12570j146107O68600K49732j97342N44776K95133m54480K10128M81412
7968A804205m8073k37632l27274J24090Q0282J65840N51260m32216o70205J215392
7958B225669k99362m9983J6086J84374k15412j02744O48436P51928O00026p91037
7948B967981J21667j130076l63350l81545p78775k86910N22456M6664l304K13512
7938I28320l61538L16461j97907j84718k21331J81344O1558K76009m69376j37925
$$ plain form
7928 190897 357625 1046932 789551 926885 151780 338094 453066 464237 277344 510542
7918 510542 206955 38985 201206 -187060 -468091 -168677 193887 257845 -470464 -497333
7908 -497333 -608080 -364416 109560 -103044 -119173 -145192 -95302 -330055 1176572 1969394
7898 1969394 554501 719032 46088 406695 -210229 -115443 244829 43910 -111549 -792995
7888 -792995 -529761 -118560 330845 -217680 1788 131951 204877 -183467 -213909 60561
7878 60561 152726 -75522 231100 -9374 86165 -407535 241819 -170933 31130 108525
7868 108525 -260334 506584 345782 370673 315749 -42508 -138922 -215004 -321659 541294
7858 541294 601308 410691 446792 173065 27973 236200 11213 -429526 135294 4292
$$ packed form
7928A90897J66728O89307k57381J37334p75105J86314J14972J1171j86893K33198
7918E10542l03587j67970J62221l88266k81031K99414L62564O3958p28309k6869
7908d97333j10747K43664M73976k12604j6129k6019M9890k34753J506627P92822
7898A969394j414893J64531o72944L60607o16924R4786L60272k00919j55459o81446
7888g92995K63234M11201M49405n48525K19468J30163P2926l88344l0442K74470
7878F0561R2165k28248L06622k40474R5539m93700O49354m12752K02063P7395
7868A08525l68859P66918j60802K4891n4924l58257r6414p6082j06655Q62953
7858E41294O0014j90617L6101k73727j45092K08227k24987m40739N64820j31002
$$ plain form
7848 4292 -452601 215998 -166992 63344 156170 -99091 586028 377366 503929 102558
7838 102558 387811 404634 93974 90349 123138 45085 86468 -181303 -393435 -453341 -88694
7827 -88694 683565 933602 410053 359832 976322 843183 692237 528362 881340 729893
7817 729893 332030 274634 780522 159009 389372 626789 391254 -83369 528609 343638
7807 343638 172294 673156 304400 328145 723143 857912 1145995 885751 1027221 1483802
7797 1483802 1846806 1379689 960743 961765 1360965 1766708 1537133 1513965 1746005 1918532
7787 1918532 1889417 1002154 1070667 1479486 1380369 1586337 1977526 2790086 2819335 2460344
7777 2460344 2613962 3095712 2925589 2174517 1851401 1780674 766143 745464 723254 1124820
$$ packed form
7848D292m56893O68599l82990K30336R2826k55261O85119k08662J26563m01371
7838A02558K85253J6823l10660l625L2789p8053M1383k67771k12132n9906L64647
7827h8694P72259K50037n23549n0221O16490j33139j50946j63875L52978j51447
7817G29893l97863n7396N05888o21513K30363K37417k35535m74623O11978j84971
7807C43638j71344N00862l68756K3745L94998J34769K88083k60244J41470M56581
7797A483802L63004m67117m18946J022L99200M05743k29575k3168K32040J72527
7787A918532k9115q87263O8513M08819r9117K05968L91189Q12560K9249l58991
7777B460344J53618M81750j70123p51072l23116p0727j014531k0679k2210M01566
$$ plain form
7767 1124820 827350 962940 960171 766235 332267 920617 177915 2236 708141 629572
7757 629572 743142 827900 399288 534497 378678 109428 -134694 212966 370808 373963
7747 373963 728781 329846 -54295 -336059 -234504 -165422 562694 1001822 706369 411111
7737 411111 230491 257517 -446 -138588 -62263 -220605 -579973 -391189 397130 458677
7727 458677 990589 36622 204484 220399 -222177 -118973 -213655 119084 283982 -95907
7717 -95907 -245080 323068 -235646 392531 -6997 -596051 -10333 552943 46882 -74971
7707 -74971 483459 448175 827465 712356 341195 122653 99471 527233 -54578 -154316
7697 -154316 80227 -54312 201129 345857 254182 527603 215931 383746 330819 -139369
$$ packed form
7767A124820k97470J35590k769j93936m33968N88350p42702j75679P05905p8569
7757F29572J13570Q4758m28612J35209j55819k69250k44122L47660J57842L155
7747C73963L54818l98935l84141k81764J01555O9082P28116M39128k95453k95258
7737D11111j80620K7026k57963j38142P6325j58342l59368J88784P88319O1547
7727D58677N31912r53967J67862J5915m42576J03204r4682L32739J64898l79889
7717i5907j49173N68148n58714O28177l99528n89054N85718N63276n06061j21853
7707g4971N58430l5284L79290j15109l71161k18542k3182M27762n81811r9738
7697a54316K34543j34539K55441J44728r1675K73421l11672J67815n2927m70188
$$ plain form
7687 -139369 -273049 4072 -111728 -367505 193012 -193792 362844 121091 82830 -217899
7677 -217899 -749207 -297553 -187388 7082 -20245 -19043 -46960 475452 181134 82264 655436
7666 655436 -83278 -311358 -225379 1386 556615 704771 808567 1264569 415996 434563
7656 434563 469209 -467947 -315759 -397079 -469020 218560 200636 193074 87330 -555682 -1113804
7645 -1113804 -731389 -443756 493839 306645 212292 316146 639167 415195 430701 436714
7635 436714 201240 97154 2351 -221644 -343632 -558920 190268 493635 -74913 40002
7625 40002 146439 -64862 -693166 276253 607167 898903 428388 125673 -375000 285692
7615 285692 702864 122746 209436 210212 271255 660077 240549 -207772 179495 -300388 -62722
$$ packed form
7687a39369j33680K77121j15800k55777N60517l86804N56636k41753l8261l00729
7677b17899n31308M51654J10165J94470k7327J202k7917N22412k94318r8870N73172
7666F55436p38714k28080Q5979K26765N55229J48156J03796M56002q48573J8567
7656D34563L4646r37156J52188q1320p1941O87580j7924p562j05744o43012n58122
7645a113804L82415K87633R37595j87194r4353J03854L23021k23972J5506O013
7635D36714k35474j04086r4803k23995j21988k15288P49188L03367n68548J14915
7625D0002J06437k11301o28304R69419L30914K91736m70515l02715n00673O60692
7615B85692M17172n80118Q6690P76O1043L88822m19528m48321L87267m79883K37666
$$ plain form
7604 -62722 32661 448442 -115515 -636151 -180455 -103701 -730044 -474028 -287329 -306469
7594 -306469 -353976 -569610 -325197 -373568 -19474 -211967 -250671 -853624 -625133 -391973
7584 -391973 -651956 -180931 81387 -281512 -241732 -156319 -60330 239770 8558 -42189
7574 -42189 129266 -203937 -66461 239091 -192080 -129446 114761 330225 -218826 -304869
7564 -304869 438626 420859 160040 94473 151197 -201454 -2208 270769 718588 694300
7554 694300 926778 618927 236571 370965 786103 -101171 416666 832153 66462 483803
7544 483803 73824 -147379 195590 173109 -28536 -649471 -495383 117914 531713 157768
7534 157768 65379 109162 -243280 -148774 -524232 -800462 -428921 -226524 79489 6839
$$ packed form
7604f2722R5383M15781n63957n20636M55696P6754o26343K56016J86699j9140
7594c06469m7507k15634K44413m8371L54094j92493l8704o02953K28491K33160
7584c91973k59983M71025K62318l62899L9780Q5413R5989L00100k31212n0747
7574d2189J71455l33203J37476L05552m31171O2634K44207K15464n49051q6043
7564c04869P43495j7767k60819o5567N6724l52651J99246K72977M47819k4288
7554F94300K32478l07851l82356J34394M15138q87274N17837M15487p65691M17341
7544D83803m09979k21203L42969k2481k01645o20935J54088O13297M13799l73945
7534A57768r2389M3783l52442R4506l75458k76230L71541K02397L06013p2650
$$ plain form
7524 6839 -478198 474184 655736 250535 328423 310811 25765 155625 52801 -234681
7514 -234681 51394 206961 380897 187739 617955 529947 155134 299610 205066 454926
7504 454926 267589 890832 595682 -236990 -123872 -204738 -9944 -75900 -33641 390573
7494 390573 -38616 299842 170947 673232 194872 -18897 8018 35550 841713 363345
7484 363345 562649 753197 683849 603071 293549 446037 333556 333700 327886 254665 621804
7473 621804 700488 629721 4380 113666 196609 298689 581963 43939 436315 480527
7463 480527 198801 411915 628428 719720 535549 645658 287601 -250382 -68259 369385
7453 369385 233540 90111 463587 351605 956294 855559 226063 231373 205368 451607
$$ packed form
7524F839m85037R52382J81552m05201P7888j7612k85046J29860j02824k87482
7514b34681K86075J55567J73936j93158M30216q8008l74813J44476r4544K49860
7504D54926j87337O23243k95150q32672J13118q0866J94794o5956M2259M24214
7494C90573m29189L38458j28895N02285m78360k13769K6915K7532Q06163m78368
7484C63345J99304J90548o9348q0778l09522J52488j12481J44n814p3221L67139
7473F21804P8684p0767o25341J09286Q2943J02080K83274n38024L92376M4212
7463D80527k81726K13114K16513R1292j84171J10109l58057n37983J82123M37644
7453C69385j35845j43429L73476j11982O04689j00735o29496N310k6005K46239
$$ plain form
7443 451607 533940 -491408 207873 356239 -296619 -381169 -601638 -271207 601276 189329
7433 189329 -126435 -240899 -33115 1113414 323934 188549 111816 -73172 -343804 65222
7423 65222 -48414 -116649 565255 279543 -580407 -415824 338843 485556 459592 135955
7413 135955 -96007 399137 377351 165701 367473 764069 186543 654161 728323 458445
7403 458445 595730 699607 342822 169670 9326 899529 835256 644762 311343 -135874
7393 -135874 245706 384646 646310 27275 324595 137008 512947 592689 113205 -347623
7383 -347623 259936 293392 33837 310366 64978 -101623 259915 413341 247182 573802
7373 573802 155748 910061 619173 541557 546493 1175691 7862 -80308 421383 341329
$$ packed form
7443D51607Q2333j025348O99281J48366o52858q4550k20469L30431Q72483m11947
7433A89329l15764j14464K07784J146529p89480j35385p6733j84988k70632M09026
7423F5222j13636o8235O81904k85712q59950J64583P54667J46713k5964l23637
7413A35955k31962M95144k1786k11650K01772L96596n77526M67618P4162k69878
7403D58445J37285J03877l56785j73152j60344Q90203o4273j90494l33419m47217
7393a35874L81580J38940K61664o19035K97320j87587L75939P9742m79484m60828
7383c47623O07559L3456k59555K76529k45388j66601L61538J53426j66159L26620
7373E73802m18054P54313k90888p7616M936O29198j167829q8170N01691q0054
$$ plain form
7363 341329 44149 86733 147441 -103758 285675 40662 140700 491495 441442 -358059
7353 -358059 -382446 202285 650921 892002 934201 331493 628552 1041151 463529 66784
7343 66784 927122 290282 139998 612706 848951 -274059 203328 371242 617814 958106
7333 958106 838533 101290 318404 922312 694616 710694 597668 669232 848438 221997
7323 221997 292910 267695 644008 588452 370741 544024 -177913 308438 212899 -280376
7313 -280376 461464 928227 475570 627366 929505 -186204 117640 937743 791785 990927
7303 990927 718310 807892 555103 535473 286675 207222 257840 652558 659316 123904 335551
7292 335551 792221 296346 13214 -154700 113758 512308 186848 572631 -209241 277107
$$ packed form
7363C41329k97180M2584O0708k51199L89433k45013J00038L50795n0053p99501
7353c58059k4387N84731M48636K41081M2199o02708K97059M12599n77622l96745
7343F6784Q60338o36840j50284M72708K36245j123010M77387J67914K46572L40292
7333I58106j19573p37243K17114O03908k27696J6078j13026P1564J79206o26441
7323B21997P0913k5215L76313n5556k17711J73283p21937M86351r5539m93275
7313b80376P41840M66763m52657J51796L02139j115709L03844Q20103j45958J99142
7303I90927k72617Q9582k52789j9630k48798p9453N0618L94718O758n35412K11647
7292C35551M56670m95875k83132j67914K68458L98550l25460L85783p81872M86348
$$ plain form
7282 277107 344845 274278 162019 480150 801803 551132 393484 889864 777835 1161729
7272 1161729 1054768 325771 351192 1005386 432588 148138 484491 1113515 1081902 390378
7262 390378 169120 385067 677322 760770 1412784 593785 433347 -52829 572105 410723
7252 410723 632393 758344 780036 681954 548065 594065 414928 352151 541583 567646 -53433
7241 -53433 189610 -68577 82798 38227 318714 859828 805329 690407 39911 217020
7231 217020 -104499 -49586 422915 871378 722746 226898 -223545 594021 282019 934036
7221 934036 954670 508630 612707 775829 366095 429774 849244 1128238 645725 955792
7211 955792 1051148 412081 -126968 323479 825298 712920 1112320 499409 546517 688897
$$ packed form
7282B77107O7738p0567j12259L18131L21653k50671j57648M96380j12029L83894
7272A161729j06961p28997K5421O54194n72798k84450L36353O29024l1613o91524
7262C90378k21258K15947K92255Q3448O52014q18999j60438m86176O24934j61382
7252D10723K21670J25951K1692r8082j33889M6000j79137o2777J89432K6063o21079
7241e3433K43043k58187J51375m4571K80487N41114n4499j14922o50496J77109
7231B17020l21519N4913M72501M48463j48632m95848m50443Q17566l12002O52017
7221I34036K0634m46040J04077J63122m09734O3679M19470K78994m82513L10067
7211I55792R5356o39067n39049M50447N01819j12378L99400o12911M7108J42380
$$ plain form
7201 688897 353811 162253 389718 65017 34528 -43776 99166 205172 356058 355232 31800
7190 31800 455721 242759 641226 167834 256642 1104532 604398 345180 43674 278899
7180 278899 445364 337648 426864 629561 640904 926227 472142 131026 434686 697543
7170 697543 398019 310872 6371 385409 936453 832739 689493 890279 1092115 479307
7160 479307 705530 1480318 1710177 1042267 872027 328400 161855 -79329 970948 1242603
7150 1242603 1054960 450555 288166 529860 269674 79839 429580 946304 759963 601827
7140 601827 901427 1174621 417224 245611 15947 630630 1012177 1138770 585604 -83522
7130 -83522 305903 779457 1121567 1330321 511950 459703 572581 752439 285008 455565
$$ packed form
7201F88897l35086j91558K27465l24701l0489p8304J42942J06006J50886q26l23432
7190C1800M23921k12962L98467m73392Q8808Q47890n00134k59218l01506K35225
7180B78899J66465j07716Q9216K02697J1343K85323m54085l41116L03660K62857
7170F97543k99524q7147l04501L79038N51044j03714j43246K00786K01836o12808
7160D79307K26223P74788K29859o67910j70240n43627j66545k41184J050277K71655
7150A242603j87643o04405j62389K41694k60186j89835L49741N16724j86341j58136
7140F01827K99600K73194p57397j71613k29664O14683L81547J26593n53166o69126
7130h3522L89425M73554L42110K08754q18371n2247J12878J79858m67431J70557
$$ plain form
7120 455565 978564 1029823 967319 1173575 906981 1065188 788522 1200455 523860 160005
7110 160005 448136 832273 566885 741194 335387 430708 414328 214098 274379 235982
7100 235982 665897 691279 1216736 1051528 793116 1523084 1276618 677622 481145 595917
7090 595917 362063 235723 -48906 441682 1134504 1152317 1497754 244680 703042 922937
7080 922937 776440 835160 1224300 1345146 1045105 758964 1502677 737670 757166 1289408
7070 1289408 606469 1159647 1146652 1174204 1100770 1177301 1075177 1546350 870039 869323 1219222
7059 1219222 1431038 1251275 964670 877535 1220136 1337093 1737146 1423083 1482054 1856512
7049 1856512 973601 1001109 1172614 989809 1120072 1693213 1155556 1536408 1319485 1327195
$$ packed form
7120D55565N22999N1259o2504K06256k66594J58207k76666M11933o76595l63855
7110A60005K88131L84137k65388J74309m05807R5321j6380k00230O0281l8397
7100B35982M29915K5382N25457j65208k58412P29968k46466n98996j96477J14772
7090E95917k33854j26340k84629M90588O92822J7813L45437j253074M58362K19895
7080I22937j46497N8720L89140J20846l00041k86141P43713p65007J9496N32242
7070A289408o82939N53178j2995K7552p3434P6531j02124M71173o76311p16L49899
7059A219222K11816j79763k86605q7135L42601J16957M00053l14063N8971L74458
7049A856512q82911K7508J71505j82805J30263N73141n37657L80852k16923P710
$$ plain form
7039 1327195 1752090 1806973 1144782 1446645 1542235 2004242 2018469 2472702 2458205 2228269
7029 2228269 2308733 2923065 2954574 3119457 4298262 4350846 5419121 7115114 9085553
7020 9085553 9781816 10474984 8526314 6738368 5025268 3630318 2934338 2435659 2558104
7011 2558104 2294692 2228125 1040284 759219 775439 1457310 1380341 1343442 1600082 2134482
7001 2134482 1482404 1383927 1118309 1235437 1616241 946348 991079 1717881 1481701 1389372
6991 1389372 1406501 1043027 1108839 1342963 791306 706832 1054895 888739 986831 -16356
6981 -16356 747224 920147 862859 938657 507289 1254408 591157 749711 622292 46603
6971 46603 378424 734292 527737 1102880 844264 29506 507441 1071212 686124 909039
$$ packed form
7039A327195M24895N4883o62191L01863R5590M62007J4227M54233j4497k29936
7029B228269Q0464O14332L1509J64883J178805N2584J068275J695993J970439
7020I085553O96263O93168j948670j787946j713100j394950o95980m98679J22445
7011B558104k63412o6567j187841k81065J6220O81871p6969l6899K56640N34400
7001B134482o52078r8477k65618J17128L80804o69893M4731P26802k36180r2329
6991A389372J7129l63474O5812K34124n51657q4474L48063j66156R8092j003187
6981a6356P63580J72923n7288P5798m31368P47119o63251J58554j27419n75689
6971D6603L31821L55868k06555N75143k58616q14758M77935N63771l85088K22915
$$ plain form
6961 909039 1139552 595926 565488 756091 764672 970230 572683 1149912 1000766 473299
6951 473299 1150718 1005723 601342 1150276 638938 101529 666567 540743 340480 1356059
6941 1356059 1709521 1130093 955167 699857 852322 1003705 1073491 977441 1472790 1346406
6931 1346406 1987132 1430725 1214759 858020 1293181 1569404 1143152 1037059 700340 591633
6921 591633 1131147 1108754 280638 767823 1205859 780767 1017344 1493373 603497 316200
6911 316200 983503 626341 847268 847268 1105961 884644 1295343 1305973 1082126 1001776 932909
6900 932909 1496574 1649668 1450602 1274599 1049970 694335 1061426 1003221 419045 660890
6890 660890 973246 1204102 1279516 1091801 1407486 1411707 1352857 1115534 1652996 1405024
$$ packed form
6961I09039K30513n43626l0438J90603Q581K05558l97547N77229j49146n27467
6951D73299O77419j44995m04381N48934n11338n37409N65038j25824k00263J015579
6941A356059L53462n79428j74926k55310J52465J51383O9786r6050M95349j26384
6931A346406O40726n56407k15966l56739M35161K76223m26252j06093l36719j08707
6921E91633N39514k2393q28116M87185M38036m25092K36577M76029q89876k87297
6911C16200O67303l57162K20927%K58693k21317M10699J0630k23847q0350o8867
6900I32909N63665J53094j99066j76003k24629l55635L67091n8205n84176K41845
6890F60890L12356K30856P5414j87715L15685M221n8850k37323N37462k47972
$$ plain form
6880 1405024 1450778 1746897 1552519 1246409 1018383 570239 510600 496848 725556 566086
6870 566086 465158 567768 1083427 1434268 930894 1083690 1086808 1389060 1290284 1695690
6860 1695690 1248544 978020 1072417 1149578 1419513 1793998 1874613 1774995 1331054 1238308
6850 1238308 1328515 1646334 1172078 1417049 1134886 550509 1027966 1676865 1908088 1794858
6840 1794858 1433240 1210759 1321516 1250525 1219488 1140727 1678780 2143395 1116349 1300010
6830 1300010 1426179 1104151 1117875 116878 282871 926987 832604 833269 1406253 1143170
6820 1143170 1192354 929749 1146210 1351450 1341822 1478903 2035862 997803 898967 1626759
6810 1626759 1124250 1016178 1260557 1609741 766152 467024 1460956 1724990 1532285 1573409
$$ packed form
6880A405024M5754K96119j94378l06110k28026m48144n9639j3752K28708j59470
6870E66086j00928J02610N15659L50841n03374J52796L118L02252r8776M05406
6860A695690m47146k70524R4397P7161K69935L74485Q0615r9618m43941r2746
6850A238308R0207L17819m74256K44971k82163n84377M77457O48899K31223j13230
6840A794858l61618k22481J10757p0991l1037p8761N38053M64615j027046J83661
6830A300010J26169l22028J3724j000997J65993O44116r4383O65N72984k63083
6820A143170M9184k62605K16461K05240r628J37081N56959j038059r8836P27792
6810A626759n02509j08072K44379L49184q43589k99128R93932K64034j92705M1124
$$ plain form
6800 1573409 1826272 1833695 1706365 1563005 1335902 1302095 1715173 1341350 1248062 1347738
6790 1347738 940980 799807 1072482 1254750 1331924 1530513 1655028 1032087 1206849 1223120
6780 1223120 1589674 1335387 850167 1063212 1361973 1454393 1227999 1203140 1244958 2155294
6770 2155294 1297489 1372288 1917125 1685807 1299994 1513563 1773665 1763939 1814132 2271661
6760 2271661 1983847 1571921 1752404 1256443 982130 1483966 1882367 2107724 1436789 1923067
6750 1923067 2176969 1570887 921865 1345259 1915851 1663299 1989234 2054392 2393421 1743762
6740 1743762 1420778 1625187 1892563 1692530 1486389 1333071 1420982 1184454 1181673 1357032
6730 1357032 2269581 2298446 1886758 1436139 1203884 1334277 1870561 1480399 1929518 1694754
$$ packed form
6800A573409K52863P423j27330j43360k27103l3807M13078l73823r3288R9676
6790A347738m06758j41173K72675J82268P7174J98589J24515o22941J74762J6271
6780A223120L66554k54287m85220K13045K98761R2420k26394k4859M1818R10336
6770B155294q57805P4799N44837k31318l85813K13569K60102r726N0193M57529
6760B271661k87814m11926J80483m95961k74313N01836L98401K25357o70935M86278
6750A923067K53902o06082o49022M23394N70592k52552L25935O5158L39029o49659
6740A743762l22984K04409K67376k00033k06141j53318Q7911k36528k781J75359
6730A357032R12549K8865m11688m50619k32255J30393N36284l90162M49119k34764
$$ plain form
6720 1694754 1888706 1248512 1561394 1685166 1460469 1851347 1890370 1796152 1861510 2332669
6710 2332669 2147835 1809411 1363342 1218652 1338342 1987915 2181307 1827771 1888143 1938596
6700 1938596 1250754 1869044 1902440 1646008 1602026 1605161 1783560 2227128 2622930 1918518
6690 1918518 1748895 1869672 1664362 2072707 1874563 1779679 1590428 1611854 1193164 1728836
6680 1728836 1193141 1762412 2052600 1215011 2003254 2201339 1989569 2139736 2540768 2351213
6670 2351213 1945048 1939862 2006296 2049387 1799586 2450294 2388855 1711675 2097006 1857166
6660 1857166 1402836 1499581 1414795 1857914 1440796 1436089 949343 1090711 1477479 2474833
6650 2474833 2272209 1778018 2122540 2401623 2231323 2414017 1902936 1863153 1358004 1820388
$$ packed form
6720A694754J93952o40194L12882J23772k24697L90878L9023r4218O5358M71159
6710B332669j84834l38424m46069j44690J19690O49573J93392l53536O0372N0453
6700A938596o87842O18290L3396k56432m3982L135J78399M43568L95802p04412
6690A918518j69623J20777k05310M08345j98144r4884j89251K1426m18690N35672
6680A728836n35695N69271K90188q37589P88243J98085k11770J50167M01032j89555
6670B351213m06165n186O6434M3091k49801O50708o1439o77180L85331k39840
6660A857166m54330R6745q4786M43119m17118m707m86746J41368L86768R97354
6650B474833k02624m94191L44522K79083j70300J82694n11081l9783n05149M62384
$$ plain form
6640 1820388 2018728 1648843 2232875 2349371 2579916 1973797 2088541 2317301 1990026 1976118
6630 1976118 2623573 1660035 1147605 1460280 2311963 1858882 1185385 1906197 2098833 2470819
6620 2470819 2928730 2427600 1937840 2009361 2810145 2396283 2083504 1833396 1794315 1843332
6610 1843332 1548711 1720857 2004033 2902588 2727880 2488101 2022809 2159926 2578809 1838734
6600 1838734 2387456 1730301 1784123 2034410 2316253 2588939 1932974 1067348 1412951 2327288
6590 2327288 2779157 2386188 2518477 2666770 2295425 2603518 2588398 3030086 2899852 2090516
6580 2090516 2634252 2169569 1746772 2143931 2212918 2254771 2567989 2943656 2876274 2063410
6570 2063410 2553942 2259216 2322310 2614405 2276809 2129888 2009722 2094624 1792548 2834169
$$ packed form
6640A820388J98340l69885N84032J16496K30545o06119J14744K28760l27275j3908
6630A976118O47455r63538n12430L12675Q51683m53081o73497P20812J92636L71986
6620B470819M57911n01130m89760P1521Q00784m13862l12779k50108l9081M9017
6610A843332k94621J72146K83176Q98555j74708k39779m65292J37117M18883p40075
6600A838734N48722o57155N3822K50287K81843K72686o55965q65626L45603R14337
6590B327288M51869l92969J32289J48293l71345L08093j5120M41688j30234q09336
6580B090516N43736m64683m22797L97159O8987M1853L13218L75667o7382q12864
6570B063410M90532k94726O3094K92095l37596j46921j20166Q4902l02076J041621
$$ plain form
6560 2834169 3068627 3133211 2589878 2359606 2321696 2514860 2426625 2752294 2977195 3176571
6550 3176571 3051660 2827182 3038573 2516065 2392721 2091507 2804355 3373304 3071540 3154696
6540 3154696 3267485 2513527 2604967 2837867 2731974 3246017 2715868 2784519 2683003 2275982
6530 2275982 2779713 3086511 2696941 2581580 2478927 2790216 3024257 3199867 2823745 2600309
6520 2600309 2584015 2624013 2942716 3157812 2573842 2178723 2146016 2601925 3283297 3243242
6510 3243242 3214919 3181546 3323630 3223065 2657107 2752567 2493318 2568745 2758946 2854365
6500 2854365 2731307 3133435 3554953 3175988 3042991 2610395 2793458 2643591 2613672 2476621
6490 2476621 3231738 3085521 2853105 2815392 3168298 2663583 2236369 2903084 2739809 3012950
$$ packed form
6560B834169K34458O4584n43333k30272l7910J93164q8235L25669K24901J99376
6550C176571j24911k24478K11391n22508j23344l01214P12848N68949l01764Q3156
6540C154696J12789p53958R1440K32900j05893N14043n30149O8651j01516m07021
6530B275982N03731L06798l89570j15361j02653L11289K34041J75610l76122k23436
6520B600309j6294L9998L18703K15096n83970l95119l2707M55909O81372m0055
6510C243242k8323l3373J42084j00565n65958R5460k59249P5427J90201R5419
6500B854365j23058M02128M21518l78965j32997m32596J83063j49867k9919j37051
6490B476621P55117j46217k32416l7713L52906n04715m27214O66715j63275K73141
$$ plain form
6480 3012950 3597614 3573288 3854257 3148238 3233900 3334091 3264888 3141496 2914333 2853814
6470 2853814 3178055 2985388 3063987 3292772 3124292 3107236 2941803 3497584 3418475 3324230
6460 3324230 2515004 2693406 3118208 3225157 3066600 3458727 3560015 4133622 3031003
6451 3031003 3031469 3782944 3783140 2953440 3465552 4287880 3439963 3120013 3561243 3735596 3519800
6440 3519800 3587089 3531167 3576999 3595363 3198797 3281657 3458268 3286886 3930594 3325336
6430 3325336 3601985 3711531 3519382 3714541 3170797 3385307 4076289 3569952 3544265 2995914
6420 2995914 3598001 3551072 3499908 3426322 3621336 3906521 3740388 2779039 3027004 3738008
6410 3738008 3163214 3313055 3111964 3194704 3905535 4310879 4157400 3817865 3630669 3861411
$$ packed form
6480C012950N84664k4326K80969p06019Q5662J00191o9203j23392k27163o0519
6470B853814L24241j92667P8599K28785j68480j7056j65433N55781p9109r4245
6460C324230q09226J78402M24802J06949j58557L92127J01288N73607j102619
6451C031003M66P51475J96q29700N12112Q22328q47917l19950M41230J74353k15796
6440C519800O7289n5922M5832J8364l96566Q2860J76611j71382O43708o05258
6430C325336K76649J09546j92149J95159n43744K14510O90982n06337k5687n48351
6420B995914O02087m6929n1164p3586J95014K85185j66133r61349K47965P11004
6410C738008n74794J49841k01091Q2740P10831M05344j53479l39535j87196K30742
$$ plain form
6400 3861411 4518513 5025209 4876732 4751282 4817420 4364844 3019668 2761853 3634297 4162513
6390 4162513 3916688 3744886 4053879 3759901 4064147 4682417 3946971 4408886 4302834 4045711
6380 4045711 4788294 4990574 5041229 4699982 5013604 4837844 4968762 5406014 5011087 4346302
6370 4346302 4324953 4681011 4046142 4118321 3225143 3877252 4191376 3928043 3760553 4303790
6360 4303790 4428933 4951431 4878493 4405032 4270812 4289487 4243203 4312440 4753125 4507233
6350 4507233 4630802 4363810 4352455 4455518 4269919 4642931 4431195 5228010 4845232 4374464
6340 4374464 4470204 4640332 4751061 4822262 4470507 4711912 4971686 4961747 4813060 4656707
6330 4656707 4917352 4326809 4660912 4469999 3798510 3596280 4498228 4174451 4626455 4546970
$$ packed form
6400C861411O57102N06696j48477j25450O6138m52576j345176k57815Q72444N28216
6390D162513k45825j71802L08993k93978L04246O18270p35446M61915j06052k57123
6380D045711P42583K02280N0655l41247L13622j75760J30918M37252l94927o64785
6370D346302k1349L56058o34869P2179q93178O52109L14124k63333j67490N43237
6360D303790J25143N22498p2938m73461j34220J8675m6284O9237M40685k45892
6350D507233J23569k66992j1355J03063j85599L73012k11736P96815l82778m70768
6340D374464R5740J70128J10729P1201l51755K41405K59774r939j48687j56353
6330D656707K60645n90543L34103j90913o71489k02230R01948l23777M52004p9485
$$ plain form
6320 4546970 4615870 4833392 4981908 5196804 4909381 4869335 4862302 4920245 4926337 5254547 5446514
6309 5446514 5338216 5248358 4962200 5266228 4759360 5207539 5107516 4837896 5028005 4702594
6299 4702594 5167975 5756821 5886183 5650133 5745002 5892661 5891115 5773673 5481730 5647198
6289 5647198 5232219 5321255 4972795 4695263 4878797 5167777 5447231 5159687 4739237 5052711
6279 5052711 5304371 5532202 5488468 5973540 5567899 5744674 5350019 5398996 6386415 6006270
6269 6006270 5733914 5358563 5390088 5818645 5882139 6248752 6374016 6586643 6264478 5668497
6259 5668497 5476215 5660920 5713883 5437645 5544152 6124789 6416507 6509187 7093386 6435423
6249 6435423 6009887 6500167 6620099 6428884 6356154 6093746 6246194 5866226 6343023 6628858
$$ packed form
6320D546970O8900K17522J48516K14896k87423m0046p033N7943O092L28210J91967
6309E446514j08298q9858k86158L04028n06868M48179j00023k69620J90109l25411
6299D702594M65381N88846J29362k36050R4869J47659j546j17442k91943J65468
6289E647198m14979Q9036l48460k77532J83534K88980K79454k87544m20450L13474
6279E052711K51660K27831m3734M85072m05641J76775l94655M8977R87419l80145
6269F006270k72356l75351L1525M28557O3494L66613J25264K12627l22165n95981
6259E668497j92282J84705N2963k76238J06507N80637K91718R2680N84199o57963
6249F435423m25536M90280J19932j91215p2730k62408J52448l79968M76797K85835
$$ plain form
6239 6628858 6468987 6519525 6242788 6364113 6546211 6470672 6424302 6822645 6192893 5861790
6229 5861790 6421233 6532533 7064812 7170355 7533519 7047285 7178023 7339413 7314116 6785633
6219 6785633 6758670 6664457 6769471 6702161 6882604 7110701 6956724 7166151 7426148 6966778
6209 6966778 7220156 7146277 7686559 7988720 7898935 7897099 7559617 7522053 7891892 7282395
6199 7282395 7263250 7281986 7791330 8116698 8078607 8154464 8047796 7673151 8009567 8381976
6189 8381976 7909213 8241558 8520924 8357544 8347340 8672530 8441841 8103336 8036563 7895480
6179 7895480 8279075 8957698 9142725 9529195 9408563 10068053 10371874 10027957 9857935 9731392
6169 9731392 9184919 8692377 8826689 9164218 8927925 8804693 9450233 9624261 8883773 8927877
$$ packed form
6239F628858j59871N0538k76737J21325J82098p5539m6370L98343o29752l31103
6229E861790N59443J11300N32279J05543L63164m86234J30738J61390k5297n28483
6219F785633k6963r4213J05014o7310J80443K28097j53977K09427K59997m59370
6209F966778K53378p3879N40282L02161q9785j836l37482l7564L69839o09497
6199G282395j9145J8736N09344L25368l8091P5857j06668l74645L36416L72409
6189H381976m72763L32345K79366j63380j0204L25190k30689l38505o6773j41083
6179G895480L83595O78623J85027L86470j20632O59490L03821l43917j70022j26543
6169I731392n46473m92542J34312L37529k36293j23232O45540J74028p40488M4104
$$ plain form
6159 8927877 8818492 8827393 9033497 9353287 9344243 9063844 9220936 10081473 9415294 9735603
6149 9735603 9949243 9726189 9867341 9603335 9597816 9340101 9506120 9846914 9279440 9504893
6139 9504893 9414858 9606694 9550107 9508261 9533894 10078750 10287946 10708477 10760187 10166793
6129 10166793 9652670 10047625 10104756 9530044 10122764 10312747 10649957 10507791 10879711 10657740
6119 10657740 11174443 11526014 11276466 11093248 10898178 10486025 10362040 11027314 11082881 11356514
6109 11356514 11479973 11360852 11698892 11127175 11181289 11616289 11847364 11879765 11990164 12007763
6099 12007763 11761746 12382113 12310693 12441427 12550175 12709177 12349363 12788767 12546720 12614300
6089 12614300 12457064 12706112 13008023 12441440 12498109 12929164 12970870 13290718 13254972 12906661
$$ packed form
6159H927877j09385Q901K06104L19790r044k80399J57092Q60537o66179L20309
6149I735603K13640k23054J41152k64006n519k57715J66019L40794n67474K25453
6139I504893r0035J91836n6587m1846K5633N44856K09196M20531N1710n93394
6129A0166793n14123L94955N7131n74712N92720J89983L37210j42166L71920k21971
6119A0657740N16703L51571k49548j83218j95070m12153j23985O65274N5567K73633
6109A1356514J23459j19121L38040n71717N4114M35000K31075L2401J10399J7599
6099A2007763k46017O20367p1420J30734J08748J59002l59814M39404k42047O7580
6089A2614300j57236K49048L01911n66583N6669M31055M1706L19848l5746l48311
$$ plain form
6079 12906661 13155736 13450005 14333385 13721177 13636206 14272642 14370640 13525883 14222107 14644651
6069 14644651 14601895 14354081 14543148 14335592 14372518 14721074 14710155 15305882 15261196 14917083
6059 14917083 14970180 15252621 15357950 15427914 16068036 15586532 15271710 15394764 15350897 15775175
6049 15775175 15658864 15687720 15503611 15780700 16483802 16443449 16657965 16022642 16364240 16649394
6039 16649394 16446244 17008631 16833332 16704405 17074874 17710031 17919774 17511669 17625605
6030 17625605 18227086 18100931 18076423 18388875 18074063 18990008 19007507 18625532 19031043 18709282
6020 18709282 19392158 19752647 20094476 19637226 19799135 19790581 19939723 20203481 19967901 20177494
6010 20177494 20241573 20349254 20362162 21120269 21419924 22135701 22420576 21991032 21444344 21838158
$$ packed form
6079A2906661K49075K94269Q83380o12208q4971O36436R7998q44757O96224M22544
6069A4644651m2756k47814J89067k07556L6926L48556j0919N95727m4686l44113
6059A4917083N3097K82441J05329O9964O40122m81504l14822J23054m3867M24278
6049A5775175j16311K8856j84109K77089P03102m0353K14516o35323L41598K85154
6039A6649394k03150N62387j75299j28927L70469O35157K09743m08105J13936
6030A7625605O01481j26155k4508L12452l14812R15945J7499l81975M05511l21761
6020A8709282O82876L60489L41829m57250J61909q554J49142K63758k35580K09593
6010B0177494O4079J07681J2908P58107K99655P15777K84875m29544n46688L93814
$$ plain form
6000 21838158 22438068 22367586 22229714 22911983 23096927 22168598 22650348 22751913 23066656 23600695
5990 23600695 23447443 24559756 24492171 24301257 24164708 24748642 24985229 24941731 25627859 25617437
5980 25617437 25351991 25610879 25735336 26723155 27306754 26961371 27028357 27182047 27828711 27819128
5970 27819128 27874178 27513246 27817003 27694449 28596486 29382968 29379798 29731977 29263660 28998538
5960 28998538 30037185 30437978 31069623 31114505 30861114 31154487 31870048 31634667 32252850
5951 32252850 32734544 32683236 32938069 33368312 33594284 33905092 33778953 34168138 34875083 35769503
5941 35769503 35602436 35159705 35705336 36007962 36941431 37171856 37429893 38286100 38432436
5932 38432436 38167247 39038583 39322684 39643781 39871514 39997410 40910588 40962746 41667923 42205241
$$ packed form
6000B1838158N99910p0482j37872O82269J84944r28329M81750J01565L14743N34039
5990B3600695j53252J112313o7585j90914j36549N83934K36587m3498O86128j0422
5980B5617437k65446K58888J24457R87819N83599l45383O6986J53690O46664r583
5970B7819128N5050l60932L03757j22554R02037P86482l170L52179m68317k65122
5960B8998538J038647M00793O31645M4882k53391K93373P15561k35381O18183
5951C2252850M81694n1308K54833M30243K25972L10808j26139L89185P06945Q94420
5941C5769503j67067m42731N45631L02626R33469K30425K58037Q56207J46336
5932C8432436k65189Q71336K84101L21097K27733J25896R13178N2158P05177N37318
$$ plain form
5922 42205241 42461940 42594807 43207939 43741165 44150624 44770868 44936780 45800704 46116582
5913 46116582 46124850 46227533 47321097 48126282 48093431 48818516 49545678 50059296 50481873 50628269
5903 50628269 51237895 51869587 52294032 52626902 53227917 53656878 54345260 55240442 56496774
5894 56496774 56842594 57729470 57439163 58077038 59099984 60685212 61024750 61157452 61647341
5885 61647341 62627150 63062623 63691461 64214008 64734427 65993696 66696385 67066862 68617753
5876 68617753 68929870 69856451 71222763 71644703 72977286 73817501 75054822 76174850 76827146
5867 76827146 78064457 78993416 79440333 80650091 81542595 82873645 83871350 85209963 85610450
5858 85610450 87152749 87898003 89326435 91111566 92513542 93595821 94098890 95341564
$$ packed form
5922D2205241K56699J32867O13132N33226M09459O20244J65912Q63924L15878
5913D6116582Q268J02683J093564Q05185l2851P25085P27162N13618M22577J46396
5903E0628269O09626O31692M24445L32870O01015M28961O88382Q95182J256332
5894E6496774L45820Q86876k90307O37875J022946J585228L39538J32702M89889
5885F1647341R79809M35473O28838N22547N20419J259269P02689L70477J550891
5876F8617753L12117R26581J366312M21940J332583Q40215J237321J120028O52296
5867G6827146J237311R28959M46917J209758Q92504J331050R97705J338613M00487
5858H5610450J542299P45254J428432J785131J401976J082279N03069J242674
$$ plain form
5850 95341564 96864879 98369739 99875681 101195614 102685539 104363424 106097686 106995585
5842 106995585 108670483 109723574 111202791 113084573 114354096 115525436 116865716 118933297
5834 118933297 120902116 122467812 124757172 126008024 128005532 130070037 132141433 134019928
5826 134019928 136295067 138727622 139933601 141940694 143969528 146091589 148681666 151125859
5818 151125859 153150448 155744086 157924817 160726126 163437942 166123095 168775416 171035063
5810 171035063 173119848 176835328 179247939 181817723 184995153 188014981 190567083 194480478
5802 194480478 197670001 200459022 202945528 206182487 209689558 213234474 216313959 219826559
5794 219826559 223980544 227030775 230951800 234133361 238309804 242041220 245980698 249194792
$$ packed form
5850I5341564J523315J504860J505942J319933J489925J677885J734262Q97899
5842A06995585J674898J053091J479217J881782J269523J171340J340280K067581
5834A18933297J968819J565696K289360J250852J997508K064505K071396J878495
5826A34019928K275139K432555J205979K007093K028834K122061K590077K444193
5818A51125859K024589K593638K180731K801309K711816K685153K652321K259647
5810A71035063K084785L715480K412611K569784L177430L019828K552102L913395
5802A94480478L189523K789021K486506L236959L507071L544916L079485L512600
5794B19826559M153985L050231L921025L181561M176443L731416L939478L214094
$$ plain form
5786 249194792 253317041 257025038 261159208 265332235 268986753 272778065 276684086 281144182
5778 281144182 285803755 289580907 293165899 297563467 302095710 306090248 310353551 314141614
5770 314141614 318213410 322202196 326024958 329965842 333735469 337882556 341296832 344643596
5762 344643596 348640345 351816165 355531579 358394080 361891321 365693254 368189442 371023071
5754 371023071 373229061 376216882 378885027 381062060 383464518 385590886 387157356 388116921
5746 388116921 389504280 390293406 390927374 391851157 392259996 393206505 392994360 392868060 392410904
5737 392410904 391573766 390368318 389382850 388141381 387057837 385259529 383160200 381773485
5729 381773485 379061991 376273516 373809924 370777662 368015357 365036308 362300020 358943500
$$ packed form
5786B49194792M122249L707997M134170M173027L654518L791312L906021M460096
5778B81144182M659573L777152L584992M397568M532243L994538M263303L788063
5770C14141614M071796L988786L822762L940884L769627M147087L414276L346764
5762C44643596L996749L175820L715414K862501L497241L801933K496188K833629
5754C71023071K205990K987821K668145K177033K402458K126368J566470R59565
5746C88116921J387359P89126O33968R23783M08839R46509k12145j26300m57156
5737C92410904q37138j205448r85468j241469j083544j798308k099329j386715
5729C81773485k711494k788475k463592l032262k762305k979049k736288l356520
$$ plain form
5721 358943500 355743438 352262262 348879824 344507838 340409306 336182633 332088695 328188037
5713 328188037 323959123 320164207 316025089 312184734 307929146 303448893 298933616 294681825
5705 294681825 289546650 284941073 280803991 277252675 272551532 268135091 264067226 259923107
5697 259923107 255580129 251962164 248584051 244895983 240592033 236139739 232596076 228206058
5689 228206058 224422963 221041711 217597565 213944160 210079498 206060116 203415371 200233811
5681 200233811 196501610 192700588 190181721 186586073 183673794 180237489 177484894 175001085
5673 175001085 172324755 169016724 166267225 163893095 161076017 158369869 155626594 153273744
5665 153273744 150503923 148172926 145508749 143020182 140351797 138644494 135832560 134104647
$$ packed form
5721C58943500l200062l481176l382438m371986m098532m226673m093938l900658
5713C28188037m228914l794916m139118l840355m255588m480253m515277m251791
5705B94681825n135175m605577m137082l551316m701143m416441m067865m144119
5697B59923107m342978l617965l378113l688068m303950m452294l543663m390018
5689B28206058l783095l381252l444146l653405l864662m019382k644745l181560
5681B00233811l732201l801022k518867l595648k912279l436305k752595k483809
5673A75001085k676330l308031k749499k374130k817078k706148k743275k352850
5665A53273744k769821k330997k664177k488567k668385j707303k811934j727913
$$ plain form
5657 134104647 131884153 129644167 127151871 125952625 123973555 121638825 120248115 117935116
5649 117935116 115719916 113544026 111997393 110316947 108709979 106980600 105122875 103209346
5641 103209346 102202349 100891129 99154289 97872060 96758787 94904678 93216615 92007477
5633 92007477 90453549 88957247 87909198 86527663 85823562 84262332 82895991 81772373
5625 81772373 80276922 79410704 78242063 77266100 75827471 75379208 73738940 72979978 71749626
5616 71749626 70688720 70183477 69891462 69261350 68277323 67181171 65948045 65264405 64461108
5607 64461108 63432608 63128789 62390782 60746058 59831249 58768603 58861457 57942570 57118884
5598 57118884 56168264 55116934 54794450 53891635 53269957 52353423 52338246 51793585 50642566
$$ packed form
5657A34104647k220494k239986k492296j199246j979070k334730j390710k312999
5649A17935116k215200k175890j546633j680446j606968j729379j857725j913529
5641A03209346j006997j311220j736840j282229j113273j854109j688063j209138
5633I2007477j553928j496302j048049j381535p04101j561230j366341j123618
5625H1772373j495451q66218j168641r75963j438629m48263j640268p58962j230352
5616G1749626j060906n05243k92015o30112r84027j096152j233126o83640q03297
5607F4461108j028500l03819p38007j644724r14809j062646R2854r18887q23686
5598E7118884r50620j051330l22484r02815o21678r16534j5177n44661j151019
$$ plain form
5589 50642566 49596129 49272480 48281776 48104750 48019852 47335831 47137445 46755098 45918296
5580 45918296 44766742 44027242 43488713 43580797 42820675 42120108 41609099 41206236 40986417
5571 40986417 40364801 39758119 39370036 39481163 39355318 38410379 37320035 37269951 37167569
5562 37167569 36481950 36592004 35846692 35771472 35337270 34522575 33931318 33508565 33578964 32893310
5552 32893310 32631833 32120044 32102793 31782641 31383743 30689675 30618588 30544562 30140391 30110454
5542 30110454 29820508 29054187 29122407 29045065 28486973 28440907 27815102 27783573 27516748 26580468
5532 26580468 25856300 25962588 25776992 25297468 25385624 25711816 25674698 25199954 24302807 24777733
5522 24777733 24591113 24136370 23776605 23968994 23679607 23200945 23117232 22837721 22581233 22482663
$$ packed form
5589E0642566j046437l23649r90704j77026q4898o84021j98386l82347q36802
5580D5918296j151554p39500n38529R2084p60122p00567n11009m02863k19819
5571D0986417o21616o06682l88083J11127j25845r44939j090344n0084j02382
5562C7167569o85619J10054p45312p5220m34202q14695n91257m22753P0399o85654
5552C2893310k61477n11789j7251l20152l98898o94068p1087p4026m04171k9937
5542C0110454k89946p66321O8220p7342n58092m6066o25805l1529k66825r36280
5532B6580468p24168J06288j85596m79524Q8156L26192l7118m74744q97147M74926
5522B4777733j86620m54743l59765J92389k89387m78662q3713k79511k56488r8570
$$ plain form
5512 22482663 22162091 21345695 21254718 21507833 21828506 20959820 20634894 20799445 20540149 20054430
5502 20054430 19918709 20274617 19722096 19604696 19807666 19373466 19603477 19220992 18514564
5493 18514564 18216214 18617179 18867014 18160907 18084538 17576944 18053033 17536088 17703363 18240056
5483 18240056 17985730 17045345 17044312 17358123 17027549 16477033 16292659 16898043 16190053 15946119
5473 15946119 16060222 15828523 15302302 14963959 14987174 14899961 15294100 15053858 14922472 14592218
5463 14592218 14738653 14513841 14854821 14259353 13864944 14585648 14132791 13483326 13306727
5454 13306727 13681634 13696659 13960710 13992068 13771986 13177745 13435248 13285468 12829900 12875057
5444 12875057 13036606 12748010 12783750 12460405 13137412 12462097 12410001 11733467 11694079 12406590
$$ packed form
5512B2482663l20572q16396r0977K53115L20673q68686l24926J64551k59296m85719
5502B0054430j35721L55908n52521j17400K02970m34200K30011l82485p06428
5493A8514564k98350M00965K49835p06107p6369n07594M76089n16945J67275N36693
5483A8240056k54326r40385j033L13811l30574n50516j84374O05384p07990k43934
5473A5946119J14103k31699n26221l38343K3215q7213L94139k40242j31386l30254
5463A4592218J46435k24812L40980n95468l94409P20704m52857o49465j76599
5454A3306727L74907J5025K64051L1358k20082n94241K57503j49780m55568M5157
5444A2875057J61549k88596L5740l23345O77007o75315n2096o76534l9388P12511
$$ plain form
5434 12406590 12290916 12176601 11537825 11200425 11568448 12217128 11692763 11651141 11427220 11349830
5424 11349830 11237858 11286841 11095930 11220559 10926298 9824946 10277949 10556408 10560501 10656786
5414 10656786 10624986 10027991 10768171 9900195 9462958 10427670 10398707 10214299 9986266 9863453
5404 9863453 10423809 10358443 10165051 10281567 9943934 10150289 9888212 9542238 9353296 9327088
5394 9327088 9293948 9415440 9632135 9748120 8971946 8993134 8716892 8876978 9052753 8798377
5384 8798377 8629922 8013747 8046816 8171336 8084990 8212782 8152329 8585088 8346232 8454436
5374 8454436 8496610 8292090 7731866 7757724 7522640 7512358 7650464 7607991 7272214 7644402
5364 7644402 8303688 7689937 7044555 7108729 7294501 7207438 7606442 7684155 7887711 7927716
$$ packed form
5434A2406590j15674j14315o38776l37400L68023O48680n24365m1622k23921p7390
5424A1349830j11972M8983j90911J24629k94261j101352M53003K78459M093R6285
5414A0656786l1800n96995P40180q67976m37237R64712k8963j84408k28033j22813
5404I863453N60356o5366j93392J16516l37633K06355k62077l45974j88942k6208
5394I327088l3140J21492K16695J15985p76174K1188k76242J60086J75775k54376
5384H798377j68455o16175L3069J24520q6346J27792o0453M32759k38856J08204
5374H454436M2174k04520n60224K5858k35084j0282J38106m2473l35777L72188
5364G644402O59286o13751o45382O4174J85772q7063L99004P7713K03556M0005
$$ plain form
5354 7927716 8187321 7647124 7424440 7530488 7680131 7375050 6652598 7225837 7689620 6853749
5344 6853749 6529844 6086402 5702396 6123775 5951822 6255095 6727501 6882314 6421002 6630848
5334 6630848 6610377 6565289 6783927 6465011 6109261 5982658 5840614 5796886 5766251 5714604
5324 5714604 6392159 6170821 6115598 5870219 5436278 5691696 5504732 6147583 5825882 6079931
5314 6079931 6478929 5919343 5987314 5616440 5848661 5505590 5488318 4998755 4917039 5194360
5304 5194360 4894511 5540782 5495255 5617655 5489365 5252320 5488946 4788743 5152242 5190388
5294 5190388 4772033 4584738 4760872 4837734 5174112 5026829 5218596 5715462 4989019 5139062
5284 5139062 5564202 4882311 4825787 5298497 5460199 5009206 4657013 5018274 5290468 4710700
$$ packed form
5354G927716K59605n40197k22684J06048J49643l05081p22452N73239M63783q35871
5344F853749l23905m43442l84006M21379j71953L03273M72406J54813m61312K09846
5334F630848k0471m5088K18638l18916l55750j26603j42044m3728l0635n1647
5324E714604O77555k21338n5223k45379m33941K55418j86964O42851l21701K54049
5314F079931L98998n59586O7971l70874K32221l43071j7272m89563q1716K77321
5304E194360k99849O46271m5527J22400j28290k37045K36626p00203L63499L8146
5294E190388m18355j87295J76134P6862L36378j47283J91767M96866p26443J50043
5284E139062M25140o81891n6524M72710J61702m50993l52193L61261K72194n79768
$$ plain form
5274 4710700 4368552 4349102 4952276 4712342 4141775 4509802 4414006 4255765 4290541 4506603
5264 4506603 4353135 3925517 4232545 4541874 4358408 3941211 4284733 4046675 3765014 4159583
5254 4159583 4344784 4078931 4613575 4599920 4237487 4254426 4560200 4337576 3853773 4062773
5244 4062773 4222441 4071120 4627234 4415822 3722950 3778346 4114316 4500856 4686139 4283224
5234 4283224 4034403 4015107 3903553 4294301 3924344 4470906 4328476 4200354 4293031 4287475
5224 4287475 3355835 3633230 3736851 3267694 3572219 3542381 3357356 3614277 3698870 3944233
5214 3944233 3750972 4300271 4341329 4213786 3648933 2754199 3014778 3686255 3996163 3896585
5204 3896585 3685997 3649060 4095649 3860918 3557766 3424733 3981194 3270628 3034046 3524956
$$ packed form
5274D710700l42148j9450O03174k39934n70567L68027r5796j58241L4776K16062
5264D506603j53468m27618L07028L09329j83466m17197L43522k38058k81661L94569
5254D159583J85201k65853N34644j3655l62433J6939L05774k22624m83803K09000
5244D062773J59668j51321N56114k11412o92872N5396L35970L86540J85283m02915
5234D283224k48821j9296j11554L90748l69957N46562j42430j28122R2677n556
5224D287475r31640K77395J03621m69157L04525k9838j85025K56921Q4593K45363
5214C944233j93261N49299M1058j27543n64853q94734K60579O71477L09908r9578
5204C896585k10588l6937M46589k34731l03152j33033N56461p10566k36582M90910
$$ plain form
5194 3524956 3413503 3895788 3879227 4269383 3335048 3302793 3684172 3982256 3637240 3170270
5184 3170270 3131917 3572779 3376004 3550345 3843915 3561988 3333862 3515965 3560904 3020075
5174 3020075 2938458 2812215 2641511 3196215 3386914 3254653 2939487 3287689 2869484 3035175
5164 3035175 3720501 3243624 2964311 3208732 2639209 2772238 3530472 3293807 3501127 3020518
5154 3020518 3022882 3578947 3517383 2594678 2598839 3119029 2807506 2895671 3257123 2866628 3299583
5143 3299583 3218159 3366361 3290900 3810598 3763634 3518632 3648641 2889769 3028262 2883358
5133 2883358 2921039 3560465 3076037 3395022 3179385 3387448 3248309 3061655 3236595 4123953
5123 4123953 3405942 3240699 3685650 3186505 3475091 3670305 3108812 3235154 3643720 4066283
$$ packed form
5194C524956j11453M82285j6561L90156r34335l2255L81379K98084l45016m66970
5184C170270l8353M40862j96775J74341K93570k81927k28126J82103M4939n40829
5174C020075q1617j26243j70704N54704J90699j32261l15166L48202m18205J65691
5164C035175O85326m76877k79313K44421n69523J33029P58234k36665K07320m80609
5154C020518K364N56065o1564r22705M161N20190l11523Q8165L61452l90495M32955
5143C299583q1424J48202p5461N19698m6964k45002J30009p58872J38493j44904
5133B883358L7681O39426m84428L18985k15637K08063j39139j86654J74940Q87358
5123D123953p18011j65243M44951m99145K88586J95214n61493J26342M08566M22563
$$ plain form
5113 4066283 4133026 3826137 3256173 3007485 3909044 4628324 4662342 4415610 4089476 3606682
5103 3606682 4072673 4269782 3768025 4085073 3706703 3693785 3996533 3631799 4167026 3511984
5093 3511984 4062097 3897060 3623131 3576418 3903790 4542797 4655432 4656113 4552265 4640035
5083 4640035 4738887 4741731 4959940 6441559 6223959 6095097 7088626 7642325 8240703 9328774
5073 9328774 10427161 11675535 14423208 17581045 20599125 22811668 22082406 19877216
5065 19877216 15663412 12642994 10407276 9092769 7975663 6453012 5750775 5661694 5889045
5056 5889045 5645331 5330826 4875758 5115596 4933261 4704102 4383335 4740564 5348093 4813328
5046 4813328 4167768 4600154 5078802 4555824 4625801 4290911 4519925 4499373 4732890 4534050
$$ packed form
5113D066283O6743l06889n69964k48688R01559P19280L4018k46732l26134m82794
5103C606682M65991J97109n01757L17048l78370j2918L02748l64734N35227o55042
5093C511984N50113j65037k73929m6713L27372O39007J12635O81j03848Q7770
5083D640035R8852K844K18209J481619k17600j28862R93529N53699N98378J088071
5073I328774J098387J248374K747673L157837L018080K212543p29262k205190
5065A9877216m213804l020418k235718j314507j117106j522651p02237q9081K27351
5056E889045k43714l14505m55068K39838j82335k29159l20767L57229O07529n34765
5046D813328o45560M32386M78648n22978O9977l34890K29014k0552K33517j98840
$$ plain form
5036 4534050 4374982 4328285 4382569 4108456 4227780 3724440 3720726 4003589 3205253 3457377
5026 3457377 2428699 2680279 2983693 3064299 3230806 3131759 2901162 3148655 2818094 3350497
5016 3350497 3560939 3141051 2742952 2945534 2929639 2291418 2545534 2869895 3120110 2953714
5006 2953714 3281917 3806989 3404228 2880175 2768540 2780366 2314028 2719787 2911510 2936897
4996 2936897 3050090 3568501 3027481 3377831 3203549 3439740 2848609 2882640 3576764 3508903
4986 3508903 3205612 3365075 3779629 3834495 3981711 4061384 4457871 4476963 4438995 4572064
4976 4572064 4202479 4880658 5014139 5338414 5883012 6002990 6300846 6113646 7085278 7527315
4966 7527315 7429343 8537302 10628077 12064830 14393530 17099940 20235935 21278746 20877076
$$ packed form
5036D534050j59068m6697N4284k74113J19324n03340l714K82863p98336K52124
5026C457377j028678K51580L03414Q0606J66507r9047k30597K47493l30561N32403
5016C350497K10442m19888l98099K02582j5895o38221K54116L24361K50215j66396
5006B953714L28203N25072m02761n24053j11635J1826m66338M05759J91723K5387
4996B936897J13193N18411n41020L50350j74282K36191n91131L4031O94124o7861
4986C508903l03291J59463M14554N4866J47216P9673L96487J9092l7968J33069
4976D572064l69585O78179J33481L24275N44598J19978K97856j87200R71632M42037
4966G527315r7972J107959K090775J436753K328700K706410L135995J042811m01670
$$ plain form
4957 20877076 18740425 15418266 12734746 9833108 8472261 7706199 6789863 6679421 6617475
4948 6617475 5802458 5065823 5472466 5395074 5405719 4986643 5356143 5679453 5147847 5250456
4938 5250456 6069736 6554596 6885918 6473075 7220463 6756827 5535833 5653782 5730820 5157410
4928 5157410 5238656 4866758 4631040 4596238 4734789 4812826 5618083 5484692 4891342 5013224
4918 5013224 4425281 4741014 4384059 4794769 4889671 4745979 4882918 4631159 4203161 5298161
4908 5298161 5491182 4521343 5595594 5470685 5707694 5382254 5384128 5342095 5587428 5898095
4898 5898095 5891926 6053748 5862561 6041032 6955506 6988929 6320950 6947157 6946668 7014232 7128271
4887 7128271 7917823 7785144 8391721 7964741 8258188 7971080 8669220 9146603 9609848 9383106
$$ packed form
4957B0877076k136651l322159k683520k901638j360847p66062r16336j10442o1946
4948F617475q15017p36635M06643p7392J0645m19076L69500L23310n31606J02609
4938E250456Q19280M84860L31322m12843P47388m63636j220994J17949P7038n73410
4928E157410Q1246l71898k35718l4802J38551P8037Q05257j33391n93350J21882
4918E013224n87943L15733l56955M10710R4902j43692J36939k51759m27998J095000
4908E298161J93021r69839J074251j24909K37009l25440J874m2033K45333L10667
4898E898095o169J61822j91187J78471R14474L3423o67979O26207m89O7564J14039
4887G128271P89552j32679O06577m26980K93447k87108O98140M77383M63245k26742
$$ plain form
4877 9383106 10167864 10753656 10559340 11173508 11483975 11995796 12520122 13078904 13684393 14147621
4867 14147621 14010648 14305771 14713518 15879061 16226664 17038548 17892248 19174590 20217647
4858 20217647 20027392 21176028 21661546 22918002 24459154 25766127 27158049 28029813 28839297
4849 28839297 29931279 31417917 32943191 35467985 37926645 39832989 43208382 46149568
4841 46149568 49949747 54204849 59982547 68787084 79755341 95277822 115407448 131545338
4833 131545338 137098852 127723679 109714755 95950767 87931409 84565513 83152143 84721791
4825 84721791 87579098 92817308 100019987 109592182 120670541 132752227 142351063 150727636
4817 150727636 158445740 169216996 183777772 200070879 211527096 217272487 219206434
$$ packed form
4877I383106P84758N85792j94316O14168L10467N11821N24326N58782O05489M63228
4867A4147621j36973K95123M07747J165543L47603Q11884Q53700J282342J043057
4858B0217647j90255J148636M85518J256456J541152J306973J391922Q71764Q09484
4849B8839297J091982J486638J525274K524794K458660J906344L375393K941186
4841D6149568L800179M255102N777698Q804537J0968257J5522481K0129626J6137890
4833A31545338N553514r375173j8008924j3763988q019358l365896j413370J569648
4825H4721791K857307N238210P202679R572195J1078359J2081686R598836Q376573
4817A50727636P718104J0771256J4560776J6293107J1456217N745391J933947
$$ plain form
4810 219206434 222088650 229945650 240869450 247403083 244937639 233643396 219543391 208893147
4802 208893147 203706665 198369714 189284570 174632699 156134853 141199578 128919340
4795 128919340 119295945 109656978 98724819 86387733 74056331 63576685 55976818
4788 55976818 49851017 44574459 40450236 37685857 34515040 31839797 30252696 28186712
4780 28186712 26218332 24285516 23217457 21851304 20761808 19874579 18871007 18292240
4772 18292240 17520313 16749079 15681897 15278123 14651770 13941856 13647217 13167235 11988870
4763 11988870 11356851 11509971 11465867 10979472 10267262 9894233 9274678 8123397 8031933 7956386
4753 7956386 7959949 7594776 6988104 6882201 6709127 6606951 7051155 6707717 6150178 5830436
$$ packed form
4810B19206434K882216P857000J0923800O533633k465444j1294243j4100005j0650244
4802B08893147n186482n336951r085144j4651871j8497846j4935275j2280238
4795A28919340r623395r638967j0932159j2337086j2331402j0479646p599867
4788E5976818o125801n276558m124223k764379l170817k675243j587101k065984
4780B8186712j968380j932816j068059j366153j089496q87229j003572n78767
4772A8292240p71927p71234j067182m03774o26353p09914k94639m79982j178365
4763A1988870o32019J53120m4104m86395p12210l73029o19555j151281r1464p5547
4753G956386L563l65173o06672j05903j73074j02176M44204l43438n57539l19742
$$ plain form
4743 5830436 5903005 5544534 5430289 5421386 5648447 4980207 5058831 4945767 4777278 4635774
4733 4635774 4588293 3593810 3770928 4610912 5261435 5451518 4536849 4314346 4306660 4286554
4723 4286554 4392672 4109941 3937785 3435752 3701632 4344504 3810070 3503598 3274329 3047206
4713 3047206 2717282 2571172 2408482 2897903 3102215 2611055 2504403 2780113 1961862 2050832
4703 2050832 2568981 2773241 3057062 2320792 1698903 1789203 1991915 1682156 1862799 1686523
4693 1686523 1390183 2047879 1929533 1793560 1670034 1457447 1623292 1258679 1088073 983765
4683 983765 736031 1295317 1349530 1275409 1222521 1316674 1245727 977402 1653163 1411387 969998
4672 969998 1549558 2091552 749166 1005546 1777174 1671004 614998 347865 494398
$$ packed form
4743E830436P2569l58471j14245q903K27061o68240P8624j13064j68489j41504
4733D635774m7481r94483J77118Q39984O50523J90083r14669k22503p686k0106
4723D286554J06118k82731j72156n02033K65880O42872n34434l06472k29269k27123
4713C047206l29924j46110j62690M89421K04312m91160j06652K75710q18251Q8970
4703B050832N18149K04260K83821p36270o21889R0300K02712l09759J80643j76276
4693A686523k96340O57696j18346j35973j23526k12587J65845l64613j70606j04308
4683I83765k47734N59286N4213p4121n2888R4153p0947k68325O75761k41776m41389
4672I69998N79560N41994j342386K56380P71628j06170j056006k67133J46533
$$ plain form
4663 494398 618007 776482 430533 968043 708450 771230 807285 1023124 1138797 1101209
4653 1101209 1011323 1053046 787540 986903 1396776 1468652 577049 835958 662693 1056494
4643 1056494 920328 1298198 978010 936229 1573484 384831 788133 487098 225505 150309
4633 150309 732282 1326052 1152655 1288466 956817 1166027 865029 672704 1359692 1441539
4623 1441539 1267806 1735506 1328160 1115972 1226348 1479173 1812467 1587748 1634144 1251948
4613 1251948 1676040 1350739 1260771 1719323 1609919 719491 942740 1560422 1401614 1593302
4603 1593302 1313135 1851982 2155856 1709685 1238721 1277565 1510673 1597730 1968424 1896727
4593 1896727 1946295 2086344 1672397 1664372 1735338 2301308 3179742 3017557 2676862 2896424
$$ packed form
4663D94398J23609J58475l45949N37510k59593O2780L6055K15839J15673l7588
4653A101209q9886M1723k65506J99363M09873P1876q91603K58909j73265L93801
4643A056494j36166L77870l20188m1781O37255j188653M03302l01035k61593p5196
4633A50309N81973N93770j73397J35811l31649K09210l00998j92325O86988Q1847
4623A441539j73733M67700m07346k12188J10376K52825L33294k24719M6396l82196
4613A251948M24092l25301q9968M58552j09404q90428K23249O17682j58808J91688
4603A593302k80167N38847L03874m46171m70964L8844K33108Q7057L70694p1697
4593A896727M9568J40049m13947q025P0966N65970Q78434j62185l40695K19562
$$ plain form
4583 2896424 3508764 3015534 2773944 3235206 3632007 4141592 4082920 4157613 3628829 4040741
4573 4040741 3799521 3116613 2925099 3640584 3455910 2949047 2869241 2554468 2831501 2634281
4563 2634281 2519080 2710364 2658848 3011026 2715442 2305029 2087887 1513294 1330914 1549919
4553 1549919 1711107 1607158 1493304 1998190 1787114 1347658 1192837 1604244 2105888 2385043
4543 2385043 1912040 1288823 1459130 1887787 1733597 1463185 1741468 1823189 2542852 1915727
4533 1915727 1450040 1990042 2583625 2536511 2887870 2758365 2686418 3670214 4017530 4659401
4523 4659401 4863232 4697587 4268984 3629942 3178534 3054741 3366700 3375619 3008755 3193882
4513 3193882 3143011 2586134 2772933 2698515 2684210 3208477 2500257 1882288 1931320 1617791
$$ packed form
4583B896424O12340m93230k41590M61262L96801N09585n8672P4693n28784M11912
4573D040741k41220o82908j91514P15485j84674n06863p9806l14773K77033j97220
4563B634281j15201J91284n1516L52178k95584m10413k17142n74593j82380K19005
4553A549919J61188j03949j13854N04886k11076m39456j54821M11407N01644K79155
4543B385043m73003o23217J70307M28657j54190k70412K78283Q1721P19663o27125
4533A915727m65687N40002N93583m7114L51359j29505p1947R83796L47316O41871
4523D659401K03831j65645m28603o39042m51408j23793L11959Q919l66864J85127
4513C193882n0871n56877J86799p4418j4305N24267p08220o17969M9032l13529
$$ plain form
4503 1617791 1806167 1557861 2024018 2026042 2087030 1628328 1981970 1843568 1213031 1258242
4493 1258242 1452513 1867415 1573593 789051 1156936 1038983 1080460 1876573 1494458 1580871
4483 1580871 1991830 2099245 2166092 1811209 1884378 1276079 1634610 1628087 1391285 1009282
4473 1009282 1428056 1420448 1142548 889757 1205664 1790821 1309049 1440115 1825939 1961005
4463 1961005 1902206 1843113 2061603 2377985 1984007 1607121 1716748 1528110 1429778 2710047
4453 2710047 2472180 2582026 2278272 2548644 2449484 1908913 1993363 2023937 2337882 2972882
4443 2972882 2933160 3252211 3211840 2765531 2735739 2887256 3561827 4469122 4562035 4693319
4433 4693319 4600629 4871083 4864750 5111988 5232059 5262048 6292916 5990454 6770978 7168903
$$ packed form
4503A617791J88376k48306M66157K024O0988m58702L53642j38402o30537M5211
4493A258242J94271M14902k93822p84542L67885j17953M1477P96113l82115Q6413
4483A580871M10959J07415O6847l54883P3169o08299L58531o523k36802l82003
4473A009282M18774p608k77900k52791L15907N85157m81772J31066L85824J35066
4463A961005n8799n9093K18490L16382l93978l76886J09627j88638r8332J280269
4453B710047k37867J09846l03754K70372r9160n40571Q4450L0574L13945O35000
4443B972882l9722L19051m0371m46309k9792J51517O74571R07295R2913J31284
4433D693319r2690K70454o333K47238J20071K9989J030868l02462P80524L97925
$$ plain form
4423 7168903 7598525 8221314 8826642 8835188 10020343 10362805 10570021 11014792 12103838 12689272
4413 12689272 13550101 14972223 16512481 18408850 20516185 22930617 26036057 30320799
4405 30320799 36609418 46587559 58608760 74350012 85111685 86998712 75258462 58793510
4397 58793510 45329126 36035721 30882635 27238495 24983282 23174578 21234667 19110126
4389 19110126 17641137 16033112 15402461 15823394 15707829 14624822 12420074 10921508 10183051
4380 10183051 9219988 8379447 7688762 7528386 6593825 5816654 5536200 5518875 5582507 5294105
4370 5294105 5158522 4776617 4281092 4244814 3822376 3527615 4072285 4057769 4044589 4071325
4360 4071325 3690250 3099176 2711929 2652165 2943426 3494936 3689769 3240718 3348205 3376294
$$ packed form
4423G168903M29622O22789O05328Q546J185155L42462K07216M44771J089046N85434
4413A2689272Q60829J422122J540258J896369K107335K414432L105440M284742
4405C0320799O288619R978141J2021201J5741252J0761673J887027j1740250j6464952
4397E8793510j3464384r293405n153086l644140k255213j808704j939911k124541
4389A9110126j468989j608025o30651M20933j15565j083007k204748j498566p38457
4380A0183051r63063q40541o90685j60376r34561p77171k80454j7325O3632k88402
4370E294105j35583l81905m95525l6278m22438k94761N44670j4516j3180K6736
4360D071325l81075n91074l87247n9764K91261N51510J94833m49051J07487K8089
$$ plain form
4350 3376294 3382660 3384110 3303047 2510671 2619920 1840225 1687631 1725270 2012440 2044230 2026804
4339 2026804 2115466 1849138 1975803 1072494 1353920 1189218 1842390 1470189 1823627 1705504
4329 1705504 1433602 1365731 1758313 1346156 1626699 1723610 1283630 1403340 1080757 487040
4319 487040 747853 560421 1057639 1091279 1742454 1724768 1340311 1359496 863352 1088289
4309 1088289 1475718 1786671 2212122 2609457 2048275 1721344 2411467 2949704 3533053 3774258
4299 3774258 3786805 4198104 4512244 4586734 4352918 4731748 4519577 3521010 3623138 3396454
4289 3396454 3002310 3585847 2432422 2148469 2397461 2330690 2222985 1582058 1379757 1755321
4279 1755321 1634951 1876910 1212104 1345916 1156615 858242 1034814 1336361 955833 460473
$$ packed form
4350C376294O366J450q1063p92376J09249p79695j52594L7639K87170L1790j7426
4339B026804Q8662k66328J26665r03309K81426j64702O53172l72201L53438j18123
4329A705504k71902o7871L92582m12157K80543R6911m39980J19710l22583n93717
4319D87040K60813j87432M97218L3640O51175j7686l84457J9185m96144K24937
4309A088289L87429L10953M25451L97335n61182l26931O90123N38237N83349K41205
4299C774258J2547M11299L14140P4490k33816L78830k12171r98567J02128k26684
4289C396454l94144N83537j153425k83953K48992o6771j07705o40927k02301L75564
4279A755321j20370K41959o64806J33812j89301k98373J76572L01547l80528m95360
$$ plain form
4269 460473 632043 -12400 148671 352032 618213 870139 1259628 263947 493913 794489
4259 794489 228751 711161 744571 902275 621448 421326 356377 417940 920361 1043168
4249 1043168 702240 536117 478 449464 762114 935403 1132329 979368 661564 595038
4239 595038 802752 871063 586729 724575 868478 857535 1094199 1260120 822785 1239228
4229 1239228 1350278 806860 728999 671616 880784 1681087 1308645 1215347 1031147 1178925
4219 1178925 1472171 1946254 1406104 589648 1274883 1491229 1511530 1195332 1566956 1746320
4209 1746320 1512521 1026949 1186121 1927271 1806573 1405326 1224711 625527 1373753 1293825
4199 1293825 1015439 1272612 1548592 1705244 1413407 1403043 2016927 2044574 1857475 1861843
$$ packed form
4269D60473J71570o44443J61071K03361K66181K51926L89489r95681K29966L00576
4259G94489n65738M82410L3410J57704k80827k00122o4949O1563N02421J22807
4249A043168l40928j66123n35639M48986L12650J73289J96926j52961l17804o6526
4239E95038K07714O8311k84334J37846J43903j0943K36664J65921m37335M16443
4229A239228J11050n43418p7861n7383K09168Q00303l72442r3298j84200J47778
4219A178925K93246M74083n40150q16456O85235K16346K0301l16198L71624J79364
4209A746320k33799m85572J59172P41150j20698m01247j80615n99184P48226p9928
4199A293825k78386K57173K75980J56652k91837j0364O13884K7647j87099M368
$$ plain form
4189 1861843 1411628 1380301 1474674 2088195 1807304 2040012 1726954 1104571 1598545 1826470
4179 1826470 1465209 1358486 1543976 1633717 1116008 1317843 885865 1338217 693392 906317
4169 906317 1141640 263902 576354 188382 346036 388793 749331 1109054 770300 242134
4159 242134 823496 1319159 1128191 775435 62192 377441 634403 479386 748806 386909
4149 386909 643675 790349 1489368 626846 659347 579381 636877 528032 834096 259570
4139 259570 765745 573557 127280 -180401 273576 241063 -600011 -232303 454955 346475
4129 346475 675517 762761 964119 788453 708636 170177 -27647 372503 353854 508544
4119 508544 280107 -185234 186213 676166 135376 -137700 -55530 -210430 162640 -67301
$$ packed form
4189A861843m50215l1327R4373O13521k80891K32708l13058o22383M93974K27925
4179A826470l61261j06723J85490Q9741n17709K01835m31978M52352o44825K12925
4169I06317K35323q77738L12452l87972J57654M2757L60538L59723l38754n28166
4159B42134N81362M95663j90968l52756p13243L15249K56962j55017K69420l61897
4149C86909K56766J46674O99019q62522L2501p9966N7496j08845L06064n74526
4139B59570N06175j92188m46277l07681M53977l2513q41074L67708O87258j08480
4129C46475L29042Q7244K01358j75666p9817n38459j97824M00150j8649J54690
4119E08544k28437m65341L71447M89953n40790k73076Q2170j54900L73070k29941
$$ plain form
4109 -67301 -245211 123578 21818 440211 520984 721567 1094599 1478525 335134 393112
4099 393112 437156 209971 317969 657005 201167 558245 1459044 765948 561756 915304
4089 915304 779696 350910 -105036 640483 815153 595041 -34658 381882 209135 566593
4079 566593 157419 424481 471363 -38416 254498 540161 410135 10465 100115 522372
4069 522372 836084 358969 118645 117318 45125 -261708 -144032 766187 542365 410917
4059 410917 579240 625129 -108129 87271 -652025 -126822 291522 198049 481321 112901
4049 112901 1056209 452108 833325 1282498 901279 1082085 495144 107784 -103255 287813
4039 287813 74315 -150882 170965 -459852 -289960 170732 428792 -138130 730555 198794
$$ packed form
4109f7301j77910L68789j01760M18393Q0773K00583L73032L83926j143391N7978
4099C93112M4044k27185J07998L39036m55838L57078R00799o93096k04192L53548
4089I15304j35608m28786m55946P45519J74670k20112o29699M16540j72747L57458
4079E66593m09174K67062M6882n09779K92914K85663j30026l99670Q9650M22257
4069E22372L13712m77115k40324j327p2193l06833J17676R10219k23822j31448
4059D10917J68323M5889p33258J95400p39296N25203M18344r3473K83272l68420
4049A12901R43308o04101L81217M49173l81219J80806n86941l87360k11039L91068
4039B87813k13498k25197L21847o30817J69892M60692K58060n66922Q68685n31761
$$ plain form
4029 198794 526416 1141562 404715 38812 280716 957970 891903 386445 79291 283251
4019 283251 336639 442212 -176573 -16272 132291 -203838 556379 496318 893550 1076827
4009 1076827 462633 553180 272145 612079 405176 487688 920441 949780 761578 308962
3999 308962 525984 730043 161407 196863 350371 185467 458741 1136849 574992 579937
3989 579937 962699 523470 601606 829551 455829 584039 766244 946022 784085 354749
3979 354749 784325 861683 750848 925382 926567 894688 1016915 1140189 1597048 1484622
3969 1484622 750820 472772 868528 1072271 1001792 1001207 1129683 609440 1041169 1164285
3959 1164285 848014 666452 891955 1222012 970508 1318933 842453 1155674 993815 1290312
$$ packed form
4029A98794L27622O15146p36847l65903K41904O77254o6067n05458l07154K03960
4019B83251N3388J05573o18785J60301J48563l36129P60217o0061L97232J83277
4009A076827o14194R0547k81035L39934k06903Q2512M32753K9339j88202m52616
3999C08962K17022K04059n68636L5456J53508j64904K73274O78108n61857M945
3989E79937L82762m39229P8136K27945l73722J28210J82205J79778j61937m29336
3979C54749M29576P7358j10835J74534J185l1879J22227J23274M56859j12426
3969A484622p33802k78048L95756K03743p0479n85J28476n20243M31729J23116
3959A164285l16271j81562K25503L30057k51504L48425m76480L13221j61859K96497
$$ plain form
3949 1290312 1962184 1649548 1716395 1992958 2136109 2653928 1995774 1862674 2341836 2805913
3939 2805913 2838494 3163190 3037682 2303160 1894855 1704866 2297653 1916482 1097658 1153251
3929 1153251 1295810 1005224 1042876 881495 1388066 1614081 1326200 849501 1272357 1481660
3919 1481660 1521862 1268214 1266898 346388 725130 757724 892581 474226 986425 1242510
3909 1242510 773569 -175089 562982 1006096 886332 716369 1143558 780787 788274 284902
3899 284902 887302 948547 796555 1358255 955249 1400601 880399 919726 1176469 656432
3889 656432 1049644 1741503 2320451 1799623 1818988 2712374 2364150 2891002 2487259 2104089
3879 2104089 2267914 1738222 1308473 1530007 1512675 1413684 1384035 1001130 1405435 1242335
$$ packed form
3949A290312O71872l12636O6847K76563J43151N17819o58154j33100M79162M64077
3939B805913L2581L24696j25508p34522m08305j89989N92787l81171q18824N5593
3929A153251J42559k90586L7652j61381N06571K26015k87881m76699M22856K09303
3919A481660M0202k53648j316r20510L78742L2594J34857m18355N12199K56085
3909A242510m68941r48658P38071M43114j19764j69963M27189l62771P487n03372
3899B84902O02400O1245j51992N61700m03006M45352n20202L9327K56743n20037
3889F56432L93212O91859N78948n20828J9365Q93386l48224N26852m03743l83170
3879B104089J63825n29692m29749K21534j7332r8991k9649l82905M04305j63100
$$ plain form
3869 1242335 1069653 1346236 1135449 737801 575623 1105362 344818 -118247 44524 627372
3859 627372 285319 380618 606494 748300 91590 540681 236756 -44759 -20570 627385
3849 627385 840719 1182435 731196 464018 1037263 614058 1224940 1000661 624070 877672
3839 877672 476991 180337 326475 727968 331986 606105 413519 350766 -124973 -104826
3829 -104826 434239 92103 84982 685751 453700 651911 476603 210734 1057104 611078
3819 611078 601253 1295544 606543 784952 1175547 986793 535387 526164 1261692 1201948 320689
3808 320689 324352 315269 308067 464381 221020 -310486 -1021423 -192741 749337 384486 639643
3797 639643 999588 919828 1054140 1302973 358803 15686 582528 233534 -418261 190737
$$ packed form
3869A242335j72682K76583k10787l97648j62178N29739p60544m63065J62771N82848
3859F27372l42053R5299K25876J41806o56710M49091l03925k81515K4189O47955
3849F27385K13334L41716m51239k67178N73245m23205O10882k24279l76591K53602
3839H77672m00681k96654J46138M01493l95982K74119j92586o2753m75739K0147
3829a04826N39065l42136p121O00769k32051J98211j75308k65869Q46370m46026
3819F11078r825O94291o89001J78409L90595j88754m51406r223P35528n9744q81259
3808C20689L663r083p202J56314k43361n31506p10937Q28682R42078l64851K55157
3797F39643L59945p9760J34312K48833r44170l43117N66842l48994o51795O08998
$$ plain form
3787 190737 500214 353252 88313 274750 -118146 -208126 -253937 -215715 387268 109676
3777 109676 158935 -141558 -64352 143285 316431 533196 319967 366712 405381 468500 12231
3766 12231 -347739 -427149 -252380 769086 606823 -77950 554773 -266342 -671214 -284704
3756 -284704 -355035 -157485 -400248 258834 271143 303345 653608 591250 306891 -137229
3746 -137229 431899 481495 -236933 12496 -145051 56373 -426970 -185272 -12328 54994
3736 54994 -116511 441242 698737 515674 449982 457725 -30770 -213989 -315724 156437
3726 156437 -264536 506155 279613 570298 694663 504751 634222 287658 140608 449210
3716 449210 615485 1118492 1220356 825054 633200 990413 1187989 1249013 1406960 1418921
$$ packed form
3787A90737L09477j46962k64939J86437l92896q9980m5811L8222O02983k77592
3777A09676M9259l00493P7206K07637J73146K16765k13229M6745L8669O3119m56269
3766A2231l59970p9410J74769J021466j62263o84773O32723q21115m04872L86510
3756b84704p0331J97550k42763O59082J2309L2202L50263o2358k84359m44120
3746a37229N69128M9596p18428K49429j57547K01424m83343K41698J72944O7322
3736E4994j71505N57753K57495j83063o5692P743m88495j83219j01735M72161
3726A56437m20973P70691k26542K90685J24365j89912J29471l46564j47050L08602
3716D49210J66275N03007J01864l95302j91854L57213J97576O1024J57947J1961
$$ plain form
3706 1418921 565400 635041 570733 764207 740778 740775 841815 689573 1199338 1250923 1554629
3695 1554629 1034195 1449228 1290860 1075121 1369629 1351524 1450140 1811714 1558229 1308846
3685 1308846 1039782 1095468 1112284 998192 1273491 1973876 1718995 1536805 1564440 1726254
3675 1726254 1427116 953407 892834 1386461 1162598 622692 308628 911367 1194170 1185345
3665 1185345 825538 785771 643325 980084 758844 1206923 2014420 1189387 90999 375926
3655 375926 352409 -57452 364398 678374 935622 547955 737111 767291 164504 -139455
3645 -139455 -146523 162993 79144 369424 133721 238700 -246996 1488 308281 250820
3635 250820 850229 703600 965165 124691 85152 -27029 67554 252758 445161 -432433
$$ packed form
3706A418921q53521O9641o4308J93474k3429lJ01040j52242N09765N1585L03706
3695A554629n20434M15033j58368k15739K94508j8105R8616L61574k53485k49383
3685A308846k69064N5686J6816j14092K75299P00385k54881j82190K7635J61814
3675A726254k99138m73709o0573M93627k23863n39906l14064O02739K82803q825
3665A185345l59807l9767j42446L36759k21240M48079Q07497q25033j098388K84927
3655C75926k3517m09861M21850L13976K57248l87667J89156L0180o02787l03959
3645a39455p068L09516q3849K90280k35703J04979m85696K48484L06793n7461
3635B50820N99409j46629K61565q40474l9539j12181R4583J85204J92403q77594
$$ plain form
3625 -432433 -355130 106729 -596399 -512974 31651 -106567 -212574 -385238 -87757 298713
3615 298713 139749 166944 64608 401025 218170 -14608 -469815 -734642 -408590 -200280
3605 -200280 -303292 -244989 -724668 -129463 454676 346930 202737 400566 -9773 -524839
3595 -524839 -194624 -82572 -567543 -1061455 -933555 -565215 -593190 -112332 623171 337022
3585 337022 -98370 -208236 -351136 -812871 -74594 99314 -206575 -184282 -178867 106108
3575 106108 44678 -209323 142973 334852 51991 10814 -131181 -543069 -604921 -136243
3565 -136243 -760483 -778020 -671338 -739198 -22233 130727 -458576 -796465 -443692 165632
3555 165632 200073 -40770 -368648 374580 113177 -348362 -124984 -56296 95576 314574
$$ packed form
3625d32433P7303M61859p03128Q3425N44625j38218j06007j72664K97481L86470
3615B98713j58964K7195j02336L36417j82855k32778m55207k64827L26052K08310
3605b00280j03012N8303m79679N95205N84139j07746j44193J97829m10339n15066
3595e24839L30215J12052m84971m93912J27900L68340k7975M80858P35503k86149
3585C37022m35392j09866j42900m61735P38277J73908l05889K2293N415K84975
3575A06108o1430k54001L52296J91879k82861m1177j41995m11888o1852M68678
3565a36243o24240j7537J06682o7860P16965J52960n89303l37889L52773O09324
3555A65632L4441k40843l27878P43228k61403m61539K23378O8688J51872K18998
$$ plain form
3545 314574 103756 -327654 151800 -271544 85501 212296 -458509 -971821 -616878 -151710
3535 -151710 -426041 -224669 166485 -316344 7923 -346867 -321474 -464692 -688093 -990944
3525 -990944 -898831 -429738 -199528 -290889 -79675 -294792 -936596 -813641 -460483 -260472
3515 -260472 150476 100849 -73596 183216 -142877 -73264 -18936 336371 118787 581241
3505 581241 -52394 -38084 178363 -117606 -328574 -493478 -352290 -968401 -450805 200175
3495 200175 -264530 -105133 -429673 4338 80539 175788 -558817 -603513 -79507 342227
3485 342227 -33797 -330874 -161981 310006 377499 45259 409754 -217625 -358267 -788329
3475 -788329 -980593 -459640 -421298 -1986 -18028 -443225 30476 483995 -165355 -237041
$$ packed form
3545C14574k10818m31410M79454m23344L57045J26795o70805n13312L54943M65168
3535a51710k74331K01372L91154m82829L24267l54790K5393j43218k23401l02851
3525i90944R2113M69093K30210r1361K11214k15117o41804J22955L53158K00011
3515b60472M10948m9627j74445K56812l26093O9613N4328L55307k17584M62454
3505E81241o33635J4310K16447k95969k10968j64904J41188o16111N17596O50980
3495B00175m64705J59397l24540M34011P6201R5249p34605m4696N24006M21734
3485C42227l76024k97077J68893M71987O7493l32240L64495o27379j40642m30062
3475g88329j92264N20953L8342M19312j6042m25197M73701M53519o49350p1686
$$ plain form
3465 -237041 -95446 463543 -280477 -183862 -231617 -659507 -693199 -275795 212032 -65399
3455 -65399 -25791 72071 46199 -313722 -172496 -420129 -239568 -612962 268845 178696 -12445
3444 -12445 -229670 135982 -256129 380091 206286 -550280 -618253 -457303 -468229 -633109
3434 -633109 -1206444 -832931 -524292 -62190 -175742 273852 66484 439596 -193872 -457431
3424 -457431 227093 -512586 -448501 -382059 42073 -373940 -514794 89154 -76110 -52711
3414 -52711 -277500 -234838 -700826 -270041 80844 -232350 -874719 -734916 -362349 -67763
3404 -67763 -302129 -757293 -324946 -157496 60505 134338 -63300 -564706 -676818 -1002197
3394 -1002197 -1034196 -378921 -40626 -957563 -588515 -203351 -157550 -119803 -104314 -395521
$$ packed form
3465b37041J41595N58989p44020R6615m7755m27890l3692M17404M87827k77431
3455f5399L9608R7862k5872l59921J41226k47633J80561l73394Q81807r0149j91141
3444a2445k17225L65652l92111O36220j73805p56566o7973J60950j0926j64880
3434f33109n73335L73513L08639M62102j13552M49594k07368L73112o33468k63559
3424d57431O84524p39679O4085O6442M24132m16013j40854O03948j65264K3399
3414e2711k24789M2662m65988M30785L50885l13194o42369J39803L72567K94586
3404f7763k34366m55164M32347J67450K18001P3833j97638n01406j12112l25379
3394a002197l1999O55275L38295r16937L69048L85164M5801L7747J5489k91207
$$ plain form
3384 -395521 -72089 -384731 -371097 -290385 -693864 -515271 -1005253 -1082043 -952885 -554041
3374 -554041 -327349 -162887 -6325 -435418 268467 -293388 -66246 188572 380440 463974
3364 463974 394827 -364139 -593210 -807102 -30943 -298780 -247578 -111286 601814 95074
3354 95074 -728707 -75409 -429367 -235083 85778 222767 -244447 -734318 -641364 -498628
3344 -498628 -160835 -332735 -234871 -649248 -496859 203427 174503 -14370 140710 436177
3334 436177 42379 -534546 -181862 6183 -299804 -645024 -1059051 -851165 -117418 -116485
3324 -116485 -322641 -389653 -600052 -495916 -95925 -93714 282407 -499897 -857993 -146640
3314 -146640 -228390 -428791 -355795 -335971 -496381 -295208 -892703 -315296 -837544 -325904
$$ packed form
3384c95521L23432l12642J3634Q0712m03479J78593m89982p6790J29158L98844
3374e54041K26692J64462J56562m29093P03885n61855K27142K54818J91868Q3534
3364D63974o9147p58966k29071k13892P76159k67837N1202J36292P13100n06740
3354I5074q23781O53298l53958J94284L20861J36989m67214m89871R2954J42736
3344d98628L37793j71900R7864m14377J52389P00286k8924j88873J55080K95467
3334D36177l93798n76925L52684J88045l05987l45220m14027K07886P33747R33
3324a16485k06156o7012k10399J04136L99991K211L76121p82304l58096P11353
3314a46640q1750k00401P2996J9824j60410K01173n97495N77407n22248N11640
$$ plain form
3304 -325904 -163153 -372921 293912 200068 446192 384243 423342 185827 -665026 -115156
3294 -115156 -482526 -134024 140535 -67460 -504109 -158983 300774 180721 267532 23317
3284 23317 -29027 -223722 -490359 -555103 -119908 -461142 -906166 -33927 239091 -620492
3274 -620492 -736333 -162105 -350403 253632 -143592 -99104 -625025 -544156 -168480 483576
3264 483576 365238 84420 -85846 -198176 -490656 -415476 -718201 -541943 97742 -20177
3254 -20177 -480914 -340472 -150760 -628061 -180309 -293528 -141145 510326 223454 -604981
3244 -604981 -351432 -300389 613262 94271 -148403 -343738 -559831 -578732 -579337 -988331 -96622
3233 -96622 -6438 -208688 -548095 -232105 -461159 -735373 -871020 -1239119 -696218 -602738
$$ packed form
3304c25904J62751k09768O66833r3844K46124o1949L9099k37515q50853N49870
3294a15156l67370L48502K74559k07995m36649L45126M59757j20053Q6811k44215
3284B3317n2344j94695k66637o4744M35195l41234m45024Q72239K73018q59583
3274f20492j15841N74228j88298O04035l97224M4488n25921Q0869L75676O52056
3264D83576j18338k80818j70266j12330k92480P5180l02725J76258O39685j17919
3254b0177m60737J40442J89712m77301M47752j13219J52383O51471k86872q28435
3244f04981K53549N1043R13651n18991k42674j95335k16093j8901o05m08994Q91709
3233i6622R0184k02250l39407L15990k29054k74214j35647l68099N42901R3480
$$ plain form
3223 -602738 -816067 -233466 -165292 82401 2310 -496639 -390673 -138920 -591535 -446119
3213 -446119 -518823 -163571 -161013 -576893 -19554 287265 594348 100249 -219146 -380609
3203 -380609 -17507 -152899 44268 -223096 -70375 -547524 -459078 52148 -33834 -538833
3193 -538833 -480072 -43289 167700 -856511 -890869 -14503 -104521 -234297 570873 775469
3183 775469 409080 170033 -292556 218093 309409 126947 -258271 -54802 -347701 -389763
3173 -389763 284510 -361326 -534112 -843027 -1138454 -636837 -209057 -314504 -624298 -710238
3163 -710238 -237216 138335 -620068 -717003 -425069 -190900 -405453 1120 -306393 -647586
3153 -647586 9828 202371 -441388 -1014539 -99520 -57497 -12922 693717 498550 -157910
$$ packed form
3223f02738k13329N82601O8174K47693q0091m98949J05966K51753m52615J45416
3213d46119p2704L55252K558m15880N57339L06819L07083m94099l19395j61463
3203c80609L63102j35392J97167k67364J52721m77149Q8446N11226q5982n04999
3193e38833N8761M36783K10989j024211l4358Q76366r0018j29776Q05170K04596
3183G75469l66389k39047m62589N10649R1316j82462l85218K03469k92899m2062
3173c89763O74273o45836j72786l08915k95427N01617M27780j05447l09794q5940
3163g10238M73022L75551p58403r6935K91934K34169k14553M06573l07513l41193
3153f47586O57414J92543o43759n73151R15019M2023M4575P06639j95167o56460
$$ plain form
3143 -157910 -370745 -596758 -356653 188479 -50008 414153 -181878 -813276 -490702 138424
3133 138424 269324 -567996 -682809 -19702 151358 17785 160231 -177122 -521141 -402854
3123 -402854 -506766 -814173 -979483 -597939 10527 -195534 -257936 -396761 -311749 -52810
3113 -52810 -37287 -264179 2215 62562 -89623 -29300 39006 -210346 167616 126347 -134333
3102 -134333 42531 -182281 169394 -250616 -754795 -382657 -308734 -131721 -86948 -82235
3092 -82235 -446742 13299 -66102 -320412 -425037 -326167 -256426 -754369 -306523 233050
3082 233050 292171 256006 -485581 -498383 -316988 -349651 162407 -66226 -238876 -439715
3072 -439715 -303845 -324722 -41893 -426063 -626414 -911115 -757017 -374544 -147743 -330214
$$ packed form
3143a57910k12835k26013K40105N45132k38487M64161n96031o31398L22574O29126
3133A38424J30900q37320j14813O63107J71060j33573J42446l37353l44019J18287
3123d02854j03912l07407j65310L81544O08466k06061o2402j38825Q5012K58939
3113e2810J5523k26892K66394O0347j52185O0323O8306k49352L77962m1269k60680
3102a34333J76864k24812L51675m20010n04179L72138P3923J77013M4773M713
3092h2235l64507M60041p9401k54310j04625R8870O9741m97943M47846N39573
3082B33050N9121l6165p41587j2802J81395l2663N12058k28633j72650k00839
3072d39715J35870k0877K82829l84170k00351k84701J54098L82473K26801j82471
$$ plain form
3062 -330214 -301232 -643821 -175110 289181 374264 283920 -307430 295434 -109502 110218
3052 110218 151785 191864 32543 -365587 -637052 -808145 -260418 -142574 3228 74063
3042 74063 -553478 -754645 -512955 -184241 -172006 -110530 -56436 -273233 22307 -589882
3032 -589882 -555390 166320 59924 -235215 -266285 -353730 -807890 -754608 -358530 -511448
3022 -511448 400238 426302 -76959 -40279 631684 898270 1088901 710633 365145 31030
3012 31030 -86310 -41591 -260202 -67939 -344412 33551 1352 -484801 -584542 503166
3002 503166 432426 175932 291936 -38985 -100133 -169499 -334850 -1142439 -1335418 -643388
2992 -643388 -120645 -406185 -112284 -231703 -444892 -310094 -532229 191403 89588 -192791
$$ packed form
3062c30214K8982l42589M68711M64291Q5083r0344n91350O02864m04936K19720
3052A10218M1567M0079j59321l98130k71465j71093N47727J17844J45802P0835
3042G4063o27541k01167K41690L28714J2235O1476N4094k16797K95540o12189
3032e89882L4492P21710j06396k95139l1070q7445m54160N3282L96078j52918
3022e11448R11686K6064n03261L6680O71963K66586J90631l78268l45488l34115
3012C1030j17340M4719k18611J92263k76473L77963l2199m86153r9741J087708
3002E03166p0740k56494J16004l30921o1148o9366j65351q07589j92979O92030
2992f43388N22743k85540K93901j19419k13189J34798k22135P23632j01815k82379
$$ plain form
2982 -192791 -497294 -251386 375501 -36724 -311817 -539745 -411232 -158920 -715087 -853118
2972 -853118 -752791 -314639 -27505 -505145 -306842 444562 9331 170753 -8211 -92548
2962 -92548 355447 231301 247051 -335903 -571224 23782 -116490 27545 133441 346983
2952 346983 -213355 -180465 90349 42319 -337110 -537517 -39555 -1101916 -899115 -552192
2942 -552192 -383585 -191773 -39051 319734 75871 -552807 -264066 -412573 -347968 -442060
2932 -442060 -311746 56575 423661 820906 701557 150399 167893 -308074 -354033 -299574
2922 -299574 -408602 27311 152718 -26803 -698708 -130303 -88933 -226965 -298402 -1012454
2912 -1012454 -630877 -409907 138933 -1033003 -501562 41618 -361669 -521701 -502780 -140446
$$ packed form
2982a92791l04503K45908O26887m12225k75093k27928J28513K52312n56167j38031
2972h53118J00327M38152K87134m77640J98303P51404m35231J61422j78964q4337
2962i2548M47995j24146J5750n82954k35321N95006j40272J44035J05896K13542
2952C46983n60338L2890K70814m8030l79429k00407M97962j062361K02801L46923
2942e52192J68607J91812J52722L58785k43863o28678K88741j48507O4605r4092
2932d42060J30314L68321L67086L97245j19349n51158J7494m75967m5959N4459
2922b99574j09028M35913J25407j79521o71905N68405M1370j38032p1437p14052
2912a012454L81577K20970N48840j171936N31441N43180m03287j60032J8921L62334
$$ plain form
2902 -140446 -3432 -4847 -934298 -157859 -766548 -218297 -407794 -499480 15721 15086 -366275
2891 -366275 -1038438 -865309 -659905 -163937 -124448 -183003 39130 -108168 -140257 -87299
2881 -87299 91694 -141748 -682033 -966242 -478512 -691601 -366849 40995 -50468 -114520
2871 -114520 60594 -286626 70065 525970 140819 -456159 -250687 66632 134627 -72186
2861 -72186 -139364 -246847 66212 469458 564436 -60868 -812517 -358624 -99916 -85865
2851 -85865 10778 196815 932060 597155 345091 323123 -424919 -661978 -578568 39297
$$ packed form
2902a40446J37014j415r29451P76439o08689N48251j89497r1686N15201o35l81361
2891c66275o72163J73129K05404M95968L9489n8555K22133j47298l2089N2958
2881h7299J78993k33442n40285k84209M87730k13089L24752M07844r1463o4052
2871a14520J75114l47220L56691M55905l85151n96978K05472L17319O7995k06813
2861g2186o7178j07483L13059M03246R4978o25304p51649M53893K58708J4051
2851h5865R6643J86037P35245l34905k52064k1968p48042k37059Q3410O17865
$$ [...]
##END NTUPLES=NMR SPECTRUM
##END=
