##TITLE=1H_CA-9488-1`
 200.13Hz, DMSO_CCl4.
 8 sc
 14.8.2026
##JCAMPDX= 6.0         $$ Bruker NMR JCAMP-DX V2.0
##DATA TYPE= NMR SPECTRUM
##DATA CLASS= NTUPLES
##ORIGIN= UXNMR, Bruker Analytische Messtechnik GmbH
##OWNER= pz
$$ XWIN-NMR		Version 3.5
$$ Fri Aug 14 12:22:55 2026 Russian Standard Time (UT+4h)  she@DPX200
##.OBSERVE FREQUENCY= 200.1313
##.OBSERVE NUCLEUS= ^1H
##.ACQUISITION MODE= SIMULTANEOUS
##.ACQUISITION SCHEME= undefined
##.AVERAGES= 8
##.DIGITISER RES= 18
##SPECTROMETER/DATA SYSTEM= spect
##.PULSE SEQUENCE= zg30
##.SOLVENT NAME= DMSO
##.SHIFT REFERENCE= (INTERNAL, DMSO, 0, 15.5188)
##AUDIT TRAIL= $$ (NUMBER, WHEN, WHO, WHERE, WHAT)
$$ ##TITLE= Audit trail, XWIN-NMR		Version 3.5
$$ ##JCAMPDX= 5.01
$$ ##ORIGIN= Bruker BioSpin GmbH
$$ ##OWNER= she
$$ F:/spectra/data/she/nmr/H-C/1/pdata/1/auditp.txt
$$ ##AUDIT TRAIL=  $$ (NUMBER, WHEN, WHO, WHERE, WHAT)
(   1,<2026-08-14 12:21:29.31 +0400>,<she>,<DPX200>,
      <created by zg, POWCHK disabled, PULCHK disabled
       configuration hash MD5:
       00 E9 B6 7A A2 85 ED C7 34 08 36 98 17 FE 4E 26
       data hash MD5: 16K
       8D 1B 93 0C C6 38 96 36 0A 56 A3 2E 70 83 89 EA>)
(   2,<2026-08-14 12:21:31.70 +0400>,<she>,<DPX200>,
      <Start of raw data processing
       efp BC_mod = 2 LB = 0.25 FT_mod = 6 PKNL = 1 PHC0 = -4222.09 PHC1 = 16.3923 SI = 16K 
       data hash MD5: 16K
       68 D0 BD 9A 4D 72 C3 DC 69 74 65 21 1D F1 9B FE>)
(   3,<2026-08-14 12:21:54.81 +0400>,<she>,<DPX200>,
      <pk PHC0 = -8.256276 PHC1 = 9.999998 
       data hash MD5: 16K
       2E 47 B4 96 7E 71 36 B8 5B 55 F5 3C 8A 8F 08 69>)
(   4,<2026-08-14 12:22:00.87 +0400>,<she>,<DPX200>,
      <abs ABSG = 5 
       data hash MD5: 16K
       84 0C A2 34 2D B8 17 4B 9B 8A 66 9F 4E 0A 59 15>)
$$ ##END=
$$ 
$$ hash MD5
$$ 96 05 03 EA 53 24 4E AF 39 29 4A 7A 2E 88 6A 4C
##$RELAX= 
##$RELAX= 
##$RELAX= 
##$RELAX= 
##$RELAX= 
##$RELAX= 
$$ Bruker specific parameters
$$ --------------------------
##$DU= <F:/spectra>
##$EXPNO= 1
##$NAME= <H-C>
##$PROCNO= 1
##$TYPE= <nmr>
##$USER= <she>
##$AMP= (0..31)
100 100 100 100 100 100 100 100 100 100 100 100 100 100 100 100 100 100 
100 100 100 100 100 100 100 100 100 100 100 100 100 100 
##$AQSEQ= 0
##$AQ_mod= 1
##$AUNM= <au_zg>
##$AUTOPOS= <>
##$BF1= 200.13
##$BF2= 200.13
##$BF3= 200.13
##$BF4= 200.13
##$BF5= 200.13
##$BF6= 200.13
##$BF7= 200.13
##$BF8= 200.13
##$BYTORDA= 1
##$CFDGTYP= 0
##$CFRGTYP= 5
##$CHEMSTR= <none>
##$CNST= (0..31)
1 1 145 1 1 1 1 1 1 1 1 1 1 1 1 1 1 1 1 1 1 1 1 1 1 1 1 1 1 1 1 1 
##$CPDPRG= <>
##$CPDPRG1= <>
##$CPDPRG2= <>
##$CPDPRG3= <>
##$CPDPRG4= <mlev>
##$CPDPRG5= <mlev>
##$CPDPRG6= <mlev>
##$CPDPRG7= <mlev>
##$CPDPRG8= <mlev>
##$CPDPRGB= <>
##$CPDPRGT= <>
##$D= (0..31)
0 0.7 0 0 0 0 0 0 0 0 0 0.03 0 0 0 0 0 0 0 0 0 0 0 0 0 0 0 0 0 0 0 0 
##$DATE= 1786695688
##$DBL= (0..7)
120 120 120 120 120 120 120 120 
##$DBP= (0..7)
150 150 150 150 150 150 150 150 
##$DBP07= 0
##$DBPNAM0= <>
##$DBPNAM1= <>
##$DBPNAM2= <>
##$DBPNAM3= <>
##$DBPNAM4= <>
$$ [...]
##$SUBNAM3= <"">
##$SUBNAM4= <"">
##$SUBNAM5= <"">
##$SUBNAM6= <"">
##$SUBNAM7= <"">
##$SUBNAM8= <"">
##$SUBNAM9= <"">
##$SW= 18.0517328524113
##$SWIBOX= (0..15)
0 0 2 0 0 0 0 0 0 0 0 0 0 0 0 0 
##$SW_h= 3612.71676300578
##$TD= 16384
##$TD0= 1
##$TE= 0
##$TE2= 300
##$TE3= 300
##$TEG= 300
##$TL= (0..7)
0 120 120 120 120 120 120 120 
##$TP= (0..7)
150 150 150 150 150 150 150 150 
##$TP07= 0
##$TPNAME0= <>
##$TPNAME1= <>
##$TPNAME2= <>
##$TPNAME3= <>
##$TPNAME4= <>
##$TPNAME5= <>
##$TPNAME6= <>
##$TPNAME7= <>
##$TPOAL= (0..7)
0.5 0.5 0.5 0.5 0.5 0.5 0.5 0.5 
##$TPOFFS= (0..7)
0 0 0 0 0 0 0 0 
##$TUNHIN= 0
##$TUNHOUT= 0
##$TUNXOUT= 0
##$USERA1= <user>
##$USERA2= <user>
##$USERA3= <user>
##$USERA4= <user>
##$USERA5= <user>
##$V9= 5
##$VALIST= <valist>
##$VCLIST= <CCCCCCCCCCCCCCC>
##$VD= 0
##$VDLIST= <DDDDDDDDDDDDDDD>
##$VPLIST= <PPPPPPPPPPPPPPP>
##$VTLIST= <TTTTTTTTTTTTTTT>
##$WBST= 1024
##$WBSW= 4
##$XGAIN= (0..3)
0 0 0 0 
##$XL= 0
##$YL= 0
##$YMAX_a= 333565
##$YMIN_a= -308109
##$ZGOPTNS= <>
##$ZL1= 120
##$ZL2= 120
##$ZL3= 120
##$ZL4= 120
##$ABSF1= 15.52653
##$ABSF2= -2.525319
##$ABSG= 5
##$ABSL= 3
##$ALPHA= 0
##$AQORDER= 0
##$ASSFAC= 0
##$ASSFACI= 0
##$ASSFACX= 0
##$ASSWID= 0
##$AUNMP= <proc_1d>
##$AZFE= 0.1
##$AZFW= 0.1
##$BCFW= 0
##$BC_mod= 2
##$BYTORDP= 0
##$COROFFS= 0
##$CY= -3
##$DATMOD= 1
##$DC= 0
##$DFILT= <>
##$DTYPP= 0
##$F1P= 0
##$F2P= 0
##$FCOR= 1
##$FTSIZE= 16384
##$FT_mod= 6
##$GAMMA= 0
##$GB= 0
##$INTBC= 1
##$INTSCL= 3.241238e-09
##$ISEN= 128
##$LB= 0.25
##$LEV0= 0
##$LPBIN= 0
##$MAXI= 10000
##$MC2= 0
##$MEAN= 0
##$ME_mod= 0
##$MI= 1.114404
##$NCOEF= 0
##$NC_proc= -7
##$NLEV= 6
##$NOISF1= 3.799351
##$NOISF2= 2.8
##$NSP= 0
##$NTH_PI= 0
##$NZP= 0
##$OFFSET= 15.51882
##$PC= 1
##$PHC0= -4230.346
##$PHC1= 26.3923
##$PH_mod= 1
##$PKNL= yes
##$PPARMOD= 0
##$PSCAL= 0
##$PSIGN= 0
##$REVERSE= no
##$SF= 200.130000576575
##$SI= 16384
##$SIGF1= 3
##$SIGF2= 2
##$SINO= 0.751879
##$SIOLD= 32768
##$SREGLST= <19F.Aceton>
##$SSB= 0
##$STSI= 16384
##$STSR= 0
##$SW_p= 3612.71676300578
##$SYMM= 0
##$S_DEV= 0
##$TDeff= 16384
##$TDoff= 0
##$TI= <>
##$TILT= no
##$TM1= 0
##$TM2= 0
##$TOPLEV= 0
##$USERP1= <user>
##$USERP2= <user>
##$USERP3= <user>
##$USERP4= <user>
##$USERP5= <user>
##$WDW= 1
##$XDIM= 16384
##$YMAX_p= 466627303
##$YMIN_p= -955582
$$ End of Bruker specific parameters
$$ ---------------------------------
##NTUPLES= NMR SPECTRUM
##VAR_NAME=  FREQUENCY,     SPECTRUM/REAL,   SPECTRUM/IMAG
##SYMBOL=    X,             R,               I
##VAR_TYPE=  INDEPENDENT,   DEPENDENT,       DEPENDENT
##VAR_FORM=  AFFN,          ASDF,            ASDF
##VAR_DIM=   16384,         16384,           16384
##UNITS=     HZ,            ARBITRARY UNITS, ARBITRARY UNITS
##FACTOR=    0.220516191357247, 1,           1
##FIRST=     3105.78141731492, 0,            0
##LAST=      -506.93534569086, 0,            0
##MIN=       -506.93534569086, -955582,      0
##MAX=       3105.78141731492, 466627303,    0
$$ Real data points
##PAGE= N=1
##DATA TABLE= (X++(R..R)), XYDATA
$$ [...]
8011 1735709 1799184 1728602 1908503 2024998 2203262 2030534 1833528 1531707 1595446 1885550
8001 1885550 1787848 1832288 2078896 1914872 2066806 2341006 2170097 1871963 1941519 2061670
7991 2061670 2206509 2085435 2186309 2277917 2235163 2286548 2261475 2022838 2143609 2179546
7981 2179546 2353460 2274758 2008493 2177126 2029464 2263913 2533809 2546007 2405466 2502232
7971 2502232 2611663 2408725 2358776 2469304 2733210 2862732 3020673 2953081 2857626 3022886
7961 3022886 3019963 2880825 2845138 2841761 2901036 3242297 3246609 3303965 3172757 2949875 2875532
7950 2875532 2907511 3148124 3225397 3473969 3413920 3305037 3302325 3387486 3474863 3342911 3299841
7939 3299841 3548072 3621692 3887312 3893521 3925008 3970338 4043690 4041729 3785774 3815719 3960792
7928 3960792 4142965 4356260 4307175 4113294 4324829 4185145 4273504 4288951 4455563 4668687
7918 4668687 4948073 4917818 4776945 5030272 5110397 5060684 5216078 5449457 5398175 5374337
7908 5374337 5492972 5428855 5343930 5465196 5647673 5933117 6321948 6484442 6287961 6385771
7898 6385771 6738629 6763013 6969546 7108801 7116672 7428220 7528911 7921735 7956435 8047380
7888 8047380 8033825 8226932 8553314 8925237 9313426 9539304 9878816 10181124 10230686 10227376
7878 10227376 10326438 10895283 11356557 11586649 11986901 12375155 12762344 12958098 13270880 13852082
7868 13852082 14118915 14507795 15003026 15431166 15937296 16438350 16966895 17514498 17927828
7859 17927828 18478653 19370449 20140914 20807911 21450122 22277428 22637039 23386184 24340178
7850 24340178 25220379 25818619 26576669 27411296 28270183 28836376 29461119 30137664 30755643
7841 30755643 31094110 31487905 31983149 32512613 32908563 32996574 33298503 33027549 32731446 32652991
7831 32652991 32749291 32689657 32353460 32135743 32014117 31877200 32014122 31963888 31968628 31854132
7821 31854132 31491933 31311997 31472751 31457766 31624079 31763348 31881433 32029806 31697917 32097496
7811 32097496 32298325 31981848 32239788 32226333 31943360 31941941 31828778 31237381 30870637 30399648
7801 30399648 29692453 29553535 28954895 28416137 27673144 26751974 25710227 25102059 24600928
7792 24600928 23717852 22912068 21664923 20629522 20010652 19508046 18698295 17796130 17347920
7783 17347920 16880708 16037875 15448084 14959127 14049720 13265152 12856676 12536612 12079686
7774 12079686 11516344 11021283 11137929 10833782 10276158 10098806 9678984 9401583 9309249 8803078
7764 8803078 8610616 8412020 8179115 7997450 7965650 7734502 7332803 7198286 7100165 6844593
7754 6844593 6389985 6524408 6293956 6113484 5732251 5544105 5458666 5418826 5275796 5053327
7744 5053327 5100760 5033132 4963437 5029817 5050799 4968205 4770867 4627527 4843069 4895106 4742478
7733 4742478 4738331 4916681 5002408 5177440 5156661 5126404 4847305 4369939 4074121 3921534
7723 3921534 3816144 3569740 3232211 3125760 3154254 3027114 3015565 2931281 3012900 2938377
7713 2938377 3058442 3011687 2882265 2879867 2878847 3200373 3256924 3200719 3068438 3020285 2824633
7702 2824633 2753043 3178187 3629830 3515014 3353820 3344425 3229313 3127921 2806366 2469040
7692 2469040 2375256 2329743 2234172 2045446 2069555 2144259 2024266 1774887 1800195 2014675 2040502
7681 2040502 1907158 1486970 1770249 1709447 1377029 1469071 1491283 1488288 1523533 1723624 1695862
7670 1695862 1425695 1315020 1492512 1786101 1806230 1756635 1554095 1371745 1517651 1603635
7660 1603635 1225522 974799 1014901 1161194 1092346 1162270 1013877 818311 869501 923220
7650 923220 775174 811942 1151906 955710 931906 851088 832242 669618 602080 944092 892314
7639 892314 943876 950655 816929 896292 829659 750793 982114 801142 654942 836483 734985
7628 734985 866899 843795 469951 256511 424496 648585 829488 879747 751228 601142
7618 601142 517597 656573 528999 261513 593884 756181 669105 537908 398123 406856
7608 406856 560740 509927 719671 740737 691883 617321 402485 563219 507999 105664 84056
7597 84056 200552 391339 373305 356826 163665 274409 431908 432415 584736 521929 576495
7586 576495 788295 882981 683102 479336 473328 463807 140445 355851 326913 440036 473217
7575 473217 522976 759918 394685 393730 455586 535155 494042 477442 438976 245862 643884
7564 643884 764768 415137 213587 438551 329903 295637 306834 531120 588015 230131
7554 230131 184586 365962 207988 100015 257111 308129 249438 233013 228629 -22927 91425
7543 91425 128102 -14481 172604 176805 117589 326139 234170 154826 271665 245974 262521
7532 262521 328088 298305 394323 412743 95335 123432 79495 56142 144966 5256 -84240
7521 -84240 44983 298915 287646 290557 88823 136889 252734 347816 257359 197154 197046 258168
7509 258168 90614 46748 143760 153380 144082 -29478 76844 180766 118524 147902 316333
7498 316333 435775 509185 454265 271941 309974 334095 177107 -3675 370443 579977
7488 579977 428714 476122 580547 542821 541220 468093 153244 173793 81596 182159 194815
7477 194815 -130200 -74160 377175 151328 266597 410317 143099 297639 606734 767912
7467 767912 603453 288584 393185 291198 211554 116735 -192669 135015 184089 271183
7457 271183 381594 316324 161866 208591 8800 -10848 -48928 -69516 337753 302149 237018
7446 237018 204404 105323 213131 265965 191429 146928 417765 505042 345155 194209 227010
7435 227010 277560 330960 352761 242514 212286 336261 430861 208634 246594 398894 491634
7424 491634 520687 498991 317756 342017 375609 193083 13916 369422 319783 229973 -19799
7413 -19799 174713 222543 344519 269302 196960 236428 141270 348451 459970 571870 370633
7402 370633 170704 114399 188162 378911 413666 507811 545483 505769 535975 400543 291579
7391 291579 212949 201425 294341 167110 108044 101732 2313 151654 -2755 313656 123739
7380 123739 24536 363052 432888 291987 463419 552925 268653 342388 291931 179144 479035
7369 479035 609098 379017 607309 679438 428972 310872 338562 523058 296689 404992
7359 404992 421600 150171 344524 421094 397380 258261 483125 413997 71357 203755
7349 203755 250752 411745 389434 456247 205340 214807 413531 150855 145771 265262 530696
7338 530696 539384 377641 406530 212296 355253 484772 186891 196061 571377 416789 426205
7327 426205 398158 607010 611987 486747 377970 223144 133309 293313 389090 246415 157815
7316 157815 284988 396496 229189 204817 91970 113803 164199 396700 463080 463459 426213
7305 426213 477867 399156 415860 836215 968364 651614 534627 655539 800096 721562
7295 721562 456973 571953 753174 673227 387576 307519 193132 221868 540450 569564
7285 569564 567910 442988 330510 225865 266166 187139 229416 252518 337676 457987 583493
7274 583493 547016 490472 258727 87281 166857 43806 119895 244516 337405 293607 483766
7263 483766 563360 457801 609719 473963 204674 273879 387976 269205 32881 -16140
7253 -16140 30837 261400 435678 215413 89714 96804 430327 153471 94456 188447 372663
7242 372663 437708 240527 275569 331846 124663 198791 239230 292654 348037 309910 121162
7231 121162 259172 313846 226415 462767 316171 401552 512756 481629 100305 45636 138171
7220 138171 620076 690304 499608 358138 140716 199712 251319 255638 166765 195149 402507
7209 402507 291579 258291 277057 295636 260841 153987 79897 76179 163627 234873 371936
7198 371936 389555 407103 122563 161455 167490 234661 443028 298356 504903 353727 255670
7187 255670 425350 445811 200145 261682 421479 563531 547248 261664 84025 179945
7177 179945 186812 90429 204024 176807 264768 130284 -3198 69085 373802 534386 544843
7166 544843 403039 451798 302147 250237 80429 346833 354825 354070 370469 58168 142714
7155 142714 299597 639042 661371 689707 706871 308647 -36025 89617 199992 579341
7145 579341 633604 597442 644701 446856 239554 391532 326731 319053 216437 233052 488017
7134 488017 450522 246652 71076 219844 222216 403722 416106 257748 302844 283911 269960
7123 269960 311828 459884 212354 462198 407691 232169 219184 235403 212489 418507 459504
7112 459504 437315 147769 231700 404034 401144 332641 114749 173664 240413 151706 241223
7101 241223 451375 329831 454692 549120 687250 538891 419915 245047 454147 425801
7091 425801 322371 121218 185842 392520 537608 667612 618368 542020 359146 84549
7081 84549 251051 343369 426099 345565 262029 249318 249268 330765 381983 372434 321461 302471
7069 302471 463416 470213 314314 367654 497501 394007 185618 345397 549670 573945
7059 573945 439219 433867 449444 290156 275373 432572 113948 78003 281910 214204 362136
7048 362136 389976 486382 325680 431736 497297 401485 260475 247165 392544 314465 672782
7037 672782 379026 217357 417623 435072 573123 358713 313247 431770 589050 715913
7027 715913 416049 528941 409745 156691 296482 373697 483005 754014 658725 500913
7017 500913 519101 601544 482960 792129 751035 703330 608102 574617 752988 666140 593315
7006 593315 355321 293490 320136 238164 159997 252204 267815 382412 258254 261014 209921
6995 209921 199422 341651 393156 266477 217617 409923 537735 605648 569513 585753 443230
6984 443230 218248 348849 431909 427167 512758 461143 605309 671841 543551 537087 644243
6973 644243 745127 771983 1003309 798865 576263 274463 182472 355864 711191 642123
6963 642123 558186 590742 390558 614285 401212 464974 390907 488757 563703 630917 676395
6952 676395 611160 609187 515460 560509 593446 678909 556611 679251 608633 854115 828901
6941 828901 502199 575894 396906 500378 733549 916454 696474 268557 415511 673100
6931 673100 833732 850117 720959 562703 925333 738703 508490 360598 554873 781721
6921 781721 627549 584419 530007 482795 376580 625303 461722 697358 741704 328498
6911 328498 258120 523461 559209 517317 875194 913006 825783 705223 659805 809141 964900
6900 964900 576787 367747 674158 619012 849598 672729 573865 636225 601866 566337 352550
6889 352550 486138 916346 1220767 977077 693671 897392 825965 707516 1024095 1033346
6879 1033346 737428 914579 806151 665975 952652 744203 699500 561634 587800 790669
6869 790669 933932 831879 938491 822874 614586 806253 742836 729475 654262 535874
6859 535874 617657 791085 803035 687537 991229 1123860 998071 945947 863533 794098 411289
6848 411289 575347 782259 1012692 898142 908934 979730 1046447 1209674 1023721 733299
6838 733299 714995 869246 901447 891267 673598 824254 837648 852835 624800 537355 686366
6827 686366 768569 1046034 1053513 756644 847101 757426 772264 914323 999465 999942 996617 993354
6815 993354 789150 918362 1081997 918213 527902 716265 980835 963661 883710 946840
6805 946840 931978 1249627 1388466 1368971 1033002 904111 674688 844374 904681 943692
6795 943692 950932 1076525 860440 835605 1240313 1409939 1168534 1107197 1302344 1134665
6785 1134665 1057397 859649 879576 970185 1309126 1077035 957786 812482 1123474 1206065
6775 1206065 1214366 1335117 1111057 991853 1059767 954806 774052 921234 986799 1227362
6765 1227362 1428360 1322167 1294830 1302207 1161459 928909 891849 1068802 1156170 1006309
6755 1006309 1236057 995694 1081548 882511 1100372 1198829 1205781 1274221 1301906 1152773 1049622
6744 1049622 1375148 1151425 1028866 1272667 1310905 1214183 1286163 1215456 1022251 1210404
6734 1210404 1111769 1134563 1188344 1282969 1360994 1215006 1299071 1225350 1160027 1403078 1512418
6723 1512418 1627421 1572370 1384608 1694175 1578353 1608858 1326224 1184033 1140866 1230025
6713 1230025 1311966 1379525 1357737 1351879 1226187 1210690 1229602 1225863 1219578 1433457 1663313
6702 1663313 1319680 1326525 1315269 1580926 1631526 1736042 1654910 1503255 1324275 1232007 1354961
6691 1354961 1434661 1634785 1434033 1400108 1573760 1707572 1570535 1395882 1303872 1153365
6681 1153365 1447550 1501715 1490457 1562667 1379131 1631518 1700472 1680630 1434516 1652570
6671 1652570 1681144 1900318 1793804 1644781 1609081 1913457 1931289 1550354 1608911 1716105
6661 1716105 1737212 1612322 1616466 1854891 1718424 1975028 2254359 1976034 1585329 1663225
6651 1663225 1634063 1629955 1786128 1742017 1780278 1943548 1857313 1897707 1949360 2182993 2195391
6640 2195391 2205759 2132409 1798972 1808334 1969187 2019670 1798365 1901465 1947646 2015268 2107112
6629 2107112 2197603 2078285 2173924 2271001 2271997 2053406 1997430 2088916 2038840 2312828 2267774
6618 2267774 2248501 2189756 2176888 2291735 2233029 2494251 2543575 2286925 2081276 2199267
6608 2199267 2366194 2364568 2128491 1974367 2053364 2343904 2470171 2680849 2542086 2599064
6598 2599064 2540820 2331334 2364010 2759001 2681224 2442334 2480665 2771538 2698926 2686213 2440454
6587 2440454 2663659 2876966 2782400 2740201 2482137 2360791 2662736 2629804 2566897 2595314
6577 2595314 2810045 2922577 2894295 2812847 2959472 2802759 3230930 3095159 3209328 3250745
6567 3250745 3071017 3209298 3276911 3222853 3125389 3106552 2867848 3039662 3511077 3503623 3312064
6556 3312064 3334927 3061385 3414975 3404524 3322654 3392916 3410222 3285222 3708191 3847004
6546 3847004 3781021 3682570 3725325 3815867 3827533 3730044 4176592 4053155 4027231 4021330 4045201
6535 4045201 3908197 4133856 4150475 4415788 4478685 4387000 4252529 4389316 4473566 4545844
6525 4545844 4593991 4635762 4767552 4984322 4998107 4716852 4882688 5123721 5023811 5330715
6515 5330715 5608197 5513238 5643103 5759458 6053096 6054700 6130976 6382366 6355805 6213898
6505 6213898 6515838 6644461 6706228 6767524 7119043 7346854 7481623 7733776 7710607 7825721
6495 7825721 7943978 8301590 8731064 8705816 8626354 9021907 9403076 9556588 9511770 9931625
6485 9931625 10326541 10399733 10775054 11002152 10979261 11187828 11597072 11792421 12134121 12560889
6475 12560889 12808534 13036747 13160048 13365525 13925992 14151483 14853555 15357791 15637432
6466 15637432 15939595 16621274 16983085 17130369 17452990 18008209 18450243 18724445 19187646
6457 19187646 19412726 20047552 20538758 20974999 21505627 21527403 21902571 22264411 22821522 22890454
6447 22890454 22736097 23106357 23591751 23876270 24160376 24498128 25037775 25241096 25682224
6438 25682224 26491224 26963904 27655479 27998067 28634960 29265200 29798146 30163160 30570464
6429 30570464 31092863 31557005 31858529 32261462 32746212 32844662 32689287 32681761 33137589 33018217
6419 33018217 32669777 32539555 32512700 32447835 32444890 32636666 32736130 32745163 32679951 32752199 32711960
6408 32711960 32832259 33387896 33574983 33785873 34030989 34211798 34363402 34903542 35097725
6399 35097725 35005385 35270752 35339266 35234923 34939901 34655660 34407841 33938904 33386065 33141044
6389 33141044 32810409 32515449 32009981 31358438 30801842 30094356 29858615 29789166 29450000 28949431
6379 28949431 28595423 28248481 27936108 27615616 27523017 27445248 27214459 26711929 26581572 26487142
6369 26487142 26444444 26279970 25882931 25745102 25546757 25025487 24514574 24203147 23894930 23375806
6359 23375806 22682936 22101794 21655797 21740264 21239313 20407411 19523436 19206619 18828898 18494989
6349 18494989 17923995 17664677 17426671 17403225 16874099 16736499 16585803 16373641 16218084 15984998
6339 15984998 15519838 15391903 15258892 15129099 15064239 14677901 14895412 14790825 14454795 14508493
6329 14508493 14393756 14368131 14267331 13919023 13830559 13550648 13386597 13248633 13234832 13025401
6319 13025401 13426695 13306142 13099655 13073724 12802163 13015694 13116271 13161519 13152761 13410586
6309 13410586 13612738 13671530 13487342 13512655 13590886 13588639 13783139 14200236 14511208 14630143
6299 14630143 14855048 15179461 15496282 15634991 15839702 16146688 16862374 17437300 17839699
6290 17839699 18203857 18703686 19259511 19772852 20196347 20689536 21587168 22419200 22929062
6281 22929062 23706042 24493485 25371735 25963378 27025462 27463205 28010160 28782267 29667168
6272 29667168 30253338 30992897 31169102 31636970 32244998 32823210 33252154 33528489 33925708
6263 33925708 34512015 35110200 35129451 35151997 35432116 35436290 35070848 34938596 34814385 34986819
6253 34986819 34943761 35138700 35194906 35492660 35778248 35889941 36199229 36869055 37466045 37990108
6243 37990108 38402294 39225932 39900716 40508752 41139267 41790721 42657302 43272514 44084976
6234 44084976 44998955 45800952 46653503 47143285 47846885 48281049 48651863 49022730 49319860
6225 49319860 49691392 49865842 49663830 49514342 49552148 49505509 49587332 49470467 49266248 49101612
6215 49101612 48797650 48697518 48528592 48346697 48091750 48111511 48410984 48288230 48443785 48964686
6205 48964686 49529704 49831609 50092079 50339342 50477997 50637164 50688122 50596262 50491561 50395474
6195 50395474 50429244 50336725 50118739 49756809 49596774 49506977 48950716 48745497 48459670 47948331
6185 47948331 47437035 46653338 46139313 45739913 45150940 44554204 44184118 43768176 43454393
6176 43454393 43253149 42995614 42889385 42871989 42668354 42768771 42982563 43222475 43224026 43422663
6166 43422663 43606461 43557857 43957367 44252438 44278575 44452057 44292239 44053216 44123485 43489856
6156 43489856 43272343 42859103 42405637 42029718 41374280 40651511 39763501 39075097 38357783
6147 38357783 37771243 37098584 36617067 36167112 35657741 35174209 34707666 33952631 33690705
6138 33690705 33558582 32967042 32724101 32365357 31935919 31672331 31732030 31278159 31145481 30765703
6128 30765703 30005714 29848780 29649674 29143201 28822103 28407813 27777863 27159555 26627830
6119 26627830 25979001 25296307 24864944 24105303 23616470 23004876 22324682 21657556 20990553
6110 20990553 20547559 19631255 18845702 18192519 17419905 16819810 16276555 15661602 15088934
6101 15088934 14650010 14456776 13919568 13251284 12899460 12608307 12134891 12099342 11840462 11448939
6091 11448939 11217790 11089862 10802612 10494239 10114324 9654845 9531893 9777081 9657481
6082 9657481 9638430 9501659 9207045 9170739 8935798 8805958 8690344 8550871 8579576 8674352
6072 8674352 8702524 8548097 8469012 8462283 7890572 7907969 7909382 7950580 7882963 7715367 7676250
6061 7676250 7713998 7681650 7764341 7678892 7384090 7286289 7465115 7285725 7293830 7491938 7558666
6050 7558666 7653250 7376534 7157140 7360746 7187053 7094783 7046849 6684044 6642518 7086797
6040 7086797 7247991 7316479 7187567 7120147 6933710 6677415 6699400 6895031 6845089 6890178
6030 6890178 6635353 6596544 6763036 6958363 7146989 7242616 7011827 7193374 7116892 7023178
6020 7023178 7195306 7064219 7101395 7078435 6803917 6788124 7186561 7147151 6973683 7086385
6010 7086385 7142225 6959746 6920316 6838910 6696101 7113057 7040652 6817394 7020167 7249538
6000 7249538 7194305 7054958 7038391 6948226 6939540 6940124 7337450 7314154 7374651 7425665 7692126
5989 7692126 7873064 7988063 7890702 8071794 8280645 8307377 7903937 7834151 8042456 8372194
5979 8372194 8188220 8146560 8191761 8029926 8080005 7931324 8117478 8579094 8525036 8564423
5969 8564423 8610203 8401470 8454469 8318192 8311805 8414673 8535036 8733638 8770621 8886303
5959 8886303 8877589 9225465 9454547 9492143 9569411 9575424 9616639 9884912 10061797 9846849 10035157
5948 10035157 9942747 9937437 10220071 10082495 10103491 10261521 10442179 10463864 10666987 10589183
5938 10589183 10809273 10997161 11096313 11117869 11279840 11487586 11788022 11604069 11620761 12140053
5928 12140053 12336242 12524212 12753482 13142691 13107998 13025671 13599581 13806486 14314843 14436529
5918 14436529 14592308 14871923 14770149 14561719 15313995 15815237 15930313 16098038 16229406
5909 16229406 16671585 16902694 17106592 17709783 18212743 18318843 19092951 19762106 20275150
5900 20275150 20645065 21339623 21817885 22487706 23006338 23655184 24217267 25147356 26038143
5891 26038143 26837722 27471840 28648013 29658480 30629708 31773720 32992402 33958671 34880379
5882 34880379 35811865 37103808 38378544 39234386 40196329 41145050 42215931 43149863 43273378
5873 43273378 43683230 44025374 44179907 44625838 45101952 44801804 45039538 45420057 45666785
5864 45666785 45824319 46090748 46608152 47301907 47779045 48502261 49428764 50093416 50964215
5855 50964215 51824065 52949719 54059933 54759990 55696936 56829206 57612725 58302260 59323859
5846 59323859 60067576 60906464 61745772 62190709 62415799 62835771 63143147 63212713 63525358 63771439
5836 63771439 63766139 63393616 62959966 62585982 62122059 61368751 60620076 59655307 59135611 58569954
5826 58569954 57915697 57193097 56315951 55742354 55269675 54761055 54557775 54332182 54343893 54053915
5816 54053915 54002297 54058446 54140027 54214900 54113366 53937109 54085693 54031050 54076290 54023359 53787235
5805 53787235 53510795 53014037 52470363 51701897 50915645 50508864 49445577 48432190 47552884
5796 47552884 46324808 45182897 44371678 43426561 42454912 41594297 40547473 39895931 39119615
5787 39119615 38314423 37730655 37046056 36311827 35658258 35356576 34770914 34486210 34194058
5778 34194058 33906039 33443623 32954820 32768165 32418443 31900871 31413488 31245709 30924498
5769 30924498 30721726 30454757 30275708 30376233 30004125 29872220 29674738 29502210 29684024
5760 29684024 29734971 29767609 29439751 29428600 30041134 30393486 30874477 31407666 32361313 33276416
5750 33276416 34257665 35887259 38098764 40944646 44537963 49394750 56159922 64569394
5742 64569394 72143918 74870517 72521043 67784173 61324609 53912839 47425789 41495237
5734 41495237 36061939 32164427 29135394 26818782 25128885 23926957 22939860 22032003
5726 22032003 21242079 20635065 20053192 19837802 19339299 18949198 18466827 18162166 17770173
5717 17770173 17632496 17464880 17219177 16908120 16977974 17019522 17036911 17077576 16958360 16948201
5707 16948201 16871249 16867427 17157053 17076944 16850839 17031551 17328049 17533311 17794152 17730856
5697 17730856 17772288 18279655 18677923 18971838 19182190 19590313 20017847 20306113 20572342 21121159
5687 21121159 21581596 22085166 22585856 22971709 23798755 24289368 24662231 25207286 25922699
5678 25922699 26796152 27208505 27636768 28418859 28940465 29356227 29819112 30166243 30974540
5669 30974540 31703844 32058228 32500512 32635082 32899610 33321260 33475000 33609725 33921938
5660 33921938 34253128 34389607 34669624 34462172 34272570 34529076 34608562 34616658 34829471 34701161
5650 34701161 34809641 34763494 34637412 34272905 34132773 33923178 33973045 33919100 33449817 33328102
5640 33328102 33362899 33051076 32784227 32801603 32466175 32509839 32803716 32929264 32985423 33267779
5630 33267779 33324609 33277453 33531907 33904172 33981660 34175192 34405505 34541594 34579812 34695483
5620 34695483 34869338 34785334 34684921 34556481 34518767 34353646 34204968 34056268 33642034 33489539
5610 33489539 33198825 32978351 32620500 32253525 32110650 31974630 31354346 30877670 30280686
5601 30280686 29724749 29202671 28679267 27997211 27200432 26509352 25791371 25119380 24623291
5592 24623291 24102064 23438258 22374735 21626087 21019541 20554295 20156891 19418805 18788463
5583 18788463 18163801 17815707 17098188 16708086 16436526 16099451 15506036 15122290 14864634
5574 14864634 14511996 14043158 13519649 13297848 13115755 12869552 12525319 12318568 11921975
5565 11921975 11663683 11734722 11592799 11376990 11269840 11182954 11078939 10933148 10665252 10683744
5555 10683744 10424894 10544254 10352218 10094409 9923049 10023685 9976057 9826099 9689409 9561753
5545 9561753 9432383 9338407 9344937 9249321 9220805 9121730 9076809 9045973 9151452 9041206 9053332
5534 9053332 8912174 8748932 8535136 8483281 8737397 8648282 8323483 8349733 8397653 8477103
5524 8477103 8576851 8358990 8272786 8239505 8132909 8009476 8281138 8219724 8109469 8102726 8025126
5513 8025126 7918199 7893368 7679702 7654415 7947442 8170383 7980156 7805393 7996398 7982469
5503 7982469 7757356 7642021 7803001 7663993 7629851 7619224 7824429 7791020 7777623 8082991
5493 8082991 7929836 8021824 8037838 7935170 7789001 7772018 7708992 7650263 7807360 7968971
5483 7968971 7629803 7367264 7482786 7344232 7624412 7507605 7382118 7681232 7729715 7635236
5473 7635236 7784591 7654937 7699423 7647288 7850473 7685732 7695626 7962357 8263707 8124427
5463 8124427 7813339 7803189 7892846 7760317 7896742 8112839 7960227 7859684 7878683 7974672
5453 7974672 8253289 8156124 8064463 7929705 7832015 7900093 8063034 7987356 7872562 7794878 7693498
5442 7693498 7564502 7672430 7869120 7706119 7833808 7929665 7966314 8062870 8282057 8092156
5432 8092156 8125207 8232056 8108047 8104443 8096231 8142918 8480910 8513597 8546076 8675332 8868013
5421 8868013 8709149 8792188 8600828 8572968 8619718 8675012 8627993 8458833 8374459 8410691 8219284
5410 8219284 8366660 8454704 8530293 8577384 8640954 8852729 8657389 8777526 8866968 8693801
5400 8693801 8787908 8781140 8552725 8838253 9044739 9124414 8886312 8779208 8745279 9016991
5390 9016991 9180463 8976765 8742391 8892307 9118059 9176418 8955344 9004096 9201062 9197033
5380 9197033 9006115 8760164 8928423 8763118 8909939 9091128 9048043 8952100 9040057 9414301
5370 9414301 9189454 9155528 9112001 9184653 9256915 9036235 9175305 9291861 9139845 9179567
5360 9179567 9338149 9481666 9373943 9494589 9481432 9228448 9324364 9297911 9200817 9325016
5350 9325016 9422501 9363888 9482917 9505451 9512115 9598363 9477600 9276301 9022520 9125010 9146590
5339 9146590 9002890 8890723 9239789 9484262 9759567 9766073 9626523 9747851 9612309 9715520
5329 9715520 9746179 9612054 9484225 9813434 9708927 9793013 10023955 10189194 9982487 9985717
5319 9985717 9817185 9939484 9980324 9985803 10102900 10217595 10228422 10261264 10178295 10227157 10400161
5308 10400161 10354472 10404221 10530349 10632163 10954689 10807069 10716672 10690818 10629685 10753850
5298 10753850 10651712 10804594 10872551 10906561 10941675 10804647 10760804 11032234 11012722 11110967
5288 11110967 11026003 11024283 11045273 11014375 11120711 11330722 11571814 11552630 11354761 11366376 11425257
5277 11425257 11519787 11380206 11541224 11747683 11671312 11642362 11615317 11712858 11826434 11664517
5267 11664517 11612690 11458461 11540126 11714089 11751289 11838163 11914045 11924194 12074368 11868699
5257 11868699 11806540 11872978 11734292 11857754 11729038 11858171 11731462 11711196 11723526 11905394
5247 11905394 12076657 12140687 12155952 12056031 12085526 11984064 12107863 11973008 11880394 11924552
5237 11924552 11774138 12006212 12095176 11706043 11554601 11454499 11737496 11499768 11484852 11527800
5227 11527800 11455219 11468850 11501332 11312187 11026080 11075681 11090362 11113777 11389653 11507099
5217 11507099 11547742 11486133 11833714 11855473 11841885 11637305 11626868 11853287 11943416 11981292 12236310
5206 12236310 12470879 12373557 12558680 12432857 12691319 12794092 12629940 12564229 12834570 12832310
5196 12832310 13120491 13222106 13162600 13060047 13219957 13302938 13346450 13452733 13430598 13714084
5186 13714084 13833213 14080409 14352023 14633541 15029056 15223546 15639406 16371675 17076021
5177 17076021 17390569 18210688 19302623 20490265 21673350 22691622 23734539 24105438 24187916
5168 24187916 23816052 23214347 22395645 21514803 20622083 19856951 19348486 18544718 18495883 18415799
5158 18415799 18343369 18346830 18369074 18681777 19321338 19788119 20277167 20724509 21261075 22033129
5148 22033129 23067806 24121285 25970084 27757062 29752440 32413798 35166204 38431977
5140 38431977 41685816 45600466 48480006 50008635 49998861 48268761 45742521 42872137 39605734
5131 39605734 36485806 33169405 30669911 28715012 26727561 25610385 24803796 24051619
5123 24051619 23430556 23150648 22870287 22776917 22722502 23297234 23843321 24299275 25154127 25970049
5113 25970049 27229527 28878757 30891412 33331608 36097844 39358167 42597322 46090980
5105 46090980 48943369 50522259 50764902 48991347 46189683 42463994 38762445 35356895
5097 35356895 32091315 28950952 26653270 24801880 23175623 21403051 20122680 19308640
5089 19308640 18458752 17955923 17494656 17358602 17343685 17223861 17070422 17066674 17098146 17614164
5079 17614164 18113582 18124928 18750983 19664810 20703248 21316265 22279216 23162802 23229816 23182107
5069 23182107 22550663 21634160 20209399 18917485 17688391 16809893 15655562 14765133 14090882
5060 14090882 13427579 12662802 12292095 12066565 11692664 11453165 11300819 10959432 10704984
5051 10704984 10559624 10529521 10445377 10143716 10252241 10178906 10194553 10041292 9962099 9836353
5041 9836353 9757126 9752319 9649461 9602580 9667086 9478285 9295209 9388758 9321412 9268264 9327287
5030 9327287 9339339 9539762 9464775 9364093 9199121 9193904 8977687 8801660 8803797 8807186 8522013
5019 8522013 8413590 8703508 8754289 8448168 8285106 8300193 8411833 8631617 8454812 8643850
5009 8643850 8622520 8468147 8551632 8462775 8665144 8691545 8489475 8172560 8324140 8128729
4999 8128729 8110074 8315379 8346807 8321455 8201657 8182050 8369904 8491478 8598592 8513294
4989 8513294 8735593 9183820 9112229 9234456 8841727 8545208 8383391 8279468 8303105 8059148
4979 8059148 7807737 7766632 7439891 7436879 7282072 7047158 7161384 7177843 6921593 6898858
4969 6898858 6930899 6947699 6734039 6864863 6814277 6796227 6633054 6422244 6321208 6651634
4959 6651634 6516172 6210336 6184514 6113037 6319341 6158230 6118487 6123511 6015700 6101984 6251831
4948 6251831 6182159 6085832 5995294 5972996 5785020 5675013 5892835 5995993 5740261 5515108
4938 5515108 5656914 5727026 5657611 5564531 5577708 5941209 5713804 5345237 5401599 5289843
4928 5289843 5296322 5691539 5543792 5536245 5352597 5113701 5141044 5395231 5314321 5167305 4929098
4917 4929098 4956390 4830431 4970252 5358341 4939095 4832021 4656761 4861126 4749253 4663668
4907 4663668 4706779 4723259 4652328 4583277 4771518 4776603 4732753 4762833 4900329 4752472 4666017
4896 4666017 4718568 4718334 4613227 4540420 4547231 4683722 4868851 4696406 4789211 4662969 4454340
4885 4454340 4381769 4527258 4517295 4338695 4417822 4468468 4334526 4316538 4499017 4522037 4596934
4874 4596934 4458129 4496939 4723973 4733629 4823943 4870066 4763885 4751005 4773411 4946260 4595419
4863 4595419 4709717 4812766 4760389 4598450 4716608 5065702 4873753 5085772 5070535 4883601
4853 4883601 5122534 5089043 5086696 5052824 5014989 5466506 5579600 5683082 6405831 6859620
4843 6859620 7035304 7167296 7068219 6989602 6757959 6583528 6579259 6638265 6701794 6901791 6776532
4832 6776532 6939989 7330392 7365090 7583129 7577275 8162039 8375321 8508926 9033100 9573423
4822 9573423 10019547 10538151 11178672 11932028 12810963 13765572 15123384 16845650 18969724
4813 18969724 21512794 25023507 29766757 35587699 41637095 44674463 43336739 40521899
4805 40521899 36457276 31851193 27152668 22871045 19172098 16378959 13977559 12360726
4797 12360726 11488915 10426564 9564760 8872830 8222347 7762870 7657372 7474355 7039076
4788 7039076 6731759 6459482 6315065 5987430 5776372 5797466 5477026 5279862 5179587 5235296
4778 5235296 5005156 4784643 4836677 4580697 4530952 4816181 4618831 4478858 4287680 4074603
4768 4074603 4036594 4024432 4277220 4216310 4008625 3948774 3954578 3667642 3614515 3783114 3986726
4757 3986726 4038000 3585595 3689818 3742061 3599938 3573892 3491946 3656216 3715817 3418469
4747 3418469 3409663 3472307 3451830 3450838 3184088 3242465 3404586 3340027 3711183 3802776 3298607
4736 3298607 3215043 3153430 3251975 3432112 3189326 3147119 3217553 3213097 3058429 2994310 2822957
4725 2822957 3026331 3076207 3201189 3174319 3005727 3137984 2774791 2806213 3033375 2975466
4715 2975466 2919871 2749113 2755944 2914133 3037089 2951142 2843377 2700258 2503384 2525781
4705 2525781 2814474 3000381 2885526 2868979 2732665 2719175 2645055 2950051 3105284 2799490
4695 2799490 2775377 2865353 3074985 2999313 2791054 2858180 2810816 2828110 3049471 3151664 3080549
4684 3080549 2941291 2897896 3036997 2956804 3087720 3041964 2691094 2933811 3189618 3199487
4674 3199487 3069423 2982158 3057376 2980204 3032407 3185352 3152008 3209960 3198598 3281318 3205938
4663 3205938 3260247 3560692 3626325 3486106 3498490 3791199 3872272 4029014 4156290 3992657
4653 3992657 3983474 3834769 3751198 3843630 3974696 3971361 3843021 4086623 4186913 4356596 4381962
4642 4381962 4345613 4754091 5031994 5437486 5614929 5779236 6078977 5900881 6279058 6730616
4632 6730616 6963010 7143257 7785633 8793685 9779130 11175034 12594819 13916535 15072287
4623 15072287 15297058 15144207 14223446 13189198 12357273 11620036 11265539 11195746 10996166
4614 10996166 11051173 11260931 11629599 12537207 13508976 14380052 15323689 16269680 16910259 17493562
4604 17493562 18414293 19705769 20692753 21860197 23270689 24649947 25501720 26228167 26505314
4595 26505314 26951413 27250464 27903117 28837362 29460754 29889215 30121817 29757088 28933519
4586 28933519 27948874 26922346 26192398 25534641 25006234 24451141 23530485 22079737 20983385
4577 20983385 19796924 18394244 17296662 16444288 15495142 14463917 13525550 12187377 11257027
4568 11257027 10295315 9321143 8561208 7942000 7112804 6779193 6283039 5725126 5338275
4559 5338275 5041027 4850832 4615400 4535221 4472273 4539248 4525326 4303762 4189486 3966550
4549 3966550 3661718 3528908 3534607 3639085 3765968 3819238 3470848 3551931 3670344 3446162
4539 3446162 3445492 3520234 3207200 3378361 3177918 3115569 3140975 3177003 3200319 3141685 3125121
4528 3125121 2970463 2875394 2613658 2449707 2680851 2949384 3011926 2771029 2484191 2493378
4518 2493378 2825019 2573105 2612953 2873424 2939963 2773935 2743090 2611247 2480707 2557661
4508 2557661 2457854 2421825 2387005 2343386 2367594 2208141 2099883 2240789 2309697 2414608 2277730
4497 2277730 2191307 2240901 2241646 2232691 2340461 2449532 2382570 2176310 2307630 2580149 2440391
4486 2440391 2391632 2373105 2316871 2405925 2036102 1967444 2119631 2235680 2316276 2360224 2281214
4475 2281214 2030229 1979627 2034753 2075666 2338595 2450425 2374566 2397496 2269897 2454686
4465 2454686 2244847 2315679 2442357 2168800 2111238 2235654 2339600 2384511 2268760 2006715
4455 2006715 2065090 2241600 2386392 2412907 2355878 2414923 2636220 2561589 2585911 2604629 2653421
4444 2653421 2506558 2663941 2638533 2523422 2423627 2468688 2651464 2769299 2811215 2614261
4434 2614261 2839281 3007599 3238243 2936728 2827072 2986702 2835976 2764353 2900412 3189044
4424 3189044 3311810 3343378 3399846 3317717 3251079 3311889 3263885 3404086 3314180 3293902 3407636
4413 3407636 3654458 3763834 3798218 3946652 3925151 4073991 4130103 4365357 4362671 4338714 4549240
4402 4549240 4619838 4728274 4705796 4839012 5074247 5185442 5233577 5314880 5409207 5384000 5245511
4391 5245511 5527937 5811803 6042906 6089511 6334553 6424732 6802045 7033025 7107099 7200379
4381 7200379 7635227 7997896 8032906 8383792 8672198 9230175 9535962 9679850 10268389 11007927
4371 11007927 11562286 12044781 12536843 13231570 13809201 14013832 14401971 14974150 15621073
4362 15621073 15583254 15492053 16045713 16768847 17126681 17506790 17772341 18168362 18707532 19174538
4352 19174538 19777943 20152283 20822704 21141016 21219878 21473627 21485660 21674962 21673260 21354772
4342 21354772 21080960 20964589 20943767 20610047 20583141 20491334 20692518 21132859 21161781 21249070
4332 21249070 21565843 21420310 21607714 21874422 22103882 21902402 21874457 21987520 21878540 21731863
4322 21731863 22144453 22285691 22653407 22819297 22953977 23332014 23629892 24041065 24508285
4313 24508285 24990349 25463006 26302508 26944981 27663364 28464093 29457859 30235978 31020499
4304 31020499 31886253 32321869 32723294 33305814 33711043 34026892 34055140 34083836 34309556 34423863
4294 34423863 34606648 34647840 34730800 34737265 34877798 34865423 34662314 34656404 34598096 34272879 34159771
4283 34159771 33851021 33140166 32464313 31575415 30587510 29819711 28884287 28228778 27606685
4274 27606685 26940231 26472574 26132328 25782219 25192120 24731413 24478377 23815039 23275520
4265 23275520 22928924 22411990 22209815 21738883 21586489 21656281 21551983 21177083 21229769 21091865
4255 21091865 20896450 20775054 20459692 20557223 20417632 20467057 20639252 20499123 20651106 20822626
4245 20822626 21186075 21327738 21708169 21785930 21741107 21857466 21605751 21590573 21462068 21405493
4235 21405493 20844261 20493626 20012839 19257930 18815897 18195692 17849014 17582358 17702280
4226 17702280 17244696 16847937 16645339 16600572 16320244 15870874 15219568 14840734 14302834 13778907
4216 13778907 13149082 12350831 11697887 11105025 10658316 10362605 10024789 9579874 9154115
4207 9154115 8761155 8564249 8389817 7953226 7680867 7538887 7577410 7460712 7189462 7065982
4197 7065982 7053808 6997467 6814533 6661455 6518689 6682880 6743956 6597785 6578525 6606159
4187 6606159 6642240 6622832 6584743 6627003 6576743 6381642 6386137 6316052 6618396 6836399 6663781
4176 6663781 6885739 6925916 7063329 7207955 7402774 7155314 7087943 7015087 7393293 7480415
4166 7480415 7591350 8045242 8477886 8642537 8888109 9022366 9014170 9074246 9314665 9507676
4156 9507676 9769248 10224154 10254758 10487929 10813152 11285180 11876527 12240888 12417865 12995688
4146 12995688 13623717 14334764 14826862 15029898 15510079 16127389 16763623 17096305 17139429 17475653
4136 17475653 17963411 17830363 17790345 17894439 18188793 18373176 18385269 18924747 19365454 19511645
4126 19511645 19628473 19903777 20460346 20754845 20810416 20933302 20921238 20789740 20602468 20583470
4116 20583470 20754538 20783216 20968906 20814980 21205037 21620497 21765972 21971110 22743760 23553047
4106 23553047 24393691 25635817 26510216 27339708 28250562 28945393 29524403 29874620 29818325
4097 29818325 29685451 29721383 29524791 29637180 29809488 29665391 30045367 30445721 30660459 30995205
4087 30995205 31636033 32477939 33220860 34014197 34548857 34871230 35307933 35606224 35637295 35499432
4077 35499432 35120242 34648531 34180474 33509398 33133639 32565752 31785811 31584547 30970407
4068 30970407 30495938 30497076 30728988 30597118 30117249 30060131 29722923 29343551 28929948 28315801
4058 28315801 27249523 26718070 26144464 25431483 24795792 24311192 23935180 23535008 23065399
4049 23065399 23065337 23041238 23263940 23232149 23489304 23938739 24554599 25202908 25671080 26469723
4039 26469723 27418686 28382442 29351079 30117594 30624832 30766793 30433137 30407482 30514663 30163465
4029 30163465 30039506 29942380 29741997 29453297 29457166 29224616 28796855 28098890 27224201 26744795
4019 26744795 26073937 25056770 24030669 23160027 21956236 20796253 19556275 18585373 17929729
4010 17929729 17293369 16517851 15889849 15266351 14841661 14434937 14224475 13902969 13248649
4001 13248649 12950685 12758142 12776763 12577208 12140039 11858165 11828474 11925585 11560658 11491088
3991 11491088 11437910 11230400 11210604 11132207 10891050 10786880 10697668 10548860 10808168 10868891
3981 10868891 10958599 10906109 10858365 10823813 10870833 10999442 10873531 11070855 11033924 10903377
3971 10903377 10716054 10679443 10498958 10697450 10778046 10953222 10917081 10980244 11137189 11048673
3961 11048673 11130014 11282565 11594571 11711893 11779861 11680996 11980132 12303066 12398222 12679673
3951 12679673 13186342 13578791 14147072 14554935 14968020 15349529 15888106 16505545 16942320
3942 16942320 17532946 18118762 18532751 19087183 20354502 21685179 22897291 23727687 24123857
3933 24123857 23904492 23893946 23341995 23086110 23006686 22557814 22432143 22641702 22706122 22681436
3923 22681436 22639733 22907719 23152492 23249159 23599819 23358011 23658216 23973448 24384999 24649401
3913 24649401 24693688 24677846 25031079 25819220 26279567 26778386 27201249 28178233 29369885 30137604
3903 30137604 30371890 30473385 30125458 29303308 29027041 28904684 28497620 28119285 28371110
3894 28371110 28604695 28726965 28769114 29233114 29721038 30411883 30841837 31016930 31452476 32104966
3884 32104966 32892501 33569693 34429567 35451825 36529761 37635492 38674447 39945313 41563804
3875 41563804 42828070 43914216 45107259 46552981 47914143 49090083 50085546 51011245
3867 51011245 52136645 53297322 54272058 55028814 56183078 57372489 58447396 59825442
3859 59825442 61046696 62634389 64602832 66137993 67754936 69481966 71239042 72763297
3851 72763297 74247381 76103841 77946620 79563356 81327364 83614231 86157264 88451721
3843 88451721 90939366 93252798 95208069 97034402 97924137 98475381 98622436 98652626 98389657
3834 98389657 97908901 97683980 97614838 97919194 98641027 99590223 100751318 102018013 103347646
3825 103347646 105080419 106423220 107230962 108039985 108236376 107751509 106880998 105395025 103060609
3816 103060609 100822072 98440869 96145148 93591989 91625193 89878892 88118065 86620163
3808 86620163 85017981 83653240 82151834 80539557 78655612 76834311 74741769 72721728
3800 72721728 70368921 67903887 65194839 62657852 60207266 57785084 55529277 53429551
3792 53429551 51207364 49104670 47676713 45994713 44173561 42717444 41206339 39870841
3784 39870841 38644759 37494524 36319204 34735065 33678595 32777291 31763499 31023936
3776 31023936 30329486 29557662 29155220 28367372 27528208 26880711 26217201 25833378 25171860
3767 25171860 25050344 24671337 24033164 23626818 22865327 22282505 22004588 21773053 21387115
3758 21387115 21450387 21339207 20924820 20532701 20136525 19911826 19586686 19365071 19227855 18978920
3748 18978920 18611384 18576262 18579165 18273741 17815942 17968053 17855944 17836618 17622929 17390708
3738 17390708 17297058 17259310 17350261 17293285 17140803 16879368 16808260 16854290 16898720 16693804 16688475
3727 16688475 16835446 16647225 16478292 16781522 16850659 16674324 16716729 16781627 16758795 16835979
3717 16835979 16904026 16681530 16737507 17169879 17149028 17527478 17832791 17916205 18052074 18240126
3707 18240126 18393595 18785301 19363081 19620102 19839498 20864693 21466580 21778013 22294456
3698 22294456 22781070 23730319 24380021 25237559 26304717 27510316 28477790 29655101 30477826
3689 30477826 31342178 31931305 32322686 33094949 33455018 33806888 34055484 34097379 34260864 34270489
3679 34270489 34025546 34213366 34333280 34362348 34366166 34450196 34631509 34994147 34991588 35361744
3669 35361744 35754576 36072558 36662425 36855671 37094600 37625134 37743773 37656705 37675830 37957430
3659 37957430 38277366 38746709 39277862 39890979 40322104 40811227 41679545 42489593 43449347
3650 43449347 44477627 45477085 46585688 47714184 48449077 49011165 49489425 50372396 51232152
3641 51232152 52030625 52815674 53508785 54568292 55620335 56365762 57177522 58066701 58838367
3632 58838367 59475174 60056522 60465731 60804991 60982855 61267689 61309578 61273222 61107896 60933696
3622 60933696 60955239 60720919 60527544 60392120 60062843 59795152 59417413 58866559 58521779 58154252
3612 58154252 57696305 57103273 56362836 55384594 54558651 53579314 52638440 51852312 51119307
3603 51119307 50372299 49608142 49143257 48901868 48783422 48818079 48698822 48918103 49282270 49778638
3593 49778638 50218837 50818579 51493868 52073390 52694678 53422438 53836581 54048790 54186334
3584 54186334 54193526 54348285 54520189 54527812 54311545 54113003 54137358 53936400 53618194 53383768
3574 53383768 53134588 53042742 52852301 52432800 51821619 51448279 51229681 50772634 50088552 49769669
3564 49769669 49388194 49054898 48547041 48290561 47782304 47596389 47431704 47212719 46545856
3555 46545856 46076922 45712347 45258511 44900872 44647925 44508991 44149338 43769911 43651676
3546 43651676 43552600 43872784 44097514 44360872 45081327 45940478 47020689 48876983 51460342
3537 51460342 54190947 57549141 61877268 66333045 70002866 71944843 72044322 70795372
3529 70795372 67942797 64473361 60835899 57172072 54258364 51697070 49354855 47602137
3521 47602137 46523779 45968979 45404026 45112828 45097908 45637358 46033824 46743230 47335054
3512 47335054 48355352 49892706 51469001 53346920 55919298 59113105 62922942 67735125
3504 67735125 73919551 81160087 89773003 98972497 106449240 110342603 109589442 105115782
3496 105115782 98369723 90354369 81661288 73126710 65604131 59314481 54124260 49662812
3488 49662812 46005930 43188146 40620593 38871302 37588839 36268396 35301108 34835472
3480 34835472 34296337 34169149 33959962 33764254 34580683 35164596 36419788 38103812 40116170
3471 40116170 42688592 45618327 49129235 52840242 55828180 57584081 57263662 55498560
3463 55498560 52630746 48704372 44438407 40353608 36734118 33656834 31219210 28930481
3455 28930481 27354346 25864886 24724341 23427033 22287838 21726642 20880769 20202250 19538621
3446 19538621 19192212 18704888 18386745 18259549 18250010 18140993 17857428 17605778 17645962 17695055
3436 17695055 17823018 17863367 17805244 18112656 18304049 18362827 18446908 18287834 18821136 19094660
3426 19094660 18925661 19011643 18536111 18080013 17419825 17270765 17072019 16792536 16353188 15972037
3416 15972037 15913595 15914851 15941374 16038628 16081125 16164300 16254499 16274770 16146091 16216663 16402337
3405 16402337 16184586 16114032 15964245 15868098 15860160 16134984 16271541 15932885 15927835 15837197 15615347
3394 15615347 15609123 15568700 15485639 15635623 15173853 15136228 15335106 15227161 15308567 15111981
3384 15111981 15102237 15217424 15201636 15477406 15739814 15962779 16214442 16374274 16653393 16775039
3374 16775039 16986892 17430826 17500493 17541570 17592615 17502818 17826977 18194727 18251149 18003104
3364 18003104 17759373 17695494 17699685 17553754 18050692 17977841 18025184 18114987 18242090 18513161
3354 18513161 18671632 18932224 18807571 19227262 19425115 19096279 19316775 19287991 19171005 19128056
3344 19128056 18898298 19400420 19477233 19582109 19818922 20062792 20266503 20313454 20387445 20593756
3334 20593756 20988833 21342114 21588953 22195989 22454175 22843430 23527138 23973802 24529647
3325 24529647 25141050 25810790 26606035 27547302 28642158 29739236 30617091 31941847 33120799
3316 33120799 34172560 35552145 37077113 38788923 40288740 41967996 43918713 45692497
3308 45692497 47165012 48461599 49656099 50538587 51170429 51422481 51448335 51532627 51181254
3299 51181254 51036806 51105298 51337287 51887152 52389909 52889820 53681187 54804468 56010862
3290 56010862 57214168 58705019 60228499 61686753 62666455 63350677 64038015 64841260 65102284
3281 65102284 64641913 63951253 62895346 61429103 59672941 57873147 55976888 54317573
3273 54317573 52864886 51434196 50491985 49749102 49301311 49113846 49050058 48878485 49421902
3264 49421902 50261558 51256385 52289358 53637637 54758893 55330320 56195978 56843168 57285740
3255 57285740 57760074 58382423 58911167 59821713 60761509 61648023 62352810 63405334 64242255
3246 64242255 65245881 65763231 66213536 66518154 66544506 66371798 66432465 66638441 66788397 67280285
3236 67280285 68057084 68691178 69686868 70940170 72284489 73582270 75070840 76828031 78752063
3227 78752063 80165038 81677806 82771292 83972962 85257554 86231403 87236626 88575997
3219 88575997 90412303 92634159 95517650 99069135 102984053 107486646 112512067 117436301
3211 117436301 121789008 125536527 128375767 130343100 131440634 132800994 134008130 135618607
3203 135618607 138375369 142254069 147497526 154151435 162634615 173004536 185222022 199601761
3195 199601761 217281890 237825634 261831570 289513842 320689690 352892292 382661768
3188 382661768 405020039 416152246 414089617 400230302 377751315 349781390 319009763
3181 319009763 288652810 260269144 234982323 213221157 194815653 179197195 166279440
3174 166279440 155225581 146227094 138169413 130856341 124524345 119301524 114513258 110378475
3166 110378475 107089165 104032918 101415053 99554354 98635613 97638291 96988132 96964728 97247390
3157 97247390 97612996 98223583 99310556 100186674 101277710 103015927 105129107 107178332 109950806
3148 109950806 112607049 115906835 119179147 122664993 126553030 130393573 134947870 139861560
3140 139861560 145354711 151720903 159306514 167719561 177496961 188897350 201988870 216831684
3132 216831684 234413583 255097393 278922529 306300814 336902910 369476899 401823250
3125 401823250 431004750 453046088 465207004 466627303 457408204 440229334 417568337
3118 417568337 392664448 367482355 343419174 321473612 302261059 285061711 270281885
3111 270281885 257235296 245431265 234884189 225313024 217463752 211192951 206073699 202873089
3103 202873089 201629092 201864906 203947825 208023914 214902939 223927779 235441083 250106804
3095 250106804 268223552 290095860 315274049 344097496 373915054 401592105 422890555
3088 422890555 434759703 434948009 423469940 402487665 374451241 342893840 310273163
3081 310273163 279230949 250308712 224861984 202773939 184085476 168264616 154644275
3074 154644275 142721710 132395921 123548868 115833050 109152403 102947662 97214573 92187774
3066 92187774 88058815 84156692 80543647 77295173 74679561 72157441 70248639 68383426
3058 68383426 66662500 65274772 64055162 62998116 62111766 61106799 60295478 59691457 59348033
3049 59348033 59708300 60143830 60699661 61592297 62675904 64101513 65354375 66151455 66760397
3040 66760397 67071668 66489424 65424048 63799721 61201506 58394188 55449089 52618309
3032 52618309 49816997 47006522 44527186 42244928 40282463 38193803 36536616 35114408
3024 35114408 33833819 32649172 31419270 30697146 29785052 28730206 27841102 27078160 26191945
3015 26191945 25430164 24865440 24270332 23589095 22880077 22242428 21750973 21289213 20714048
3006 20714048 20233509 19940238 19505671 18915320 18383404 17979926 17877974 17281584 16496317
2997 16496317 16208070 15892897 15707959 15325156 14994140 14573552 14395292 14245799 14116567
2988 14116567 13548640 13256173 13202334 13002537 12448880 12183646 12178209 11930937 11659142 11348732
2978 11348732 11148121 11018180 11088676 11045411 10737178 10573215 10331825 10179577 10104538 10013648
2968 10013648 9770007 9408034 9258373 8903443 8770913 9094270 8684251 8418542 8587690
2959 8587690 8336027 8294208 8024881 7859221 8166846 7750223 7783998 7686349 7327014 7172701
2949 7172701 6960149 6922062 6736564 6634680 6912418 6960676 6798447 6812817 6447541 6252937
2939 6252937 6130244 6168551 6041364 5747271 5573241 5722343 5818183 5913161 5658268 5649154
2929 5649154 5447755 5419437 5615866 5423248 5469291 5763845 5666483 5405672 5348703 5359017
2919 5359017 5139109 5091819 5215821 5275637 4898868 4862486 4984918 5199760 5081127 5112804
2909 5112804 5382779 5292633 5298098 5250401 5414998 5400062 5208497 4978861 5122894 5152140 5286331
2898 5286331 4871036 4583662 4636683 4531431 4529997 4624617 4424817 4041224 4113124 4056515 4085494
2887 4085494 3963306 4079731 3971836 4001871 3883184 3753825 3928113 3806201 3670691 3638663
2877 3638663 3647582 3687615 3726385 3335383 2982883 2861428 3057932 2874219 2718111 2797571
2867 2797571 2696446 2606580 2606397 2469352 2400177 2546165 2522131 2580964 2549114 2633711 2484183
2856 2484183 2457949 2772605 2791145 3077729 2985640 3020653 3001862 3177131 3177744 3161713 3489844
2845 3489844 3790750 4021295 3994669 4001138 4210133 4109742 4249278 4057951 4123879 4064829
2835 4064829 3898728 3947627 3588479 3516393 3440902 3166758 3090208 3193122 3247100 2916636
2825 2916636 3062451 2968617 2685418 2890135 2821207 2538515 2642486 2687091 2669207 2770064
2815 2770064 2921794 2963719 2693420 2898601 2719946 2839320 3030417 3022916 3025272 2878348
2805 2878348 3049779 3652852 3596460 3642482 3714827 3634784 3190969 3017931 2975687 2641798
2795 2641798 2435675 2487176 2337911 2388050 2218940 2271094 2261073 2274213 2272745 2294897 2197113
2784 2197113 2295184 2071287 1867999 2163614 2125958 1869549 1742541 2044763 2082838 1992609
2774 1992609 1706130 1585511 1506056 1548934 1745626 1809925 1718681 1634794 1729164 1637587 1524649
2763 1524649 1780895 1819032 1963400 1900161 1750347 1918393 1857042 1598734 1570144 1443873
2753 1443873 1420426 1269101 1417079 1297713 1231264 1415373 1339729 1307881 1545923 1543465 1351637
2742 1351637 1559008 1614029 1569624 1567471 1641926 1208224 1135570 1113201 1131893 1231709 1374444
2731 1374444 1438382 1183179 1456695 1525048 1351337 1184752 1117081 1314397 1184109 1180808
2721 1180808 1180411 1273107 1186238 867868 1004237 1076016 1135277 974083 920292 724331 706879
2710 706879 888936 902762 917769 866669 743399 989216 1028178 1202224 1153361 1170248 1175938
2699 1175938 946938 901375 1273289 1207463 1140490 1285766 1089613 904124 1101495 1143807
2689 1143807 1119067 1088916 1169948 1258948 1078062 1192497 1123114 1219109 919945 980412 1274547
2678 1274547 991394 861590 1015744 1203769 1043719 1065504 749840 928974 887331 836585
2668 836585 1099126 921165 991824 789055 1012889 1046134 910094 702918 733097 584076
2658 584076 583609 721551 646910 568874 449116 731261 770196 725881 533453 557924 593902
2647 593902 702876 697458 648053 747509 453530 498174 545413 727108 672588 482717 483564
2636 483564 470691 626868 513776 603557 654083 757422 950939 784463 845077 794995 982173
2625 982173 851909 771633 934801 1027245 1091908 1126482 858245 952016 874552 980117 668924
2614 668924 414298 232570 123887 376609 621532 735780 424216 399343 393968 526720
2604 526720 640983 575484 640710 604321 1006913 838033 630948 783601 704055 659905 489952
2593 489952 781433 854522 794745 935801 758152 602166 639561 678586 1027536 1077546 842480
2582 842480 934097 1027454 899971 618903 710041 764875 659569 899187 816550 955492 1255819
2571 1255819 1444374 1219048 1197678 1489318 1482973 1465032 1369228 1108553 986480 1065838 1183532
2560 1183532 1113694 1104194 1167103 1238485 1131586 854858 658065 690828 682561 741583 709130
2549 709130 805174 869362 973573 1055530 1181921 888136 526813 374401 479723 634510
2539 634510 709372 483156 671088 839386 733828 708212 813217 924919 759834 733931
2529 733931 807638 566456 652540 674276 818422 976351 860919 733070 649732 474586
2519 474586 556624 576115 788088 1195869 928576 670637 289168 575860 528029 535413 607107
2508 607107 673756 869291 553128 578869 831219 536160 455160 484164 584427 773310
2498 773310 595284 535211 580111 595739 659901 638302 675941 825930 819092 503636 650165
2487 650165 960486 707594 583446 523754 209862 475307 589437 750749 883781 700176
2477 700176 477794 696511 837526 674084 583621 718403 807509 767435 900432 1029467
2467 1029467 864094 921718 946011 831944 815959 1018323 880239 851133 1050649 650529
2457 650529 732335 741680 679732 660030 569735 679063 764404 665719 807531 904788 713058
2446 713058 638442 595798 528772 657478 947982 1008614 819009 676946 846355 1061771
2436 1061771 1163012 1040996 1240933 1037088 933954 988479 882924 1149865 1078532 1046900
2426 1046900 935328 1093177 1148891 1092054 1062717 1011777 1193696 1049983 935081 838301
2416 838301 752472 1014789 1175476 1277528 1282539 1310553 1165167 1259408 1373520 1160416 1049057
2405 1049057 1492533 1499559 1593488 1667116 1726118 1811943 1627823 1672196 1831032 2037775 1984271
2394 1984271 1839680 1978519 1936314 1619763 1717062 1802279 1950296 2012259 2265425 2246392
2384 2246392 2167410 2096626 2136676 2245235 2326206 1940677 1989836 2024175 2236447 2208577 2307318
2373 2307318 2337636 1885333 1979477 2226061 2267114 2221995 2562778 2666876 2695657 2793058 2993971
2362 2993971 3257361 3755110 3512715 3500345 3705926 3910170 4063829 4519229 4548840 4606009
2352 4606009 4413489 4521937 4774372 4992987 4993763 4883704 5177180 5433180 5663684 5669530
2342 5669530 5913051 6433296 6754764 6911999 7195635 7503392 7923607 8390225 9013896 9200860
2332 9200860 9345807 9468360 10110315 10765449 11371508 12099920 12855684 13924127 14802893
2323 14802893 15746945 16832864 17956614 19349182 20826390 22669831 24761662 27131283
2315 27131283 29100278 31575062 34183247 37028844 40434682 44329841 49064447 55030979
2307 55030979 63379390 74194140 87082421 104849800 129545192 157700815 178279048
2300 178279048 181502458 172588436 158336131 139834897 119514620 100441083 83206254
2293 83206254 68851938 57924964 49728025 43153233 38497870 35514508 32819979 30761371
2285 30761371 28669322 26420943 24857572 22938456 21070324 19369042 17737086 16304453
2277 16304453 14969015 13952626 13041813 12477907 11637321 11079510 10945441 10483848 10109846
2268 10109846 9632786 8891239 8407569 8251693 8211122 7615677 7165856 7190227 7280300 7073555
2258 7073555 6928467 6910148 6583725 6287015 6013004 5768927 5634567 5610449 5524374 5267753
2248 5267753 5055496 4783174 4726030 4823928 4476396 4425380 4544002 4421685 4114540 3982950
2238 3982950 4007133 4036141 3932114 3938557 3878851 3763625 3835649 3797616 3611025 3450825 3464482
2227 3464482 3425627 3127273 3060694 3066605 3035042 2820554 2732338 2667626 2667291 2452021 2530672
2216 2530672 2714953 2637440 2455388 2433024 2455283 2117945 1943379 2159013 2116131 1587259
2206 1587259 1791983 1686156 1775401 1806817 2040305 1902226 1767221 1947906 1917802 1763004
2196 1763004 1706786 1414457 1486179 1660909 1687757 1897507 1827583 1821093 1623794 1270620 1406536
2185 1406536 1606304 1644356 1623897 1456860 1497242 1474993 1190618 920226 976648 1060364 1049631
2174 1049631 1105830 1218018 1091459 953870 854317 829279 768137 641400 779238 1021475
2164 1021475 1053824 933001 610307 583047 669391 902734 844715 852838 684541 705107 737880
2153 737880 677607 760140 904028 813938 636880 772841 782735 901515 847347 694967 632332
2142 632332 714961 732921 558196 642883 668374 709296 678796 433803 368085 561659 789123
2131 789123 621658 704954 981253 818981 784636 395568 109317 318369 696654 645909
2121 645909 530149 542365 467650 483242 500204 526881 450309 498046 451104 581167 588960
2110 588960 630053 268260 405403 520503 413873 339725 272990 434077 558468 578897
2100 578897 449145 505238 499576 528402 409211 197559 281156 312135 448247 340426 340567
2089 340567 210059 133370 45632 -33092 128754 60526 73701 77955 198225 124337 283413
2078 283413 228255 -53503 -93202 -66955 -222720 -243391 -111348 -91317 -80809 -82108 75162
2067 75162 110373 -9875 261590 425843 228360 201648 385970 349166 259974 151896 229211
2056 229211 247753 -4955 -90066 109162 153256 257236 170452 259476 267781 138340 382062
2045 382062 356111 79456 167915 398568 323617 482485 668987 514533 420990 509603 675479
2034 675479 857146 747142 696531 765715 729672 828381 898290 533424 496076 472214 303928
2023 303928 554030 447791 330140 498151 402470 226659 121396 295082 331892 417946
2013 417946 115358 98277 90946 229186 68399 108280 186359 341865 421429 441269 149165
2002 149165 -10498 312930 295539 273328 -21266 130141 181494 -147339 -263253 -34085
1992 -34085 158160 435929 473583 273786 9040 93150 158646 77488 82136 160011 299764
1981 299764 42884 -193635 -194254 -362660 -230624 14964 97292 -215844 -206041 -116377 -6968
1970 -6968 -138151 -100083 22318 -58685 51008 97485 287825 304757 -92606 -8337 110991
1959 110991 328738 288781 395 34017 94428 115137 -46947 151680 203592 92489 187204
1948 187204 177581 278251 358590 212830 99466 24022 98750 229778 177881 189407 166059
1937 166059 72915 356031 288453 117351 136265 121038 58927 206615 161342 -87017 -238352
1926 -238352 -395394 -242747 -189080 -165546 -249211 -239477 -63944 181350 141378 256393 441360
1915 441360 166705 -317643 -238190 54554 96644 -16809 98854 140386 176315 162298 56202
1904 56202 -28630 -123447 163973 157564 10547 -30021 -96324 -107724 -32728 131314 275337
1893 275337 275899 115449 -197836 -191128 -258754 91169 138973 -38686 -123059 -50412 -101985
1882 -101985 -151541 -178641 36182 -2205 123505 266009 212408 110077 239493 199852 313859
1871 313859 123835 -213643 -209913 96962 170682 -147954 -21735 -231588 -144835 -151166 -81324
1860 -81324 -60541 46619 -51845 -204995 -135266 -62139 98172 -150278 -160927 -209926 -87373
1849 -87373 -136568 -174629 -129804 -229745 -34273 -64146 -155009 -198874 -272735 93180 270493
1838 270493 172699 373419 145047 87431 -102656 -146317 -130820 34884 -63359 -66003 -47750
1827 -47750 -141395 -167096 -302946 -294345 -201798 -228529 -131057 -42641 -76161 -90169 -60428 31901
1815 31901 91652 303227 346008 14799 -79626 64353 -61380 -95324 -20268 -88176 -15249
1804 -15249 -19362 -36662 -245097 -173070 5627 25655 -48705 -232940 -228838 -84552 -4678
1793 -4678 228754 26646 119134 58780 -76210 -56293 -203410 -223554 -246501 33691 73537
1782 73537 26831 -45433 -59983 -82561 -82703 -54111 -32252 323520 148047 -45605 63213
1771 63213 142776 57986 -41666 26183 -28293 -193830 -118495 17158 -84926 -82086 -54450
1760 -54450 30176 -86832 -143155 -12862 6734 -6350 -69240 -57311 92070 226272 270472
1749 270472 221088 420619 283715 127745 -326232 -454350 -533378 -505688 -354453 -170888
1739 -170888 76460 235192 -55722 -165835 -257704 88124 -177622 -171961 -179449 -360035 -358207
1728 -358207 -303235 -154376 -220137 -280372 -21403 208582 177160 -21337 45785 84132 40203
1717 40203 252480 100313 -27609 -235303 -274408 -256830 -141290 -237010 -260850 -107383 -114318
1706 -114318 -162797 28985 97994 -138546 -253308 -315927 -46644 -15133 -152020 -186102 -164792
1695 -164792 -16752 -51507 39905 -63287 110608 -56320 -83116 -54272 165729 300657
1685 300657 174718 -81589 110474 104061 125743 19718 -53638 -130349 -129403 26962 -255957
1674 -255957 -270881 -134522 16411 -4451 -341038 -157817 -71219 -61438 -219050 -57679 -24592
1663 -24592 -120944 -33827 -6590 256527 217382 69475 -33325 -84772 -110058 -144235 -137116
1652 -137116 -187490 -215162 -170328 -176806 -156817 -167453 -242845 -262875 -22628 -183177 -233813
1641 -233813 -302983 -46070 51733 -266284 -312636 -172532 -12131 -230569 -93090 -117663
1631 -117663 -175802 -77219 -324851 -306430 -65978 237011 196494 177592 29332 41596 174275
1620 174275 3226 -80247 62269 -120596 -388474 -460066 -240699 -58288 -62806 -35524 -109124
1609 -109124 -225967 -245152 -182932 -244434 -313192 -202778 -316774 -394400 -275195 -230165 -29336
1598 -29336 -196469 -43419 162464 32810 24207 -32084 24572 -42129 -251546 -303739 88044
1587 88044 90531 104097 118888 -59939 10875 -176076 -48176 -159994 -241320 -138876 89757
1576 89757 73381 23752 163728 57011 -282501 -359534 -326122 -243697 -252431 -237129 -133324
1565 -133324 -224583 -269026 -97352 4794 17806 113730 260599 119671 -114014 -36343 -193630
1554 -193630 -185693 -106700 48351 163275 17195 -40984 301591 254054 285428 65671 231012
1543 231012 201552 -153598 -149106 -104097 -169940 10007 71721 227109 380573 21653 -77473
1532 -77473 -136801 -13630 -42079 -203054 -292554 -69183 29701 -224988 -16212 168607 -94961
1521 -94961 -263100 -273431 -207165 -286893 -316797 -392027 -287559 -269887 -195312 -13640 -173704
1510 -173704 51597 -77852 -333436 -271884 -77290 -93915 84827 39478 -82119 -126148
1500 -126148 -97990 -16533 -248665 -271761 -74923 -113210 -205938 -167095 -45951 -218459 -432917
1489 -432917 -387832 -169780 59022 118769 -137212 -52810 -86013 -293731 -309769 -188610 256905
1478 256905 -52415 -3822 49610 45670 -51713 -104534 -319540 -236071 -20768 -24250 -244893
1467 -244893 -358975 -52888 43290 47372 -46134 11732 31301 -273526 -293969 -416384 -425183
1456 -425183 -545401 -165244 53436 -255694 -332995 -294115 -133680 -277938 -200407 -174985
1446 -174985 -152303 -120383 -282100 -360278 -167953 -179955 -268951 70414 19959 -70317 -145915
1435 -145915 -4466 44583 70898 -95206 -61714 -106371 -213626 -28936 -14131 -121543 -76601
1424 -76601 -84988 -56306 217228 220586 336534 75115 137038 173535 -41474 -118989 36839
1413 36839 183313 -162979 -407041 -70537 30124 4715 6974 17862 117476 35467 112836
1402 112836 117974 -270204 -380206 -128769 -4240 17462 43792 138582 -37678 7285 -16989
1391 -16989 108531 156556 141370 17716 344 222578 -243532 -387039 -165940 -237601 -451871
1380 -451871 -399477 -322948 -108462 -188049 -318830 -203762 -378652 -182685 59572 -19720
1370 -19720 170617 270354 -15032 -270958 23103 50937 102912 -19893 -35374 -262094 -343538
1359 -343538 -291297 -127520 71348 -39538 41836 -22349 -207912 -115599 -39408 -240353 -131174
1348 -131174 -3963 30828 761 36976 79156 9441 -400468 -394345 -185362 -256907 -120865
1337 -120865 7709 -226786 -63140 -25835 48861 132095 421855 530720 477847 313040
1327 313040 52407 -74880 -363712 -341253 -240830 -227983 -199143 -179803 -308154 -210742 -51842
1316 -51842 100954 -29000 -79596 -54147 -20219 -80449 177670 326349 281337 113298 207456
1305 207456 160806 58920 109894 222951 51992 128886 -8480 -48896 118263 193333 -84022
1294 -84022 69137 113745 46770 78354 -27611 -279098 -291007 16947 -27504 -84348 -177450
1283 -177450 -44878 -71803 79294 172702 98997 46930 161 -116193 -310035 -164631 96628
1272 96628 -103685 -163673 -74936 102047 -214812 -299140 -444263 -113784 -202274 -453694 -308493
1261 -308493 -224828 -97673 94009 54304 -147300 -479235 -418887 -379425 -340884 -112815 -100441
1250 -100441 -190786 -361030 -441135 3830 -6472 -241432 -124099 -135890 -202250 -194496 -320160
1239 -320160 -181893 -257621 -152950 7311 -233481 -51223 -149322 -312977 110955 42038
1229 42038 -336858 -4084 -5695 59640 -26440 -177790 -148058 97857 102228 -84374 171171
1218 171171 273362 32030 -170735 -34668 -64111 -73894 -207184 -187606 1163 -12770 -300942
1207 -300942 -337488 -105215 -8509 79326 42617 -231155 -281448 -208063 -312010 -427973 -119161
1196 -119161 79588 146666 133696 -49578 -257510 -331753 -157577 -338165 -267875 -402054
1186 -402054 -179403 -96791 -377679 -276145 -141012 31120 227201 120064 307536 256736
1176 256736 -95241 -26322 -42939 -65562 -35754 -207198 -295269 -294889 -189551 -173060 -367452
1165 -367452 -420939 -284209 -327418 -168590 -49670 -270160 -291084 -413439 -387460 -280177
1155 -280177 -67246 -43884 -54987 126914 91648 -16054 -82109 -6006 -220132 -219183 -352696
1144 -352696 -225607 -63943 -20450 -83746 123529 -8149 -224356 -226721 -51126 -205129
1134 -205129 -221337 -177821 19687 44425 -35784 48244 42444 22681 -51669 -57107 -141424 -197979
1122 -197979 -365741 -209805 -226839 25585 -42560 -340050 -102010 -64826 -8912 33560 -31352
1111 -31352 -169784 -51565 -43567 -116864 211381 382821 310937 -73663 -149248 86914 218469
1100 218469 37816 155790 1738 4329 111066 59728 243776 196556 -113803 133324
1090 133324 -74115 -91718 -121486 -284637 -184710 21219 56244 -24592 242563 296201 131520
1079 131520 163120 -138085 -152767 265200 323199 294092 -26019 -85175 110330 57337 45895
1068 45895 123089 -172015 -114556 -76343 -120486 -274232 66959 161954 -18440 36230 49500
1057 49500 -255113 -479432 -218654 -39282 -79920 -87485 186998 86888 -72246 -42665 -203294
1046 -203294 -182229 -42871 -258790 -209721 -275768 -130280 78653 -19901 -193760 -368079
1036 -368079 -421453 -498572 -569459 -50852 39515 101417 171830 -47752 -147111 -176240 -52442
1025 -52442 -212094 -152799 5739 -19265 -21956 -85258 4142 594 -83239 138121 391431
1014 391431 250920 96329 236929 324357 351433 259239 166370 287337 232089 35782 54301
1003 54301 -58665 -128114 -50678 -388118 -313068 -206006 -24887 169376 194279 221032 333403
992 333403 274033 172900 219231 -29162 44767 -232525 -294220 59389 254732 247984 114468
981 114468 -102080 73299 135451 75070 208989 212584 -15393 -48977 24018 58583 44373
970 44373 -124271 -233896 -242187 -175751 -148032 -241156 -43048 115745 12349 -13394 -9646
959 -9646 -118865 -31800 -33723 12820 -168844 -168100 -45029 -65695 49404 98059 -266028 -550614
947 -550614 -424065 -294711 -134178 -146158 -139772 -162986 -95868 -97618 18220 -221776 -373481
936 -373481 -260609 -102710 -217129 -203469 37670 139947 -76635 -164079 -220907 -128093 44591
925 44591 96682 192416 313540 145887 -56389 -15236 -109320 -326747 -135717 216795 -30708
914 -30708 -162397 71539 114891 -24042 -5794 -79735 -45729 -71655 -59980 -222205 -31673
903 -31673 69230 -73365 -411188 -279482 -321259 -323872 -456480 -278254 -202887 -360237 -91626
892 -91626 196659 144529 -22896 196962 -97270 -47427 208955 157941 39426 67306 131527
881 131527 159962 125227 105949 193088 168671 177310 241215 -13268 -96089 -74862 110468 265613
869 265613 219183 266646 208363 106034 -62763 -254886 -259452 157038 220319 20976 15346
858 15346 125368 86071 78 -99885 -151734 133037 -17332 -294348 -138540 13473 -16286
847 -16286 -26244 -26106 102722 62621 283631 61270 41881 175672 151697 -30062 -37331 36455
835 36455 59974 130997 124976 104074 -154100 -92669 -92754 -81469 27803 10045 -156572 -198989
823 -198989 -126475 -101970 -107390 -89883 -162450 -67341 -43789 -183849 -72860 177730 198214
812 198214 50065 62457 -66661 13035 9966 -86363 -13823 125098 99305 -142511 -88643
801 -88643 -107558 44895 -2419 -11321 97900 50734 -73249 -115164 139156 -149418 -148798 -89286
789 -89286 -20915 141717 9129 48937 126622 -72224 -77308 -164800 -49033 4845 -93814
778 -93814 -253956 -206370 -47703 -218904 -254985 117887 288775 129463 -65377 -72614 30166
767 30166 118226 -116591 -241025 -299638 -195856 238573 222986 165286 -44880 -14783 117067
756 117067 199872 80996 165719 100437 -84087 109202 -70792 -149164 17518 -35035 -277256
745 -277256 -280529 -169426 13737 24852 -163879 -62253 -132637 -396543 -455533 -169898 -69039
734 -69039 -131334 -62591 -11052 -260165 -223580 -19857 117930 5975 25589 108494 272377
723 272377 244312 140796 319762 90292 -26179 257454 41271 126484 241082 126892
713 126892 160698 -53258 -241369 -21158 26981 24094 59142 211042 65559 100958 -121748
702 -121748 -56644 112807 13526 88567 78570 20976 -118605 -188365 -40929 140490 72694
691 72694 62774 154733 -139610 -12337 280192 99931 -110289 -222029 -97598 -117399 -6133
680 -6133 69700 -19464 175467 37618 -130222 49708 -123474 832 -56882 -756 -69824
669 -69824 -48436 -67261 -90099 -82117 -85593 -262497 -253842 143953 283253 -146456 -11618 128402
657 128402 263398 256715 340418 292914 179071 191397 156980 217485 109278 -98046 -107038
646 -107038 -131817 -109051 202854 228804 107232 19547 78691 38385 -88091 -194691 16645
635 16645 5009 -215119 -87276 -114338 -225556 4574 85194 -28968 -132507 -239908 -93483
624 -93483 -107376 45721 117825 -186054 -103833 -86548 81709 710 39794 155361 42937
613 42937 -162228 -253247 -248892 -226691 -44766 -204266 -276754 77498 215491 14304 79337
602 79337 81057 -148307 59885 -19015 -119864 35866 6934 -20280 15195 259352 327078
591 327078 265411 331623 266999 209305 219612 267860 318162 218446 34693 207178 275911
580 275911 310785 77919 266334 536699 246262 279089 206304 -83568 -8153 53037 -99699
569 -99699 48393 62915 -133436 -78963 173479 220516 237483 165072 -94317 -193752 -29553
558 -29553 135823 19991 -236980 -424176 -483754 -20979 110310 125550 -257261 -335607 7371
547 7371 127480 36472 -73384 106271 51998 47977 152125 17379 -137182 -81116 -9178
536 -9178 -127115 -240060 -304111 54891 6707 18669 265256 212458 123255 -124218 -30471
525 -30471 52394 84494 32318 -48894 -134182 -221146 -185590 -216123 -227337 54648 175915 144034
513 144034 -8601 256728 307560 343032 210897 204333 188948 496843 402333 145502 382370
502 382370 371966 266308 -83923 -12410 37405 137607 23351 -63939 -12844 -78350 115877
491 115877 330716 179658 210519 -29383 120257 108597 40321 204431 323778 62881
481 62881 146895 222954 151367 270399 208949 280746 132366 -162769 109045 155824 140947
470 140947 114195 71497 62295 -109463 100049 61585 64310 135388 297459 90081 14125
459 14125 86766 115028 152841 186842 114117 -46404 -74661 238816 264062 206052 57091
448 57091 88290 49470 193501 -133491 -4518 167384 -60969 -105119 291020 255708 124968
437 124968 373920 305655 343897 265692 73804 -92839 -63438 -9009 153387 286209 172931
426 172931 118695 56277 189658 233718 297009 365766 151895 54304 209883 197536 260987
415 260987 108464 25157 204006 203443 334184 350774 136353 62510 220596 396586 332678
404 332678 146324 32255 -174251 162366 84895 163897 288995 360445 147407 283405
394 283405 403900 312344 248524 78725 136158 59629 42596 -34293 76390 68804 -24669
383 -24669 -71817 176273 442338 266515 225048 -33854 -111871 8470 44621 -210074 -198638
372 -198638 55071 164498 235942 182197 13167 310376 491924 210689 144289 184920 30660
361 30660 224177 114563 125387 104619 -12973 125275 210555 211657 227542 64336 52751
350 52751 -26468 128140 180301 121477 303170 321716 230087 121340 158047 -79154 -166747
339 -166747 148284 223842 100627 113775 331464 438457 277264 363065 317236 226917 503120
328 503120 452388 256674 42383 -267978 -217383 -146964 176589 367211 210198 78426
318 78426 193441 271544 320392 239448 99088 26171 -33642 27891 89768 213633 117976
307 117976 146718 345827 270521 -6585 -2152 -12157 -27157 38299 162114 401279 317044
296 317044 409816 266619 114008 218442 175965 15740 -107056 112061 360025 216793
286 216793 246143 86490 314597 21562 -169621 -433917 -323812 -68135 130982 299032
276 299032 425682 307667 297647 340508 282144 300867 142453 233009 311906 219844 489620
265 489620 263240 232967 196685 123796 338543 270009 251616 344612 450528 409369 588648
254 588648 386786 232817 20737 -139763 7697 178481 103233 163834 183499 336475
244 336475 455390 319332 253969 284429 115784 279768 250157 135994 406560 500182 718446
233 718446 897170 767263 450434 321002 386849 470991 590339 266793 43495 -70156
223 -70156 -169094 -79482 54191 77272 141494 105044 76474 161716 535770 495977 262722
212 262722 301488 310551 185022 526082 573577 437333 427729 268493 216180 80838 348207
201 348207 476982 304102 218875 42522 -125004 2519 -186901 -52956 101943 226439
191 226439 -111404 -44868 197926 69260 205836 108622 136278 96830 201902 343425 257051
180 257051 294987 269552 35888 -81967 195010 272188 234335 132520 -87031 303222 282892
169 282892 318778 399721 442435 354463 273562 244037 259541 81516 267631 463877 279426
158 279426 158284 348709 305930 289761 261090 57051 -79750 -116300 -214310 47654 198149
147 198149 100540 100506 19472 18879 -62803 -110819 62684 306312 345627 231286 251720 242470
135 242470 217554 250553 210353 189004 256330 484913 365688 38576 -20495 193933 159493
124 159493 416843 400210 315401 322072 374483 495746 356805 242047 283366 357733 440031
113 440031 323796 245774 174024 248438 164471 270692 344138 248413 391119 466025 416099
102 416099 354080 288961 304506 458564 541316 396391 320684 272577 400462 423417 165876
91 165876 261670 374336 293359 228618 96955 187633 251288 179739 266869 354775 342988 265313
79 265313 159569 277433 211344 220048 198640 328402 490079 475560 246371 243330 300516
68 300516 431460 543276 375438 319509 397344 539034 356985 157357 86597 223768 449491
57 449491 538780 457201 322447 364237 478345 418208 127695 51878 123988 241166 268208
46 268208 385079 329481 181846 263295 269736 373159 310953 330941 430721 285883 271220
35 271220 380132 315772 254778 232414 450517 381178 361838 278719 158521 197856 316080
24 316080 232095 137445 178791 226257 223137 86439 107936 115039 54432 116265 208920 268566
12 268566 348767 208978 309621 332443 263163 369908 420246 510268 461715 338918 451238
1 451238 510446
0 510446
$$ Imaginary data points
##PAGE= N=2
##DATA TABLE= (X++(I..I)), XYDATA
16383 -2820020 -2564223 -2407403 -2573255 -2495718 -2452432 -2524427 -2423624 -2448080 -2472326 -2373922
16373 -2373922 -2250425 -2334075 -2285211 -2101528 -2137412 -2007338 -1951409 -2160164 -1946808 -1715256
16363 -1715256 -1760732 -1726169 -1742778 -1804994 -1694911 -1583869 -1612042 -1598834 -1619427 -1525589 -1292601
16352 -1292601 -1224984 -1216570 -1345845 -1306905 -1232798 -1236220 -1183174 -979194 -1052440 -908586 -902539
16341 -902539 -794121 -885497 -669905 -579519 -630977 -539834 -481645 -484091 -627003 -475779 -530390
16330 -530390 -378335 -436820 -459018 -307952 -268619 -360808 -236983 -264748 -239144 -209407 -167376
16319 -167376 -62571 -65222 110804 162894 287168 340687 261765 203028 247946 212257 247954
16308 247954 273134 200192 256540 339853 387939 511767 452472 632002 811582 781402 696142
16297 696142 709256 783913 734140 737305 679224 907109 903160 975236 952371 1027850 1084599 1065903
16285 1065903 1161405 1245032 1284816 1144745 1148490 1276489 1130335 1065427 1302465 1524363
16275 1524363 1600027 1322475 1290985 1240628 1400265 1543419 1526696 1568147 1491091 1503059 1456162
16264 1456162 1659155 1776252 1782923 1809203 1927743 2091934 2117515 2066518 1816087 1768888
16254 1768888 1900245 1949122 2179438 2296673 1958785 2059070 1971912 1899693 1982832 1945346
16244 1945346 2149120 2370836 2392629 2357921 2399499 2380701 2398773 2444319 2319099 2585896
16234 2585896 2638854 2500632 2376054 2520192 2735465 2521817 2532088 2280560 2168320 2521538
16224 2521538 2733356 2669979 2391437 2363558 2772332 2982690 2996957 2873291 2680562 2674123
16214 2674123 2651123 2820208 2814885 2814867 3127605 2994116 2820490 2991143 2941846 2887987 2888487
16203 2888487 2975885 3057045 3334311 3501218 3384642 3252223 3142674 3065544 3056386 3092116
16193 3092116 3091586 3241845 3397946 3062888 2944186 3126849 3036254 3163043 3292258 3215316
16183 3215316 3249084 3377952 3188349 3329474 3259532 3231470 3205496 3509860 3351452 3327814
16173 3327814 3269659 3312977 3621194 3763122 3639526 3478319 3314595 3382543 3565492 3598274
16163 3598274 3364700 3339477 3475951 3402520 3466496 3436879 3724833 3694551 3683189 3695508 3390663
16152 3390663 3251833 3416497 3213231 3426114 3707981 3707706 3458646 3653034 3726082 3804278
16142 3804278 3976341 3866904 3986419 3814030 3796486 3656974 3566154 3823164 3814701 4006977
16132 4006977 4021472 3797506 3937741 4094066 3881479 3630088 3752334 3738718 3800097 3838500
16122 3838500 3788911 3688585 3773445 3615240 3952884 3952173 3945141 3989280 3775724 3917280 4041908
16111 4041908 4041596 3874229 3888554 3859667 3723377 3417223 3425023 3552983 3778838 3699261 3647719
16100 3647719 3801458 4019625 3917655 3703898 3565582 3765389 3918628 3982744 3897030 3435206
16090 3435206 3617120 3852539 3804403 3668447 3600378 3516068 3780630 4163672 4393838 4091258
16080 4091258 3983534 4036030 3930840 4020149 3875035 4207614 4143477 4178803 4093462 4221320
16070 4221320 4206523 4035772 4129346 4319069 4451340 4202716 4063926 3972053 3967344 4023917
16060 4023917 3803735 3827811 4047981 4259772 4264573 3917839 3931651 4059358 4136612 4197886
16050 4197886 4139002 4310210 4389052 4265376 3957711 3760531 3870096 3873275 4100494 3869601
16040 3869601 3900880 4001482 3827813 4154779 3931555 3694244 3755573 3886982 4255466 4430285
16030 4430285 4349641 4213603 4036808 4040628 3970912 4117040 4105264 4132090 4043477 3879990 3953883
16019 3953883 3855152 3866736 4147848 4218065 4189112 4270409 4159999 4245497 4017021 4177795
16009 4177795 4162994 4261822 4509288 4193823 3826107 3924808 3863241 3860627 3950354 3846061 4039201
15998 4039201 3844467 3863624 3861443 4011753 3949623 3962300 3996134 4051632 4168866 4150913 4159925
15987 4159925 4047382 3974502 3984885 4292840 3949253 3952298 4052941 3753435 3687047 4010959
15977 4010959 3999966 4241032 4113826 4078505 4252321 4121438 4107168 4312142 4331886 4383504
15967 4383504 4276309 4238937 4237373 4240596 4155845 3945539 3925213 4197815 4381129 4284555 4404096
15956 4404096 4187129 4359301 4213615 4127235 4283589 4253762 4243589 4289613 4336965 4140626
15946 4140626 4034264 3828246 3906505 4067128 3924944 4152312 4252017 4356782 4454533 4059929
15936 4059929 3904284 4056327 3901739 4105008 4100635 4155475 4199564 4237145 4335378 3978360
15926 3978360 4089736 4093799 4066723 4157968 4141255 3939685 3801730 3818222 3829010 3725497 3916743
15915 3916743 4093567 4132982 4120609 4074109 4188338 4251442 4205525 4142263 3959330 3953926 3970119
15904 3970119 3907159 4159725 4081943 3935956 4015540 4138261 4037454 4040620 3836451 3764003
15894 3764003 3754539 4025829 4084848 4035626 3892942 3985352 4038007 3955609 3952937 4029259 4184028
15883 4184028 3972505 4244564 4524980 4627734 4476596 4197551 4061525 3915758 3853080 4137733
15873 4137733 4226001 4240906 4067685 4048773 4058107 4027948 3990004 3858483 3909167 3706512 3737674
15862 3737674 4118680 4241534 4161188 4005081 3773986 4136617 4142562 4257708 4267291 4292840
15852 4292840 4345401 4364224 4135578 3882047 3876046 3989958 4348590 4294286 4168873 3955934
15842 3955934 3853548 4081067 4043129 3831026 3987081 4193777 4185517 4063633 3825189 3821703
15832 3821703 3876989 3989643 4066171 3941635 3887660 4226549 4407847 4180997 4215312 4327714
15822 4327714 4519726 4432903 4170970 4346281 4445676 4452932 4489654 4538591 4544971 4217561 4428373
15811 4428373 4167756 3836969 4044535 4306553 4269201 4298241 4512091 4449604 4263939 4247100
15801 4247100 4215260 4296268 3963860 3919537 3953466 4170769 4194752 4242119 4236651 4033838 3960802
15790 3960802 4034640 4226947 4095197 3789438 4077101 4357007 4267850 4236613 4024067 4125522
15780 4125522 4119424 4280883 4205874 4377879 4309966 4261218 4210666 4400677 4241037 4043687
15770 4043687 4073359 4019138 4054808 4096124 4240576 4304184 4350130 4304338 4066010 4217763 4333127
15759 4333127 4124013 4181482 4331712 4359588 4140705 4140495 4028341 3922494 4024292 4165071
15749 4165071 4027245 3928932 3929874 4030963 4098098 4016426 3991694 4142937 4166629 4094564 3804639
15738 3804639 4159826 4108087 4157126 4372790 4542645 4513704 4288848 4311767 4121748 4159717
15728 4159717 4051252 4251673 4281294 4248023 4198567 4071079 3805082 3849799 4337845 4192566
15718 4192566 4174369 4235155 3867231 4114588 3978930 4153246 4412768 4119629 3980061 4072438
15708 4072438 4002191 3878923 3856117 4036282 3655006 3544736 4083010 4201044 4334153 4366067
15698 4366067 4182154 4331802 4462696 4417555 4378056 3927438 4060477 4062698 4204007 4377765
15688 4377765 4164523 4254600 4435591 4498363 4171696 4206766 4239784 4476616 4476317 4169802 4162503
15677 4162503 4188824 4030210 3903957 4143755 4221328 4508332 4471851 4304303 4107700 4094328
15667 4094328 3862646 4018949 4005800 4134548 4475959 4248727 4469764 4370720 4441289 4177424
15657 4177424 4156285 4144584 4260868 4215942 3979511 3821493 3915159 3951907 3998662 4390700
15647 4390700 4273237 4288739 4399837 4400517 4070474 3891311 4069551 4318726 4260236 4228422
15637 4228422 4272633 4320575 4390502 4504397 4512209 4376152 4340914 4363483 4298645 4129893 4049527
15626 4049527 4306892 4446860 4446553 4387530 4333351 4388631 4350831 4284535 4223023 4256376 4245716
15615 4245716 4100744 3937231 4038918 4272466 4242734 4245441 4375921 4049602 3876062 3996981
15605 3996981 4052234 4183969 4467525 4633858 4448590 4182919 4023782 4207515 4248137 4328873
15595 4328873 4131188 3890702 3877638 3846311 3959256 4207092 4119402 4450922 4416079 4518537
15585 4518537 4507950 4411167 4589023 4396909 4234854 4204246 4452038 4171189 4078641 4164928
15575 4164928 4283189 4294815 4426409 4339931 4356344 4535075 4508381 4274303 4160087 4090006
15565 4090006 4225708 4256935 4272755 4256059 4209425 4276270 4349705 4450355 4446336 4410666 4332839
15554 4332839 4364564 4188991 4295856 4172330 4209557 4157546 4114997 4221675 4193339 4207575
15544 4207575 4462884 4638862 4470492 4270983 4141264 4147858 4064431 4026638 3837118 3965517
15534 3965517 4155286 4237336 4047552 4020732 4078843 4202796 3923145 4223942 4392449 4191612
15524 4191612 4186418 4234367 4181187 4243711 4181597 4201929 4404593 4256093 4037295 4133479 4495743
15513 4495743 4569008 4586910 4366319 4191269 4144962 4215035 4294122 4353008 4598632 4597671 4225983
15502 4225983 4084402 4337992 4234789 3987730 4124523 4169077 4426786 4506795 4412704 4205521
15492 4205521 4254474 4302030 4354850 4277547 4326559 4386732 4359608 4216899 4192426 4240859 4143688
15481 4143688 4253506 4404224 4319465 4510367 4428542 4118469 4052581 4238132 4302282 4319309
15471 4319309 4337532 4170890 4022887 4292755 4185527 4127432 4337674 4246650 4335740 4391661
15461 4391661 4465839 4486009 4347864 4390797 4526111 4122684 4017870 4186614 4108717 4025561
15451 4025561 4091155 4065766 4213407 4130200 4129560 4351593 4341664 4242447 4209352 4106509 4039226
15440 4039226 4074562 3965803 4166084 4174825 4087365 4042509 4355869 4428856 4216733 4074122
15430 4074122 4089401 3899258 4230049 4483976 4297777 4306193 4100757 4160900 4140630 4242505
15420 4242505 4033603 4127518 4476395 4428671 4400601 4379456 4519019 4387454 3962012 4359654
15410 4359654 4288219 4240281 4349877 4180343 4193922 4480121 4314697 4074799 4287775 4170163
15400 4170163 4198391 4434430 4416780 4385604 4298876 4430087 4635753 4492043 4633428 4380913
15390 4380913 4170047 4284745 4495431 4592829 4310781 4221029 4181382 4387970 4373170 4601850
15380 4601850 4652514 4622135 4541649 4409693 4381084 4139467 4443949 4795058 4728066 4534366
15370 4534366 4666692 4546042 4344490 4356273 4413579 4213943 4193306 4381580 4229865 4239953
15360 4239953 4440986 4680355 4534258 4576144 4468449 4535720 4481394 4212584 4380052 4499901
15350 4499901 4398001 4290635 4175497 4087243 4046042 4238497 4363779 4431596 4174081 4132540
15340 4132540 4493879 4318985 4407020 4215189 4117447 4218820 4392557 4435851 4191663 4183031
15330 4183031 4162063 4235748 4453095 4458227 4145376 4229971 4327815 4226732 4446787 4543785 4503014
15319 4503014 4450568 4441959 4403453 4514243 4527083 4582943 4578062 4561749 4357530 4402470 4289690
15308 4289690 4456062 4511690 4509510 4175136 4149846 4174902 4019113 4200630 4197043 4327775 4401428
15297 4401428 4319719 4425273 4527721 4585786 4531696 4296291 4484912 4670365 4621950 4175923
15287 4175923 4461538 4523958 4500623 4392034 4335986 4661775 4535455 4417209 4490324 4410560
15277 4410560 4289301 4388944 4639487 4429204 4391048 4428079 4287390 4383238 4390139 4499310
15267 4499310 4603679 4809211 4752771 4627079 4418904 4248735 4334046 4383253 4335943 4385552
15257 4385552 4327209 4046491 4161382 4364458 4458870 4520345 4445006 4521013 4596668 4295718
15247 4295718 4099859 4174764 4403927 4295576 4295661 4451031 4527964 4236937 4408062 4714904
15237 4714904 4420729 4475684 4555629 4600044 4431151 4328583 4194607 4191042 4385615 4414162
15227 4414162 4356758 4250163 4302892 4302123 4180443 4254427 4325893 4189240 4149486 4267498 4123022
15216 4123022 4265411 4420325 4616787 4577587 4708677 4673106 4355249 4374545 4390419 4568741
15206 4568741 4504517 4159681 3970575 3965328 4126303 4173093 4329551 4175052 4091966 4180859
15196 4180859 4315972 4380867 4027370 4363902 4482401 4362223 4329013 4461918 4484627 4341667
15186 4341667 4226202 4248389 4297236 4376255 4732940 4580193 4357279 4479666 4499458 4433341
15176 4433341 4402260 4400704 4624795 4714092 4610588 4529326 4569204 4457815 4318003 4328928 4320818
15165 4320818 4360115 4338768 4581402 4543496 4577592 4601900 4642560 4411479 4108785 4276558
15155 4276558 4615531 4291216 4341920 4524639 4298370 4414583 4478822 4255826 4213137 4441211
15145 4441211 4409708 4329762 4539655 4608128 4617297 4525383 4427248 4567592 4447182 4396221 4355362
15134 4355362 4492588 4502860 4537282 4489065 4145459 4485235 4751568 4628117 4651088 4277750
15124 4277750 4347743 4474127 4504637 4531804 4464837 4568864 4380597 4288985 4425804 4421049 4548136
15113 4548136 4572322 4310279 4423237 4651130 4664295 4423762 4379667 4478304 4584844 4453101
15103 4453101 4399450 4546302 4573467 4479332 4411626 4227749 4221791 4230869 4145703 4120025 4249406
15092 4249406 4064374 4066987 4400438 4458507 4617552 4383724 4528086 4231279 4117362 4393343
15082 4393343 4243311 4238759 4458716 4451070 4340802 4540999 4724854 4735697 4727706 4894529 4755628
15071 4755628 4663205 4880785 4620888 4240188 4338922 4764353 4638083 4587866 4792971 4824298
15061 4824298 4780073 4421337 4540022 4347989 4424939 4437123 4094454 4329309 4439230 4274285
15051 4274285 4100294 4254617 4310099 4399116 4375087 4528311 4540189 4401347 4491206 4519865
15041 4519865 4539205 4368849 4203680 4365501 4165546 4377509 4385008 4398802 4456955 4576361
15031 4576361 4641874 4352147 4376810 4615490 4797268 4657738 4449819 4523676 4736571 4882201
15021 4882201 4859534 5019740 4913535 4741221 4901035 4614092 4480684 4518598 4453503 4525726
15011 4525726 4712759 4607435 4394952 4384244 4537118 4470261 4776756 4942410 4746818 4630046
15001 4630046 4587662 4470296 4543692 4465679 4225819 4140006 4440518 4358504 4165515 4360851
14991 4360851 4627905 4757589 4490946 4548107 4446587 4350954 4104533 4333297 4535718 4439844
14981 4439844 4536703 4448428 4624537 4425501 4269529 4447687 4448542 4562348 4776206 4787802
14971 4787802 4635293 4510508 4300935 4445873 4759813 4651231 4676463 4516213 4281527 4280189
14961 4280189 4405878 4571851 4235242 4475128 4501085 4592289 4728559 4647369 4615074 4390812
14951 4390812 4445767 4208695 4440007 4620192 4399933 4350936 4637963 4637494 4667141 4709219 4653191
14940 4653191 4753896 4842858 4468603 4642719 4794916 4690162 4418110 4355801 4455366 4536308
14930 4536308 4598168 4661241 4395838 4448195 4670890 4529436 4559212 4698037 4465040 4261817
14920 4261817 4264596 4227884 4571454 4396112 4530566 4570925 4443641 4336736 4391696 4528774
14910 4528774 4525207 4591748 4659706 4575408 4385805 4369346 4504311 4638451 4602184 4696086 4474405
14899 4474405 4393817 4630592 4413611 4482616 4476850 4448954 4510270 4630445 4722483 4481269 4486961
14888 4486961 4684133 4563009 4438612 4640838 4778892 4764590 4567689 4692090 4733995 4611936
14878 4611936 4647343 4508238 4480597 4359398 4444010 4666259 4587722 4679194 4560068 4509653
14868 4509653 4596393 4623918 4495178 4650905 4784354 4727738 4776615 4555633 4714616 4735489
14858 4735489 4398231 4502610 4476816 4440815 4691636 4609829 4661889 4607321 4538691 4588877 4677669
14847 4677669 4599525 4469634 4489636 4443575 4355859 4672544 4570346 4713187 4560579 4360780
14837 4360780 4476384 4459747 4286279 4329747 4368170 4308432 4567304 4657743 4632387 4542219 4696746
14826 4696746 4893491 4818844 4524522 4460655 4649574 4885308 4842330 4681191 4793125 4812815
14816 4812815 4698244 4497872 4323886 4324444 4424517 4461633 4676576 4655959 4559997 4738895
14806 4738895 4575029 4419820 4349543 4358284 4581105 4677467 4671853 4626341 4438249 4412712 4560288
14795 4560288 4597427 4646757 4443372 4559256 4468859 4381111 4282945 4273094 4617884 4697811 4571024
14784 4571024 4559196 4578578 4712786 4757113 4742853 4441590 4375862 4394583 4630742 4648160 4345288
14773 4345288 4553954 4443068 4441023 4486801 4438204 4406414 4427871 4342104 4529330 4602842 4540724
14762 4540724 4752668 4871584 5027922 5068105 4579004 4893683 4781589 4462171 4701980 4966799
14752 4966799 4750738 4594126 4604862 4685988 4606806 4630144 4847542 4614968 4575426 4487156
14742 4487156 4589033 4878347 4751405 4851246 4708364 4600725 4714643 4916207 4719883 4742262
14732 4742262 4793104 4703496 4531294 4506002 4450315 4529917 4496941 4451825 4553509 4501524 4437857
14721 4437857 4490136 4412637 4519249 4753563 4813707 4684300 4854335 4764293 4697737 4683237
14711 4683237 4714531 4786097 4773777 4544349 4188805 4271073 4488395 4859937 4814618 4753891
14701 4753891 4752863 4672836 4498619 4681949 4823849 4710313 4797000 4899249 4831522 4808319
14691 4808319 4427204 4428824 4630858 4750042 4673193 4508162 4390215 4614289 4746281 4766525
14681 4766525 4597340 4646108 4878649 5019050 4633156 4588517 4509200 4789865 5011228 4988846
14671 4988846 4796788 4706357 4924109 4805499 4844540 4964775 4779855 4630414 4717928 4693384
14661 4693384 4807176 4785051 5101761 4789617 4824594 4820266 4673464 4876797 5133315 5248251
14651 5248251 5027190 4597417 4532179 4920930 4671419 4716045 4791571 4749953 5001321 4891883
14641 4891883 4703162 4568098 4515079 4555678 4733900 4762565 4803146 5046111 4864209 4781497
14631 4781497 4452367 4465294 4700493 4674802 4648836 4734056 4739756 4597875 4678070 4911702 4811074
14620 4811074 4800140 4833925 5008823 4995586 5013322 4883825 5046754 4828487 4754158 4973164
14610 4973164 4989134 4799497 4957266 4878910 4625132 5018937 5072286 4736770 4634509 4692569
14600 4692569 4649805 4587717 4575197 4416064 4795025 4797949 4510843 4675056 4631530 4479973
14590 4479973 4627745 4747123 4557749 4830245 4670222 4551444 4332798 4561379 4723864
14581 4723864 4631953 4848047 4947776 4770195 4781317 4745646 4691054 4714634 4789902 4702595 4774235
14570 4774235 4866113 4716759 4567124 4654466 4471722 4480086 4573127 4771067 4892474 4732969
14560 4732969 4646077 4642986 4516638 4613023 4733699 4920342 4867747 4759328 4896369 5008140
14550 5008140 4959651 4920366 5089470 5116589 4902327 4681168 4634809 4793767 4835226 4892141
14540 4892141 4917276 4979741 4897835 4807780 4795447 4745775 4592916 4763167 4779734 4639197 4734856
14529 4734856 4687491 4506217 4495316 4618331 4685782 4694687 4731539 4820970 4564444 4741318 4875736
14518 4875736 4886278 4905453 4735094 4832680 4810722 4677788 4549020 4428148 4362734 4375591
14508 4375591 4445378 4690303 4713821 4860277 4692245 4736386 5009257 4832776 4909393 4652698
14498 4652698 4975206 4850372 4679280 4690120 4811753 4944426 4743687 4639851 4580638 4535468
14488 4535468 4444250 4676208 4999870 4825717 5011918 5089721 4772934 5019700 5239208 4946735
14478 4946735 4674503 4709997 4970137 4968677 4782006 4934900 4982842 5029450 5138985 5153518
14468 5153518 5166519 4833833 4578544 4751552 4677504 4719870 4581462 4631889 4756875 4955464
14458 4955464 5081242 5075457 4934447 4794339 4754733 4690549 4981356 5069589 4850045 4846203 4736598
14447 4736598 4619072 4844490 4587700 4869226 4742587 4774248 4871339 4805719 4746792 4664355
14437 4664355 4853170 5061377 4989819 4856976 4884296 5045680 5065122 4846311 4766610 4691352
14427 4691352 4484275 4418123 4711626 4794840 4651074 4526965 4637274 4575925 4505338 4749563
14417 4749563 4707797 4919172 4875849 5023805 5060823 4853211 4844550 4796151 4905045 4917248 5040095
14406 5040095 5037084 5215252 4991181 4828602 4846566 4897736 4925632 4749918 4899124 4668359
14396 4668359 4516823 4783441 4812872 5000237 5124274 5069557 4675643 4750204 5021652 4910891
14386 4910891 4845160 5052490 4813831 4637463 4885605 5073914 5071783 5097830 4930617 4690621
14376 4690621 4787768 4955704 5085588 5127784 5068010 4804540 5055563 5079974 5065668 5018938
14366 5018938 5033520 4971473 5137168 4996644 4835003 4877167 4734055 4972766 5102843 4945753
14356 4945753 4776548 4741449 4824362 4888529 4803906 5081484 5149217 4945931 5081338 5153500
14346 5153500 4895935 4997924 5123089 5030883 5157548 5144060 5232851 5260003 5109352 5015430
14336 5015430 4960559 4931680 4975676 4890730 4662669 4620483 4744564 4716325 4503984 4726056
14326 4726056 4775304 5110640 4976920 4986250 5194447 5171596 4979621 4894379 4922109 4759758
14316 4759758 4746493 4738442 4705489 4589983 4677898 4710228 4975887 4916278 4840974 4759874 4915216
14305 4915216 5083772 4828776 5097867 5206188 5096511 5098015 4959268 4887153 4940111 4949235
14295 4949235 5291891 4956866 4915306 5087754 5121468 5077640 5113312 4987387 5009120 4783034
14285 4783034 4798802 4964973 4847815 4892235 4965344 5002018 4968904 4951994 4754599 4792271 4980941
14274 4980941 5093507 4855196 4874415 5001004 5201235 5006192 4905741 5109621 5000361 5107459
14264 5107459 5078195 4873034 5021796 5010193 5018860 5060693 4867890 4886817 4913803 4887392 4956840
$$ [...]
##END NTUPLES=NMR SPECTRUM
##END=
