##TITLE=1H_CA-9480(2)-1
 200.13Hz, DMSO+CCl4.
 8 sc
4.8.2026
##JCAMPDX= 6.0         $$ Bruker NMR JCAMP-DX V2.0
##DATA TYPE= NMR SPECTRUM
##DATA CLASS= NTUPLES
##ORIGIN= UXNMR, Bruker Analytische Messtechnik GmbH
##OWNER= pz
$$ XWIN-NMR		Version 3.5
$$ Tue Aug  4 13:25:05 2026 Russian Standard Time (UT+4h)  she@DPX200
##.OBSERVE FREQUENCY= 200.1313
##.OBSERVE NUCLEUS= ^1H
##.ACQUISITION MODE= SIMULTANEOUS
##.ACQUISITION SCHEME= undefined
##.AVERAGES= 8
##.DIGITISER RES= 18
##SPECTROMETER/DATA SYSTEM= spect
##.PULSE SEQUENCE= zg30
##.SOLVENT NAME= DMSO
##.SHIFT REFERENCE= (INTERNAL, DMSO, 0, 15.499)
##AUDIT TRAIL= $$ (NUMBER, WHEN, WHO, WHERE, WHAT)
$$ ##TITLE= Audit trail, XWIN-NMR		Version 3.5
$$ ##JCAMPDX= 5.01
$$ ##ORIGIN= Bruker BioSpin GmbH
$$ ##OWNER= she
$$ F:/spectra/data/she/nmr/H-C/1/pdata/1/auditp.txt
$$ ##AUDIT TRAIL=  $$ (NUMBER, WHEN, WHO, WHERE, WHAT)
(   1,<2026-08-04 13:23:30.87 +0400>,<she>,<DPX200>,
      <created by zg, POWCHK disabled, PULCHK disabled
       configuration hash MD5:
       00 E9 B6 7A A2 85 ED C7 34 08 36 98 17 FE 4E 26
       data hash MD5: 16K
       25 65 85 E6 0B F6 99 7C 21 91 7B DA 5B 87 3C 14>)
(   2,<2026-08-04 13:23:33.67 +0400>,<she>,<DPX200>,
      <Start of raw data processing
       efp BC_mod = 2 LB = 0.25 FT_mod = 6 PKNL = 1 PHC0 = -4214.84 PHC1 = 4.592301 SI = 16K 
       data hash MD5: 16K
       C0 20 7B 61 6D 29 F5 3A 4E 5E 8F 49 F9 F1 56 B7>)
(   3,<2026-08-04 13:24:10.00 +0400>,<she>,<DPX200>,
      <pk PHC0 = -4.826426 PHC1 = 5.2 
       data hash MD5: 16K
       8E 7A E8 A4 76 C4 F9 F1 05 EF 0A 83 01 8D D2 33>)
(   4,<2026-08-04 13:24:13.50 +0400>,<she>,<DPX200>,
      <abs ABSG = 5 
       data hash MD5: 16K
       96 11 9F 5D AA E0 4A 94 54 D6 70 89 3A 95 07 96>)
$$ ##END=
$$ 
$$ hash MD5
$$ 4D 67 17 DC 67 EF B8 4C B4 C4 C6 B1 E7 8E BB C0
##$RELAX= 
##$RELAX= 
##$RELAX= 
##$RELAX= 
##$RELAX= 
##$RELAX= 
$$ Bruker specific parameters
$$ --------------------------
##$DU= <F:/spectra>
##$EXPNO= 1
##$NAME= <H-C>
##$PROCNO= 1
##$TYPE= <nmr>
##$USER= <she>
##$AMP= (0..31)
100 100 100 100 100 100 100 100 100 100 100 100 100 100 100 100 100 100 
100 100 100 100 100 100 100 100 100 100 100 100 100 100 
##$AQSEQ= 0
##$AQ_mod= 1
##$AUNM= <au_zg>
##$AUTOPOS= <>
##$BF1= 200.13
##$BF2= 200.13
##$BF3= 200.13
##$BF4= 200.13
##$BF5= 200.13
##$BF6= 200.13
##$BF7= 200.13
##$BF8= 200.13
##$BYTORDA= 1
##$CFDGTYP= 0
##$CFRGTYP= 5
##$CHEMSTR= <none>
##$CNST= (0..31)
1 1 145 1 1 1 1 1 1 1 1 1 1 1 1 1 1 1 1 1 1 1 1 1 1 1 1 1 1 1 1 1 
##$CPDPRG= <>
##$CPDPRG1= <>
##$CPDPRG2= <>
##$CPDPRG3= <>
##$CPDPRG4= <mlev>
##$CPDPRG5= <mlev>
##$CPDPRG6= <mlev>
##$CPDPRG7= <mlev>
##$CPDPRG8= <mlev>
##$CPDPRGB= <>
##$CPDPRGT= <>
##$D= (0..31)
0 0.7 0 0 0 0 0 0 0 0 0 0.03 0 0 0 0 0 0 0 0 0 0 0 0 0 0 0 0 0 0 0 0 
##$DATE= 1785835410
##$DBL= (0..7)
120 120 120 120 120 120 120 120 
##$DBP= (0..7)
150 150 150 150 150 150 150 150 
##$DBP07= 0
##$DBPNAM0= <>
##$DBPNAM1= <>
##$DBPNAM2= <>
##$DBPNAM3= <>
##$DBPNAM4= <>
$$ [...]
##$SUBNAM3= <"">
##$SUBNAM4= <"">
##$SUBNAM5= <"">
##$SUBNAM6= <"">
##$SUBNAM7= <"">
##$SUBNAM8= <"">
##$SUBNAM9= <"">
##$SW= 18.0517328524113
##$SWIBOX= (0..15)
0 0 2 0 0 0 0 0 0 0 0 0 0 0 0 0 
##$SW_h= 3612.71676300578
##$TD= 16384
##$TD0= 1
##$TE= 0
##$TE2= 300
##$TE3= 300
##$TEG= 300
##$TL= (0..7)
0 120 120 120 120 120 120 120 
##$TP= (0..7)
150 150 150 150 150 150 150 150 
##$TP07= 0
##$TPNAME0= <>
##$TPNAME1= <>
##$TPNAME2= <>
##$TPNAME3= <>
##$TPNAME4= <>
##$TPNAME5= <>
##$TPNAME6= <>
##$TPNAME7= <>
##$TPOAL= (0..7)
0.5 0.5 0.5 0.5 0.5 0.5 0.5 0.5 
##$TPOFFS= (0..7)
0 0 0 0 0 0 0 0 
##$TUNHIN= 0
##$TUNHOUT= 0
##$TUNXOUT= 0
##$USERA1= <user>
##$USERA2= <user>
##$USERA3= <user>
##$USERA4= <user>
##$USERA5= <user>
##$V9= 5
##$VALIST= <valist>
##$VCLIST= <CCCCCCCCCCCCCCC>
##$VD= 0
##$VDLIST= <DDDDDDDDDDDDDDD>
##$VPLIST= <PPPPPPPPPPPPPPP>
##$VTLIST= <TTTTTTTTTTTTTTT>
##$WBST= 1024
##$WBSW= 4
##$XGAIN= (0..3)
0 0 0 0 
##$XL= 0
##$YL= 0
##$YMAX_a= 609360
##$YMIN_a= -598734
##$ZGOPTNS= <>
##$ZL1= 120
##$ZL2= 120
##$ZL3= 120
##$ZL4= 120
##$ABSF1= 15.50339
##$ABSF2= -2.548459
##$ABSG= 5
##$ABSL= 3
##$ALPHA= 0
##$AQORDER= 0
##$ASSFAC= 0
##$ASSFACI= 0
##$ASSFACX= 0
##$ASSWID= 0
##$AUNMP= <proc_1d>
##$AZFE= 0.1
##$AZFW= 0.1
##$BCFW= 0
##$BC_mod= 2
##$BYTORDP= 0
##$COROFFS= 0
##$CY= -3
##$DATMOD= 1
##$DC= 0
##$DFILT= <>
##$DTYPP= 0
##$F1P= 0
##$F2P= 0
##$FCOR= 1
##$FTSIZE= 16384
##$FT_mod= 6
##$GAMMA= 0
##$GB= 0
##$INTBC= 1
##$INTSCL= 3.241238e-09
##$ISEN= 128
##$LB= 0.25
##$LEV0= 0
##$LPBIN= 0
##$MAXI= 10000
##$MC2= 0
##$MEAN= 0
##$ME_mod= 0
##$MI= 1.114404
##$NCOEF= 0
##$NC_proc= -5
##$NLEV= 6
##$NOISF1= 3.799351
##$NOISF2= 2.8
##$NSP= 0
##$NTH_PI= 0
##$NZP= 0
##$OFFSET= 15.49899
##$PC= 1
##$PHC0= -4219.667
##$PHC1= 9.792301
##$PH_mod= 1
##$PKNL= yes
##$PPARMOD= 0
##$PSCAL= 0
##$PSIGN= 0
##$REVERSE= no
##$SF= 200.130004546158
##$SI= 16384
##$SIGF1= 3
##$SIGF2= 2
##$SINO= 0.751879
##$SIOLD= 32768
##$SREGLST= <19F.Aceton>
##$SSB= 0
##$STSI= 16384
##$STSR= 0
##$SW_p= 3612.71676300578
##$SYMM= 0
##$S_DEV= 0
##$TDeff= 16384
##$TDoff= 0
##$TI= <>
##$TILT= no
##$TM1= 0
##$TM2= 0
##$TOPLEV= 0
##$USERP1= <user>
##$USERP2= <user>
##$USERP3= <user>
##$USERP4= <user>
##$USERP5= <user>
##$WDW= 1
##$XDIM= 16384
##$YMAX_p= 523761711
##$YMIN_p= -197193
$$ End of Bruker specific parameters
$$ ---------------------------------
##NTUPLES= NMR SPECTRUM
##VAR_NAME=  FREQUENCY,     SPECTRUM/REAL,   SPECTRUM/IMAG
##SYMBOL=    X,             R,               I
##VAR_TYPE=  INDEPENDENT,   DEPENDENT,       DEPENDENT
##VAR_FORM=  AFFN,          ASDF,            ASDF
##VAR_DIM=   16384,         16384,           16384
##UNITS=     HZ,            ARBITRARY UNITS, ARBITRARY UNITS
##FACTOR=    0.220516191357247, 1,           1
##FIRST=     3101.8129509483, 0,             0
##LAST=      -510.903812057481, 0,           0
##MIN=       -510.903812057481, -197193,     0
##MAX=       3101.8129509483, 523761711,     0
$$ Real data points
##PAGE= N=1
##DATA TABLE= (X++(R..R)), XYDATA
$$ [...]
11873 -30724 -21335 -19217 -45371 -53921 3750 25233 13712 8317 9958 -20577 -31165 -46462 -30319
11860 -30319 -45612 21901 17371 -18440 -40605 -29019 12861 -10136 -29709 28472 47779 -9614
11848 -9614 29628 44067 55395 40929 -3137 41362 -17840 9031 43421 -60368 -73031 -28004
11836 -28004 46558 -14975 -47655 -10328 649 32211 34018 37642 -10428 -70884 -71574 -20950
11824 -20950 22458 1487 -32222 -39967 -37788 -5720 18431 7014 -46240 17394 46939 69379
11812 69379 -12842 -56866 -57675 -60601 -48249 -13675 -7292 40416 13910 -55551 36177 -32970
11800 -32970 -58573 -31311 -12760 23969 -19485 -49553 -90804 -49759 -36847 -49533 -5674 -14913
11788 -14913 -56233 -37355 -37131 -41013 -89367 -153208 -93247 -34393 -71160 -65440 -42221 -13667
11776 -13667 -55232 -66199 -49386 -69805 -100306 -34423 -33503 -7023 76588 37933 -69395 -14616
11764 -14616 16941 -18637 -33875 -34213 13678 -24008 25018 -32226 -11565 -15138 9803 9639 13035
11751 13035 -8690 14584 -5768 38331 22150 -17482 28095 -28998 -27530 -20627 -17219 -18460
11739 -18460 -7185 -12797 -54735 -82239 -84046 -90050 -69602 -20297 17575 -7160 -51426 -11836
11727 -11836 -4139 -50120 -36830 -38075 31716 -17022 4198 32620 -32193 2371 38900 52099
11715 52099 404 4347 26124 -6963 24587 465 -36804 12041 41682 -57163 -113833 -49905
11703 -49905 -82821 -89297 -124262 -141419 -76818 -72303 -52090 -31947 -5522 -38802 -20882 -8980
11691 -8980 58547 94608 2593 -13696 -30000 -35136 -36645 21925 -1971 735 -3537 4681 -69581
11678 -69581 -95559 -37514 8875 70173 2504 40400 -3914 -2013 11711 -6572 -25215 16994
11666 16994 34616 -1825 25447 66771 90596 121317 86039 -3145 -75061 -81792 -42829 10848
11654 10848 26334 48730 62248 110832 99802 14061 42799 -15322 25348 38347 -25459 -38454
11642 -38454 -27130 -74145 -49834 -17552 -45298 -104902 -67494 -26291 -52630 -26502 -32091 -73186
11630 -73186 -72778 -125129 -104600 -71768 -59153 -23244 -28796 6928 -45669 -109764 18246 -28856
11618 -28856 -51419 -514 -40041 5235 44235 90517 40776 -10113 -1462 -32316 -30256 -86792
11606 -86792 -102199 -47480 -22440 -47847 -69756 -63900 -53843 -37495 -44567 -96361 -19618 -36152
11594 -36152 -11031 34620 -53726 -94052 -44886 9614 -92129 -46054 -9340 -56433 -9735
11583 -9735 -52207 -66520 -11286 1050 55437 15172 -12655 -32275 -65333 12724 54789 31907
11571 31907 21943 -3325 -31098 -57818 -53949 -52253 13024 9736 -33730 -23978 -27281 -11766 -17890
11558 -17890 23017 11342 -28121 1832 -69513 -88031 -68422 -53600 -31800 -18775 -50795 -55592
11546 -55592 -11195 -30586 -42813 -6523 -2394 -18482 -14396 -9609 -697 63497 55898 45797 15660
11533 15660 1356 -12583 13441 1667 -4658 46657 51018 101346 143562 45176 38706 17913
11521 17913 -28959 -6333 834 -3375 44301 -15987 -35012 -5828 26971 48620 50926 85181
11509 85181 83836 56668 47759 56351 48266 19460 -22818 -21691 -16133 -52061 -24189 -27676 -13657
11496 -13657 -2154 -3695 38425 3168 88 -24191 -42263 -8683 -21454 -61072 -24457 -20228
11484 -20228 -26574 -70765 -97979 -49009 46549 4298 -105725 -77793 -22539 -66142 -67447 -47394
11472 -47394 -45775 -41759 -45783 -60974 -3622 -37663 -11204 5742 60249 90583 49607 -35645
11460 -35645 15026 43928 -27570 -7098 -14523 -32778 -61130 -88812 -82408 -41142 60752 45307
11448 45307 27563 35897 -3702 28698 21862 -86215 -94538 -40741 -56932 -47124 33663 59606
11436 59606 -7882 -13379 -25941 16090 -1711 7867 17001 -40625 -127502 -156942 -53094 -13868
11424 -13868 -56590 -18272 6487 -47937 -35707 31919 32543 14216 -3635 -10485 52549 85998
11412 85998 95469 48742 -11004 -65569 8706 34054 -32607 -70023 -95075 -84176 -66715 -38405
11400 -38405 -34314 -4292 -18585 -62495 -46786 -28067 -50796 -11782 3392 -10525 53515 34983
11388 34983 -72855 -53315 -9209 -21711 -20559 -17405 55431 8414 -56816 -24830 -44646 -38873
11376 -38873 -82234 -88309 -38590 -32971 -64707 -73409 -1242 -2371 31157 23406 2716 -23104 -64446
11363 -64446 -81863 -52143 9224 30878 32495 -8967 -14273 -22283 -11226 -36058 28025 8296
11351 8296 -22759 31862 18317 -295 -52224 -50056 -21824 -48354 -56501 -74719 -88450 -110732
11339 -110732 -114192 -61708 -76364 -21557 -53784 -68456 -33850 -63089 -46092 -10486 4017 17676
11327 17676 5230 -41414 -58151 -26065 29714 12371 468 22387 19225 -14725 -6934 -11874
11315 -11874 -8707 -50024 36363 54654 31204 -7320 -6471 20736 -46680 -98946 -104317 -48475
11303 -48475 15367 -1179 14927 -15857 -77731 -93115 -53460 -46922 -8736 -30986 -34104 -8943
11291 -8943 -37564 -49714 -5835 8072 7703 -7970 13438 -11613 -43689 -64194 -38278 27574
11279 27574 31354 49127 9890 19171 60706 25580 20107 -17579 -10025 -31010 -19727 31295
11267 31295 6337 -34981 -69032 -31507 -80577 -17300 -10520 -9563 19417 4637 1828 73105
11255 73105 64547 57077 23883 13864 49558 46424 -1146 -85825 -122497 -72771 -16622 -20684
11243 -20684 1172 26850 24150 -9630 26956 -7804 -33317 -60787 -106374 -97109 -76987 21756
11231 21756 12698 15484 5842 21384 -16979 7036 -19643 -43660 -49010 -39732 -62681 -52540 -16356
11218 -16356 -14023 -68091 -54720 -27868 -54767 -37016 -35742 -31283 -43458 39 66064 -20825
11206 -20825 -14070 -22794 -49856 -34193 -4487 -21428 -22707 7399 11335 -37906 14371 -22239
11194 -22239 -40906 4097 -9240 40741 -52125 -44568 -32847 1005 -17221 305 54339 7404
11182 7404 23672 50450 3884 22354 3463 -227 15603 16259 64533 28594 -5832 9438
11170 9438 46166 20414 -15600 -38287 -28230 -59987 -17960 -8391 -38974 -14798 51055 63940
11158 63940 42823 26849 -28384 6952 -96323 -79613 -33581 54931 24946 67304 2414
11147 2414 -11777 -32572 20120 22235 12755 -16293 19891 34803 32629 79825 19959 -7433
11135 -7433 -71713 -39465 -34360 -86303 -79368 -4832 43418 45938 3936 5543 36207 8637 27072
11122 27072 55204 -11285 14887 -6764 -10546 -73116 -51250 -19298 -91886 -53956 -27737 -95613
11110 -95613 -85178 -10178 4345 -27112 -27079 -45673 -40461 -31900 -81513 -71897 -56467 -34083 -21161
11097 -21161 -20044 -55243 -85850 -61857 -42265 10298 25498 -8726 -15571 -51034 -51336 -2396
11085 -2396 -25033 58967 75103 25551 29027 -4445 19622 15975 31044 64149 66546 41068
11073 41068 -17216 14257 38253 3781 -25111 -53311 -14901 -2167 30660 4196 -69100 -101634
11061 -101634 -54452 -37187 -35964 1787 -4877 29952 11373 55255 52821 13822 4819 -32284
11049 -32284 -22374 -45802 -77831 -31763 -33648 8458 15400 -36941 17821 20675 18408 -41470 -58193
11036 -58193 -45040 -62932 -823 1010 13678 26066 -11656 -48085 -23807 3796 -44028 -36859
11024 -36859 -2239 -19444 -67380 -50198 -17739 -16587 974 -70044 -105487 -95931 -71955 497
11012 497 -66892 -26793 -21678 25292 -2157 -84676 -47787 -7016 -6584 -73594 -44051 -72850 -41275
10999 -41275 15172 16575 -5261 53866 31610 51287 52296 72803 35625 7512 51985 38427
10987 38427 17691 -12573 -73913 -42986 -26966 -42621 -45209 -66695 -17864 46366 -16030 -25044
10975 -25044 -20115 -86338 -52181 45295 -459 -16993 13363 -49451 -39488 1929 18840 9097
10963 9097 21313 -35179 -30100 15595 -11320 -51812 -40016 -35449 -70560 -52698 -85299 -127036
10951 -127036 -80994 -73921 -64025 -15647 21489 -5510 -42909 366 17975 34778 -2480 -3267
10939 -3267 -31138 -42288 42752 38303 11571 -33659 -61992 -74923 -28330 -29663 -9414 -21316
10927 -21316 -39982 -64257 19015 14158 -18285 -22256 22464 1042 -44970 27847 -39665 -29661
10915 -29661 -31705 -98826 -54993 -25739 -45040 -20437 5075 -42316 -30400 -52045 11649 11728
10903 11728 -40270 -19951 -32887 -30882 -63612 63264 15500 -35980 43071 1044 -39318 -51410
10891 -51410 -31122 138 -14803 -18602 38394 51949 43997 -16685 -47141 -38593 -73439 -31030
10879 -31030 -23224 -22809 -52412 -51143 -16477 -20273 9428 -34346 -8094 -19049 -61807 -79605 -40570
10866 -40570 -17300 1606 -2761 -8416 -73030 -101931 -98042 -61358 -29868 -24658 8288 -46450
10854 -46450 -21160 -20432 -44808 -19837 -23658 -55416 -65255 -121997 -116975 -89159 -18486 -3636 -35880
10841 -35880 -73612 -56048 -4944 -10415 -36708 -67467 -27497 -8981 -21092 -103601 -62491 -4277
10829 -4277 32718 51619 -28933 -1613 -27716 -10477 7246 -19660 -53199 -22387 -25387 -13344
10817 -13344 -9455 -40072 -82398 12756 52643 -12509 27869 -18048 -69651 -46922 32375 36888
10805 36888 19916 11030 -7884 -39825 -13452 -1040 12144 38336 -27093 -89698 -90281 -46922
10793 -46922 26827 37071 6679 4184 -7266 -33716 2484 37894 60571 32697 24573 -29688
10781 -29688 24505 75434 76200 50122 -10891 -58064 -120136 -69638 -19276 -30054 -30223 -27752 -6154
10768 -6154 73798 76126 8098 -16324 5033 -17195 -19321 28357 68233 46347 -15250 -35754
10756 -35754 -45653 -79570 -22583 -30562 -28062 -28071 -6922 -24050 -20444 -40037 -3828 41637 58806
10743 58806 45962 39523 -5235 15903 -9510 1286 48022 46343 19201 -30786 -15335 -33627
10731 -33627 -93893 -77985 -6679 18255 19594 -22163 30801 13198 5104 3024 -35744 -45185
10719 -45185 -18898 -26482 36841 72792 54075 -16553 -73327 -60502 15947 -8184 23019 34983
10707 34983 16293 -35563 -22491 38320 66686 32825 18430 49 -62679 -4178 -59532 2340
10695 2340 44869 50862 -6779 43196 44626 -24252 -42344 -99316 -65295 -46811 -52926 -105548
10683 -105548 -86678 -45001 -96025 -38291 -103529 -129511 -23746 -16365 4684 -6863 -58117
10672 -58117 -76224 -20522 4344 -53820 -39553 8366 -26422 -17192 -13348 -68982 -87669 -94337
10660 -94337 -39010 20165 -42400 -53345 -83378 -59374 4259 7987 245 -9897 -13620 5963
10648 5963 -42150 -60649 -75959 -88661 -111780 -56867 23763 16027 -34988 -15731 -53971 -53505
10636 -53505 -16118 -43691 -44735 13628 48140 26108 2943 9282 -29811 -60482 -19050 8237
10624 8237 -2842 5662 -5992 -32417 -38784 -35021 9324 -36035 -16651 -37265 -30612 -16666 -1366
10611 -1366 29471 10506 16514 65235 12539 574 -43766 -61401 5750 -64871 -57951 -56295
10599 -56295 -30161 -42728 -60448 -1153 37588 898 7068 1476 -6881 -8633 4271 46649
10587 46649 17767 -25103 -34037 -43501 -46896 -39271 19620 14241 -19642 22547 -16908 -39196 -18407
10574 -18407 -64748 -72797 -53104 -66558 -65008 -58896 24287 46484 78910 62714 -40782 38136
10562 38136 59552 -40328 -88383 -41108 -14816 -20577 -22346 -17327 -85519 -168576 -78245 -39558
10550 -39558 -109785 -128491 -21989 34292 92966 6337 34576 72884 66522 44328 -14939 -89032
10538 -89032 -109634 -80259 -923 40462 23078 -7962 13883 9720 -29165 -50320 26110 7268
10526 7268 -7210 19759 -61420 -68346 -20973 -8270 -6785 27118 10610 -9670 -6956 -7172 -11713
10513 -11713 6470 67341 95928 70131 45895 42031 15159 14592 -71179 -26414 7101 -9141
10501 -9141 -3737 -85799 -24194 -60741 -55371 -4891 28468 38741 26961 -2859 -38636 -111702
10489 -111702 -41239 35284 -14310 -58186 -14530 -13109 -49246 -59357 11387 -1035 -22917 -18607
10477 -18607 20522 -29570 -26328 12834 16979 34367 -56909 -75673 -23244 31195 14327 -1
10465 -1 -7953 -54882 -36426 -19386 -945 -80587 -6205 -42809 -80791 -42738 -20277 -42731 -192286
10452 -192286 -197193 -132557 -40950 -35472 -10466 4561 60113 66155 25679 -31820 -28457 56193
10440 56193 101860 -10300 -49244 -10348 10250 -62153 -28466 -72978 -55592 -47674 -35577 -15990
10428 -15990 -65592 -66649 -114446 -18183 -43222 15361 -36075 -29952 -1771 -74454 -89219 -76953
10416 -76953 -41293 -3632 31356 76150 20319 -43590 -33952 6072 -7651 31423 -128 -19751
10404 -19751 -514 -37907 -26141 -57959 -87528 -37346 -14375 -42806 -4231 -82857 -47555 21907
10392 21907 86826 86918 20960 -3801 -4249 14806 -48370 -56315 -22991 -49349 -126712 -125124 -102378
10379 -102378 -64737 -90426 -19593 -15019 -82427 -74559 -38525 17338 4659 -63083 -102526 -33183
10367 -33183 -47101 -26173 -52860 -41193 -57736 -59878 -42741 -42964 -29335 -63067 -43179 -33031
10355 -33031 -26687 -57571 -11837 -36969 -77468 -101602 -73463 -25595 9269 43296 -48610 -14717
10343 -14717 -20471 -21696 -14489 12108 -20024 -23742 -46895 -50470 30145 -28251 -90702 -93907 -58761
10330 -58761 -72867 -62385 -96288 -81394 -61483 -89395 -3244 -57140 -8861 15488 2895 -27444
10318 -27444 -30230 -14833 -10837 -27793 -10241 -23257 10543 62081 35594 15838 -26194 -69106
10306 -69106 -103933 -84459 -42733 -48589 -4956 -60546 -92232 -33719 -15400 -18477 -11979 25238
10294 25238 -30858 -8332 40 -7356 -32538 -15196 -49258 -60311 -25483 39476 72874 30182
10282 30182 -29470 -17736 11177 -23606 -56041 -17747 -36328 -26823 -20012 -15661 -14229 -68469
10270 -68469 -41820 -13122 -7188 -69 -16837 -67000 21359 55392 -26622 -3917 -49078 -42918
10258 -42918 -14964 -21869 -8041 -15768 -19726 -27960 -74978 -74103 16856 22538 -13643 25774 -21086
10245 -21086 -58791 -92969 -28664 -14741 -38373 -25587 -23336 -25438 -48558 -36306 -2511 3601
10233 3601 -16834 -2635 -67198 -2898 -5373 6990 67956 5583 -46135 -55304 -35588 -9122
10221 -9122 5803 -1775 -37617 -2041 17248 -2930 -23286 -42682 -75186 -77696 -59608 -74397
10209 -74397 -4203 -60559 -24716 -42661 -80600 -82746 -68093 -56247 -10197 -974 1735 27545
10197 27545 -43604 -11490 -21243 15835 33511 20799 -896 -42255 -120952 -61503 -41959 -28112
10185 -28112 -46538 -57188 -32330 4382 -41590 8634 44535 50527 72802 2422 22033 5936
10173 5936 -14209 -6797 -176 -20051 -35187 -37838 -33912 -43242 -5787 13751 5896 -40113 -53509
10160 -53509 -136871 -103057 -48680 -56873 -94976 -96194 -103324 -33716 85524 44013 835 67160
10148 67160 51283 34149 -34926 -34231 -56707 -65421 -65021 -26196 4932 -21361 -14334 44228 71561
10135 71561 72302 84853 4221 -9919 11326 36607 32356 16306 -20379 -52575 -52383 17521 13005
10122 13005 -13827 -30282 -54302 -80845 -78850 -32270 14341 8590 10409 -1934 -66770 -74993
10110 -74993 -28127 -42055 -15901 -6562 19951 26183 7999 -57306 -61674 -36953 1068 12181
10098 12181 -5789 -25414 -29771 14463 24275 -37069 15411 28415 29595 -5094 -14020 -73499
10086 -73499 -84634 -51921 -51602 -36215 -40120 -17186 -4992 -8065 11665 -20774 -75676 -89868
10074 -89868 -100779 -47137 -27412 -72933 -116052 -70752 -7988 -66768 -36921 -46182 -56583 -74558
10062 -74558 -80347 -63553 -34847 27857 87429 33793 15937 -18054 14196 71471 -32031 -47277
10050 -47277 -57889 -5020 1738 -18468 8409 63187 38363 -4897 -34897 -24055 -61985 -12531
10038 -12531 -25094 -58025 -124230 -1675 990 -13667 -31808 -79610 -39698 5496 12389 -6281
10026 -6281 -47686 219 37025 -27600 -32405 11699 -8580 -42634 -43590 -62377 -40096 -36513 -33506
10013 -33506 -27618 -36947 -38984 -64447 -48910 -42994 -15461 2118 -32103 -57128 -63094 -16908 -9588
10000 -9588 -12737 -42273 -46724 -9080 6550 -55088 -57167 -12560 -12074 14118 -45183 -11482 -9215
9987 -9215 28796 68108 15548 6318 -53649 -11782 7223 -34877 -155 -33507 -54431 24439
9975 24439 -87360 -69669 -35022 -37078 -61516 -67422 -49781 -12252 60504 24535 -407 -63260
9963 -63260 17540 346 -57483 16733 -13273 6009 -22141 5226 18311 6538 40183 22155
9951 22155 10982 16859 8933 -79418 -115280 -20884 12859 -14945 -23583 -41031 -19119 67410
9939 67410 10990 -62383 -34405 -52477 -20526 -41230 -81709 -75564 -42159 337 -76474 -23018
9927 -23018 5818 10084 -5471 -76225 -108195 -34443 -47841 -98754 -1230 -17112 -17663 20693
9915 20693 43589 6477 -41699 -100903 -70891 -43285 -67769 -46597 -9655 95079 46336 47916
9903 47916 61520 33462 -9189 -52600 -52197 -59742 -41513 9473 10699 -43646 -17568 46035 13361
9890 13361 -27823 6305 -27106 4507 -8384 -42224 -20910 -2859 28153 21622 -28022 -9513
9878 -9513 29902 -8441 19725 -30566 -10162 23851 837 -47851 -66137 -25965 -103864 -61997
9866 -61997 -21032 -6652 5142 4207 8702 31971 -21127 -73300 -53314 16832 3344 -43372
9854 -43372 -66691 -38192 -11971 -46017 -14626 -17835 -20030 5489 18252 -6999 -46194 -36645
9842 -36645 2936 -2486 9269 48202 43678 5662 -34008 -54422 -23520 27872 34002 56629
9830 56629 5081 976 44484 -15903 -11110 -25165 -103530 -34116 18402 26193 30885 69566 45362
9817 45362 -15565 28157 -39277 -19881 -9315 1709 31958 42504 10753 28831 104041 80475
9805 80475 68528 13953 -32512 -25604 -6377 -10736 -22638 19951 -12247 58648 87138 71838
9793 71838 51304 30500 26604 17834 3949 -6564 13476 30398 55285 -31381 5531 32278
9781 32278 11805 -54193 -96499 -57672 -14295 -32292 -48614 -17974 -2732 31295 45925 43822
9769 43822 50502 52939 49520 49670 19291 21998 33204 22221 11617 -55686 -72548 -31447 25521
9756 25521 15784 -8528 -36979 37294 -9604 -10951 63861 -33758 -17217 20085 29470 6286
9744 6286 -11517 -210 -33298 41736 14247 63092 92056 79460 149149 93901 51091 44585
9732 44585 90467 38764 47689 35556 10497 37928 20169 28956 17259 43001 21075 -30551
9720 -30551 1616 -61297 -16156 -44028 -59411 -40520 16188 34870 4077 -23087 -1568 51500
9708 51500 15146 -14904 -41939 29083 48141 26323 -49224 5118 -15280 -27657 5849 -3813
9696 -3813 5857 -29832 -36510 -2937 4888 -25320 15320 18897 27540 40673 15988 -884 4009
9683 4009 -9531 27508 -36444 -54500 -39420 -18720 1627 -8657 4794 8524 -37106 -13961
9671 -13961 31727 1281 28227 -8794 -31327 -21311 -44567 -50498 -35935 -14437 17987 52582
9659 52582 29780 13305 81667 98768 108714 61191 43115 -40266 -25754 28386 -8769 20695
9647 20695 3712 50795 14885 6780 40769 -14348 -21904 29422 26942 9171 23444 -44466
9635 -44466 -4732 11771 -10561 13503 59645 60728 16701 -30406 -57907 -14327 15327 -7815
9623 -7815 56114 108959 33932 4646 40259 74588 73919 9140 -20230 81566 93657 34557
9611 34557 -15088 12631 64432 77506 83105 71742 30403 21974 2331 69890 87608 110607
9599 110607 117932 118371 106350 104915 139535 128399 95897 101259 60047 -4908 52743 14575 10159
9586 10159 11159 -19077 -31996 49778 50755 51466 92083 66590 76886 50801 -6265 45695 27594
9573 27594 25176 47020 12971 79303 138948 147973 94070 79699 67148 59355 111022 38850
9561 38850 35226 13993 24100 111690 98490 78570 131170 98220 82293 134873 87047 73963
9549 73963 113731 88419 75927 53010 65015 110011 65833 67244 113354 126746 109160 91264
9537 91264 60772 148852 217411 135982 114948 166438 116829 118196 150214 171641 238325 211681
9525 211681 141262 218809 255470 325590 401173 436287 518112 638863 836826 987890 1153458
9514 1153458 1247124 1277503 1257921 1133798 1040091 924459 758063 659753 537710 429775
9504 429775 345947 276577 230745 147477 159251 181421 169885 146914 165796 94017 85466 104556
9492 104556 110456 129076 146564 133159 133078 116125 78156 132383 76483 50143 37373 99305
9480 99305 89994 88169 141407 112874 95266 88048 72799 128295 116108 119280 137269 173602 168270
9467 168270 53645 -5993 22155 54710 21539 94132 97112 99763 80439 89364 101661 84559
9455 84559 52594 31271 60695 67948 106723 91939 99410 143431 137247 80493 67549 43914
9443 43914 63919 78257 29389 10561 60818 59764 17041 78571 101148 56491 105782 81312
9431 81312 55830 98626 125150 101577 69793 36739 35553 32419 87134 120665 89244 86179
9419 86179 85788 25340 -15412 20038 302 60549 57802 -15447 -55880 12173 38997 56540
9407 56540 76040 13654 -28150 -5430 -6534 -20151 6903 17299 62308 105340 95832 125333
9395 125333 103225 47429 26955 17033 31447 -18225 16882 -1334 -61784 -26695 -6704 46566
9383 46566 38931 42188 1359 -27784 -15470 25971 -1034 -19194 -1264 -43926 22045 26584
9371 26584 11002 2281 -45684 -40670 -22606 -4904 8964 -31622 -45367 12399 49730 74407
9359 74407 36596 1096 34297 2022 -1917 -5312 -30113 -48548 -24021 40649 62319 102327
9347 102327 34051 -57097 -66843 -17671 26314 56906 61555 -15931 -56558 -74331 -74506 -24239
9335 -24239 -33613 -66432 -10559 46964 44714 -35829 -82266 -45865 22904 33869 -40759 -54731
9323 -54731 -69216 -58742 -34456 -31524 -45633 15148 -5863 -3386 -17759 11182 -13159 -29726
9311 -29726 -27862 -43008 -22724 -17411 22091 -3962 -11486 -73045 -28466 -30170 -7310 -19744 -22295
9298 -22295 3015 4045 -1623 43111 -25864 -64640 -31416 -49529 -78420 -58795 4359 25191
9286 25191 -18637 -43733 -73805 11125 61376 59484 31398 37217 39928 32629 -40445 -38842 -9475
9273 -9475 -26628 -34603 -55649 -4223 -52375 -62781 -46105 2762 9659 4799 -64657 -18203 -7926
9260 -7926 419 35666 98165 120049 79762 72388 32314 45109 -7681 -38530 19375 10422 57821
9247 57821 3970 39267 52683 -15502 25088 6894 22981 48535 36355 57446 101310 49517
9235 49517 32250 19280 -4709 15879 -27800 -13322 17748 28826 3686 -37695 -54572 -30732
9223 -30732 -66594 -163548 -180749 -136663 -94805 -79694 -108691 -104296 -33602 2648 14088 -38220
9211 -38220 -22269 17741 54094 32806 -14918 72626 28071 14952 -10141 25079 16832 -16741
9199 -16741 -23005 -38724 30042 -62771 -46902 -32686 728 12252 64497 60702 62036 133040
9187 133040 82925 44096 -52716 -101792 -8605 -48107 -40650 4330 3366 41077 70656 47039
9175 47039 -9187 5704 -35737 -46749 -19186 2534 38168 38148 29490 -2852 7725 68959 57683
9162 57683 7951 -38906 -3540 32260 3894 8127 11807 5108 63380 -25829 -69084 -71933 -98968
9149 -98968 -125099 -62209 10881 20635 -1011 -13484 7968 8597 23349 13049 5104 -24462 35221
9136 35221 69079 35016 2381 -9507 -11840 13648 1745 29472 -34805 -49646 -24823 -20682
9124 -20682 -46232 -24706 50408 48394 18540 -8414 -23264 -26367 -24363 -7577 -5107 23314 -21783
9111 -21783 -9526 18177 -37874 -39521 -40255 -90711 -119858 -43956 -44744 -40375 -93558 -62114 -30039
9098 -30039 -67467 -5743 -12584 -37385 -63538 -85369 -26416 -13642 14670 38237 20923 18830
9086 18830 49774 -5407 -40792 -40226 -40553 -20494 27649 5858 9919 -28186 -48757 -11758 3312
9073 3312 40076 40667 40851 -16932 17832 50316 53423 17202 -1236 -20191 -61397 -25485 -30281
9060 -30281 -9519 53324 110708 52679 98072 96913 56079 19654 -51892 6773 60013 26464
9048 26464 -40551 25613 121684 89765 29688 30868 19431 33913 28277 55713 69935 37739
9036 37739 67385 25679 14821 11932 48665 78254 25698 -2145 13827 96089 71137 44842
9024 44842 39160 77669 51972 46285 34607 18486 34954 24811 4131 25729 44330 14982
9012 14982 40292 -3931 43537 64704 82751 69782 45818 132380 108263 142014 104259 125492
9000 125492 118998 85637 84556 87556 76281 95529 107338 127943 71329 32443 44557 11928
8988 11928 78691 66064 65494 56543 58658 109997 140026 78277 48370 53547 48550 47395 37538
8975 37538 56245 69743 37962 19406 93128 107424 100540 110504 70930 79060 43279 80341
8963 80341 66150 62060 42356 -5917 80064 118521 106316 86220 36484 40193 27853 34758
8951 34758 51376 71154 72829 123023 127916 81206 70467 78446 47676 16476 54386 121420
8939 121420 110239 109523 134871 105229 144310 189638 163294 121211 193910 211088 122694 107496
8927 107496 149586 105569 121922 143333 178251 151498 121592 155050 156928 143192 143407 119208
8915 119208 141853 155733 191656 203592 168407 160227 94391 84780 190875 190907 118486 188866
8903 188866 170919 85044 127556 78688 70719 112270 89397 74573 19628 48475 86553 112053
8891 112053 122184 162594 167018 51851 96546 89061 86983 64012 73924 164466 123605 99693
8879 99693 57124 97087 114107 122450 115531 63130 43801 108450 107168 136661 119246 83151
8867 83151 138733 114412 69470 93925 105164 134296 143974 156370 191469 154292 191903 180040
8855 180040 109201 118972 121554 77380 91493 125062 94013 75506 111822 139293 84910 113730
8843 113730 129763 159254 184564 250357 245194 161653 174288 150223 97113 128829 147931 163544
8831 163544 184358 176868 207615 203294 146906 159302 198830 220418 239466 237479 188233 235079
8819 235079 334139 271273 260494 320766 340461 352503 334404 317422 309865 312365 324664 317414
8807 317414 374093 354932 297711 267870 280102 261050 287536 338325 333430 374807 348150 398865
8795 398865 377471 349798 366777 354771 381157 411682 407948 323106 318205 373291 431643 471610
8783 471610 444655 456424 509159 448862 431568 456471 495767 472458 542877 550863 604960 581937
8771 581937 595054 633901 718492 676250 655120 682418 715055 709382 752545 830562 815601 835660
8759 835660 866837 870048 852235 932830 951367 984286 993314 1005195 1044925 1057153 1115583 1154956
8747 1154956 1183026 1258309 1256408 1344045 1389664 1410065 1443944 1512186 1583411 1677298 1836396
8736 1836396 1891531 1910624 2027601 2120189 2208260 2322150 2428707 2525200 2681201 2774656 2942180
8725 2942180 3082217 3262059 3453362 3628624 3831737 4037348 4240231 4394143 4650372 4898459
8715 4898459 5098858 5281570 5483050 5764146 5968632 6092734 6231688 6266670 6282512 6317379
8705 6317379 6299301 6232925 6148676 6027157 5896564 5705016 5511539 5303125 5071906 4881316
8695 4881316 4646695 4437961 4195284 3957026 3827563 3633438 3425155 3349295 3127991 2888169
8685 2888169 2790894 2644799 2503711 2434898 2294882 2135293 1942325 1871388 1836238 1779141
8675 1779141 1720947 1656432 1592430 1552538 1470625 1415622 1392370 1352872 1346580 1273683 1199310 1162607
8663 1162607 1128917 1112843 1115042 1048688 957809 919409 869049 844024 845204 841609 819668 745474
8651 745474 759141 816454 798306 786139 788229 706214 672686 637684 644702 657677 616910 624656
8639 624656 560304 549604 573165 558561 529345 527075 549133 542657 573884 503583 441860 431933
8627 431933 411946 442647 406262 377687 363550 327066 350901 384304 355260 340281 322383 318003
8615 318003 318595 254428 331000 397826 309225 291647 263742 236014 213923 217401 256555 234816
8603 234816 212655 228343 229748 237224 213499 200588 215061 188732 247380 297627 325550 234237
8591 234237 193881 218522 271647 205289 143975 99081 154211 191067 175078 135576 132309 130432
8579 130432 176336 254020 357219 285391 275548 357669 296576 284418 282758 289670 306230 286648
8567 286648 258576 244633 198762 286491 314014 301600 228787 204854 219932 256396 302983 309352
8555 309352 309798 264607 307046 343225 422861 408236 365661 403950 443729 494831 553422 683753
8543 683753 826121 955399 1202524 1552494 2021878 2558972 3040105 3366062 3564365 3627967
8533 3627967 3493626 3291382 2897516 2436772 1932755 1568891 1316375 1041098 827167 663501
8523 663501 569507 546933 505074 451700 393869 376180 301619 255304 247379 254056 282731 269713
8511 269713 272673 264305 202338 193870 236202 178883 142432 131688 81696 124398 124359 120789 120141
8498 120141 158320 122528 47597 23657 113065 98298 90526 56009 41300 49709 62086 77190
8486 77190 67870 8639 5813 20301 29969 27908 42705 68877 161617 184880 77005 41504
8474 41504 43003 57252 1250 13052 344 -39242 -29682 84365 14262 -9529 -23705 -11867
8462 -11867 -36380 56931 147236 74461 103672 57472 25979 84196 37546 33431 67105 5008
8450 5008 36985 95164 48782 30573 26258 17530 -51629 -37193 -22198 -41744 19110 76986
8438 76986 21170 -23957 -21877 27024 38182 24794 22413 50509 42960 20543 3292 39147
8426 39147 -40405 6247 50791 10239 28972 -7745 -3178 -47060 22984 85491 63010 34344
8414 34344 77487 30732 14382 19011 -5959 -37359 -38105 -65795 -9320 -24904 -63138 -75204
8402 -75204 -87884 14044 58902 29908 -27733 -38707 -19833 -1310 40671 36929 46829 -38180
8390 -38180 -50467 13832 -21405 -29878 -9089 2976 44481 83636 75175 25330 17577 -27423
8378 -27423 -23229 12120 24497 58593 21133 24221 84034 44977 64372 47296 51994 32629
8366 32629 27294 -40816 -70046 11608 -16136 13043 -12313 6085 -53041 -43554 -23870 -41967
8354 -41967 -78267 -75162 -107442 -63357 -9117 -41562 -86598 -49142 -7539 -40972 -67277 -27750
8342 -27750 -22657 -65930 -60525 -2631 -14492 1466 -6967 2944 -33561 -81977 -72621 20680 31925
8329 31925 -6093 -47142 -92997 -81306 -53174 -55160 -38565 -37303 -26407 -12389 13522 26165
8317 26165 4628 16906 -26058 18042 11596 -65908 -120110 -45205 -60466 -66592 -40071 -38200
8305 -38200 -49149 -452 18342 -16349 -30929 10794 33428 -21237 -67895 -55631 -76314 -59179
8293 -59179 -25859 -45679 -96666 -49893 -33143 -14728 -26156 -94423 -98631 -54347 -52422 -57401
8281 -57401 -69646 -44664 -68014 -85613 -55444 -29242 26778 72989 54702 45664 -4817 -42121
8269 -42121 -48433 -34575 -49887 -73150 -54936 -72317 -65253 24837 10642 -39921 -53449 -68449
8257 -68449 -29692 12056 3202 -27268 -33953 -19027 -32448 -79349 -42342 -31323 5834 -23551
8245 -23551 23208 -21164 -12697 -21243 -56098 -40199 -30311 -7078 -8052 -50999 -5481 -18388 -18591
8232 -18591 -20747 9749 18283 -24344 -52456 -7213 8452 5560 -20258 -50141 -57182 -100474 -30820
8219 -30820 -15984 -22571 -35460 -72573 -72056 -37792 -64885 -24209 -17569 -21739 -31484 11444 3649
8206 3649 -7606 -1373 -31931 -40314 -14920 -96162 -129836 -94870 -60453 -75676 -67138 -103528 -71203
8193 -71203 -134363 -79508 38993 27229 -27528 -109270 -68795 -114500 -58541 -57644 -2028 12133
8181 12133 28635 14478 2982 8485 32350 36266 -16588 -49663 -61252 21884 -8574 -74357
8169 -74357 -75661 -112807 -88831 -17981 11142 -17810 -20866 -43368 -115237 -109190 -70006 -42994
8157 -42994 -53587 -55886 -91017 -78750 -68026 -77356 -51842 40155 65318 33920 -25386 -30227
8145 -30227 -63763 -62116 -42380 -22364 -49399 -116989 -54807 -91219 -35373 11822 17671 -9436
8133 -9436 1378 -46819 -58218 -41171 -43210 -16759 16029 27887 12826 -26425 -73165 -91243
8121 -91243 -73876 -136724 -106907 -43185 -40937 -66876 -71983 -77477 -89249 -67632 -92757 5607
8109 5607 16723 -13258 -72269 -33989 -50 -64375 -30159 -6222 -24355 -38537 -51766 -18959
8097 -18959 -38873 -64342 -44026 1856 -42124 -49606 -243 21600 46885 74106 93748 -8866
8085 -8866 8875 30825 -7993 -4119 -7302 -54211 -24183 -1735 -56127 -46239 -48850 -49717 21502
8072 21502 50285 28647 -7390 62096 90681 55992 -538 4318 -68431 -110088 9198 7126
8060 7126 -27984 -80940 -104679 -86891 -95746 -55695 -79868 -122141 -99599 -79324 -14042 -45225
8048 -45225 -62265 -26714 984 -39785 -67619 -90334 -10382 -24226 -49180 -39097 -75736 -88337
8036 -88337 -65240 -31746 -41817 -73853 -82141 -66282 -38378 -37255 -110973 -125771 -36700 -32909
8024 -32909 -23934 -48566 -66414 -83174 -28090 -56944 -113711 -71863 -66573 -22206 -88035 -106225
8012 -106225 -56153 -45311 12991 -28519 -21365 -48370 -83414 -27055 -34417 -3737 -40897 -75706
8000 -75706 -93226 -89183 -69818 -71109 -16059 -27251 -27743 -85908 -135882 -48766 -36176 -45194 -57851
7987 -57851 29119 15151 -26234 -62644 -46033 -13105 -15980 -47249 13925 -3287 -53110 -58706
7975 -58706 -74964 -60193 -19472 27822 -4772 -26409 -27710 -57682 -35417 8170 13151 18357
7963 18357 -11704 -1080 -38631 -46488 -25062 -52227 -63005 -72068 -69707 -74379 -66883 -100160 -104208
7950 -104208 -73009 -68513 -35812 -104021 -110349 -42701 -8245 -31238 -9956 -2806 -19678 -22081
7938 -22081 17291 -46111 -23120 13128 -29134 -75506 -54748 -25655 -44318 -29644 -65143 -53402
7926 -53402 -39467 -53576 -74478 45232 44139 -22736 -27410 -57432 -74605 -21051 -64843 -117612
7914 -117612 -67525 -72735 -105127 25686 50127 41364 14160 -28744 2106 -27612 -24059 -12003
7902 -12003 27670 -25091 -54049 -69646 -103886 -117194 -100227 -20635 -29598 -23520 3697 -14928
7890 -14928 -63311 -66596 -22578 -28044 -29722 -23933 -44072 -70904 14802 12788 -42992 -55207 -93723
7877 -93723 -86615 -88549 -16721 -39728 -3536 54405 40976 -28608 -67923 -116792 -88556 -73761
7865 -73761 -83593 -78689 -65499 -3854 -27936 -76664 -39791 -46578 -61386 -61115 -52785 19165 57105
7852 57105 82330 -53092 -54985 38675 79213 64188 53833 46181 -10785 -50730 -16693 3508
7840 3508 13774 5318 -14005 -70142 -14669 -8748 -46873 -64052 -78811 -82566 -28015 -40763 -28988
7827 -28988 14357 14042 52079 68812 79624 40383 9926 12475 28045 4513 -40122 12599
7815 12599 50573 -23940 53499 -11969 -69140 -104815 21987 136027 -1072 17986 -20747
7804 -20747 -74588 -53953 -36251 -55950 -63050 -75945 -27257 -66474 -136181 -33354 -49413 -93919
7792 -93919 -56651 -54333 -144957 -96097 -30805 -67242 -16184 -28802 11751 34536 -10991 -67730
7780 -67730 42167 17971 11442 31180 26808 -24003 38658 96375 37882 23681 79398 76304
7768 76304 82857 50413 22076 59765 100956 138206 109135 65470 58420 90228 13539 41682
7756 41682 -10017 -40379 -32082 -11549 14413 -76635 -34095 20255 71785 87255 69287 76019
7744 76019 75925 112381 110610 143651 222704 260630 274471 343605 396107 426006 386094 428650 381470
7731 381470 290365 185507 185129 143722 153210 86297 161540 184401 173481 157277 122935 141995
7719 141995 154719 158670 134770 124379 215258 210376 152476 149619 223733 317720 422274 456557
7707 456557 501934 562126 605114 586251 540679 448493 436973 453618 379353 274408 184427
7696 184427 134576 100250 142041 91067 105908 99372 89518 40999 75443 78081 64757 66158
7684 66158 30010 11178 40597 21428 39220 25066 96775 123080 133857 121791 83775 97097
7672 97097 77401 80068 73308 75259 81491 -9645 25157 64148 36057 41088 -20979 -70821 -11931
7659 -11931 19424 84198 35326 -47694 3243 41581 2358 -46766 -60261 -60857 -70240 -101363
7647 -101363 -60854 23564 16228 18590 -18992 -23691 20605 -7107 -39664 -10222 23275 22196
7635 22196 -45372 -33472 -7341 7464 6910 11269 -8331 -54747 -34571 -13751 -18776 22174 31114
7622 31114 32857 25616 -31009 -29528 -29186 -58943 -69104 9973 -17469 -64005 -52295 -6662 86424
7609 86424 18831 81885 98536 31580 -8009 -73671 -11289 22336 -34907 -24938 -30457 -10389
7597 -10389 27985 13129 -27930 -82270 -88732 -166199 -98499 -63189 -59478 -67570 -53530 -80256
7585 -80256 -46322 15300 44272 9177 12004 711 -17225 26415 67712 5292 -34003 -41312
7573 -41312 -30656 2735 28757 33234 -4057 2565 -22105 -53757 -31043 -40916 -46116 -42635 -84286
7560 -84286 -86866 -101067 -29332 -8559 -5865 -569 -386 16319 -44108 -83505 -58467 21913 53328
7547 53328 99539 28388 -17298 -260 43023 38272 -9867 -8331 778 -65203 -70213 18358 61453
7534 61453 4418 17017 23871 22449 7426 883 33515 44382 63473 43124 20667 87015
7522 87015 39768 -30388 9438 48833 47706 59718 51462 28165 18311 -16804 64582 103091
7510 103091 106011 63673 23158 851 9208 -67562 -26767 17176 21256 52108 65067 41677
7498 41677 24350 40917 65452 -5073 26518 30993 54007 -19675 -24251 62263 85061 29610
7486 29610 7083 49060 43574 38350 13089 4727 63564 19534 23471 65629 52193 61542 75466
7473 75466 97308 22736 50115 62450 62069 77036 -17180 -20071 50595 71114 32301 18084
7461 18084 101466 106827 89227 91725 165868 145976 144838 120782 146749 139260 135497 149526 190871
7448 190871 212589 158040 143660 123541 116057 83668 124922 113082 86525 69205 117679 97686
7436 97686 57394 83160 107260 146786 79196 131795 176977 155013 172878 172635 150710 147896
7424 147896 189566 121704 103783 94846 99040 68276 65105 127607 149011 211898 162050 230921
7412 230921 314984 240710 235863 244181 249819 272803 204403 239343 223891 220656 209538 252964
7400 252964 264157 210810 287318 326480 370155 359310 342044 378050 342241 299754 331112 362838
7388 362838 325535 303063 307840 384591 396453 373298 384858 346274 369936 388145 405837 363532
7376 363532 335956 406311 407739 449615 473869 396964 448320 448328 428165 412906 386484 375613 407694
7363 407694 390174 433850 428743 526706 610685 585130 585598 619262 687919 686503 705442 768591
7351 768591 778391 762814 894197 921774 952462 1032702 1120941 1133916 1125498 1118474 1174400 1252954
7339 1252954 1272117 1378692 1449590 1416417 1445299 1509226 1499301 1544915 1563060 1592927 1647181
7328 1647181 1728505 1885964 2029802 2162459 2250060 2415206 2605945 2737618 2889479 3060410
7318 3060410 3212499 3431150 3728657 4157952 4655888 5275520 6059724 7130377 8560831
7309 8560831 10420020 13082475 17123440 22613286 28527051 33567018 37349294 39450111
7301 39450111 39727881 38641979 35835896 31683162 26739055 21846092 17588660 14065651
7293 14065651 11268726 9098161 7589040 6523230 5673458 4993241 4379446 3875566 3558399
7284 3558399 3182296 2941434 2735791 2500124 2318903 2148527 2035859 1917894 1761232 1773811
7274 1773811 1773820 1695095 1602140 1474723 1353776 1223815 1146609 1038712 1016998 1037320 989301
7263 989301 876749 850704 783844 768363 786229 786213 815541 838857 819655 726712 674391 699352
7251 699352 742068 692387 643741 721618 699219 630495 603924 633638 620069 577533 638000 678720
7239 678720 658049 617625 521367 444209 461369 482706 471933 419625 404648 361611 318425 216032
7227 216032 274996 326276 273109 296516 281454 245721 250043 254250 263133 250812 327669 299602
7215 299602 308974 333749 249885 196347 226483 284242 228828 155541 99826 88394 123566 180799
7203 180799 163744 199050 157706 143230 111072 111209 169195 199710 182252 161106 104108 148903
7191 148903 183768 132204 82149 40106 90927 73004 104209 107147 61403 63719 135411 129376
7179 129376 188403 181042 141471 82734 44320 33497 12529 -13023 17462 83598 47096 12701
7167 12701 104825 147358 116972 101567 78784 120246 74913 59931 2830 18571 71425 58667
7155 58667 112213 104934 54817 53049 38461 24800 301 8303 -23861 -24785 -42681 -62995 -60794
7142 -60794 1085 15724 17867 84232 69232 47334 52165 54443 152079 100783 82739 111577
7130 111577 78758 152489 133133 68017 34453 29966 -9508 4673 -6174 24517 27786 33916
7118 33916 24752 90866 72260 -32792 -47595 -54475 -4800 51734 26304 -8272 12575 46391
7106 46391 -2362 -22448 -64402 -95429 -57881 -15893 -9845 -55251 -49590 -75464 -47209 14651
7094 14651 2729 54361 54145 7667 -10220 -22187 -64741 -80234 32487 63477 -36352 -92380
7082 -92380 -66795 -63535 -44245 -117915 -67684 -801 -39067 -124542 -125765 -103482 -81388 -84281
7070 -84281 -70608 -51599 -29669 -27799 -63449 -47027 838 53005 32069 3981 -21471 -31526
7058 -31526 39524 19673 -12504 72120 26215 -21265 39934 68091 62962 15678 -4716 43392
7046 43392 7987 20513 6079 -24787 38446 101929 35357 -15292 -8193 11071 -17907 20469
7034 20469 17500 -12691 57963 11685 -20669 -27916 -27738 26790 54648 -1122 -18039 43940 -5585
7021 -5585 -4203 -12081 -34552 -7375 -23023 -10289 11409 32610 -10681 -33154 -9763 29238
7009 29238 -15005 -29594 -37738 -71876 -71800 -82370 -36383 18569 52726 15111 28169 55164 22029
6996 22029 2319 -10972 21250 18085 33939 -47192 -100980 -40664 -22804 -20864 -41515 16478
6984 16478 -50980 -45689 -45606 -48223 -46726 -30129 -27516 -16343 6136 -20379 -19633 6569 -2548 -50332
6970 -50332 -68925 -2401 42210 41841 125655 120952 83253 174 37090 38526 112094 39440 -1196
6957 -1196 27694 -43984 -15164 2969 -24447 -66991 -26140 -33606 -65829 -12958 -26036 34787
6945 34787 38055 22489 -24663 -16350 -46234 -44470 -50275 -89279 -118847 -44245 1948 -19668 -16474
6932 -16474 -16974 -3413 6310 -3850 -27953 62167 4355 18579 -20463 8717 17673 -11315 34694
6919 34694 37347 -12148 -60978 -27332 3560 -33836 -73830 -90910 -77960 11060 -49 -14390
6907 -14390 -53786 -96717 -27528 32495 45215 -33293 -35972 30178 103593 82969 72099 91908
6895 91908 94040 130165 146417 188293 225592 202291 222915 184421 197637 155593 113886 52600
6883 52600 4764 11214 76307 22692 15491 -7653 -53743 2557 31947 39654 19768 51875
6871 51875 98936 23172 -14677 45774 -14520 -35373 -10678 -5138 -35151 -86124 -98604 -79682
6859 -79682 -14628 8277 38423 -37584 -63897 -39848 -34461 -35510 -20281 -146 -22660 21885
6847 21885 -27457 9182 23290 -28489 51246 23475 -37151 10768 -1295 -25045 76087 52526
6835 52526 -37586 -24911 -39455 -16417 -18532 -7766 -23687 -7366 -6687 5020 -61781 -37308
6823 -37308 -18403 37794 3534 12641 9407 -33868 -52288 -51231 5857 9166 8821 68786 8503
6810 8503 18392 54767 79429 87856 82347 110638 42632 -3653 -140 38318 81157 34866 -31107
6797 -31107 -10954 27663 55561 35636 42141 25682 24962 74672 126408 114970 85461 101868
6785 101868 119353 125883 132551 64834 24277 66269 119879 136428 70152 80854 89732 86491
6773 86491 78537 83945 102452 16925 66179 119207 93056 122946 141198 80317 46869 104034
6761 104034 145831 89818 55241 62504 68683 62345 21633 75857 108891 13771 34437 34655 40783
6748 40783 73624 92599 104856 57328 100332 78753 140046 96892 89732 118036 76001 89153
6736 89153 86924 139177 120539 117409 127397 137183 138096 109336 139600 185932 159062 148839 163488
6723 163488 204187 194385 164993 171350 178681 140467 124411 207277 279448 212738 203591 189292
6711 189292 246831 244805 251938 237426 242159 218953 203831 233745 233013 239549 267090 224988 217095
6698 217095 141950 92350 150509 179702 149468 145445 120783 71466 89147 100723 188164 170740
6686 170740 159418 156051 208919 138357 120403 174654 127937 136485 83368 77260 19006 -8232
6674 -8232 12874 16439 56546 135849 111298 97118 75408 82508 87173 59724 -11484 -16132 11740
6661 11740 -5719 39420 23377 72402 110783 92124 3582 16597 -19626 -67948 -47144 11392
6649 11392 -45814 -28842 16559 52136 8714 21592 9412 -18727 24447 18591 5874 -2372
6637 -2372 5012 -26771 -44857 15532 4630 -26841 -49314 -54963 -31785 -97527 -57701 -11784
6625 -11784 -33854 -19292 63943 51998 41082 -25490 -35283 28777 8660 -6109 -37659 -22496
6613 -22496 -38543 -11767 -24677 41361 16860 -48131 -57082 -39710 -19676 -69587 -75595 -49931
6601 -49931 -30508 -35252 -374 -42164 -46238 -85966 -109889 -67595 -41249 42700 -32199 -120782
6589 -120782 -141984 -147762 -29843 -28906 -27277 -20544 -87631 -99652 -149338 -160145 -158310 -149952 -88185
6576 -88185 -55134 -71255 -108770 -70778 -42485 -22541 -26034 -152574 -84003 -89225 -129996 -78933
6564 -78933 -11723 -1305 -13700 -55658 -93493 -56916 11869 -45737 -37645 -37097 -31464 -14414 -59667
6551 -59667 -14171 31564 1340 -20833 3627 6591 75454 7659 -2275 9280 -1159 -7770
6539 -7770 -23698 206 -43 -27710 20916 82804 121839 55717 1306 44225 7004 -15657
6527 -15657 13564 43495 79606 -28111 -14057 60084 64939 38774 29321 25643 47967 30490
6515 30490 11056 27875 30364 32166 75491 103896 132793 114727 136177 134486 116880 97723
6503 97723 115160 154394 139904 55721 50276 143784 107710 87969 35571 -11059 27451 40875
6491 40875 -7843 -10920 87645 99373 18154 -7838 49127 47041 79621 142060 139177 140626 138062
6478 138062 74629 40278 38956 111086 99376 70398 96463 151060 42956 41563 64207 49624
6466 49624 22967 27566 55291 29706 66274 103173 152744 135480 63874 31402 43752 -12729
6454 -12729 -25595 -12522 38663 8450 26544 60527 -6932 -67569 -41554 -53717 48973 9329
6442 9329 -9826 -3067 66846 105172 5106 -8567 40382 32640 35289 -43846 -58262 -9325
6430 -9325 40625 9578 -14958 -30508 -33150 27463 201 13727 6521 -35133 -58851 -50650 -6804
6417 -6804 5641 19241 9008 9143 -20777 -67914 -78455 -83156 -55618 -58038 -90710 -57146 -59893
6404 -59893 -108614 -93939 -53943 -68972 -91414 -6213 33446 -7537 13010 -23484 20475 27820
6392 27820 88292 32031 -1233 19217 -86579 -47834 -15277 10778 7510 21337 23894 -32340
6380 -32340 -46853 33469 18304 45372 87704 133803 76330 42939 110319 105514 44629 49538
6368 49538 74971 95451 52510 4241 36687 29978 10329 80216 103046 11455 22908 72381
6356 72381 64162 21285 -9149 38788 62265 5674 -7887 -54549 -52225 54968 -12289 18093
6344 18093 38053 16041 23802 -21577 -11105 2438 -59982 -111243 -87683 -65905 -27657 -5951
6332 -5951 -34244 -36394 13459 989 5854 13761 -25221 53474 106877 74169 162821 108487 97450
6319 97450 124003 128043 182099 154370 162381 158031 195412 242854 219779 154831 117446 94416
6307 94416 99726 128350 178167 134045 197519 208371 196480 188546 212465 317269 311362 364596
6295 364596 354136 389562 344127 381187 360896 310607 375845 317529 323301 325792 319229 308588
6283 308588 328597 268463 295895 347028 311503 384068 423870 431245 454282 519671 531232 470509
6271 470509 531992 626197 698035 789566 810704 820640 879703 938258 1047932 1044500 972881 918044
6259 918044 889643 850886 859259 829825 820254 713614 684230 610470 551062 628596 623253 556426
6247 556426 548441 604545 619475 636990 612997 655970 711376 725928 788472 833191 846001 946511
6235 946511 953475 942195 908514 906110 926525 920893 913147 899933 882505 860910 767454 760369 772158
6222 772158 708963 619752 624373 600186 592197 539996 551781 562271 570296 565535 615135 612355 653533
6209 653533 674526 634434 602082 603124 680816 669916 671587 669320 729887 692159 719817 734043
6197 734043 762688 761629 747429 781054 751750 688644 698844 719793 689585 657251 681133 678559
6185 678559 704265 782370 792274 892952 988384 1062363 1121779 1288183 1528325 1725957 1974865
6174 1974865 2210128 2394502 2591792 2703977 2796782 2880497 2906199 2944709 2872054 2722864
6164 2722864 2547936 2324853 2060636 1841049 1682030 1467648 1319353 1151980 1070682 1029212
6154 1029212 996753 952191 825794 736725 698689 708834 705414 710379 712056 676341 672135 702583
6142 702583 636645 593845 617339 649123 612873 567504 620027 649144 629498 678977 681222 720121
6130 720121 732172 754800 731660 716798 695088 696285 688996 617961 614665 624137 641343 582793
6118 582793 604232 652366 665061 667198 701046 703363 728018 787108 788848 818569 818565 856423 851228
6105 851228 868322 889081 852018 907259 841421 860936 922222 873055 873305 786576 828736 800169
6093 800169 780987 872251 812357 753129 818919 906367 875403 877151 883856 819697 791495 843690
6081 843690 903294 951813 990063 959150 974110 996300 1002606 1007935 1024382 997039 989147 1073774
6069 1073774 1126922 1195405 1236558 1272086 1271876 1269652 1255686 1275977 1380722 1374962 1381149 1391208
6057 1391208 1416421 1403456 1405429 1407166 1325629 1303533 1279266 1202033 1192550 1207004 1181191 1270618
6045 1270618 1400415 1446259 1483193 1616445 1676847 1638299 1609158 1754712 1743194 1725629 1722067
6034 1722067 1778855 1877060 1898677 1901059 1869358 1867501 1876874 1928526 1826811 1854496 1978474 2054368
6022 2054368 2062791 2027165 2069095 2141326 2237211 2260637 2289743 2268766 2248306 2325276 2246736 2257546
6010 2257546 2288254 2338680 2413351 2467704 2449573 2462229 2508886 2549952 2610148 2637221 2608448
5999 2608448 2661197 2783964 2988488 3099713 3183715 3297989 3386747 3408096 3470062 3577698
5989 3577698 3590040 3606828 3558268 3589579 3581184 3604233 3644403 3550836 3502638 3518675 3444905 3361219
5977 3361219 3256856 3233636 3229595 3230643 3294009 3340466 3396051 3435261 3517637 3643714 3683547
5966 3683547 3810832 3935572 4041645 4178538 4282794 4330352 4388548 4427517 4465279 4524008
5956 4524008 4618480 4661894 4688191 4706761 4678731 4722887 4782118 4775520 4727397 4769135 4881232
5945 4881232 4968084 5033035 5085067 5087137 5185806 5362794 5504119 5622951 5751363 5919995 6050285
5934 6050285 6214908 6358097 6508217 6540748 6512879 6557578 6672909 6814235 6857849 6867575 6911425
5923 6911425 7010979 7135595 7277452 7455356 7612149 7816114 7982395 8196945 8430061 8635873
5913 8635873 8888751 9016178 9221250 9336755 9432184 9569527 9656137 9801571 9849224 9977657
5903 9977657 10066016 10138577 10253427 10445074 10663620 10914990 11168401 11460976 11826483 12159821
5893 12159821 12549688 12978171 13446022 13878822 14434410 14953693 15542445 16188278 16875420
5884 16875420 17554015 18287482 19050076 19858507 20777282 21624853 22556405 23524643 24391929
5875 24391929 25189133 26080891 26990466 27859435 28675052 29556563 30399140 31378459 32530224
5866 32530224 33871229 35347400 36934083 38787701 40777589 42917063 45258991 47835813
5858 47835813 50725418 53858977 57411727 61645633 66549859 72430702 79373471 87611169
5850 87611169 97669390 110301806 126331286 146979124 174041932 209724572 253869431
5843 253869431 302004097 348402620 390159620 425473375 455309546 482501668 505756229
5836 505756229 520617903 523761711 516548275 499308297 472921397 439212938 398651978
5829 398651978 353221737 305798375 260919667 220811053 186117640 157446741 134540666
5822 134540666 116525805 102428494 91095576 81691347 73704333 66928974 61151482 56287488
5814 56287488 52181848 48605222 45312454 42313401 39681883 37272454 35093602 33160709
5806 33160709 31456063 29883764 28373496 26832709 25378763 24126820 22960159 21938554
5798 21938554 21044105 20336110 19665544 19123413 18646579 18283264 18016158 17649904 17404037
5789 17404037 17230845 17100343 16931897 16826513 16700816 16486746 16208645 15909134 15596534
5780 15596534 15190631 14819634 14474014 14137753 13787162 13336326 12862303 12464822 12110818
5771 12110818 11735266 11404726 11109026 10803223 10471818 10143667 9865957 9592725 9344727
5762 9344727 9263508 9122078 9017171 8992054 9055943 9212414 9475607 9753862 10201813 10838692
5752 10838692 11789039 13202697 15298807 17520594 19395173 20778888 21547150 21560255 21005586
5743 21005586 19801591 18050057 15909731 13813064 12001162 10431655 9187717 8195066
5735 8195066 7484488 7019434 6642617 6342501 6069504 5804595 5602200 5423122 5218101 5046738
5725 5046738 4876797 4738333 4594560 4409432 4230347 4132462 4071778 3934705 3811981 3770007
5715 3770007 3745554 3678931 3540686 3395408 3364582 3469455 3462803 3469371 3510003 3491501 3533633
5704 3533633 3673132 3628712 3641224 3729391 3742478 3812150 3815157 3807332 3732207 3640002 3588166 3582325
5692 3582325 3537605 3578741 3556746 3569928 3571441 3589569 3690985 3781470 3831136 3970202 4081691
5681 4081691 4231426 4471100 4783094 5203469 5676417 6185773 6856751 7740465 8889840
5672 8889840 10263747 12224252 14883260 18289332 22040246 25512146 28246958 29935935
5664 29935935 30525920 30022581 28395208 25863486 22653974 19281244 16147586 13428243
5656 13428243 11141416 9349274 8014911 6966043 6114996 5424654 4846599 4435052 4027999
5647 4027999 3665151 3415631 3135750 2888952 2762435 2583537 2441292 2328364 2301609 2224328
5637 2224328 2059794 1984635 1913880 1834750 1754176 1701734 1647048 1611733 1608957 1563548 1540500
5626 1540500 1530616 1551840 1546459 1528201 1439606 1314038 1284410 1281961 1205411 1165996 1118238 1045174
5614 1045174 968347 918696 920960 845372 822926 806246 801350 805493 831529 851546 851608 799903 774826
5601 774826 726373 698198 735306 735264 692765 707488 687796 724192 638297 578632 540958 603654
5589 603654 658903 649185 590666 625338 663355 683171 691843 667038 659847 631948 588923 596394
5577 596394 587501 605012 606118 617212 515155 452802 505274 465767 422342 426121 501637 514589
5565 514589 452584 393687 403351 429377 441128 454563 469494 503804 519203 465420 499729 512159
5553 512159 453591 485352 470743 470282 479441 441473 446729 381942 385220 355882 326050 289860 347015
5540 347015 349925 309289 288952 354992 402046 366079 427936 485229 533814 432479 435964 459360
5528 459360 462715 403122 428157 471095 510508 463967 477028 534868 597310 608304 599402 618892
5516 618892 657444 769608 781966 886737 969978 1086610 1159399 1336474 1479874 1701691
5506 1701691 2011490 2280873 2502888 2639965 2838638 2962654 3094262 3219357 3275106 3240251
5496 3240251 3153351 3037602 2878166 2607787 2304819 2042563 1842681 1645841 1434320 1233782
5486 1233782 1086066 964504 912837 843575 801767 772429 702532 606560 545881 534623 447908
5475 447908 481752 469721 424101 366529 343618 338058 330351 320333 324278 305652 301918 280990
5463 280990 293370 236985 226069 243413 188530 159015 172078 168557 158872 195432 288072 304564
5451 304564 288739 300743 266503 260838 309642 317664 323390 314536 278373 285323 271623 224730 205881
5438 205881 184775 144284 124972 151768 139781 74125 50493 38510 9527 -53513 -71081 -70006
5426 -70006 10098 52817 11412 15473 91355 66346 108368 130729 98484 86622 44327 166830
5414 166830 174260 148174 115040 65873 79602 127303 81172 75251 115549 196012 167684 155695
5402 155695 147937 143641 167572 120190 137956 205799 219194 202252 209273 193203 194424 223559
5390 223559 209078 275239 292187 268336 272199 186695 163513 229406 254789 187560 192354 220033
5378 220033 276873 251660 282936 277573 279163 335372 341236 275438 262039 303917 339930 343981
5366 343981 315035 298951 310757 272037 261363 227378 273340 254034 255126 289919 182424 192029
5354 192029 227204 192055 194980 139689 148560 253936 226542 281333 389966 340321 331530 337675
5342 337675 342996 331744 361785 368543 417058 431946 450459 526294 517991 457628 453418 487530
5330 487530 480393 447338 418187 401326 323174 347938 411621 399877 379676 412962 338751 324889
5318 324889 329768 310116 277603 248467 206949 228253 221657 216346 266945 231044 210728 175561
5306 175561 170975 190565 181110 130903 140011 163737 189882 168553 161539 214180 195098 203319 227504
5293 227504 165114 163034 223118 252296 283262 240363 142656 243259 314877 286270 237852 227884
5281 227884 290927 302955 246497 303232 384173 379861 341016 369986 385759 375780 395759 441556
5269 441556 514710 461791 481151 477391 447418 408122 360161 374644 392385 372248 417547 419023
5257 419023 401216 401110 424987 421836 397762 347698 380979 451848 463112 417411 350050 373505
5245 373505 371096 451350 457784 431580 421752 381803 474040 424244 458121 480781 452336 454450
5233 454450 411821 431618 494090 473373 452981 494681 464676 461468 497017 484244 454593 449983
5221 449983 507960 521156 537283 517385 496636 533221 545011 581708 544590 565379 589530 601708
5209 601708 614331 615439 608820 606721 615946 612330 702844 700910 670719 621830 645583 709238 714128
5196 714128 722927 688961 686896 697429 733276 734568 719031 765491 736896 714155 820545 827285
5184 827285 864884 864730 881130 915987 897438 928168 899889 878148 904446 956625 935754 902783
5172 902783 920449 865097 958955 990229 1003769 988639 999971 1023957 979767 1002901 1040035 1083047
5160 1083047 1095840 1159694 1136176 1121231 1128101 1124141 1151541 1147975 1134304 1176982 1217847 1235345
5148 1235345 1238765 1266215 1329657 1376643 1373082 1347965 1351740 1361325 1381153 1408784 1483131 1445533
5136 1445533 1423838 1420883 1499547 1538939 1505349 1536135 1542461 1599351 1651062 1723951 1775626 1788390
5124 1788390 1767823 1838676 1852837 1908252 1985240 2039982 2029883 2010856 1997383 2083989 2167316
5113 2167316 2153012 2160430 2230110 2281669 2408273 2472517 2524746 2573667 2654047 2751175 2812048
5102 2812048 2894184 2968440 3077450 3123730 3180311 3284992 3388422 3399081 3542345 3662140
5092 3662140 3760669 3930555 4087680 4119379 4256631 4411646 4557857 4719148 4976470 5153695
5082 5153695 5207338 5444582 5638579 5858627 6124272 6324011 6593300 6883624 7127077 7365355
5072 7365355 7736517 8132250 8548720 8896401 9346043 9782860 10310248 10928294 11529968 12182850
5062 12182850 12895738 13763132 14625826 15600456 16700914 17798522 18942573 20167549 21358731
5053 21358731 22478238 23518774 24431307 25288947 25833608 26236870 26375668 26282107 25867290
5044 25867290 25231244 24395552 23521754 22509954 21374911 20230346 19100836 18036592 16996086
5035 16996086 15935818 14956392 14150015 13310666 12524235 11813200 11243266 10698224 10142972
5026 10142972 9618056 9179861 8736037 8404443 8002928 7734244 7479290 7275521 7007689
5017 7007689 6707265 6483433 6365601 6135170 5919351 5716743 5531896 5426959 5291812 5185183
5007 5185183 5071951 4902626 4779770 4669286 4582286 4489074 4454250 4399994 4374136 4307848 4257783
4996 4257783 4274528 4255731 4203484 4196963 4270030 4245963 4219970 4192415 4056176 3992416 3941415
4985 3941415 3963625 3923418 3809686 3733941 3685890 3657797 3573378 3577132 3583817 3583052 3580511 3591051
4973 3591051 3539075 3517480 3525280 3462964 3477479 3564011 3565238 3550113 3667972 3615218 3494296
4962 3494296 3471202 3525987 3556098 3573974 3594404 3611987 3613482 3582444 3606610 3558581 3572843 3660363
4950 3660363 3578587 3613590 3684594 3681691 3714855 3759354 3786077 3781870 3795351 3850556 3864567 3869130
4938 3869130 3907909 3910546 3957394 3958579 4039906 4076987 4179854 4216572 4226718 4202056 4180846 4203413
4926 4203413 4290027 4375263 4384297 4394096 4378158 4396173 4456967 4474928 4549103 4644049 4689754 4700742
4914 4700742 4725942 4774079 4864218 4898453 4943342 5027785 5046338 5078895 5155310 5215922 5284258
4903 5284258 5359745 5453505 5542500 5601687 5665648 5704286 5720340 5782433 5872461 5968496 6043812
4892 6043812 6117760 6176186 6291948 6334270 6509187 6564367 6654809 6771041 6864576 6966884 7064976
4881 7064976 7238643 7315318 7378058 7445457 7536290 7779814 7895126 7999581 8180619 8337137
4871 8337137 8456014 8533818 8740540 8857722 9005489 9146892 9262847 9435997 9601541 9812552
4861 9812552 10054900 10287669 10587667 10844758 11079634 11330617 11649907 11865684 12166601 12399067
4851 12399067 12659187 12934022 13171174 13491148 13763154 13979822 14293108 14689512 15005945
4842 15005945 15396597 15907988 16487641 16910794 17468437 18091540 18634039 19307797 20101215
4833 20101215 20830661 21676567 22681324 23678495 24832718 26144290 27526964 29104184 30956375
4824 30956375 33063274 35586134 38617693 41889419 45078583 48164577 50842404 53180390
4816 53180390 55284519 57092011 58694352 60109817 61607815 63223684 64974335 66959221
4808 66959221 68979958 71049508 73104612 75227058 77151640 79036569 80886388 82672473
4800 82672473 84484388 86269887 88116881 90186499 92368070 94730545 97420105 100442005
4792 100442005 103649413 107098997 110879834 114722530 118839251 123098887 127425789 131761423
4784 131761423 135881425 139687319 143209407 146538933 149382768 151853321 153827773 155436570
4776 155436570 156597134 157311968 157626028 157597474 157407739 157036017 156572861 156129493 155824825
4767 155824825 155639511 155613887 155820115 156377432 157126858 158055479 159215729 160449546 161662058
4758 161662058 162805332 163811111 164560720 165087220 165306793 165171801 164725771 163988682 163027660
4749 163027660 161866747 160609203 159326958 158095398 156964862 156028613 155361469 154958713
4741 154958713 154782782 154925867 155341054 155918363 156637811 157403920 158170126 158722034 159130797
4732 159130797 159209561 158910636 158289325 157073384 155419967 153333388 150737464 147610298 144053216
4723 144053216 140216491 136123150 131902632 127651864 123352594 119141351 115129509 111384186
4715 111384186 107835019 104689295 101870629 99277988 96967256 94947463 92933836 91033535
4707 91033535 89194829 87443440 85496158 83489368 81425162 79233414 76875988 74344039
4699 74344039 71678556 68940230 66190714 63318958 60439292 57505259 54626086 51894855
4691 51894855 49165573 46548345 44064052 41743980 39589716 37564641 35690735 33966782
4683 33966782 32388331 30918203 29568825 28288547 27098246 26111270 25148311 24281743 23530697
4674 23530697 22900833 22282370 21731765 21347173 20938637 20575440 20235382 19882089 19602615
4665 19602615 19349557 19060820 18787664 18486919 18145863 17807989 17544112 17223375 16827204
4656 16827204 16459625 16198768 15875678 15460133 15008723 14642098 14242780 13993055 13696177
4647 13696177 13389433 13085329 12803778 12561477 12347914 12126882 11897014 11679175 11452928
4638 11452928 11227949 11035955 10861451 10612326 10385814 10149974 9908264 9751106 9648050
4629 9648050 9615475 9633716 9695163 9711092 9720845 9635173 9432846 9193926 8782872 8411999 8081316
4618 8081316 7687675 7266178 6969295 6806505 6698238 6654262 6658814 6748878 6842056 6978828
4608 6978828 7132508 7218219 7382470 7536889 7776756 7949207 8163755 8442454 8665947 8862186
4598 8862186 9059052 9264096 9417844 9580180 9712685 9865568 9988289 10039354 10074816 10021032
4588 10021032 9919484 9756980 9566556 9330595 9092142 8868003 8591723 8298603 7966699
4579 7966699 7673399 7355852 7008901 6682444 6376280 6116027 5876204 5600429 5331386 5064972
4569 5064972 4854010 4533372 4306757 4173405 4049599 3932690 3824402 3787308 3784080 3771032
4559 3771032 3786363 3778653 3859582 3967824 4037568 4088227 4192348 4350013 4458023 4521679 4636490
4548 4636490 4728838 4888108 5017660 5081038 5176907 5294310 5293223 5264265 5288201 5335998 5396508
4537 5396508 5495038 5538407 5659764 5806196 5886526 6009754 6118003 6256301 6385965 6544457
4527 6544457 6690977 6812783 6945763 7103493 7195812 7266118 7274066 7251440 7173888 7066877 6981496
4516 6981496 6857492 6703954 6449106 6227544 6068543 5899493 5697158 5420367 5235693 5119623
4506 5119623 4989211 4815695 4814038 4785944 4765500 4734107 4778133 4756599 4704727 4621298 4671141
4495 4671141 4624228 4513263 4437087 4349316 4291662 4206491 4036449 3939474 3838079 3639604 3498795
4484 3498795 3365353 3272235 3194222 3057291 2916369 2844015 2748124 2568725 2535522 2433991
4474 2433991 2333246 2296502 2200147 2151199 2119542 2163124 2113774 2035290 2044736 2034265 1979245
4463 1979245 2014768 2001843 1985639 1859058 1827137 1785469 1810120 1808870 1782764 1796097 1709343
4452 1709343 1667948 1679065 1698456 1664374 1631273 1668516 1626311 1598050 1674111 1687249 1625534
4441 1625534 1616147 1623121 1615505 1611450 1593909 1679609 1635385 1557728 1520861 1492082 1491720 1527927 1504170
4428 1504170 1436410 1411127 1421488 1383064 1337151 1301766 1263768 1225511 1201543 1241879 1220085
4417 1220085 1134843 1161948 1111690 1091592 1097745 1071935 1025436 1012180 1064997 1061828 1053909 1078992
4405 1078992 1058139 1004038 1004045 937321 873928 906028 931212 917161 924163 868330 828629 831577 848570
4392 848570 824463 825704 771232 711188 741256 823044 835205 781619 746049 739284 790725 791209
4380 791209 688307 699462 774275 748414 692618 678414 691176 673284 650334 723718 770701
4369 770701 804831 799492 805194 804951 771501 757543 750647 728990 705688 701078 674062 692141 716191
4356 716191 675605 694483 726609 736395 721843 705847 732551 765353 680702 716651 703132 738161
4344 738161 728696 786738 805557 850665 820914 817049 830582 838251 813620 829808 880665 872254
4332 872254 876211 929691 964299 929507 877223 850034 784576 782336 790963 775056 816714 783240
4320 783240 869321 854913 870284 812108 872746 852866 870263 868699 884371 843265 845188 895881
4308 895881 916901 920417 883518 888448 883995 860098 913401 954102 903205 914441 977687 939765
4296 939765 924699 924129 946580 908415 971685 967862 975361 966703 909767 971990 1058523 1067879 1045643
4283 1045643 1119557 1147657 1185307 1183990 1216920 1243962 1272950 1355847 1329401 1393621 1333766 1377330
4271 1377330 1395509 1403978 1451114 1446189 1440068 1509550 1542215 1572805 1546658 1536909 1586388 1555761
4259 1555761 1561934 1603191 1660480 1677103 1712367 1705650 1716195 1686721 1718650 1840115 1879100 1856908
4247 1856908 1899455 1956202 2035402 1999871 2009433 2050301 2150092 2134079 2114599 2079868 2084990 2102060
4235 2102060 2163151 2140535 2153706 2240125 2288287 2373185 2435429 2501052 2545776 2547909 2584252 2740304
4223 2740304 2812801 2749837 2729197 2706416 2665008 2579286 2537317 2497490 2459914 2467955 2485877 2434227
4211 2434227 2425198 2445628 2436496 2450512 2494721 2536191 2483900 2463018 2454857 2476955 2473182 2421833
4199 2421833 2443065 2457898 2488441 2530867 2487624 2519339 2521846 2420765 2422164 2449256 2472444 2623774
4187 2623774 2672696 2568363 2539239 2493435 2438516 2463572 2536733 2524478 2496936 2560857 2516794
4176 2516794 2535062 2539346 2556670 2531707 2489483 2485829 2512343 2533067 2559108 2524400 2579595 2584311
4164 2584311 2601954 2635532 2643074 2644950 2668163 2747501 2786157 2769286 2716954 2838230 2852422 2881606
4152 2881606 2940737 3056321 3049330 3053358 3076426 3100854 3107465 3228367 3344803 3359541 3349586 3434355
4140 3434355 3488908 3432559 3435162 3472975 3476484 3474902 3550746 3603018 3680045 3646056 3700761 3715904
4128 3715904 3744799 3772837 3688908 3708276 3772431 3762139 3721441 3776674 3855697 3863297 3849493 3912695
4116 3912695 3949524 3970485 4041051 4046565 4073905 4089492 4091392 4173060 4245975 4326802 4371209 4347496
4104 4347496 4411714 4540559 4573783 4596700 4640562 4712098 4770634 4815831 4825782 4923524 4983489
4093 4983489 5003661 5097955 5104475 5215722 5310830 5350623 5395788 5347052 5439812 5527888 5550149
4082 5550149 5676237 5746632 5818461 5859799 5966157 6046525 6140707 6243730 6316370 6387745 6443949
4071 6443949 6502415 6562487 6678040 6821634 6916450 7018946 7128428 7229539 7312698 7411823
4061 7411823 7525761 7605853 7786607 7958785 8190992 8368860 8515257 8710041 8952177 9171418
4051 9171418 9434681 9606852 9757451 9932291 10054888 10197082 10293576 10373677 10498636 10732797
4041 10732797 10877638 10963922 11243690 11506320 11742332 12062672 12306864 12616255 12952789 13415751
4031 13415751 13782990 14210530 14681118 15231711 15794718 16333794 16942647 17627853 18395327
4022 18395327 19179758 19982414 20801714 21554871 22389532 23171178 23989318 24886411 25743504
4013 25743504 26620620 27497626 28359065 29266741 30237256 31210953 32215753 33191897 34198388
4004 34198388 35169884 36113994 37179436 38196156 39095028 40027363 40891017 41768885 42677160
3995 42677160 43593202 44595737 45689608 46820833 48080937 49494688 51145621 52912709
3987 52912709 54812132 56901879 59088316 61449390 63991133 66738353 69776857 72961375
3979 72961375 76370400 79984256 83809105 87684203 91480344 95257250 99002425 102582399
3971 102582399 106005785 109286573 112560111 115801398 119189161 122700996 126290045 130120792
3963 130120792 134300237 138947489 144002377 149603635 155710522 162331888 169331895 176428202
3955 176428202 183403439 189932653 195932580 201312225 206044453 210189796 213813649 217046105
3947 217046105 219912354 222578688 225165785 227579866 229761549 231643832 233183055 234281546
3939 234281546 234855999 234940473 234499832 233496911 231952357 230041962 227919030 225552758 223114758
3930 223114758 220624338 218003645 215390692 212537741 209101272 204972301 200098755 194451903
3922 194451903 188261322 181533623 174493615 167421797 160583477 154162729 148122471 142632501
3914 142632501 137745261 133348033 129266899 125489455 121934872 118511233 115186039 111838370
3906 111838370 108530193 105141384 101731030 98238320 94711713 91277462 87874402 84544249
3898 84544249 81285606 78158826 75220829 72402098 69700133 67276312 64962705 62787411
3890 62787411 60831560 59038798 57376996 55822929 54433470 53139743 51905245 50801476
3882 50801476 49761187 48706365 47738555 46871269 45940259 45073760 44241551 43370244 42498489
3873 42498489 41622577 40644490 39798738 38875613 37898849 36882647 35918323 34979754 34086727
3864 34086727 33343302 32487170 31619710 30812251 29978837 29136776 28280540 27329845 26385263
3855 26385263 25348209 24436534 23470709 22428162 21425715 20551906 19733622 18985706 18218695
3846 18218695 17453942 16835906 16220691 15672002 15186014 14672310 14257169 13857122 13408906
3837 13408906 13100931 12753348 12420223 12073487 11730833 11425153 11141795 10820256 10542507
3828 10542507 10326596 9996304 9649731 9306309 9064765 8819603 8622240 8349605 8119105
3819 8119105 7912470 7658647 7461390 7305714 7124288 6850354 6597232 6491316 6371227 6213328
3809 6213328 6059052 5953425 5753084 5632482 5569772 5464867 5388490 5210419 5085023 4961935
3799 4961935 4768918 4564860 4520889 4428563 4365901 4214082 4126059 4070826 3916408 3802102
3789 3802102 3767598 3634926 3470922 3411378 3321623 3261827 3176468 3092185 3037320 2945194 2855968
3778 2855968 2849009 2765382 2647402 2619610 2587790 2429450 2361298 2387828 2330491 2214040 2201811
3767 2201811 2211982 2164838 2082626 1990093 1949927 1952266 1826010 1867039 1829872 1775821 1768239 1775232
3755 1775232 1730483 1636966 1632581 1597378 1543935 1520442 1498168 1528744 1541468 1455240 1396419 1373899
3743 1373899 1361051 1387193 1419350 1315333 1339690 1315939 1307394 1307396 1295383 1277899 1246234 1182795
3731 1182795 1219736 1181522 1137529 1180013 1149411 1165681 1193285 1122903 1109714 1054677 1033284
3720 1033284 1061080 1104598 1138154 1112073 1072552 1057253 1037096 1107831 1154754 1140158 1105363
3709 1105363 1075012 1065637 1090727 1064823 1021379 972356 1043198 1101035 1083948 1068138 1050156 1067788
3697 1067788 1141446 1125473 1158226 1201520 1210019 1263354 1268687 1291701 1298212 1391939 1383589 1355341
3685 1355341 1284709 1278960 1298038 1276595 1306266 1351831 1329090 1366757 1376740 1403068 1376226 1334482
3673 1334482 1265032 1270357 1333637 1341891 1413633 1422963 1323219 1343003 1402908 1387725 1386590 1394391
3661 1394391 1386716 1424775 1393558 1470245 1523404 1518578 1546037 1529341 1547821 1629183 1620855 1596064
3649 1596064 1551856 1505557 1478131 1480456 1550501 1464903 1377791 1400480 1384203 1350181 1381623 1369396
3637 1369396 1402783 1353422 1316100 1345406 1377661 1404551 1425706 1397312 1439437 1452866 1416076
3626 1416076 1382983 1474423 1564861 1579879 1642829 1650657 1643317 1717763 1770193 1818328 1892632 2011893
3614 2011893 2057016 2013460 2026977 2048044 1928771 1790368 1685199 1636342 1617204 1530685 1480503
3603 1480503 1388586 1348006 1330589 1334152 1362560 1349687 1329369 1346623 1300743 1276567 1333817 1442899
3591 1442899 1493659 1451134 1440525 1595357 1810939 1964324 2063534 2192351 2303140 2395794
3581 2395794 2493429 2445201 2386667 2244457 2056387 1933561 1802089 1634212 1430340 1269451
3571 1269451 1162290 1099326 1063150 956961 960045 951016 943357 983391 958919 970639 948932 961616
3559 961616 911634 939635 975644 989223 1084804 1205059 1304980 1291181 1301105 1374399 1393025 1427471
3547 1427471 1371408 1354634 1249134 1116782 1000983 935497 890791 849807 794831 754643 696835
3536 696835 657699 662199 691763 699275 669568 674539 638952 605807 640794 674615 633598 596990
3524 596990 551176 602258 569194 566568 668971 718332 754949 700265 644857 604950 592290 630443
3512 630443 596970 582221 543208 647304 675748 618409 659075 674365 696029 730502 718721
3501 718721 809219 861864 854598 769164 806135 864418 786504 730902 804817 793950 761563 702373
3489 702373 765811 827878 814527 844031 812308 909623 896306 911965 938909 902500 972293 1004583
3477 1004583 983396 1028924 1042956 1097717 1136275 1167925 1184813 1214078 1271388 1259572 1188605
3466 1188605 1179927 1346114 1379340 1339909 1385788 1473218 1621383 1679651 1754018 1762426 1829443
3455 1829443 1951947 2009999 2133923 2226797 2354533 2516360 2605461 2652336 2835911 3004427
3445 3004427 3135484 3257226 3360418 3375344 3378751 3317115 3148786 2972476 2850550 2681450
3435 2681450 2447661 2189255 1966964 1817791 1695380 1553308 1388623 1391130 1341458 1281767
3425 1281767 1201303 1177417 1110103 1046687 1034751 1079793 1063048 965062 901652 923300 862721
3414 862721 780165 829870 807537 826018 842126 779104 742971 730687 713379 721941 702065 723869
3402 723869 659183 565161 606262 668317 696967 633686 607305 622535 634780 638803 591856 588831
3390 588831 610900 584217 567360 617993 633134 611283 555324 551918 542025 494557 509131 469446
3378 469446 507052 600203 552661 498027 495028 570603 580996 547331 550353 517789 436223 423425
3366 423425 484544 506535 514919 498599 540184 519316 451176 489568 514697 515319 530147 500971
3354 500971 518956 547353 462681 381435 368836 428451 424661 384396 383365 309337 409974 435244
3342 435244 413365 412009 362043 430931 395129 321180 330707 364993 415805 446407 452149 512540
3330 512540 523228 450202 462088 474527 478046 446927 481194 443176 427254 392710 370671 329008
3318 329008 319002 315841 257156 296684 290893 309212 326657 317012 287092 302023 294557 294933 310784
3305 310784 267154 259200 245590 315493 356991 380972 378676 317178 366725 411775 377743 390365
3293 390365 349080 344549 349503 322329 286966 259289 319026 243756 198925 151297 223035 257572
3281 257572 252876 272943 265417 265747 308524 342189 342253 284767 295287 289886 372232 389700 342104
3268 342104 361391 306813 265246 299469 344656 331345 362286 371790 358748 362089 396371 405501
3256 405501 395775 341676 259904 279023 339633 422068 390713 416205 481838 466782 399431 432619
3244 432619 481857 530636 511255 483349 492712 507128 565001 559374 573477 597749 682970 685020
3232 685020 601044 667829 736000 718510 745117 795789 877881 885991 927308 1017470 1186785 1331007
3220 1331007 1389537 1431792 1573199 1631481 1713806 1770206 1863234 1912172 1918282 1888547 1821845
3209 1821845 1720220 1770802 1856782 1765363 1779121 1753550 1724049 1665944 1655206 1642384 1560862
3198 1560862 1506535 1507287 1531529 1542061 1530376 1483093 1527568 1558535 1629038 1721705 1855839 2074295
3186 2074295 2148003 2278292 2502835 2729575 2968724 3204862 3376978 3513216 3606512 3610653
3176 3610653 3655912 3595855 3466921 3386755 3311266 3247310 3054869 2963645 2783086 2682367 2532069
3165 2532069 2432747 2300766 2144352 2000197 1906233 1857917 1744338 1712540 1650849 1664242 1599354
3154 1599354 1605507 1624468 1623936 1645000 1764782 1923664 2079122 2217082 2278539 2312150 2374010
3143 2374010 2414424 2450422 2474467 2454659 2364580 2254157 2202045 2127326 2063837 1996182 1983052
3132 1983052 1985740 1823907 1704220 1595359 1512901 1377177 1327297 1208155 1186371 1139042 1064587
3121 1064587 1096599 1085148 1095788 1023783 1038305 1038337 954123 915729 845348 748317 679434 625190
3109 625190 675506 670447 633298 646198 656862 621599 609555 659174 672427 669211 683713 614786
3097 614786 633955 694195 671664 646630 601983 637859 677648 676204 631511 581198 667780 688205
3085 688205 689734 628868 574123 622040 647486 650783 631717 594760 604768 545616 557037 564806
3073 564806 529197 550297 523074 545916 488834 438131 443284 485901 456446 474365 511561 504352
3061 504352 471978 415830 367435 396709 415635 418061 416735 350480 283945 268378 294057 275245
3049 275245 289107 294529 265761 269137 258185 266140 235936 223804 209884 177306 190552 156184
3037 156184 128089 131989 120956 116219 150246 148538 151269 64934 72459 102755 99828 145854 123613
3024 123613 84004 62874 43826 65188 24683 65302 145746 119809 154956 121069 49746 29190
3012 29190 25928 41089 56933 33420 31312 112696 95774 114013 65162 62541 16712 -31553
3000 -31553 -13860 32907 7211 48725 98557 73271 101487 62651 9489 9298 58815 69561
2988 69561 120671 65371 5107 30434 61912 48051 39237 17532 -18995 -43491 -46413 21116
2976 21116 -19975 -38620 2020 -16691 52735 28346 5877 38415 39363 55118 -31978 -51405
2964 -51405 -8551 -11886 -7336 38835 53328 4320 25558 -6822 -68651 -66935 -2458 11207
2952 11207 -18730 41875 77969 20194 -8885 -2299 30293 33608 -26439 -20956 1763 11794
2940 11794 4211 47175 32860 23829 -11495 -6453 12815 -27062 -2299 -16134 -23067 -93509 32222
2927 32222 118911 96914 105711 69126 39874 -39262 -44331 -15745 81576 94370 99934 98106 63777
2914 63777 82274 91486 102101 87435 76676 31225 51790 -6548 -15362 13656 69173 53155
2902 53155 58539 68395 99009 65137 67105 6788 17842 25981 22838 59489 108622 61386 31619
2889 31619 96324 30207 -7109 4449 72129 54530 35348 40876 72870 86945 123914 174539
2877 174539 93565 88708 86502 96373 132418 114840 202385 184303 145807 157670 171951 185578
2865 185578 160707 178982 267147 272326 283171 295886 332387 351834 369159 441972 440519 468132
2853 468132 480157 418014 441481 450652 507579 513657 465622 488128 497893 547367 538985 534053 555824
2840 555824 490331 548208 577506 596955 676688 715823 639317 625125 667700 753008 762555 724181
2828 724181 799453 835961 835503 788539 860797 962293 924613 982016 1024044 1004842 1038472 1081747
2816 1081747 1013507 1025929 1066779 1041354 927195 902245 905720 928132 997936 1062515 1108746
2805 1108746 1121233 1083008 1039898 1097901 1169164 1186472 1207525 1294134 1339831 1355887 1374274
2794 1374274 1413253 1448481 1427487 1447641 1407173 1314492 1274458 1268211 1251161 1215209 1147308 1141443
2782 1141443 1136066 1087148 1099636 1046856 1082557 1064857 996030 995771 1100850 1075318 1119293 1114995
2770 1114995 1083232 1116173 1071328 1018198 997774 966662 1045431 1107849 1101931 1085715 1118733 1137663
2758 1137663 1164001 1162212 1074849 1029623 1021796 989512 889403 839841 772346 758573 742631 654053
2746 654053 593559 633827 583954 563011 599235 579837 538150 485780 517136 526909 561780 534589
2734 534589 486219 463926 415267 384637 379250 442908 421805 353516 327696 392559 405877 348374
2722 348374 349825 341167 326641 331981 348284 344760 344932 285009 223910 180447 150270 90405 125158
2709 125158 127950 141657 129654 113251 88570 76809 125565 87809 106974 70853 34545 44649
2697 44649 23174 -7984 -27186 85903 58117 43840 69675 5522 70692 80061 127675 109058
2685 109058 117875 40507 6343 61118 61089 -2991 75240 92661 -960 -29377 -14067 -88537
2673 -88537 -81438 -27914 -21863 17131 -28070 -62952 -23779 -36762 -52556 -11437 -61351 -127459
2661 -127459 -76393 -64407 -52933 -21897 -5904 26111 -24499 -64128 -54031 -55313 -106763 -75205
2649 -75205 -24389 -43815 -39609 -39068 -60442 -47468 -105962 -50192 -32307 -17120 4043 -28189
2637 -28189 -31949 -10905 -20641 12027 41768 -1427 1933 -3202 -3099 -12974 -43000 -46228 -48627 40217
2623 40217 14142 17950 21424 -23924 -59158 -43995 -19521 -9561 -24785 -75446 -90292 -76399
2611 -76399 -63664 -84689 -32170 51097 38299 -40314 -7478 8941 16146 68869 40978 -18099
2599 -18099 11594 109242 2736 -57873 -38388 26952 93772 94056 103518 82875 127174 149433
2587 149433 167018 184865 223774 238417 144158 136257 146808 61646 126283 93543 43649 68342
2575 68342 106269 35257 -5759 32847 35242 -12161 -15910 65639 13565 -33402 -16188 -50463
2563 -50463 11550 46056 4609 3739 8861 -47991 -78224 -22652 -34713 -45008 -26742 -48654
2551 -48654 -19019 18786 61334 26310 23598 27207 -15881 -18858 37314 61324 29586 83375
2539 83375 69498 -2949 6185 -5942 -25286 -30940 -3202 -9796 9861 11785 1799 47932 45421
2526 45421 -14762 -2971 96433 56429 68955 66829 80346 71329 14714 -14097 -26259 -387
2514 -387 49459 148389 86004 58114 72376 23032 -17068 42792 76817 136182 147416 128937
2502 128937 159977 153058 122920 116175 85063 76222 90919 113380 93748 74909 90471 91139 80958
2489 80958 69000 96777 91903 118377 100234 128940 113320 74521 76768 94940 62562 75562
2477 75562 106551 133275 118331 116695 145009 130241 125366 146009 138616 120056 180216 249904
2465 249904 157854 177113 154921 111786 167817 223147 189623 123599 136135 117513 77867 34184
2453 34184 102588 112980 136962 224888 213873 172032 221657 188431 169267 159972 192116 221847
2441 221847 136975 182497 190687 177777 211949 242722 256063 258322 245199 278191 251434 267185
2429 267185 280077 292601 223341 239467 281116 186086 162304 239851 240891 201506 194387 251746
2417 251746 300966 271484 296197 287147 334059 268159 268938 335021 350725 332688 291467 340285
2405 340285 306465 284673 328659 384986 390179 362452 367809 385450 431212 424047 394354 438829
2393 438829 468492 492693 506117 491889 476938 484744 494430 492984 495877 555275 542593 560317
2381 560317 593501 591420 600999 608654 704350 678992 684616 684804 720330 709197 717162 755297 806682
2368 806682 861245 904300 947768 966089 1043326 1072425 1133584 1209586 1251824 1325776 1339734 1415094
2356 1415094 1461225 1488996 1527095 1577591 1571671 1621940 1666155 1696695 1852246 1914310 1963743
2345 1963743 2085048 2160490 2326212 2570360 2838416 3029118 3298945 3623113 3894330 4247151
2335 4247151 4537608 4818423 5179044 5616306 6073522 6685367 7557964 8711873 10343360
2326 10343360 12491944 15536477 20107687 26011257 31908795 36823373 40271705 41859706
2318 41859706 41829296 40226203 37045729 32586766 27451665 22643990 18443101 14935177
2310 14935177 12194100 10163460 8687048 7673749 6962247 6346863 5689015 5231031 4797632
2301 4797632 4349269 3970653 3595161 3268444 2946592 2701266 2444012 2323486 2214881 2122713
2291 2122713 1948878 1798645 1672554 1579017 1457799 1368118 1284887 1230113 1178070 1085541 1016892
2280 1016892 1000291 997796 1012216 1004574 965925 913839 954497 958295 926110 925319 849049 791255
2268 791255 836803 826653 835258 748160 701375 685385 692990 680531 641804 601613 624231 662613
2256 662613 596977 561676 572793 532513 515371 516313 505098 445469 413997 390663 346460 296054
2244 296054 245975 350298 307392 291223 330179 312136 224283 248724 270131 260353 214513 254523
2232 254523 213695 222686 280897 337822 318841 239343 236689 223292 186163 182774 106474 108488
2220 108488 103128 117115 160815 108626 135975 171674 175596 157772 160730 169446 166294 95702 147879
2207 147879 133497 50233 92795 169759 193371 143329 84658 92704 77274 52704 96576 72971
2195 72971 114155 142532 76749 98545 49462 17328 43489 46025 18428 49531 66441 55121
2183 55121 44092 66023 52456 72002 29262 28554 -32217 -60723 -36243 54472 78966 54416
2171 54416 15218 -40623 -57156 7234 -30240 -38677 -42324 -67212 29459 -5261 -102958 -44230
2159 -44230 4823 -23263 56481 73308 85171 37187 59630 -13305 -14558 48171 28105 49069
2147 49069 26384 -5850 -54442 -68900 -62355 -3364 13112 -37975 -33539 -21505 5557 19478
2135 19478 -6153 -17980 -46664 -10681 -82 -73033 -63722 -63004 -45960 -73479 -42004 -34336 -11264
2122 -11264 1595 -18780 -89568 -101725 -77825 -89846 -59915 -28480 -55516 -67230 -76788 -55007
2110 -55007 -108425 -83403 -56696 38376 24699 66538 -46458 -74456 -24145 -43823 17046 32971
2098 32971 43710 20481 35919 -33473 -105871 -80763 -33352 37593 31439 4294 -14174 -61145
2086 -61145 -53810 -102868 -130389 -84882 -56700 -68449 -30991 -11306 1488 -7698 -32506 -28884
2074 -28884 -24437 -58900 -50916 21121 -38354 -67372 -33226 -79225 -38053 29863 1403 -77472
2062 -77472 -26397 -47558 -24480 -61820 -49840 -24341 10959 125988 121849 60746 98270 86071
2050 86071 93185 141989 152866 174373 77697 6116 8676 -45115 19881 10545 -20206 2469
2038 2469 -20039 10033 10358 17242 67021 -20251 -21761 -25601 -54784 -37032 -51170 -51663 -2962
2025 -2962 -60068 -59577 -22473 -15672 -12293 -62928 -134214 -67411 -36563 -6616 52717 58901 -8776
2012 -8776 -61661 -63462 -88989 -56878 -57906 -25424 -34104 -69828 -44328 4524 3320 -19803 40414
1999 40414 4395 -58505 -19141 -14060 -47776 -17597 41949 47437 53780 54202 56871 15537 -18375
1986 -18375 -14194 -29377 -85432 -31288 -5057 -4655 -14983 -18570 -28158 -18745 -7746 35011 -9507
1973 -9507 -44998 -51057 -56844 -61714 -43729 -11366 6956 -14004 -67107 -77236 -114877 -114535 -92817
1960 -92817 -44603 -44399 -35021 -57326 -53888 -64369 -54022 -60722 -25062 9651 -16912 -10861 8823
1947 8823 47721 -15626 1946 1577 -12973 -85951 -36313 9960 4071 -89914 -46861 -40307 -85885
1934 -85885 -61363 -69591 -19351 1558 3794 -59779 -24814 54592 3968 -7034 -3594 -25557
1922 -25557 -28411 -12846 10963 -9724 -55790 -101306 -28888 -31400 -120195 -151470 -84509 -56844
1910 -56844 -75983 -51779 -57752 -83494 -117564 -78231 -873 16311 -57417 1946 10098 -23705
1898 -23705 -51918 -43601 -50942 -45898 -2754 -56066 -52605 -82434 -88632 -77833 -46245 -10314 -79194
1885 -79194 -64216 5473 4284 -20968 -78721 -75711 -30672 -14179 -28550 8185 -38777 -24177
1873 -24177 -6959 10088 -66344 -56009 -45757 -26982 32494 -51210 -2151 -4593 -45386 -24030
1861 -24030 -41153 -54939 -48609 -27301 -18832 -81340 -47305 -5248 -9850 21628 61583 50339
1849 50339 -56894 -34780 -46836 -9177 -84209 -126087 -39493 -24584 -50560 -116815 -72732 4230
1837 4230 -5854 -532 -45927 -109387 -49998 17827 1631 22176 -29462 -62990 17349 -62130
1825 -62130 -77584 -73398 -93776 -36356 -39734 -38111 -5755 -26611 -74369 -70515 -14382 22508 8121
1812 8121 16837 17132 -34246 -52616 -40460 1785 -18971 -56354 -78053 -39437 -31484 -29268 -57428
1799 -57428 -87852 -74385 -53589 13701 37670 -77475 -92986 -38905 -20370 -7998 24 -46593
1787 -46593 -68323 -42834 4323 -41305 -71124 -5817 48745 1440 -32998 -13356 -33200 -33196 -54990
1774 -54990 -25688 -16846 8614 73980 3338 -16655 -13891 -19349 10308 -8571 -27278 -39195
1762 -39195 -12417 -94532 -134530 -136305 -106399 -110921 -82585 -20774 -37676 -40032 28984 -18968
1750 -18968 -21714 15967 60644 58977 -7940 -79305 -27946 -48671 -54686 -17887 25840 13574
1738 13574 -45858 -5130 -16005 -32534 -33800 -6656 -66854 -106055 -65055 -14540 14867 -39072
1726 -39072 -24030 -27422 -10950 -39742 -51889 -40191 -43307 -32920 -22436 -9122 -38066 16431
1714 16431 -76646 -79424 -70830 -7722 29706 27116 -10611 -41399 55547 83822 3500 -1192 -18349
1701 -18349 -18244 3430 -15508 -28865 -32991 30413 -20063 -59978 -12842 -6602 -10347 80 -34480
1688 -34480 -13564 16726 -61548 -96902 -52668 -50682 -42588 -33316 -17252 13112 -106127 -92923
1676 -92923 -42342 -46662 37648 50520 8519 -1678 -13199 2075 -43906 -55314 -64629 -51733
1664 -51733 -84892 -48295 -49949 -53898 -4366 -37857 -97636 -31555 -7693 -82773 -58830 -54766
1652 -54766 -68675 -11480 -17848 20663 38195 -3083 -40932 -35473 12838 -2397 -27495 5923
1640 5923 20875 399 -5924 -24309 -61492 -147858 -86218 -68466 -78004 -97144 -70083 -16507
1628 -16507 -43213 44808 35495 -19777 -26055 -25883 -29907 -36061 -20602 -15800 -69599 -85423 3368
1615 3368 3147 -10264 -46473 -76854 -72165 -21942 -22869 42200 -3706 56726 56028 39710 -29047
1602 -29047 -68450 -45153 -24794 -31604 -11715 -38020 -79178 -24733 31271 7967 -25005 -20225
1590 -20225 -802 -19452 20038 43786 -33091 -52055 -82328 -61035 -7116 -51559 -86926 -90925
1578 -90925 -31645 -7585 -3593 -45554 -89956 -80702 -33565 -45970 -42522 45687 3469 -17774
1566 -17774 -28253 -49664 -85779 -88438 -62965 -29444 12963 0 -59969 -73084 -55560 -9923
1554 -9923 -42477 -14969 43881 35534 21306 10208 21113 47354 26520 -1725 -67501 -29717
1542 -29717 -41251 -29162 -35282 -77462 -19003 25083 -58523 -33740 -19717 -2777 -13058 -51035
1530 -51035 -56644 -61831 -13433 -17025 -22712 -24303 16670 35713 -19800 -26629 3734 41949 -59792
1517 -59792 -72971 -20037 13486 13014 -34711 -102356 -58638 5121 87071 81310 8390 -11199
1505 -11199 -88322 -130411 -22901 2992 -76408 -84214 -24638 -38952 -69423 -27866 -60657 -73566
1493 -73566 -18076 -17532 -85095 -43517 -6693 -29447 -29407 -35192 -41482 -20902 -43157 -25615 -49964
1480 -49964 -28644 -18450 22081 19962 36746 16990 10181 -16948 -25972 -10523 -94924 -72930
1468 -72930 -48731 -35873 -4634 -64656 -24731 -18122 -68710 -70552 -22084 -23847 43750 38747 -10913
1455 -10913 -98202 -88476 -78954 -33094 21274 -56527 -59634 -44768 -18853 -27885 -62385 -74901 -68516
1442 -68516 -135480 -85394 -28949 14285 20228 -3471 10420 -33338 -51122 4013 -19938 -33059
1430 -33059 18816 19916 -34469 -6216 -728 -20984 -37535 -28896 4497 -318 -26858 -90648 -106361
1417 -106361 -5538 -11998 -24328 9174 17087 -24742 -16012 9640 935 26277 35025 43388 24976
1404 24976 35197 91763 108701 6981 6440 -34739 -2630 3466 -6563 2432 10225 -14910 23907
1391 23907 54264 -14053 -28490 -7147 -18101 -73413 -26845 8152 -18613 -130 -34589 -101937
1379 -101937 -68957 -10769 27371 22971 60740 -2343 -67721 -59501 -14721 -35988 -53143 5532
1367 5532 36791 17721 15340 42800 9697 -18529 39609 50132 69330 -4431 -25220 7123
1355 7123 346 -2488 42037 57888 -24558 11828 4484 -63675 -40867 -28753 -53075 -52992 4378
1342 4378 10284 -10434 -45196 -63784 -58650 -61072 -31672 -57713 -21056 -11707 5133 -12189 -2038
1329 -2038 17841 -813 40853 -20142 -69317 6232 -7797 -64933 857 -32378 14435 52007
1317 52007 -69913 -95276 -66814 -19216 -13925 -64287 -31146 32553 11972 -37443 -39726 5731
1305 5731 33180 -20238 -12603 -18899 6702 62583 42914 5517 38077 55333 20609 49650
1293 49650 977 -6760 -22871 -38995 2082 22753 12390 19810 6599 23887 -13208 -65417
1281 -65417 -56144 -68205 -46215 -45749 -13589 -42135 -23854 -36959 -41343 2263 37026 64978 -36842
1268 -36842 -7958 34226 12487 17357 -17074 -81184 -63404 -69600 -48925 -2591 12213 -3552
1256 -3552 -28864 -39620 -3919 -20673 -46714 -647 8867 45805 40583 -19298 -20891 -83445 -53443
1243 -53443 27820 -5044 949 23906 -31402 -12248 15728 15564 6568 -331 26603 51008 92050
1230 92050 52023 -36120 -35543 -26546 -15584 -32240 -77301 -56699 -37888 -50180 -124317 -55996
1218 -55996 -21716 -54663 -52875 -17879 -50971 -41591 -1128 5315 -43786 -32132 -11594 -26523
1206 -26523 42266 -4657 -28553 -55590 -66705 -59965 -6931 632 -32860 -82891 -55964 -1117
1194 -1117 -17501 -22674 -49612 -49565 -17288 -63953 -92353 -39541 12979 50906 77629 86169 106642
1181 106642 49440 -8048 15568 -36230 -61400 -88087 -16217 50725 -31996 -49979 -6523 -23964
1169 -23964 -13819 -42789 -78322 -27516 -12853 -97534 -61207 -57805 -58914 -62459 -22869 -4127
1157 -4127 34041 27537 1429 50792 54380 -3543 -48800 -32664 286 -6513 -16083 -47646 -75085
1144 -75085 -69039 -39460 33414 78877 83755 100636 102964 53162 71983 48944 33933 19023
1132 19023 73009 110351 33165 -19760 -44116 -65871 -63735 -54273 -55883 -43923 -105696 -99110 -76964
1119 -76964 -64743 -43295 -35175 14427 -34786 -25948 -45643 -20693 -37507 -38404 -20927 -27401 -12931
1106 -12931 29339 71478 30641 4265 46485 101605 75001 59207 39472 4463 -48040 -41440
1094 -41440 -18910 -50396 -49067 -43552 -12296 -22892 -37107 -20083 -47165 -24011 1182 41996
1082 41996 1245 -10618 -26712 -96124 -19271 -51844 -37230 24116 15800 -12890 -58323 -6199
1070 -6199 -18844 -22305 53694 -33807 -11819 16290 -6913 -44983 -34928 1835 -35057 18905
1058 18905 68180 -23839 -50908 33735 32436 46940 46361 29411 32790 -29862 -38866 -55467 -89652
1045 -89652 -73946 -81818 -82687 -26073 40296 48295 19858 32734 -34117 -44525 -77079 -100229 -96469
1032 -96469 -76848 -43989 -7423 99113 52855 33560 -70 -36439 -68113 41874 56391
1021 56391 18505 -1198 -26826 -61399 -59131 2570 31026 23313 -13891 -24915 26701 -21672
1009 -21672 -48713 29655 26658 -9051 8752 43966 -8056 -48831 -27302 -8072 38630 26895
997 26895 39368 2376 -39715 34378 80378 60892 10557 3245 40421 88113 221 597 23012
984 23012 12917 -47946 -75091 6517 2107 12529 71061 92759 28908 -4775 -22523 36340
972 36340 99362 54326 -4558 -26966 19049 -21609 38762 14425 -8316 -23439 8471 4138
960 4138 -23119 56296 66658 29319 22969 36442 12389 19207 -5614 -6298 27599 51012 44147
947 44147 42508 -755 11604 21295 57040 -21028 -7876 -67959 -101582 -15814 -15298 7558 -28298
934 -28298 -6988 -25033 -12707 2570 -56492 -67901 -31628 -66371 -39781 -39800 -12680 49160 34993
921 34993 52691 22501 -573 -5157 74310 17724 -23967 8935 -11677 13338 -5854 667
909 667 49798 46659 38065 -33806 -60622 6900 -3839 16980 17002 45371 65659 63467 38843 26756
895 26756 62818 43628 51978 -26287 -86677 -44039 -34550 -12076 -4341 -19646 -75812 -70656 -18360
882 -18360 2862 -21657 33275 57749 50050 92482 16841 -33941 -21517 1081 23957 -19797
870 -19797 -34737 -56712 -60564 -11029 -10942 24594 -6432 -21924 -52153 -21526 14442 -10020 -6272
857 -6272 17660 14878 -28676 -21727 20696 35635 -10308 -46051 -61662 -2103 68359 -28467 -3007
844 -3007 28610 9550 -7444 42525 91585 52499 4771 -15571 20171 -60775 -30555 24190
832 24190 11902 17260 9596 -16725 -8622 17578 65438 -2902 49261 1605 29914 12044 -55362
819 -55362 6182 99023 62062 67300 105081 48493 17275 20127 62885 19111 -22720 -82372
807 -82372 -121322 -57351 -8879 -35427 -13612 34474 -18703 -81862 -17110 25817 24402 -23819
795 -23819 745 43041 30793 -151 -3287 -1876 736 53676 61336 50341 10545 -21202 42064
782 42064 23736 51393 42159 -11677 22540 82868 63284 -5661 -4222 853 52750 21649 -3171
769 -3171 3905 -28711 -101615 -102834 -27277 -34832 -36332 -48194 21573 41298 91611 64581 47105
756 47105 -16130 304 37592 2169 -17265 -66013 -15232 6810 24593 28432 20525 49993
744 49993 14607 10871 22969 15830 45181 -7351 4927 52539 -18900 -19083 40617 20219 7113
731 7113 62712 90428 43676 -20865 -6426 32119 -29448 -25986 -49987 -94802 -75995 -43092
719 -43092 -21504 17530 56958 58493 35198 6896 60115 40162 54088 47842 84016 9883
707 9883 22169 -11616 -31472 -34165 -19068 19281 -32594 8641 26260 45307 -546 -7557 -14108
694 -14108 79280 26257 50429 40188 26531 36716 27108 10959 -14282 31323 86512 63582
682 63582 38529 63039 80919 24211 -52366 -46203 -985 14335 -40275 -15511 50236 36602
670 36602 34386 69535 50452 39930 53957 33370 12178 17769 -27724 -30624 -22872 -30325 8139
657 8139 66297 80999 76743 74116 66843 77018 99930 26250 11574 15166 -21676 36190 43414
644 43414 11753 -5852 2386 26981 21158 14850 1723 13451 12263 5064 83466 48765 -10256
631 -10256 -4940 62728 66945 90750 70491 42055 79098 85498 52092 -13546 61074 68385 81294
618 81294 85167 -23750 -43627 43310 48987 71527 20684 -21216 47686 64502 34704 40467
606 40467 34508 54626 62179 26150 7715 -7625 -27802 -5556 8360 20321 6768 -22656
594 -22656 -53635 -40617 -3294 694 94575 84408 83383 55948 3804 -44060 -14558 65249
582 65249 49463 52461 3975 5279 54095 -3364 22569 -5415 -3881 -15723 -14378 -1296 -11151
569 -11151 44010 67509 5405 -14735 52463 2205 -26900 16252 14875 27834 11277 71268
557 71268 54833 99775 114147 107933 106818 82072 55090 26174 14478 -2931 -9453 -30891 1033
544 1033 -17490 118 13715 26351 16162 32179 16568 4499 -7105 48111 46704 98058
532 98058 41399 37093 16959 14898 30612 56271 93546 25905 53356 51872 60623 65793 4771
519 4771 20845 66053 36786 26429 43193 7734 14618 55933 76712 33730 -3506 33323
507 33323 -615 12128 17374 3346 57094 21839 -2782 6910 -9215 29669 38250 -977 23442
494 23442 26892 -7392 23534 52501 31909 14157 -13652 -47219 -57039 -13468 -30879 -33655 -10651
481 -10651 35794 35551 60555 77396 37908 47490 10585 49222 51248 25367 49260 56424 37728
468 37728 58390 27499 -8612 -81042 -83917 -41022 99237 99129 2131 54472 -27643 -30943 -54321
455 -54321 -13282 74110 39782 -14899 66328 88755 74995 100317 119048 127879 76507 56636
443 56636 55870 59662 57613 29410 27141 31404 -18783 79573 17416 22068 20901 7322 38421 83954
429 83954 53251 17425 33791 16192 107239 113839 63966 56377 53281 35513 -19600 -40674 21442
416 21442 11182 20163 9091 44984 70817 -36002 -35751 -73334 -23180 17200 69818 -12294
404 -12294 18467 -13440 -34545 21775 482 21100 38853 45613 28109 43761 8984 -1220
392 -1220 -3607 53662 -16002 -8747 7107 57596 52564 -21396 33538 25587 -25088 -14132 -15749
379 -15749 -14795 -34907 -18073 -51548 8903 -29 -8791 1858 33344 67870 23723 -31129 -3864
366 -3864 10424 23058 33629 21204 -11734 -8634 -35731 -50511 -50512 -48302 10971 80643 124855
353 124855 2867 -5925 -56130 -86855 -35820 -21648 8104 -25219 -4384 -30124 -43642 -28220
341 -28220 15838 33809 21788 17695 -29532 11652 -5755 48367 23746 61616 26427 5934
329 5934 29149 31854 56063 38121 48762 40027 52032 102625 111731 56687 -7229 -58628 -84931
316 -84931 -47028 -41095 6179 68611 2939 55302 54860 67180 46600 4050 58537 111344 61531
303 61531 54031 43876 68673 80851 5782 -43052 -47515 -24741 16610 47557 -8594 -76281
291 -76281 -60032 -35106 -51898 -37373 7079 -47381 -61883 7774 60224 83605 8631 37350
279 37350 36380 69485 45576 96289 128117 108163 86193 55089 36503 77468 31395 -4144
267 -4144 28168 40694 -31092 -40348 5185 30746 53136 -30902 -47589 -29831 -7178 32797
255 32797 19844 -34650 -6253 -40329 -28470 -42823 3874 14622 -24920 -23679 31513 -9275
243 -9275 -36078 11819 -345 -30802 14195 -7730 -49615 -967 -12159 -35529 -100593 -85532
231 -85532 -43766 -47693 -56558 -65448 -27154 -26069 -31627 -58603 -2416 31478 -20523 -36089 -17618
218 -17618 5760 27064 67051 111226 81047 -4191 -10482 7838 -33415 51342 30055 22901
206 22901 37898 14678 -797 -32689 19554 53059 8694 -8802 15463 10875 -30346 2421
194 2421 -17640 35213 69858 -15842 30586 21166 62052 14883 -33544 -77071 3212 48643
182 48643 63157 84987 109240 76162 -6199 -23052 34799 32556 -26876 -1892 17399 26933
170 26933 75623 44499 58835 74344 75644 106144 92911 75273 55302 35833 -6790 2249
158 2249 6481 13034 50946 53050 76446 88010 27803 13477 46871 58267 10150 6715 100506
145 100506 91485 41839 -31829 -23807 -1348 -8172 2455 -38895 -17230 28866 29253 18805 26435
132 26435 2693 -2922 -35787 -18835 1815 -17551 -33742 -3091 5742 21306 8305 -14452
120 -14452 12735 42827 30541 -12075 -58469 -36584 47240 72041 43051 51725 25046 11122
108 11122 -7594 -16209 31181 11631 -4874 -2433 19040 57032 53628 -6157 45629 42263 1860
95 1860 -31616 -10490 28875 19997 33643 48671 82099 40378 34098 52856 15222 46088 10472
82 10472 4675 27443 18105 31322 42591 67543 45312 27940 -26801 -18378 -8284 -24300 6747
$$ [...]
##END NTUPLES=NMR SPECTRUM
##END=
