##TITLE=1H_CA-9473
 200.13Hz, CDCl3.
 8 sc
 2.7.2026
##JCAMPDX= 6.0         $$ Bruker NMR JCAMP-DX V2.0
##DATA TYPE= NMR SPECTRUM
##DATA CLASS= NTUPLES
##ORIGIN= UXNMR, Bruker Analytische Messtechnik GmbH
##OWNER= pz
$$ XWIN-NMR		Version 3.5
$$ Thu Jul  2 14:52:45 2026 Russian Standard Time (UT+4h)  she@DPX200
##.OBSERVE FREQUENCY= 200.1313
##.OBSERVE NUCLEUS= ^1H
##.ACQUISITION MODE= SIMULTANEOUS
##.ACQUISITION SCHEME= undefined
##.AVERAGES= 8
##.DIGITISER RES= 18
##SPECTROMETER/DATA SYSTEM= spect
##.PULSE SEQUENCE= zg30
##.SOLVENT NAME= CDCl3
##.SHIFT REFERENCE= (INTERNAL, CDCl3, 0, 15.488)
##AUDIT TRAIL= $$ (NUMBER, WHEN, WHO, WHERE, WHAT)
$$ ##TITLE= Audit trail, XWIN-NMR		Version 3.5
$$ ##JCAMPDX= 5.01
$$ ##ORIGIN= Bruker BioSpin GmbH
$$ ##OWNER= she
$$ F:/spectra/data/she/nmr/H-C/1/pdata/1/auditp.txt
$$ ##AUDIT TRAIL=  $$ (NUMBER, WHEN, WHO, WHERE, WHAT)
(   1,<2026-07-02 14:51:10.00 +0400>,<she>,<DPX200>,
      <created by zg, POWCHK disabled, PULCHK disabled
       configuration hash MD5:
       00 E9 B6 7A A2 85 ED C7 34 08 36 98 17 FE 4E 26
       data hash MD5: 16K
       C6 C4 C8 B3 B7 9B 48 96 6A B9 42 C2 0D 69 9F 04>)
(   2,<2026-07-02 14:51:12.65 +0400>,<she>,<DPX200>,
      <Start of raw data processing
       efp BC_mod = 2 LB = 0.25 FT_mod = 6 PKNL = 1 PHC0 = -4209.507 PHC1 = -4.207699 SI = 16K 
       data hash MD5: 16K
       96 F3 A0 5A 85 06 AA 07 B8 3A 8C 08 10 31 9A 66>)
(   3,<2026-07-02 14:51:30.14 +0400>,<she>,<DPX200>,
      <pk PHC0 = -10.52001 PHC1 = 15.6 
       data hash MD5: 16K
       E8 D1 8D 7C 1F 4D 28 82 6E 8F 33 CA 4C B2 9E 46>)
(   4,<2026-07-02 14:51:34.28 +0400>,<she>,<DPX200>,
      <abs ABSG = 5 
       data hash MD5: 16K
       1A 73 51 75 84 61 23 19 33 56 FC C0 4E 11 B5 9E>)
$$ ##END=
$$ 
$$ hash MD5
$$ 28 28 09 55 73 D2 DA 26 9F BA 5E 86 84 5B 4B E3
##$RELAX= 
##$RELAX= 
##$RELAX= 
##$RELAX= 
##$RELAX= 
##$RELAX= 
$$ Bruker specific parameters
$$ --------------------------
##$DU= <F:/spectra>
##$EXPNO= 1
##$NAME= <H-C>
##$PROCNO= 1
##$TYPE= <nmr>
##$USER= <she>
##$AMP= (0..31)
100 100 100 100 100 100 100 100 100 100 100 100 100 100 100 100 100 100 
100 100 100 100 100 100 100 100 100 100 100 100 100 100 
##$AQSEQ= 0
##$AQ_mod= 1
##$AUNM= <au_zg>
##$AUTOPOS= <>
##$BF1= 200.13
##$BF2= 200.13
##$BF3= 200.13
##$BF4= 200.13
##$BF5= 200.13
##$BF6= 200.13
##$BF7= 200.13
##$BF8= 200.13
##$BYTORDA= 1
##$CFDGTYP= 0
##$CFRGTYP= 5
##$CHEMSTR= <none>
##$CNST= (0..31)
1 1 145 1 1 1 1 1 1 1 1 1 1 1 1 1 1 1 1 1 1 1 1 1 1 1 1 1 1 1 1 1 
##$CPDPRG= <>
##$CPDPRG1= <>
##$CPDPRG2= <>
##$CPDPRG3= <>
##$CPDPRG4= <mlev>
##$CPDPRG5= <mlev>
##$CPDPRG6= <mlev>
##$CPDPRG7= <mlev>
##$CPDPRG8= <mlev>
##$CPDPRGB= <>
##$CPDPRGT= <>
##$D= (0..31)
0 0.7 0 0 0 0 0 0 0 0 0 0.03 0 0 0 0 0 0 0 0 0 0 0 0 0 0 0 0 0 0 0 0 
##$DATE= 1782989469
##$DBL= (0..7)
120 120 120 120 120 120 120 120 
##$DBP= (0..7)
150 150 150 150 150 150 150 150 
##$DBP07= 0
##$DBPNAM0= <>
##$DBPNAM1= <>
##$DBPNAM2= <>
##$DBPNAM3= <>
##$DBPNAM4= <>
##$DBPNAM5= <>
$$ [...]
##$SUBNAM3= <"">
##$SUBNAM4= <"">
##$SUBNAM5= <"">
##$SUBNAM6= <"">
##$SUBNAM7= <"">
##$SUBNAM8= <"">
##$SUBNAM9= <"">
##$SW= 18.0517328524113
##$SWIBOX= (0..15)
0 0 2 0 0 0 0 0 0 0 0 0 0 0 0 0 
##$SW_h= 3612.71676300578
##$TD= 16384
##$TD0= 1
##$TE= 0
##$TE2= 300
##$TE3= 300
##$TEG= 300
##$TL= (0..7)
0 120 120 120 120 120 120 120 
##$TP= (0..7)
150 150 150 150 150 150 150 150 
##$TP07= 0
##$TPNAME0= <>
##$TPNAME1= <>
##$TPNAME2= <>
##$TPNAME3= <>
##$TPNAME4= <>
##$TPNAME5= <>
##$TPNAME6= <>
##$TPNAME7= <>
##$TPOAL= (0..7)
0.5 0.5 0.5 0.5 0.5 0.5 0.5 0.5 
##$TPOFFS= (0..7)
0 0 0 0 0 0 0 0 
##$TUNHIN= 0
##$TUNHOUT= 0
##$TUNXOUT= 0
##$USERA1= <user>
##$USERA2= <user>
##$USERA3= <user>
##$USERA4= <user>
##$USERA5= <user>
##$V9= 5
##$VALIST= <valist>
##$VCLIST= <CCCCCCCCCCCCCCC>
##$VD= 0
##$VDLIST= <DDDDDDDDDDDDDDD>
##$VPLIST= <PPPPPPPPPPPPPPP>
##$VTLIST= <TTTTTTTTTTTTTTT>
##$WBST= 1024
##$WBSW= 4
##$XGAIN= (0..3)
0 0 0 0 
##$XL= 0
##$YL= 0
##$YMAX_a= 207083
##$YMIN_a= -187997
##$ZGOPTNS= <>
##$ZL1= 120
##$ZL2= 120
##$ZL3= 120
##$ZL4= 120
##$ABSF1= 15.50339
##$ABSF2= -2.548459
##$ABSG= 5
##$ABSL= 3
##$ALPHA= 0
##$AQORDER= 0
##$ASSFAC= 0
##$ASSFACI= 0
##$ASSFACX= 0
##$ASSWID= 0
##$AUNMP= <proc_1d>
##$AZFE= 0.1
##$AZFW= 0.1
##$BCFW= 0
##$BC_mod= 2
##$BYTORDP= 0
##$COROFFS= 0
##$CY= -3
##$DATMOD= 1
##$DC= 0
##$DFILT= <>
##$DTYPP= 0
##$F1P= 0
##$F2P= 0
##$FCOR= 1
##$FTSIZE= 16384
##$FT_mod= 6
##$GAMMA= 0
##$GB= 0
##$INTBC= 1
##$INTSCL= 3.241238e-09
##$ISEN= 128
##$LB= 0.25
##$LEV0= 0
##$LPBIN= 0
##$MAXI= 10000
##$MC2= 0
##$MEAN= 0
##$ME_mod= 0
##$MI= 1.114404
##$NCOEF= 0
##$NC_proc= -8
##$NLEV= 6
##$NOISF1= 3.799351
##$NOISF2= 2.8
##$NSP= 0
##$NTH_PI= 0
##$NZP= 0
##$OFFSET= 15.48797
##$PC= 1
##$PHC0= -4220.027
##$PHC1= 11.3923
##$PH_mod= 1
##$PKNL= yes
##$PPARMOD= 0
##$PSCAL= 0
##$PSIGN= 0
##$REVERSE= no
##$SF= 200.130006751812
##$SI= 16384
##$SIGF1= 3
##$SIGF2= 2
##$SINO= 0.751879
##$SIOLD= 32768
##$SREGLST= <19F.Aceton>
##$SSB= 0
##$STSI= 16384
##$STSR= 0
##$SW_p= 3612.71676300578
##$SYMM= 0
##$S_DEV= 0
##$TDeff= 16384
##$TDoff= 0
##$TI= <>
##$TILT= no
##$TM1= 0
##$TM2= 0
##$TOPLEV= 0
##$USERP1= <user>
##$USERP2= <user>
##$USERP3= <user>
##$USERP4= <user>
##$USERP5= <user>
##$WDW= 1
##$XDIM= 16384
##$YMAX_p= 379395297
##$YMIN_p= -1623877
$$ End of Bruker specific parameters
$$ ---------------------------------
##NTUPLES= NMR SPECTRUM
##VAR_NAME=  FREQUENCY,     SPECTRUM/REAL,   SPECTRUM/IMAG
##SYMBOL=    X,             R,               I
##VAR_TYPE=  INDEPENDENT,   DEPENDENT,       DEPENDENT
##VAR_FORM=  AFFN,          ASDF,            ASDF
##VAR_DIM=   16384,         16384,           16384
##UNITS=     HZ,            ARBITRARY UNITS, ARBITRARY UNITS
##FACTOR=    0.220516191357247, 1,           1
##FIRST=     3099.60761115222, 0,            0
##LAST=      -513.109151853563, 0,           0
##MIN=       -513.109151853563, -1623877,    0
##MAX=       3099.60761115222, 379395297,    0
$$ Real data points
##PAGE= N=1
##DATA TABLE= (X++(R..R)), XYDATA
$$ [...]
7109 7730164 7334712 7903188 8250873 8106095 8306373 7706529 8010359 8894233 10101046
7100 10101046 12073170 12496610 13146383 12826317 12435964 12120405 10681358 9828778 8729903
7091 8729903 7688124 6828246 6046227 5644671 5140184 4501583 4650920 4475232 4271654
7082 4271654 4187434 3987017 4058905 4369796 4167615 4271411 4319349 3573095 3101269 3404994
7072 3404994 4155911 3934208 3272202 3599765 3572872 3239248 3862485 3971568 3767957 3146771
7062 3146771 3162268 3508436 2736848 3542670 3343033 3318772 3555818 3312960 2970283 2972547
7052 2972547 3767901 3903692 2963423 2712500 3061040 2778004 3039051 3426036 3691521 4046983
7042 4046983 3104147 2882969 2777233 2940236 3569556 3704852 3618627 3544177 3473380 3483697
7032 3483697 3807886 4194016 4135792 3002816 2657441 2681590 2775551 3445364 3940922 4145694
7022 4145694 3457628 2553455 3393514 3524232 3704872 3799050 3430465 3087552 3289403 3273374
7012 3273374 3658806 3637935 3949070 4229618 3545577 3390214 3685577 3349636 3320981 3783081
7002 3783081 4212355 3821143 3756574 3623825 4217932 4131733 4254544 4155392 3566528 3946060
6992 3946060 3791625 3763106 4550104 5297200 5353924 4760480 4670069 4817724 4901806 5423834
6982 5423834 5620412 5760945 5691709 5858765 6637556 7117233 7209842 6900862 6799252 7315017
6972 7315017 7416864 7517401 8107852 8302219 8298619 8785045 8725322 8517969 8895058 9490563
6962 9490563 9937350 9771954 9666058 10496325 10066606 11054481 11335613 11540057 11997081 11697958
6952 11697958 11391362 12022858 12152935 11779482 12049023 11949822 12465679 12799752 12569930 12462841
6942 12462841 12634886 13090219 12738963 12222332 12023451 12282160 12954383 13290054 13791717
6933 13791717 13835104 13290670 13346752 13633232 13607208 14174907 14351229 14066615 14002232 13876584
6923 13876584 13538891 14071036 14172691 14196934 14247688 14013199 13809824 12958318 13797227 13575079
6913 13575079 13696935 14267147 14039035 14110741 13959031 13867379 14033411 14038536 13402781 13199250
6903 13199250 12793256 12538087 12507386 12609302 13148123 12676779 12215741 12496606 12732791 12702901
6893 12702901 12962062 12596483 12250476 12267981 12582258 13172524 13021044 12472965 12006972 12132062
6883 12132062 12384472 12075321 12199389 11445875 11011098 11449252 11419249 11508946 11573979 11294552
6873 11294552 10462183 10477155 10210165 10500855 10239515 9789864 9408012 9129533 9444588 9994757
6863 9994757 9874007 9609439 9102376 9224022 8768755 7590572 7902593 7663188 7668055 7703121
6853 7703121 7774659 7877213 7396623 7458129 7222039 6729063 6519340 6878153 6683758 5992581
6843 5992581 6148279 6524144 6515457 6903632 7627529 6613834 6150831 5798356 5689378 6696101
6833 6696101 6789119 6998410 6343422 5959986 5969086 6620604 6739471 7478049 7901001 6292400
6823 6292400 5911550 6399708 6802766 7121608 7473229 8015221 6951669 5847433 6925803
6814 6925803 7331740 6997598 6559626 6155636 6241815 6201874 6348033 6037208 6240360 6936731
6804 6936731 6020084 5756608 5647275 5527310 5863003 5542173 5972012 6426951 6098513 6070126
6794 6070126 6545596 6369274 5700099 5929135 6214285 5731461 5230548 5274395 5887131 5777920
6784 5777920 6532676 6217059 5388955 5815683 5576684 5908963 6877863 7187601 7276596 6194345
6774 6194345 6010481 6664132 7110411 7673904 7745001 7356860 6726757 6429564 7186340 8144242
6764 8144242 8031359 7785016 7547269 7829567 7390561 7986013 8418014 9073068 8623381 7988128
6754 7988128 8586751 8975472 8921408 9102307 9471655 9622139 9245440 9466930 9624899 9357108
6744 9357108 9148821 8879336 9344504 9367297 9449523 10313511 10273680 10300755 10563753 10681557
6734 10681557 10252927 9525791 9770921 9802977 9218222 9872206 10404403 9719257 10105804 10727279
6724 10727279 10773817 10957832 11046232 11092963 11414311 11874496 12002532 11548535 11720960 11344586
6714 11344586 10722356 10621550 10555217 10234613 9984969 10052451 10023747 9370273 8889465 9169329
6704 9169329 9166117 9699452 10452957 10447997 10510214 10112275 10154290 9979930 10089760 10511543 9526823
6693 9526823 9298500 9873363 10040109 9398918 9263339 9623297 9746693 9400516 9221643 9453240
6683 9453240 8926045 9073862 9889607 10000639 9361463 9167380 8785518 9267729 9181724 9250055
6673 9250055 9604012 9254641 9552963 9653995 9518283 9381794 9566212 9522762 9041127 9525457
6663 9525457 10086782 9556170 9556920 9565931 10161143 10380176 10758372 10975494 10576874 10417732
6653 10417732 10924239 11969478 11952122 12853506 12985553 12497418 12384090 12572260 12608106 12297573
6643 12297573 12553720 12740274 11602294 11333314 11135410 11414830 12507188 12888945 12267561
6634 12267561 12046420 12386546 12465652 12691591 12929172 13114538 13030546 12327847 12089256 12514536
6624 12514536 11969160 12375343 12494895 12280883 11826315 11591788 10942225 10851884 11310879 11756781
6614 11756781 11894502 11300291 10832123 10731847 10695780 11041224 11529582 11572506 11321640 11049899
6604 11049899 10839614 11119442 11649777 12308714 12271622 12223102 11961298 11895286 12223078 12207831
6594 12207831 12836320 12812807 12400014 12417129 12928874 13197016 13668024 14077543 13550102 14010284
6584 14010284 14429391 15221382 16421913 17257276 17291356 17619787 18568275 19702422 20943639
6575 20943639 22598323 23986419 24189717 24172258 24421692 24990291 24819725 24282787 24306654
6566 24306654 24419654 23503316 23186038 23010403 23004027 23390952 23864342 24577003 25209721 25012217
6556 25012217 25145453 25482424 25994304 26652810 25788964 24799739 24847831 23895421 23605064 24189486
6546 24189486 24246703 23961359 24139654 23630785 24208320 24354648 25654471 27024658 26697707
6537 26697707 26597533 26710452 27220410 26782095 26614748 26610370 25331437 24616720 25061637 25888771
6527 25888771 26244131 25718363 25920647 25915439 25186374 24622416 24232465 23885772 23073602 21718215
6517 21718215 20728289 19822886 18748882 18043511 17758100 17876312 17729302 16336173 15881797
6508 15881797 14909915 14798172 14514826 14035567 14251173 14431275 13981592 13401384 12688665
6499 12688665 12301066 13085982 12623173 12093400 12192384 11635077 11324131 11204011 11980163 12219299
6489 12219299 11605140 11269403 11152176 11485286 11286209 11294638 11402436 11070357 10900283 11562721
6479 11562721 11784405 11764056 12503988 12661151 12282535 12396838 12342141 12968683 12863540 12837208
6469 12837208 13902604 13605336 13775523 13919482 14629746 15116643 15187474 15287766 15151279
6460 15151279 15153367 15796279 15491040 15121263 15360628 15189096 15405907 15762360 16359951 16444858
6450 16444858 16636743 17308996 17399727 17492580 18422436 19168787 19886265 20007863 20337119 21236701
6440 21236701 21663843 21698868 21510250 20749997 20406502 20405518 20029094 20220715 19632264 18772152
6430 18772152 19207929 18650144 18459392 17797811 17128640 16603021 15564767 15437870 15923668
6421 15923668 15782639 15039514 14848847 14839844 15360291 15593344 15926735 16185978 16078988 17026244
6411 17026244 17902205 18873421 18996428 19034605 18319103 17927531 18000957 17541097 17515778 17530517
6401 17530517 17526445 16868113 16663747 16768911 17158559 17306392 17561731 17385225 16961514 16770196
6391 16770196 16952617 17930426 17620697 16897855 17352182 17383446 16438038 16566762 16744385 15683371
6381 15683371 15140398 14459070 14217418 13905643 14092733 14208244 13686943 13748994 13794726 14159893
6371 14159893 14445700 14566729 14275617 14051747 14274855 14192925 14438907 14276456 14276864 13971041
6361 13971041 13458017 13112206 13249918 12801958 12190451 12934203 13113630 13400944 13494776 13848961
6351 13848961 13873921 13628881 14844813 15453009 15521368 16617550 16973234 17295208 17856368
6342 17856368 18265382 18374225 18306458 18295807 17913851 17751108 17136655 17240239 17007631 16186288
6332 16186288 15844045 15810754 15448922 15345754 16507147 15978163 15139907 15510315 15701236
6323 15701236 15930498 15895597 16854310 16844891 16556934 17812140 18863033 19029774 19878870 20008216
6313 20008216 19212500 19000932 19348600 19643665 19048851 18363065 17710501 17253384 16788997
6304 16788997 16678077 16965369 16898290 16977274 18670343 19208667 19394004 20469985 21253374
6295 21253374 20711366 20974784 21444734 21635207 21462150 20460611 19399201 19044909 18349382
6286 18349382 17594678 16832483 15685195 14990228 14562026 14356992 14164150 14435316 14500117
6277 14500117 13562652 14216163 14286619 13791199 14736898 15328064 15094026 15204986 16173057 16490942
6267 16490942 17014743 17604905 17939236 17308298 16312135 16539784 16277914 15191051 14511541
6258 14511541 13922698 13704019 13252108 13400371 13823742 13198677 12142034 11802620 12062371
6249 12062371 12547316 12492405 12291269 11940103 11097110 10854718 11062688 12061181 12431103 11958049
6239 11958049 11050044 10392327 10579849 10742410 11091851 10696788 10697997 9994124 9484587 9729032
6229 9729032 10308022 10073408 9995924 9497942 9054851 8868273 9035298 9514595 9717948 9558948
6219 9558948 9324101 9246763 9206435 9214720 8949621 9651879 10533873 10503090 10262537 9805434
6209 9805434 9572046 9460952 9806814 10125229 9962778 8833433 8765110 8875292 9226692 9257158
6199 9257158 9077151 9556558 9161052 9414117 9211557 9128667 9338753 9167688 8978876 8377001
6189 8377001 8449801 8865153 9216271 9925705 10092888 10352915 10091692 9810075 10116012 10620573
6179 10620573 10437817 11139559 11371605 10736577 10417793 11038396 10797499 11121785 11212044 11075060
6169 11075060 11355310 11681595 11318256 11490948 11653398 10930004 10866787 10359277 10304351 10779464
6159 10779464 10931283 10781048 10060544 9623111 10072746 10028646 10495687 10669070 10559019 10106812
6149 10106812 10161553 10216974 10370411 10559601 10394099 10460607 10131105 10052423 10036799 10456957
6139 10456957 10679734 10907280 10342144 9939334 10098646 10421785 10113671 10189461 9997579 9155549
6129 9155549 8756185 9435067 9760164 9359381 8880544 8814064 8906444 8441585 8848068 9915719
6119 9915719 9812902 8939301 8821399 8928234 9454866 9216383 8836627 9344798 9099910 8836975
6109 8836975 8733600 8444732 8174943 8565901 9057746 8684324 8443033 8075408 8417636 8316853
6099 8316853 8028553 7268836 7314535 8534428 8191523 7546438 7442862 7226748 8072366 8241886
6089 8241886 8019878 6948904 6917211 7246000 7407118 7689636 8177132 7922148 6438616
6080 6438616 6396135 7064255 7564209 7170527 6829913 6956281 6823525 6550455 6343942 7748295
6070 7748295 8034278 6891228 6091029 6184884 6800613 6262397 6448157 7027461 6301280 5708000
6060 5708000 5189763 5500216 6137344 5929120 5925116 5552030 5235236 5047273 6092103 6623261
6050 6623261 6141400 5608169 5395331 5585290 5565664 5921250 6395521 6131976 5856821 6064057
6040 6064057 6974156 6613700 6098481 6319771 6401434 6285603 6200799 6478517 6083829 5657521
6030 5657521 5894873 6057215 6463044 6278775 5484401 5147463 5368765 5427588 5751899 6364101
6020 6364101 5676193 4898161 5460257 5927844 6353117 5751403 6194501 6122041 4912534 5527443
6010 5527443 6814419 7098019 6711917 6488237 6525475 6160457 6288265 7133879 8101808 8556528
6000 8556528 7943411 7239155 6887041 7008688 6724874 7008195 7462144 7442937 6578587 6279570
5990 6279570 6837205 7293977 6489587 6212609 5963260 5487524 5257099 6210726 7151168 7504619
5980 7504619 6919541 6491964 6480317 6280583 6637740 6562562 6670447 6641435 6462140 6953168
5970 6953168 6625903 7008866 7327710 6792969 7136673 6990598 7073473 6666728 6917010 7696166
5960 7696166 7816954 8488296 8892944 8373127 7254875 7343947 8103974 8362741 7921999 7600941
5950 7600941 7199800 6518471 6969004 7133068 7244568 7321966 6856839 6396318 6179300 6731238
5940 6731238 7614672 7367594 6875371 6909488 7001255 7473464 8062575 8429494 7949373 7850469
5930 7850469 7720700 7592252 7782262 7572601 7582603 7882930 7878159 6946023 7038482 7815208
5920 7815208 7846791 8003937 7676457 7554123 7771644 7368461 7119810 7893948 8500865 7679234
5910 7679234 7240448 7503004 7212632 6726713 6880567 6747965 6839519 6178488 6707104 7372090
5900 7372090 7234233 7273748 7330283 7974750 7810004 7259061 7744861 7958826 7905936 7847737
5890 7847737 7745869 7126821 6934705 7057183 7043272 6868097 7011291 7285125 7084221 7125568
5880 7125568 7025937 7244133 6627293 6310939 6184238 5870220 6171781 6045381 6356292 6711653
5870 6711653 5935031 5352216 5608991 6351750 6723218 6134499 6407477 6562987 5859774 5645650
5860 5645650 6403356 7075917 6204593 5756344 6024665 6525169 6932225 7112147 8383515
5851 8383515 8117304 6831036 7220454 7652948 6955690 6902456 7648606 7531801 7056483 7338252
5841 7338252 7623698 7648450 7349190 7240239 7910683 8092808 7637466 6735104 6775123 6964733
5831 6964733 6985763 6865115 6973667 6920770 6551646 5986948 6473384 7201976 6714748 5977548
5821 5977548 5768069 5914951 5840590 6780114 7372221 6955245 6458948 6590893 6488866 6129948
5811 6129948 6547140 6989859 6151210 5056139 5579566 5694350 5050045 5886751 6462056
5802 6462056 5651762 4985414 5213533 6282906 5684626 5200129 5485524 5117744 4882503
5793 4882503 5346748 5318873 4870510 5356399 6149515 5959140 5309540 5943346 6012486 5406387
5783 5406387 5842454 5774203 5571148 5525231 6020579 5276900 5040407 6153445 6131752 5615524
5773 5615524 5146414 5383339 5527356 5876505 5909463 5260702 5399264 5764840 5302657 5468154
5763 5468154 5880819 5827737 5206373 4906321 4900831 4940403 4856492 4892274 5089700 5209680 4356114
5752 4356114 3827777 4702925 5027201 5020035 5174600 5625412 5592839 5298206 5616966 6503743
5742 6503743 5954566 5645938 5599944 5489297 5324473 5591311 6117481 5449072 5704069 6118570
5732 6118570 5253358 4972009 5000617 5644207 6022081 5890604 6621785 6443377 6518056 7090896
5722 7090896 7786437 8745928 8574833 8286995 8962051 8488325 7569173 7200899 7302558 7222895
5712 7222895 6737979 6351831 6580376 6211145 5899118 5769265 6406777 6006992 5041568 5580112
5702 5580112 6023877 6299092 6500366 6869657 6590562 5726382 4950681 5666869 6421264 5912384
5692 5912384 5724018 6076097 5709614 5671250 5188585 5585325 6110733 6312073 6418258 6110151
5682 6110151 5371628 4658443 4768576 5284078 6003743 6146447 6269208 6260946 6416399 6324856
5672 6324856 6707727 6733396 6916602 7027474 6367498 5724524 6150769 6653110 6903650 6858384
5662 6858384 7021518 6480976 6010925 5726088 6083856 7203339 7051112 6690289 7143111
5653 7143111 7648837 7843041 7862051 8131735 8706513 8594325 8144947 7737542 7919741 8001940
5643 8001940 8145728 8449847 8436556 8395897 8178851 7834624 8192399 8472129 8105733 8435215
5633 8435215 8177035 7756261 7876324 7835239 8085622 8323736 8697142 8708101 7683447 8003835
5623 8003835 8735407 8934332 8937152 8982657 9263952 8272054 8018552 8947201 9486475 9373861
5613 9373861 9696476 9190285 8786557 8943049 9062296 9577530 9062777 8506272 8262290 8694519
5603 8694519 9063265 9102723 9179367 9398534 9403910 8924855 8933511 9746477 9433143 8329051
5593 8329051 8172157 8584917 8557452 9040405 9829300 9675542 9522676 9455903 9981079 10435090
5583 10435090 10244789 10677486 10647715 9881360 9908620 9840764 10227067 10070664 9978479 9837421
5573 9837421 9791517 10062799 10334612 10672697 10799597 10138749 9828894 10485112 10734294 10790086
5563 10790086 10744278 10932733 11025150 11278950 11728832 11516421 11582885 11123006 12413690 13337718
5553 13337718 13323199 13902403 14808297 14936046 14502876 14446816 14261989 14175246 13510899 13493064
5543 13493064 13619391 12957026 12803787 13146378 13365807 13001704 13235968 13187314 13453541 14062170
5533 14062170 14092818 13714095 13552116 14069950 14417901 15191582 15738625 15808391 15951767 16714534
5523 16714534 17821836 19328703 20196926 21287226 22632237 22691630 22454270 23206418 23425469
5514 23425469 23008784 22518277 21686274 20981913 20285406 20037780 19795534 19375188 19244473
5505 19244473 18255349 18259229 18368965 18809541 18856167 18186334 18227578 18335421 19087441 20378861
5495 20378861 21656267 22467905 22321156 23367881 24400312 25840958 27629232 29407126
5487 29407126 30669550 30912107 30813533 30828622 30523045 29618343 29167682 28411492 26587124
5478 26587124 25060926 24181074 23956020 23703047 23244463 23233737 22270691 21884286 22155803
5469 22155803 22767008 22664175 22858139 23228175 23953981 23855690 24317918 25677835 27219453
5460 27219453 28467042 29571108 30017334 30786811 32026526 31576866 31169373 31839711 31901154
5451 31901154 30817506 29940482 29409347 28283290 26619204 25805527 25383194 24364179 23257500
5442 23257500 22520914 22315090 22978905 23337730 23750448 23585379 23792481 24319886 24499504
5433 24499504 24802631 25681516 27166131 27274459 27848626 29252782 29051066 28900979 29593572
5424 29593572 30374394 30151682 29413683 29526941 29168231 28175161 27716660 27230601 26994722
5415 26994722 26400029 26320530 25897176 24919092 24432114 25083049 25564544 26673041 27422276
5406 27422276 27011122 26850399 28014628 29418495 30483700 31231341 31916455 32571230 32773080
5397 32773080 33199433 33353162 32216560 32784784 32363329 31487239 30693265 29276992 28504170
5388 28504170 27591524 27488087 27165608 25872993 24443446 24027923 24187289 23200076 22454023
5379 22454023 23409480 22645602 21209234 20893549 21927847 22142757 21788267 22535280 22104831
5370 22104831 21544779 22053186 23214231 24320033 24266759 24197118 24389604 25306933 26685331
5361 26685331 27027640 27071024 28117882 28373189 28809355 29003223 30410119 31036300 32003494
5352 32003494 32597182 33600314 34031185 33353184 33517692 33109077 31961112 30408698 28841490
5343 28841490 27906761 25980163 24409354 23869187 23365248 22673518 22444500 21856775 20734293
5334 20734293 20495297 21278591 21003156 20396496 19748088 19541140 19401462 19055574 19856380
5325 19856380 20237487 19588629 19026099 18678152 18106793 18565338 18993735 18728441 18010777
5316 18010777 17933227 17391288 17511097 18343871 18355122 18741489 19369791 19387723 19033930 19639444
5306 19639444 21377134 22229894 22141391 22256673 22630396 23113754 23297439 23107219 23538981
5297 23538981 22873157 20880669 19847196 20579903 20724994 20337272 19841343 18562772 18250980
5288 18250980 17406578 17681524 18225164 17738208 17670397 16367664 15821690 15798441 16144708 16038471
5278 16038471 15956868 16435871 15671425 15594674 16531513 16572656 16419437 16723701 16942174 16691764
5268 16691764 16316186 16163381 15981913 15974540 16403488 16056750 15986550 15760327 15537945 15329759
5258 15329759 16337281 17560180 16956503 15988175 16366178 17237808 17102489 16703470 17115089
5249 17115089 17917022 18264325 17882257 18210951 17993915 17886462 18299410 17737141 17094302
5240 17094302 17606046 17798390 17536001 17293534 17157742 16948063 16507935 16846805 16989544
5231 16989544 16208452 15986716 16306487 16236806 15748078 15828966 16280609 15959792 15656057 15549285
5221 15549285 15765359 15502374 16160764 16595596 15927715 16739935 16633999 16687418 17371961 18296078
5211 18296078 18502493 18372029 19374526 19298663 18667667 19069415 19596174 19051585 17824710
5202 17824710 17929877 18383923 17698673 17477502 17215201 17037315 16232418 15655717 15717221 15428135
5192 15428135 15245299 14970985 14948358 14488818 13910851 14237773 13647386 13078038 13450156 13483109
5182 13483109 13581813 13576972 13942547 14190509 13428453 14049382 14135347 14661483 14776678 14462127
5172 14462127 14998033 15080918 16138963 17095473 17581570 17865209 18740690 18890635 18453205
5163 18453205 18671114 18199012 18029096 17501479 16750159 15422046 15746547 15380053 14871425
5154 14871425 14720096 14741120 14910056 14321793 14170625 13652486 13771929 14428246 14827735 14982728
5144 14982728 14832706 15025132 15315529 15795730 16459805 16140765 16579313 17087123 17110147 17758148
5134 17758148 18739163 19193050 18899937 18768404 18640503 17772956 17494482 16887051 16578393
5125 16578393 16498939 15943805 16129572 15781150 15332728 14752263 15634095 16094507 15896931 16519806
5115 16519806 16329725 16443997 16902626 17344315 18200511 18442903 19429197 19792463 20424602
5106 20424602 21070515 21535228 22007339 21986944 22480052 22925126 23079273 23874899 23999040 24344340
5096 24344340 24405891 24215173 24210278 23581980 23539089 22424588 21396084 20937626 21149670 20402601
5086 20402601 20632496 20831185 20650605 20249634 20664520 21012031 21564106 22375721 22367798 23669657
5076 23669657 24216670 25070563 26107853 26313984 26977240 27009436 27966840 29232135 30542186
5067 30542186 32464289 33894562 35542194 37184988 37967226 39014481 40085920 41187000
5059 41187000 41176643 39953445 38700507 36441329 34700261 33439839 31986728 30683787
5051 30683787 29038250 28323451 27757445 27345619 27132652 26811609 26920518 27014665 28146058
5042 28146058 28077192 28386305 29714631 30576949 31259575 32908799 35754091 38385491 41074657
5033 41074657 43762058 47243230 51177874 55757439 60823536 64713056 66711088 67564344
5025 67564344 65849809 62349236 58866806 54483066 50207870 46584185 43295123 39920169
5017 39920169 37508253 36341006 35003346 33063265 31622738 32145081 31465731 30492415 30651808
5008 30651808 30824241 31840194 32774819 33921306 35485412 36461536 38834496 41919252 45303513
4999 45303513 49735729 55199271 60917322 66250951 70201060 72081833 71242360 68421046
4991 68421046 64684238 60848405 56277697 51266904 47284502 43582453 40486461 38943064
4983 38943064 36869920 34659210 33537408 31540415 31121591 31306408 30717156 29816752 29560310
4974 29560310 29637058 29743554 30433143 31640947 33424928 33330188 34090762 36232428 38850102
4965 38850102 41343514 44222607 47191940 48577833 49430028 48867033 47069156 45753951
4957 45753951 43772913 41204239 39504840 37516604 35091718 34079897 33047641 32090804
4949 32090804 31907558 31690558 30940498 29918109 29851427 29463474 29842905 29777674 30070004 30266647
4939 30266647 30213961 30264505 30026678 30090299 30583408 30551567 30264826 30123739 30148078 30356671
4929 30356671 31343477 31507929 30776549 30279716 30698251 30621535 30362294 30698972 31009366 30632392
4919 30632392 30215116 30361928 30698071 31766781 33447185 34648258 35535870 35932429 36773139
4910 36773139 37737625 39019991 38651246 37633586 37598399 36579005 34988554 34737064 34675100
4901 34675100 34248643 32700000 31763127 31106908 30573484 30623788 29916666 30056113 30083223 29855843
4891 29855843 29468766 29670111 29835520 30063307 30636116 31702164 32357337 33310152 34056935
4882 34056935 35143038 36609606 38533551 40891760 41496730 42120268 41734589 41273694 41005191
4873 41005191 40193542 39568254 38312554 36929528 35745425 35373419 34833954 33562195 33253187
4864 33253187 32654145 31550263 31598407 32076031 32737352 32362500 32011589 32356084 32376330 32040262
4854 32040262 32878662 33294259 34147158 34132979 35149161 36545711 36760081 37267786 37816123
4845 37816123 38857351 39228903 39442035 39257431 38406579 37649430 37135284 37191302 36257288
4836 36257288 35640059 34935257 34050452 33615251 33768563 33684763 34148412 34182112 33873469 33693808
4826 33693808 32768674 33083814 33461253 33399183 32851523 32735709 33092168 33441510 33917137 34387056
4816 34387056 35645385 35745072 35896521 36753732 37353660 37716686 37384939 37579341 37231655
4807 37231655 37025453 36715548 35897112 36013107 36237828 35738166 35434322 35000970 34403651
4798 34403651 34020234 34070831 34654873 34472060 34329575 33617878 33842491 34158048 34335346 34513094
4788 34513094 34390311 34625607 34488088 34129416 35152400 35742367 36370882 36792620 36837182
4779 36837182 37613633 37288602 37200902 38110107 39073715 38526062 38297438 38728348 38343164 38362302
4769 38362302 38996140 39488914 39954807 39905953 39814367 40113866 41417347 42151859 42735092 42989147
4759 42989147 43338858 43470010 44432117 45788181 46445689 46211951 46810422 47731050 48078630
4750 48078630 48401856 49313330 50056983 50711010 51095842 51352897 52177097 53018774 53634136
4741 53634136 54325995 55463462 56136920 56970628 57909142 58459710 59260027 60234033 61255730
4732 61255730 62126425 62827662 63301419 64174077 64649136 65518551 65813411 65939251 66543838
4723 66543838 66525096 66862357 66887611 66708933 66855039 67193970 67448528 67095156 67724058 68305411
4713 68305411 68595039 68545109 69851444 71090859 71881119 72170336 72568429 73350566 73673385
4704 73673385 74028289 74043400 74485470 74534992 74902740 74103470 73260446 72505553 71669332 71192151
4694 71192151 70290079 69588692 68433820 66321505 64737296 64247364 64084654 63342385 61885070
4685 61885070 61120267 59946406 58485372 58313471 57395358 56458887 56000438 54595397 53089304
4676 53089304 52687647 51997265 50862492 49545911 49145854 47155855 46154068 45315907 44094787
4667 44094787 43191676 42244220 41024809 40009586 39372928 38724404 37200183 35789492 35741297
4658 35741297 34890755 33955435 33291271 32792359 31911187 30844396 31057491 30229760 29765552
4649 29765552 28978634 28152731 28303156 28633574 28079142 27258337 26893859 26279874 25656428
4640 25656428 25774931 26008388 25471911 25313235 24692846 24161506 23942626 23838989 23593358
4631 23593358 23314569 23202972 23115922 23168560 22730388 22394819 22441585 22027055 22032634 21017336
4621 21017336 20541970 20222312 19782958 20228427 20166754 19929477 19151671 19025453 19241794 18985397
4611 18985397 19105401 18990942 19267252 18193864 17834525 17972880 17279650 17316286 17643925
4602 17643925 17160595 16601410 16196245 15844394 15461798 15691935 15266051 15158680 15375418
4593 15375418 14960846 14824162 14854960 14785619 14703324 14487440 14081314 13705865 13821842 14191091
4583 14191091 14756938 14583191 13978789 13053709 12873730 13381738 13532816 13686802 13742232 12721815
4573 12721815 12172761 12296220 12310333 12884713 13211397 13414913 12919039 12190141 12066934 12648844
4563 12648844 12901834 12570731 12592713 12375217 12462376 12238966 11808376 11340594 12277350 12755772
4553 12755772 11810680 11946332 11798944 11328914 11415570 12478623 12737137 12480264 11941199
4544 11941199 11563814 11191997 11553376 12189920 12387363 11911624 11888417 11754546 11980027 12060223
4534 12060223 12623448 12516102 11563194 11788208 11723620 11119859 11159806 11055672 11762411 11394071
4524 11394071 11122422 11459283 11148253 11203349 11262247 12085836 11343298 10572205 11049220 11148847
4514 11148847 11856377 11554864 11890007 11449466 10965569 11002973 10424387 10868955 10846867 11104386
4504 11104386 10775190 10807786 11375233 10437269 10869509 11577089 10935228 10612095 11025751 11548566
4494 11548566 10655749 10642716 11239629 11496172 11268630 11185709 11155999 11042042 11091783 11351941
4484 11351941 11115563 10606020 9842862 10291842 11210373 11779663 11737418 11135909 10727615 11071415
4474 11071415 11074449 10593857 10890746 10809258 10985238 10559393 10143012 11484997 11456604 10570310
4464 10570310 10426564 10251546 10391138 10583889 10773032 10504832 10236610 10731842 10857188
4455 10857188 10899622 10650361 10320576 10584327 10230689 11040392 10317287 10197938 10693987 10730406
4445 10730406 10716974 10198345 11171057 10091689 8977559 9964111 10631465 10871953 11295046
4436 11295046 11140997 11085962 11603244 11072301 11137113 11479667 11169507 11548217 10846031 10525358
4426 10525358 10812690 11511409 11623889 11693127 12150114 12005605 11083197 11570418 11666870 11752619
4416 11752619 11619045 11193368 11249253 11222812 10930067 11703418 12497481 12221519 12289182 12250098
4406 12250098 11628300 11509323 11713740 11692728 12049528 12154102 12375371 12046357 12935225 12801653
4396 12801653 11715255 11848291 12842448 13386994 13642252 13966734 13564686 13629006 14991386
4387 14991386 17034511 19029388 20407581 21260772 20464048 20459143 20416279 19436858 18671112
4378 18671112 18043184 16990129 15637281 15416749 14936979 14320037 14692397 13812243 14140642
4369 14140642 14475002 14628542 14742382 14547800 15447287 15341831 14963814 14539364 13818456
4360 13818456 13771140 14678858 15718956 15905786 15628571 15726475 15593487 16033288 15836017 15640038
4350 15640038 16007074 16633044 16168075 15879856 16790462 17352450 17143959 17173646 17303211 17172375
4340 17172375 17093392 17302065 17898599 17964436 18144378 18206406 18601565 18629855 18548709 18801141
4330 18801141 19695797 20058802 20529319 20725994 20440167 20413813 21276703 22593574 22962502
4321 22962502 23002478 23018205 22705024 23695656 24660397 25228825 25711707 26149182 26333577 26579162
4311 26579162 27692873 28973327 29973945 30393059 30995395 32065329 32919602 33723506 35019095
4302 35019095 36236057 36819380 38291811 39413110 39571173 41267944 43316564 43932265 45689621
4293 45689621 47445692 48559543 49438378 50957396 53708911 54816460 56134571 57883586
4285 57883586 60119454 61801976 63274138 64984550 66982433 69439944 71324110 73232071
4277 73232071 75525056 77877812 80017612 81377767 82447351 83754789 85931646 87575568
4269 87575568 88993994 90300646 92041115 93155845 95265933 96790072 97834046 98347373
4261 98347373 99234824 99669105 99705486 100749182 100344657 100125118 100898037 101471486 101547199 101791607
4251 101791607 101763687 101097403 101158455 101585758 101364148 100006805 98880397 98808750 97912424
4242 97912424 96854790 96590831 96215820 95164068 93927858 93228434 92762115 92093868 91407426
4233 91407426 90418956 89431803 88675471 88396496 87474575 87189957 86861094 85731722 84569684
4224 84569684 83442073 83237570 83268165 82712482 82435315 81640777 81163941 80468400 80175760
4215 80175760 79823537 78926745 78286882 77444122 76138203 75165165 75458777 74219643 73571905
4206 73571905 73576910 72750036 71783948 70484455 69499697 69309112 68432176 68125917 67836815 66901704
4196 66901704 66324004 65688180 65384476 63979648 64257210 64218159 63766067 63628659 63605504 63697825
4186 63697825 63200879 63376275 63438042 63629201 63788979 63313623 62804474 62565624 62803756 63269548
4176 63269548 63178992 62724173 62306543 62141271 61795321 62426838 62561285 62725706 63046478 62882518
4166 62882518 62803717 62908176 63373041 63374344 63943024 64038442 63476326 63841190 64244069 65478269
4156 65478269 65840102 65979096 66371898 66305305 67327387 66993839 67659120 68971819 69519729
4147 69519729 70107949 70964641 72361179 72515226 72334934 72642874 73584743 74017727 73791709
4138 73791709 74441167 74453339 75223082 76116715 76763024 76680530 76324160 76359413 76255418 75810847
4128 75810847 75632346 75484980 75594743 74759598 73669746 73496847 73244610 73091672 73024272
4119 73024272 73082312 72495105 71836070 71285714 71185589 71195351 70339862 70094589 70403010 70124638
4109 70124638 70006697 71024370 72098631 72575783 72936871 73242239 74439126 75756707 77643110
4100 77643110 79632269 81197181 82820098 84989458 87626232 90234672 92523631 94627552
4092 94627552 96515697 98499773 100762649 103425697 105540469 107852558 110518723 112586340
4084 112586340 114964495 117354226 119430988 121786812 123513623 124903768 125553370 125374437
4076 125374437 125841898 126346370 126790303 126631116 126679535 126253109 125433996 125133409 124108770
4067 124108770 123960582 123188862 121481411 120594225 119418386 118061129 116006416 114756500
4059 114756500 113693678 112712688 111156251 109565350 109657772 109269704 108741307 108739352 109098514
4050 109098514 109595576 109916044 110219427 111618193 112970349 115246550 117436323 119392659
4042 119392659 121357105 122572699 124119128 126150229 127872772 128813461 130319086 132305817
4034 132305817 133784205 134628624 135615978 137570569 139183469 139545033 140659686 141454941 142116842
4025 142116842 142499082 142314695 142591346 142275273 141945475 140564034 139460313 138675200 137931305
4016 137931305 137318830 136450774 135927251 134538386 133709003 133516299 132335144 131038827 129995389
4007 129995389 128935435 127425635 126477758 125241017 124675301 123887432 122811506 122379934 121854184
3998 121854184 121042979 121405181 121050498 119939355 120252809 121353791 121320505 121217981 121610175
3989 121610175 121191216 121130653 121031555 121700948 121339771 120735791 120555906 119670228 119467311 119004741
3979 119004741 118488489 117584365 116718857 115545332 114013501 113063139 111757214 111084373 108908291
3970 108908291 106837925 105312572 103765638 102267710 101243926 99736709 97551497 96078782
3962 96078782 95583357 94129323 92251068 90339335 88757704 87078034 86248786 85945410 84541151
3953 84541151 83221748 82007178 80383285 79109148 78187962 77508833 76267986 74740405
3945 74740405 73772741 72463564 71636687 71556293 70900712 69201249 68196460 67640221 66693155
3936 66693155 66480139 66131924 65538426 64406087 63096804 62242650 61937504 62578436 62267063
3927 62267063 61665216 60634286 60607817 61318488 60935308 60800621 61031581 59840916 58686515
3918 58686515 58420318 57736806 57547676 57368455 56925016 57039321 56584022 56109393 56066625 55983350
3908 55983350 56547394 56419794 55918798 55818249 55974287 55955347 55896228 56016358 56755908 57028900
3898 57028900 57093505 57454447 57922632 57952987 58169493 59593065 59427876 58657052 58572045 58909840
3888 58909840 59164445 59478223 60481996 60525983 60148043 60588697 61470785 62373929 62730782
3879 62730782 63846079 64740810 65386771 66917666 67826873 69253214 70573395 72575743 74445992
3870 74445992 75863046 77915146 80649420 83129807 86346132 90643004 93547099 96102085
3862 96102085 99215915 102439338 104905215 107577436 110716391 112178466 113015480 114453038
3854 114453038 115810991 117558689 119469853 121733810 122495986 123270476 124894281 127252527
3846 127252527 128864620 130266647 131009387 131823336 131712612 132535993 133416571 133895024 134364940
3837 134364940 135361297 136952233 138252612 141054020 143762699 147296661 151384108 156388767
3829 156388767 161253097 166287035 172170718 177642186 183369509 188371921 193019955 197340880
3821 197340880 201168952 205710237 209908617 214058964 218502713 223681566 228944845 233908563
3813 233908563 238821544 243502140 246629431 249091474 250592971 250212679 248276912 245795518
3805 245795518 243003629 239950335 237209726 234031356 230130892 226549859 223866850 220767864
3797 220767864 217152381 214438261 210173668 205703900 200714814 195303141 190621871 185169123
3789 185169123 179576063 174230746 169199953 163634966 159422829 155907625 152481435 148655182
3781 148655182 144543323 141166871 138247521 134627138 131828226 129119599 125374249 121852859
3773 121852859 118950774 116346008 114109751 112280677 109350652 107234397 105459645 103327302
3765 103327302 101714468 100083734 99015810 97181120 95375530 94184794 92861270 92007041
3757 92007041 90495419 89545646 88707211 88994450 88679034 87616542 87407376 86668717 86026846
3748 86026846 85664630 86786774 86929264 86164776 86007549 85606268 85705932 85728713 85406362 85381164
3738 85381164 84957663 84515212 84118865 83955123 83821289 83611326 83364479 82708085 81789157
3729 81789157 81073566 80424835 79599229 78762633 78016640 76424705 74966257 73248498 72043833
3720 72043833 70760671 68921173 68005905 66093624 64766571 63393167 62079372 61203808
3712 61203808 59836535 58546112 57599526 56160476 54431676 52989794 52239687 51235175
3704 51235175 49715009 48005615 47739122 47282108 46042693 45605846 45818220 45410445 43886326
3695 43886326 43353026 43348159 42623318 42186424 41712632 41415848 41094295 40548853 40164437 40187897
3685 40187897 39539788 39521863 39261810 39034049 38722615 37889730 37261594 36944146 37857535 37816926
3675 37816926 36593840 36188160 36532211 35988813 36655987 36826583 36343515 35813245 35743566
3666 35743566 35960821 35418713 35198050 36046864 36006195 35517658 34810510 34484316 33921332 33267404
3656 33267404 33788158 33422685 32669329 31884222 31691404 31499495 31406466 31735468 31475842 30938429
3646 30938429 30271943 29886913 29645909 28826434 28279959 28282520 28182120 27143565 26915994 26488552
3636 26488552 26433286 26293989 26151041 25851834 25805543 25696001 25072127 25133636 24467036 24290257
3626 24290257 24200186 25065264 24907673 24772110 24012543 24020414 24503732 24234068 24154452 23758489
3616 23758489 23231065 23059009 24013484 24370551 24162490 24356766 24931103 25202720 25765081
3607 25765081 26785493 27243506 26526692 26196502 26740149 26895196 27065402 27279073 27851852
3598 27851852 27235491 26719474 27665926 27991580 28246391 28364635 28248580 27666963 27209437
3589 27209437 27529016 28016338 27663237 27035461 27776362 27463935 26336352 26216080 26675062
3580 26675062 26545792 26990118 27753133 27542615 27812922 27492772 27008221 27163719 26452276
3571 26452276 25671435 24426707 23396826 23222216 22963183 22780040 23084311 23402641 22599593
3562 22599593 22021218 22628545 22702528 22692573 22910962 23064522 22332169 21233565 21711748 21443385
3552 21443385 20910669 20294369 20031134 19932088 19314964 20307899 20462960 20768839 20644124 20733419
3542 20733419 21343266 21068948 21550585 21538766 21596917 21883321 22727922 22625869 22380604 23705870
3532 23705870 24630674 26022821 26757060 27989154 28848543 28197013 29533910 30254012 30194544
3523 30194544 29629976 28950154 28049903 27078386 26526565 26550990 26081365 25544488 25027690 24348395
3513 24348395 23969855 24536303 24679784 24711761 25140768 25203956 25055893 24560261 24738551 25122623
3503 25122623 25887124 26893299 27289701 27996892 28540144 29740538 31204678 32080470 33220715
3494 33220715 33898848 34628037 35215366 35488979 35992332 36291739 36392498 36558847 36531075 37208131
3484 37208131 38133401 38612045 38825335 39438464 40476776 41986000 44580616 47715640 51412484
3475 51412484 53682830 56895007 60757347 63940893 68063700 72206890 77009347 82941980
3467 82941980 89760921 96240015 102570880 106867269 107931477 107135249 103769365 100011062
3459 100011062 95998572 91168774 86408164 82018690 78032839 75182194 72243584 69147852
3451 69147852 66843297 65098753 64202846 64039813 64695434 65856260 67709020 71195632 74562946
3442 74562946 77508640 79778629 82759534 86282353 92081646 98939902 106106110 115948861
3434 115948861 127403003 139232668 147601268 150461542 148381493 144616237 137778240 130197680
3426 130197680 123120878 115939078 109424623 102859544 96653192 91586924 86921409 83255774
3418 83255774 79923887 77202019 75394973 74553518 73790218 73260837 74062470 75889754 76009905
3409 76009905 76422409 76607109 77044464 78077659 80048994 82675536 86235328 91522855 97600015
3400 97600015 102000623 104547826 105426747 103815180 100915632 97301470 92751322 88695824
3392 88695824 84915585 81577465 77151533 72552849 69841003 67241303 64834854 63318483
3384 63318483 62474314 61244335 60896585 61673861 61705178 61857259 61744599 61609037 61319323
3375 61319323 60179455 59313855 58648862 57766081 56700617 56814356 56894653 57973668 60051205
3366 60051205 60981516 61447076 61736683 61875287 62293271 61224979 60260986 58749776 57253657
3357 57253657 55712907 55201066 54422251 53533828 53016855 52070520 51322934 50746995 49912465
3348 49912465 50206560 50028937 50198182 49544451 48754867 48442908 47374099 47277317 46758042
3339 46758042 45970988 45244903 45382018 45769164 46081566 46306846 47101550 48200573 48404250
3330 48404250 48531815 48830155 48515524 48508487 49232082 49120774 49598763 49767299 50803383 50480764
3320 50480764 50489913 50658191 49594684 48967820 46972613 45628196 44755347 43714362 43113553
3311 43113553 41847436 41797555 42007676 41303103 41746797 42698620 44012938 44793004 45951526
3302 45951526 47433735 49822452 52616385 56389143 61287818 66181372 71727725 77905404
3294 77905404 83324687 86988149 88791734 89823524 88311322 85243378 81587858 77756826
3286 77756826 74070818 70052445 66124901 62349047 59820983 57183173 55422594 53410283
3278 53410283 52525581 52628627 52635375 53106467 54470947 55889751 56673735 58862610 62087738
3269 62087738 65927056 69920289 75571084 83187688 93460923 105238149 117852167 129239870
3261 129239870 138230277 143210943 143530244 140491984 133591743 124852075 114435736 104718053
3253 104718053 95412838 86900300 80038762 73687270 69066275 65562881 62321257 60220488
3245 60220488 58724811 57565957 56424780 55537209 56077414 56856526 58094961 59452274 61131490
3236 61131490 63268320 66324843 70460208 74864622 79199463 84898835 90652090 95817590
3228 95817590 99278701 101111916 101615999 101178578 99250718 96118951 91770547 87166210
3220 87166210 82649828 78411235 74892641 71246080 67791982 64520444 61912640 59288376
3212 59288376 56824821 54456730 52188952 49807076 48103081 47367472 46932668 45954235 46164026
3203 46164026 47024558 47307580 47470692 47789812 49558064 50643618 51087072 54329872 57209180
3194 57209180 59270767 62413678 67991116 72513251 76545128 82241118 87120425 90381289
3186 90381289 91350413 91022233 89705589 87864249 85178096 81544428 78649559 75314753
3178 75314753 70692979 65812396 61574595 57391238 52189895 48214505 44990316 42790239
3170 42790239 40396083 38859023 37714628 36335882 35391373 35305692 35180494 35168874 35524813
3161 35524813 36328189 37552354 38782447 40968145 43437115 45762701 48651460 51511057
3153 51511057 54234716 55668332 57199820 58101189 57727871 56448817 54972440 53752042
3145 53752042 51310473 49393623 46313190 42900176 40124393 38098294 35147152 32309690
3137 32309690 30299596 28089952 25772241 24346633 23016030 21590814 20541613 19945156
3129 19945156 19757966 19402022 18928385 19241452 18635965 18129339 18350934 17292158 16259373
3120 16259373 15699965 15053755 14504233 14981149 15270103 14991947 14414040 14160613 13916700
3111 13916700 13329696 13262680 13060105 12377235 11995070 12606157 12426455 12636080 12871438 12920134
3101 12920134 12469514 12682976 12552340 12435468 12634405 12508764 12845642 12292632 12001655
3092 12001655 12511475 13142495 12595346 12929501 13018453 12435024 11633026 12004943 12380058 12197022
3082 12197022 13171182 12980286 12544650 12044019 12193013 11475531 11209311 11120800 10704889 10606401
3072 10606401 10181261 10396644 10493796 10122708 10105839 9391635 8607050 9304449 9543177 9052320
3062 9052320 9100315 9561194 9868031 10006939 10541329 11230199 11118475 11654498 12201240 12601056
3052 12601056 11759529 11214444 11409570 11411009 10551369 10361172 10271659 9768109 9226282 8789782
3042 8789782 9099538 9029080 8718277 8147999 7384185 7250586 7767835 7348248 7427519 6979386
3032 6979386 6169986 5657002 5366590 6443457 6489086 6669188 7272269 6744073 6674154 7445128
3022 7445128 8004397 7507893 7293395 7404569 6628515 6723605 6774688 6696428 6313443 5720642
3012 5720642 5703448 5630049 5754537 5692619 5259122 4705651 4503932 4516162 4063929 4321664
3002 4321664 4492137 4380878 4233797 3754816 3394253 3666653 3757111 3323058 3155863 3304631
2992 3304631 3477916 3250157 2908351 3980544 4400762 3762965 3297721 3011558 3248094
2983 3248094 2860707 3160975 3586600 3373202 2645073 2429622 2764448 3617955 3449269 3512048
2973 3512048 3299643 2271953 2789669 2882513 3032869 3558738 3429319 3020971 2892996 2477362
2963 2477362 1832108 2134838 3232826 3032077 2321830 2737656 2151022 1985441 2607960
2954 2607960 2803032 2983498 2451295 2583891 2741707 2315711 2820335 3210569 2551086 2913779
2944 2913779 3063214 2713133 3052390 2919931 3218849 3278718 2963441 2918576 2878747 2809962
2934 2809962 2926807 2237132 2615812 2397843 1913050 3119742 3768172 3222835 3072894
2925 3072894 2884752 2461365 2987917 3301192 2946573 3020695 3228989 3370270 3444608 3028563
2915 3028563 2899257 2464841 2961909 3638362 3974208 3504126 3351590 3441554 3157705 3457791
2905 3457791 3450241 3179765 3477973 3880299 3504451 3141142 3412432 4401839 4090689 4067958
2895 4067958 4359965 3840435 3480127 3644642 3851346 4096871 4585045 4736276 4883664 4516911
2885 4516911 5307440 5521786 5662948 5869970 5453908 5388570 6175266 6379254 6559276 7200343
2875 7200343 7977457 8787104 8417179 8900945 9529649 9844357 10194199 10907881 10915527 10613783
2865 10613783 10128525 10454535 10947351 10497230 10963100 10812277 10350565 10470771 10842363
2856 10842363 11969800 11826234 12392310 12549870 11819238 12860610 13944088 14628767 15543709
2847 15543709 16226155 16848927 17352048 17392175 17912579 18927634 19602156 20204334 20795370
2838 20795370 21080552 21892111 22424402 21887978 21286247 21189483 20905091 20663869 20971194 21060877
2828 21060877 21052877 20445796 20854326 20368006 20041452 20087768 20565061 19974506 19990403 20879344
2818 20879344 21196287 21714536 21630834 22769701 23903046 25659496 26985065 28534959 29497300
2809 29497300 30179287 30208782 29770021 30334161 30095179 29291623 28392667 27676824 26825698 25576233
2799 25576233 25038679 24333892 23711744 22515331 22081454 21492985 21715682 21665084 21614194 21140023
2789 21140023 20398558 19887168 19782273 19386418 19489866 19397521 19303072 18947600 18148568 18543953
2779 18543953 18917548 19613237 20339583 21697511 22937658 23476696 23656633 23983630 23706819
2770 23706819 23431499 22280267 20911427 19028325 17347399 16123515 15187634 14786737 14290449
2761 14290449 13218168 11975981 11889097 11318466 11527589 12074658 11767920 11572262 10782541
2752 10782541 10373396 10074307 10313610 10759553 10048426 9149073 8392641 7643144 7838088
2743 7838088 7959151 8782607 8349640 7355359 7224049 7215596 7764463 8444210 8261362 8192607
2733 8192607 7334644 6216008 5915032 5638392 4874709 4617080 4972506 4828950 4005096
2724 4005096 3557166 3629397 3813799 3818499 3701417 3289348 3084067 3025395 2866748 3418726
2714 3418726 3662547 3232905 2282166 2272339 2208923 2057879 2369400 2373606 1611450 795334
2704 795334 792649 1380179 1911908 2128315 1775036 1429940 778406 1207937 1214165 1324488
2694 1324488 1130173 1261631 1320720 1301086 882033 1015040 1441214 1208901 953003 1184702
2684 1184702 867250 919915 759597 708962 1288370 1418367 1335263 1144603 1280516 784444
2674 784444 507315 641325 830546 470625 445345 699034 894172 656228 873302 1164535
2664 1164535 1064132 500312 1042432 1244155 834352 706359 1463947 1307911 962834 762107
2654 762107 928377 1057635 1159253 1175108 935957 1246539 1086931 666219 657996 947341
2644 947341 401918 568205 1227749 1166138 976302 644074 800795 272321 -121673 451185
2634 451185 749074 651874 109043 184051 279700 807065 1036148 581619 787056 365615
2624 365615 -40521 436878 1188919 568215 658281 283737 95090 -188562 478562 1044404
2614 1044404 474045 609493 738938 591933 847457 1271666 1417491 1345918 709221 770867
2604 770867 801956 657618 1229836 1264989 1506185 1400473 1411131 1904507 1855061 2592175
2594 2592175 2479260 2633503 2631043 1922633 1593522 1591197 1545296 1496263 1499794 1001885 220121
2583 220121 443780 192551 534764 851978 1105271 617839 180596 559451 353073 750609
2573 750609 1354217 147929 111886 1112216 836411 250852 915750 995060 517300 946454
2563 946454 803019 115317 833460 957803 834569 749330 1007181 1128859 525818 909158
2553 909158 983675 1309836 912774 569580 413852 106191 482813 -41405 193126 768181
2543 768181 608013 354378 36018 183693 314453 643317 480361 373849 420671 92443
2533 92443 344796 745430 938633 -361451 -127719 629655 739611 542864 1040848 1073711
2523 1073711 151001 647770 504928 786382 1222211 1089586 577758 475109 1668220
2514 1668220 1831095 516484 727527 1250973 435974 438124 1207559 1698428 1252504 837403
2504 837403 445234 110729 553264 1095917 1320624 1120606 659681 20645 -222875 956261
2494 956261 1294271 1308459 1202192 505650 425794 36620 739383 1239201 1372900 626409
2484 626409 295971 866768 1169844 1029175 1415470 1223246 993995 981861 1205567 863725
2474 863725 1044355 1342345 2016297 1598662 965664 210033 288756 759572 1108637 1201167
2464 1201167 1382776 1495428 781744 271852 575773 1095319 1216512 1229773 1060087 431875
2454 431875 617342 982105 891450 1297342 1224903 736375 414227 1032301 1543328 1978902
2444 1978902 1795769 1373044 1459772 1653769 1190233 1746671 1710721 1306378 1414901 1639061
2434 1639061 1872461 1805661 2035891 2114082 1586919 1382602 1768557 2179692 1993855 2159928
2424 2159928 1971665 2013271 2116237 2072013 2084969 1999528 2054178 1935368 2164524 2407829
2414 2407829 2436939 2138597 2241162 2019465 2163356 2521561 3172749 3012086 2728703 2718626
2404 2718626 2281426 2356103 2406304 2646298 2917017 2663682 3422077 3764750 3234453 3196235
2394 3196235 3436165 4109809 3589706 3641318 3931761 4316305 4389550 4013389 3677686 3704906
2384 3704906 4552487 4506397 4081161 4720952 5024066 4809160 4623027 4653563 4983208 5229085
2374 5229085 5978594 6389884 6345818 6422543 6445333 7178778 7376625 7673897 7621873 7273105
2364 7273105 7477848 7438208 7708379 7955160 7959821 9258940 9171445 9310335 10064292 10066222
2354 10066222 10173557 11859209 12901929 13087424 13618622 14999695 16442369 18829539 21991653
2345 21991653 25490053 28608127 31699776 33849952 35692005 37940873 41090586 44444395
2337 44444395 49518279 57230286 67586439 82376500 106219874 147219979 213948480
2330 213948480 294815500 359189103 379395297 373442555 359831912 321424365 274149640
2323 274149640 230591289 191665042 156787227 126587962 100276907 79888077 65720262
2316 65720262 57540356 52122943 48154170 43893721 41019253 38098619 33906670 30139388
2308 30139388 27399186 24963025 22827943 21622581 20422482 19226295 17341007 16048420
2300 16048420 15258619 14606433 14360737 14248318 12708024 11714849 10516938 10251598 10630093
2291 10630093 11129167 10853718 9767711 9357561 8548555 7475443 7342503 7488915 7320301
2282 7320301 6773628 7044284 6378342 5848415 6171144 6472881 6283348 5405347 5961114 5071867
2272 5071867 4338928 4907811 5558624 5102037 4705290 5171799 5033446 4088580 4495893 5218487
2262 5218487 4821816 3550225 2992627 3299382 3831748 4189594 4358367 3952771 3637369
2253 3637369 3727410 2881902 2600262 2809459 3056295 2462006 2379705 2865123 2524329 3070936
2243 3070936 3546740 3424962 2521728 2609540 2532827 2142776 1819816 2243277 2372997 1357003
2233 1357003 1481411 1893443 1962073 1962831 2400554 1752227 905728 789692 1415585 1634206
2223 1634206 1813871 2478697 2556660 1849382 1603079 2034745 1879256 1598107 1893991 1473260
2213 1473260 1333101 1332717 1649478 1529876 2150324 2321433 1447863 875914 811989 269533
2203 269533 739604 593277 1214443 1292737 1122601 1443043 1286087 1392197 1759887 1217829
2193 1217829 798694 -63648 -129 318204 493130 994759 702051 737628 241204 468984
2183 468984 967362 356423 721928 1285243 923800 775299 1702833 1691459 728520 724967
2173 724967 1774782 1259782 579788 927873 687719 473946 672349 755137 425272 1094349
2163 1094349 511361 380798 161895 140253 411415 231237 -142069 -24419 -12428 -37023
2153 -37023 239481 431743 252251 249408 -378359 -428494 -353310 62724 -106337 177529 199827
2142 199827 129467 467763 26171 188097 232238 154155 493748 238292 668151 389561
2132 389561 549504 367493 452653 1012944 1144636 424761 -176277 334627 640016 987272
2122 987272 1239837 809950 192691 -184420 -123358 -101261 299299 832928 1180508 391736
2112 391736 -14895 402507 955464 933636 979189 229354 -589236 -339312 -38471 439487
2102 439487 11652 40164 -148881 -91201 -165659 -667746 -390486 171448 80053 470906
2092 470906 389572 631377 292365 535982 73782 -2342 353520 143141 858581 931908
2082 931908 461394 321138 455132 845822 898590 721530 496554 615321 277851 736632
2072 736632 880303 860102 473235 71036 95140 -334623 -262746 939038 764763 477645
2062 477645 1165370 1129844 1514636 2079916 1983771 1754736 1303140 1422947 1355610 951689
2052 951689 881128 793629 291847 342402 250670 223910 -170529 -176480 291946 -163384 545587
2041 545587 1058122 603690 529855 -189229 462356 576709 466002 524212 -113910 315483
2031 315483 -489358 150549 531868 658881 386255 -251970 38514 446224 237635 291420
2021 291420 415288 -37183 -510066 -211347 294734 187558 10011 -411548 -592740 -918784
2011 -918784 -555835 -86512 173715 661762 345906 -41347 -708995 -254932 288326 165930
2001 165930 -150612 209212 271289 117111 199132 666484 739369 392401 474893 758288
1991 758288 479396 733753 411573 -383306 -632902 8671 -237404 94445 63086 -455398
1981 -455398 175392 -44525 26240 708021 63281 -396005 -362095 -417928 2663 -13270
1971 -13270 78861 -259987 -199310 458214 316535 -263047 74904 64923 -147571 435058 1138090
1960 1138090 1220605 583589 125330 127357 273777 1094330 454654 -90586 -970993 -282203
1950 -282203 377242 418393 889654 1125802 17292 -451194 -36450 -137041 459476 273554
1940 273554 22446 -389206 -460149 -85647 -21277 405514 182088 -634749 -413220 173317
1930 173317 401831 285872 158169 -380432 -932902 -128277 10240 21034 336805 42986
1920 42986 -108708 250425 149635 -48983 156897 429064 483568 228523 -227397 -261922
1910 -261922 584943 501154 395928 72744 -530782 -865089 -205010 685257 497598 277021
1900 277021 177799 75274 74372 -21527 336777 631079 681528 22678 -275790 -1175458 -730613
1889 -730613 177269 -352481 131783 613630 -487424 -851506 36706 -44154 -129983 344486
1879 344486 243097 32614 -367465 -83415 717402 385310 370002 -171019 -376872 -466000
1869 -466000 594869 965444 434050 330738 -413020 -320975 -225663 629999 1274046 315533
1859 315533 674083 199444 -411489 -53546 356757 262063 -802133 -769830 -617309 -455748
1849 -455748 100781 681400 -13929 -842201 -527673 -326465 -904479 -884126 -247053 254547
1839 254547 86940 -61500 -172587 -1070387 -715030 278970 607081 312942 244305 175804
1829 175804 -537170 -517527 106025 173516 172182 140892 134051 364186 305462 148045 255728
1818 255728 489 -151761 -50360 -85655 -220195 -337883 -315340 -232 -134053 -25780
1808 -25780 -565428 -1444887 -374912 404656 312765 105423 -69009 -767948 -547336 -431246
1798 -431246 -243631 -219286 -503939 -460238 -696408 -913583 -221075 -127316 -250611 100216
1788 100216 -31439 -82316 -41163 90168 16967 257009 205261 517405 473164 -184913 62982
1777 62982 126839 -234645 67482 911501 557126 -529713 -96006 86120 647088 158891
1767 158891 -77870 -295103 -724161 -134620 -424503 -448124 -116898 509408 428358 -401314
1757 -401314 -571943 -418708 -356762 488865 516953 424025 2087 92976 -283446 -189705 379564
1746 379564 441307 -69238 -436600 -142515 -99118 726266 594929 536853 313861 551695
1736 551695 639993 326478 728696 961446 449877 -584786 -596467 376324 361679 209267
1726 209267 -38665 -455398 -236642 -321835 -373971 282934 -10194 -663010 -762896 -174097
1716 -174097 87543 116241 -171194 -286208 -338735 -569438 154578 591879 480673 107475
1706 107475 168518 301836 92985 179461 204007 -201869 -508410 -384717 -102646 131625
1696 131625 421486 455784 487302 685631 887725 507081 -442919 -282066 -19230 -394622
1686 -394622 134614 253949 -54427 -305978 -635790 -191189 347696 683346 961475 87563
1676 87563 -110444 169370 347609 737430 642663 449314 -542191 -772522 -787610 -397942
1666 -397942 36616 -237308 126939 -491748 -1008324 13557 613936 513657 555060 -129900
1656 -129900 -648144 -985416 -125251 596731 249511 446953 -39916 -669078 -26624 408728
1646 408728 252904 -27358 9990 -235545 -431134 -121881 633135 636705 87033 -436217
1636 -436217 -882526 -706925 -544129 -68159 318151 -276442 80329 -48003 -806485 -427697
1626 -427697 173081 412948 239002 -315986 -391711 -324306 -144533 501630 148780 522183
1616 522183 504778 -78146 -116516 561678 514622 400607 -39018 -380549 -379625 373463 501706
1605 501706 476693 818054 488295 -304120 -583888 -71716 374689 507145 -152658 -241155
1595 -241155 -495433 -818350 -31060 195849 520845 337028 -498978 -394579 -466506 -327643
1585 -327643 -93473 389894 775653 -61899 -733604 -339742 262904 214800 8049 -194571
1575 -194571 -466813 -658827 -715313 40574 507176 435576 375257 -166895 55047 595089
1565 595089 541692 817833 831296 633570 -126221 -790344 -229573 515429 94508 -598508
1555 -598508 -450 37607 32050 243307 992915 855568 154671 -146973 -168178 -3937
1545 -3937 -211301 76373 53655 -81395 81753 89892 412945 744459 -121351 -500342 -324213
1534 -324213 514213 114318 -254305 602851 483362 -157719 302675 571800 -33571 -375048
1524 -375048 -341641 -110135 -87194 157192 418449 -352648 -375571 -83825 -423458 116072
1514 116072 599376 247800 -391348 -1011450 -482916 -354568 -239832 -396610 -382006 -156982
1504 -156982 -355027 -119962 304838 54729 -78667 315117 192072 133639 107717 -286913
1494 -286913 -419908 -541772 -345896 218206 427649 151654 -164618 -652471 -186224 452525
1484 452525 1051032 1367430 665653 -122886 -300662 -250300 309221 758092 308805 329884
1474 329884 -65974 -173882 510007 439403 735038 545695 170666 -671043 -1068628 -1167114
1464 -1167114 -587739 -40133 108771 -88038 -690317 -265113 -202800 154553 -184578 -183503
1454 -183503 -451014 -164342 311143 302878 -55195 354982 9412 -323619 -873622 -561017
1444 -561017 -371348 -449325 316721 38644 -93938 43141 -80978 472157 834158 1126053
1434 1126053 886173 137044 -164988 -439 336470 468251 388798 499911 -639182 -613877
1424 -613877 -298536 -535498 -686249 -166710 264587 -268917 47289 771141 161872 476560
1414 476560 481416 366722 -526711 -737646 408716 140343 -185914 -142792 70384 -608877
1404 -608877 -230702 207716 66180 -126530 -236460 -509086 -583978 363833 22891 -542273
1394 -542273 -267553 78139 218552 -317478 -79001 -358195 -279239 -336105 -158095 -220026
1384 -220026 -202065 -316722 -185694 -34022 -476743 -367032 399657 -235122 -317336 248629
1374 248629 224565 -196355 -42925 -145252 78737 -181894 -723404 -900304 -321165 176218
1364 176218 161093 -77763 -49282 188358 -127101 -143118 129149 152900 -3381 486030
1354 486030 -94592 -695865 -25995 361597 243751 353332 -29034 -424973 -1097409 -539933
1344 -539933 539811 67614 -61482 83944 -278561 -579728 28111 466414 683412 512557
1334 512557 -23647 -494366 -369182 -265264 -176983 486221 493877 252327 -244048 -87360
1324 -87360 -206923 -155222 361117 -323545 -938919 -699743 -582382 30765 535762 251777
1314 251777 -61685 -6114 -206833 -385682 210810 488153 447815 -378216 -402949 74305
1304 74305 -128268 183853 563572 694339 537362 158629 -80938 -105434 222655 272308
1294 272308 419513 139714 -270670 -333943 -663886 -416822 593394 97706 -689769 -335918
1284 -335918 -1080655 -685445 -621880 -39401 263957 -293433 -305040 -307297 -173259 -427011
1274 -427011 -354943 203735 463011 454251 122730 100825 706016 808276 206667 -105664
1264 -105664 -22840 -76556 -523287 14626 213463 185821 79026 -71294 104017 -320046
1254 -320046 329322 -36661 -428727 -368085 -126929 564474 17964 78321 108555 50080
1244 50080 264186 119770 -6280 51249 126990 -357871 -55869 75521 133386 139650 -164910
1233 -164910 -444713 -305036 -440405 -820197 -111671 48847 226087 294492 -171682 288955
1223 288955 429789 259844 173064 124152 -512611 -796497 -13213 759422 897410 160975
1213 160975 -508237 -384147 565245 699998 291572 505568 256921 -913993 -625002 204710
1203 204710 574699 -146894 -349963 -88400 -231558 -495906 -395154 -690742 -528256 -204534
1193 -204534 -234941 -169794 -509808 -372131 -49589 73489 -39009 -124273 -132600 -864884 -399376
1182 -399376 -68344 378861 275383 35023 -56222 -210553 327466 181600 568037 541823
1172 541823 78043 -518343 -821284 -448707 236799 448864 25417 -699184 -817453 -269858
1162 -269858 12104 -6365 45599 -644450 -477791 -748385 -411219 752241 1048487 -70674
1152 -70674 -470175 -710776 -348970 -285327 -183973 278472 186819 -337005 -100445 169520
1142 169520 200488 -47043 -241416 25701 222063 -783559 -738142 394428 456995 345663
1132 345663 493060 539385 -77043 -161801 241499 670360 128375 -273903 369861 330292
1122 330292 245037 -861 228679 549131 -286585 -796680 -550390 -302956 -413386 444724
1112 444724 273803 286390 -12684 -775313 -344768 16269 -198281 -116311 -658700 -564866
1102 -564866 -1044420 -695862 276249 41137 -335814 -78473 -429119 -864050 41505 663386
1092 663386 755355 630763 439258 -413454 -670724 -455177 -6161 773952 629656 798999
1082 798999 497019 159955 -18999 -574243 18369 -250213 -494804 16118 244959 -211867
1072 -211867 -668541 -400693 -139095 -40768 -81874 216793 122765 -275538 -223197 -441
1062 -441 -57484 -588469 -473118 -197662 -51430 -661060 -359467 348078 -68894 -724624
1052 -724624 -444914 -162206 -459250 -358475 223755 835950 253428 100811 103911 -591362
1042 -591362 -584157 194146 803317 346140 219623 -598340 -1253273 1208 612442 675862
1032 675862 -85320 -221579 -235683 -318602 -38152 138521 -255772 169294 467988 -499781
1022 -499781 -840666 -154520 708656 834296 598181 1089693 -54278 -1025968 -601961 -395924
1012 -395924 -302057 -540544 -136318 -567094 -1257730 -697798 -545683 561536 496813 43142
1002 43142 -106202 -471839 99455 377764 133212 482797 357979 -407223 -448685 133874
992 133874 106812 -540697 18928 -329309 -520122 -279391 323599 -63512 -987416 -438694
982 -438694 -400919 -538186 -253251 -149423 -38214 -554960 -400610 -554729 -119084 158245
972 158245 567774 439572 282333 131455 -12725 526003 462579 -73311 -329724 -89492
962 -89492 19661 417216 829127 956120 -132516 -643922 -453653 -134828 -175686 8959
952 8959 49791 -155251 -451864 118435 174550 -47036 200581 -287765 -659745 -1224417 -749419
941 -749419 -358276 -37791 26546 95262 616545 410524 98638 -112573 -119050 -233991 -586322
930 -586322 -563800 -122672 251522 -200243 -329140 12888 -55522 -160216 -535226 -478808
920 -478808 -136386 -523968 -187173 180890 338696 -7977 -677071 -844066 -350869 484272
910 484272 411364 -116662 265888 34157 -466407 250049 660891 713728 475966 440287
900 440287 781755 642693 363009 8221 -358785 -472989 43267 302589 -91729 -203746
890 -203746 107470 42930 -50505 67757 403857 349960 690439 739052 -320805 -844342
880 -844342 336986 713662 72333 2728 190358 92995 119381 -18316 471068 643155
870 643155 65563 173944 -315233 -273144 -113489 27930 -22078 103234 -431944 -729034
860 -729034 -203304 731057 502961 219910 763853 295545 -651293 -983987 -491756 -238822
850 -238822 -346616 121363 -352617 -758279 -509200 -396261 50894 324254 310860 61456
840 61456 -388697 -136271 117614 -159918 106609 698011 15242 -445873 128713 214934
830 214934 -201949 -226256 -314431 -27599 315080 367825 563027 756068 235483 -294786
820 -294786 -743384 -874937 -483577 -215522 -174577 -133118 57881 302430 -240970 -360539
810 -360539 161473 324175 409651 194330 -45800 -342703 -385916 -147393 137922 364670
800 364670 434266 -137602 -263933 -226328 -470837 -6665 685850 344020 -337381 -133578
790 -133578 702097 748381 456560 250592 148134 -450242 -490107 46996 434330 36404
780 36404 -233223 -173438 35078 240950 211317 -185469 65925 -152712 -271381 678449
770 678449 752064 248209 -84869 282875 352842 580864 230519 250927 127993 -156992
760 -156992 -36459 -108191 88651 334767 86552 -160721 345035 500101 375485 152258
750 152258 210351 276090 285145 386089 -1895 -634349 -490541 -576171 97518 856744 80763
739 80763 -564314 -163737 92988 36669 143506 -123846 -281693 -434341 -619653 2955
729 2955 347679 -269831 -590280 -592828 -411858 -492652 247098 502503 483843 121628 136928
718 136928 188606 -454704 -23474 231304 212320 217865 -336374 -130572 -704149 -455469 187508
707 187508 158768 -102113 -798658 -879992 -804486 -113512 114872 348237 -244006 -969855
697 -969855 -552903 -223315 -416087 -715681 -526796 -305307 -833955 -514249 -69682 266089
687 266089 -495135 -870128 -224056 -610767 -743557 -755717 -595934 -215664 -358210 -572346
677 -572346 -253797 227605 -398080 -356085 -3204 71454 -144408 -328856 -70279 148957
667 148957 -351022 -424885 -295323 -346732 -345597 -232155 448447 684065 695624 46463 -177003
656 -177003 257547 890462 1053943 -81855 -68121 -764262 -586580 440087 258723 128453
646 128453 -170967 -570124 -88573 110976 277974 177326 286189 208550 -414251 -713374
636 -713374 445047 584876 -168199 189947 -141689 -438190 -318916 -54591 272599 508496
626 508496 -299660 -202207 -225192 -204034 -579493 78946 158305 -466222 -814726 -738681 -1073981
615 -1073981 -652193 -259245 -377565 -201728 -405833 -520178 -297894 -91757 70347 11484
605 11484 26962 94933 -50780 69580 309992 293813 19312 -44727 246167 261387 45620
594 45620 -20678 717297 190446 300632 67332 -418258 -73526 -36112 208038 290117 212819
583 212819 -123801 -715756 -592305 -501504 -24912 -413759 -853625 -543724 -487388 -34703
573 -34703 -451317 -652860 -620817 -737553 -327474 -337420 12994 -341578 -649175 -652326 -510980
562 -510980 358324 398717 348718 -163280 -564820 -510687 -120893 -293766 -105476 216640
552 216640 293360 254251 319088 465172 65593 64479 127608 -35111 138699 191132 350614
541 350614 -10268 -66402 83638 156538 -458071 -286099 -545215 -254028 278223 383345
531 383345 -354037 -447170 -319252 -184578 560595 24872 -547267 -669825 -608015 453141
521 453141 234510 -185617 -654249 -516152 3600 290016 837842 -76249 -535399 -516644
511 -516644 -194546 -350496 -538423 396899 -297905 -272250 129378 165838 -30868 345353
501 345353 418718 116979 219699 -133280 186319 -175999 -136441 534471 82449 -392037
491 -392037 -72738 -336664 -309809 620799 644922 -38533 -281501 -141688 -113029 -394281
481 -394281 228582 594168 327513 51482 300006 -86681 -873083 -210655 -107954 -554985
471 -554985 -744205 -95089 246719 -4126 852203 308304 -503664 -154004 20415 -657495
461 -657495 -1192178 -119275 337040 258179 243912 -208493 -197760 -253388 6886 780503
451 780503 519976 -305971 74694 47161 -327047 167673 1101805 641209 -147428 52046
441 52046 -81123 -59309 221771 144751 -429220 -483192 77932 -627769 71517 427338 -308536
430 -308536 -743409 -415611 -368883 -388140 -627928 -331094 307262 -196077 -779922 15263
420 15263 354166 -9200 360752 699888 319735 -248404 -318086 -453791 -291232 513544
410 513544 676017 223283 386154 263275 -234834 -93294 -142525 -174386 -137084 129932
400 129932 -126245 357767 117701 -189409 -308887 64813 -179031 79740 178409 -66754
390 -66754 -120027 -117749 669641 542941 860821 196790 282141 717268 60925 -323099 -511781
379 -511781 -404338 -528548 -683177 296080 250406 -364624 198999 1067219 590521 509307
369 509307 584851 611658 48335 -399226 -181643 132294 203574 23191 47922 -95770 -809523
358 -809523 -568382 44236 692350 1030082 897279 592850 425128 453172 271978 -46561
348 -46561 -695774 -625587 -20797 -648667 47108 358929 632410 481138 567316 691703
338 691703 252487 -20284 124676 -19429 111785 -279968 -480570 177579 766169 627340
328 627340 37040 137168 76619 -192731 59749 572040 57820 -44898 296975 133152
318 133152 140260 146266 133249 -401656 -691990 -328259 -232947 62259 419102 564408 359878
307 359878 576446 675435 372440 363156 -68246 -1048225 -433536 -190451 42356 386298
297 386298 235519 -260658 -263942 621045 473440 -301660 -87501 388148 -266804 -559895
287 -559895 -118060 441056 605668 340759 549243 348280 -222094 -766530 -452086 -235212
277 -235212 -567922 102982 171188 -404069 -604920 -595044 -16680 70674 459312 161835 -465667
266 -465667 -930341 -772970 -296482 194825 267530 213400 -11159 169413 -481 -12472
256 -12472 15308 78960 247152 -308645 -421725 157080 21881 493105 946860 355409
246 355409 -63910 -256152 154687 530811 560224 422401 -500693 -715011 -827991 -404389
236 -404389 195744 506610 400404 443263 459819 54317 553332 737245 1085811 880720
226 880720 974477 496881 -48485 -86681 26262 488463 -44615 -543023 -677936 -364367
216 -364367 -200823 -345521 160011 527542 420467 -252447 -525927 253383 589116 148985
206 148985 502028 392310 -210101 -360827 -315298 -576121 383213 713227 124122 -352899
196 -352899 26926 -259373 578271 975359 964015 -5479 -842721 -174178 -20136 -232146
186 -232146 -244474 327641 390607 104005 239239 844974 608241 538418 -376324 -224871
176 -224871 400366 -341737 -254224 13702 -210371 -106301 -25855 -103492 -197306 -478664 -458224
165 -458224 -166162 302277 -167538 -143791 221413 428276 411220 294830 604234 218424
155 218424 -178801 -309327 43702 548876 1166145 385022 -132636 -61497 277323 353072
145 353072 113205 418187 200908 -838217 -702997 -9663 391992 134392 -207041 -223918
135 -223918 281395 634911 95386 36024 182428 -214650 -27093 163092 309044 406958
125 406958 234675 664615 284269 -667467 -54069 80056 -98680 180754 131009 -374792
115 -374792 -187669 -63441 -292497 107644 24813 -49157 -174574 -368707 -314404 210010
105 210010 464705 266978 464233 426873 141835 140398 514 59923 -165919 13262 -312633
94 -312633 -134173 -240727 -509305 152279 769075 642442 -300630 -156414 -29095 -177937
84 -177937 208878 543645 563655 -222495 -770743 -49142 347442 -245254 363692 119946
74 119946 -330155 -166028 393475 669003 380346 153291 -189876 -177047 -124279 75132
64 75132 78368 179861 309050 -466989 -518641 255834 599134 334532 -113198 -181365 -36222
53 -36222 109724 471934 682354 -161379 -474630 -408725 -377870 181089 211416 35021 -100349
42 -100349 -327227 -37938 -57982 109890 99209 123347 -133795 475234 620862 -14685 -361699
31 -361699 -313759 -486912 -567590 -171395 8547 112634 -236196 186523 604203 674342 653380
20 653380 401190 -328622 -295832 -40724 331028 382344 156588 -35931 -258021 -197272 663271
9 663271 1012852 371425 56702 -411330 -414647 -283786 222483 69756 -52871
0 -52871
$$ Imaginary data points
##PAGE= N=2
##DATA TABLE= (X++(I..I)), XYDATA
16383 -4177054 -3558315 -3132242 -3264748 -3363635 -3290822 -3328325 -3648067 -3352062 -3182552 -2801030
16373 -2801030 -3032628 -3335460 -3145580 -2943925 -2729461 -2934953 -2529929 -2893372 -2941306 -2525458
16363 -2525458 -2611101 -2410640 -2518063 -2618012 -2162006 -1997545 -2309566 -2208914 -1748036 -1739078
16353 -1739078 -2104685 -2588601 -2598011 -1943065 -1926462 -1786284 -1211429 -1595981 -2242120 -1854188
16343 -1854188 -1858568 -1579079 -1266256 -1071076 -1118536 -949237 -770332 -560727 -649003 -735515
16333 -735515 -711991 -806837 -805916 -839986 -762850 -799432 -542243 -216279 -310401 -523107 -616462
16322 -616462 -394460 -412137 -112555 178206 16636 -153181 -276299 -246003 114664 93175
16312 93175 73440 -147581 -826334 -488167 -32076 485998 953107 557293 211118 121241
16302 121241 -29312 603280 483684 536059 419435 521696 70772 702717 1015065 1104762
16292 1104762 981598 926597 389282 544755 519901 670071 1559283 1859025 1086028 956320
16282 956320 1252723 1322238 1806717 2129689 1657817 1008571 1342434 947227 1101429 1952657
16272 1952657 2809192 1596065 1112137 1560983 1803213 2034132 2280672 2251627 1422873
16263 1422873 1484681 1959848 2429508 2303900 2270612 2007123 1959998 2542745 1969745 1734338
16253 1734338 2004987 2824569 2600351 2685167 2717382 3001647 2482696 2235077 2654842 2864539
16243 2864539 2225453 1730650 2024487 2412598 2466319 2613505 3234486 2849685 2567849 2996423
16233 2996423 3004200 2546199 3050509 3456549 3310533 3460858 3802661 3782357 3823862 4195496
16223 4195496 4020379 3869637 3592206 3278974 2837680 2857264 3633786 3506519 3096801 3101567
16213 3101567 3583163 2889844 3362357 3869457 3897752 3266848 2893829 3485828 4081065 4220488
16203 4220488 4461419 3848899 3482966 3673095 4256077 4559003 4607918 4681286 3990540 3330071
16193 3330071 3378120 4476188 5082885 4875315 4227328 4426933 4009683 4105210 4302525 3816031
16183 3816031 3326868 4281257 4173560 3998341 4260002 4306826 3995530 3746518 4406647 4779824
16173 4779824 4283301 4860489 4788665 5053369 5468183 4873501 4100750 4195897 4531591 4268400
16163 4268400 3588697 4026500 4643257 4443074 4540245 4648688 4775178 4049706 4302833 4481419
16153 4481419 4385353 4599079 4259966 4063274 4547081 4505838 4673777 4770791 4841022 4618956
16143 4618956 4670917 4746042 4357379 4064649 4560970 4725178 4322164 4802341 5616639 4882795
16133 4882795 4219023 3971111 4155624 4004779 4522090 4923067 4181470 4311674 4299163 4778471
16123 4778471 5284467 5113999 4796363 4306848 4163480 4342895 5710929 5715028 5618689 4934950
16113 4934950 4493262 4238426 4935682 5650609 5102560 4947044 4549577 4645425 4881435 5188806
16103 5188806 5426016 5295557 5015911 5574082 5253155 4534995 4398325 4681565 4429479
16094 4429479 4824091 5262613 4700557 4477375 4893875 5181577 4767279 4906347 5053091
16085 5053091 4580562 4716080 5274391 5456023 5147302 5428637 5623108 5188109 4395600
16076 4395600 4802290 5024680 4943222 5224026 5868789 5427758 4526605 5382035 5906288 5637767
16066 5637767 5667503 5460331 5102437 3828871 4161062 4837573 5423056 5452944 4741796 4869518
16056 4869518 4844748 4630249 4743490 5271245 5353537 5329993 4864539 5149854 5218793 5423645
16046 5423645 5050897 4858608 4887562 4353248 3813979 4516152 5149477 4711750 4729960 4948901
16036 4948901 4423347 4735193 5356836 5279857 5041416 4633841 4388994 4535753 5151585 5152050
16026 5152050 4869665 5432121 5387447 4999676 5101177 5404583 5137232 4723495 4822747 4577569
16016 4577569 4605279 4823862 4768273 4981071 5626315 5485735 4974820 4834756 5148284 4353923
16006 4353923 4312874 4873547 5022751 4947547 4661915 4767141 4600223 5152434 5201353 4584091
15996 4584091 4213102 3800899 4867843 5037928 5183274 5917187 5459473 5148057 4684489
15987 4684489 5010190 4810301 4885487 5545782 5104951 4114021 5131982 5932615 5666827
15978 5666827 5539007 5044363 4757513 4638071 5048564 5366084 5421317 5666719 5626991 5212964
15968 5212964 4726037 5581885 5393644 4719994 5335407 5159642 4785749 4116133 4899925
15959 4899925 5485485 5017014 5190479 5059625 5245399 4979184 4737968 5975269 5266698
15950 5266698 5169417 4997706 4118568 4589977 5068192 4786280 5234713 4880622 4670483 4305949
15940 4305949 4417748 5109572 5200537 5378051 5245587 5077941 4485324 4802875 5080207 4711610
15930 4711610 4687362 4749712 4596315 4948331 5028319 4929288 4625790 5106133 5312321 4911649
15920 4911649 4056089 4552572 4877475 4949654 5474847 5311534 5387339 5196626 5043742 5421854
15910 5421854 5122999 5300095 5088307 4789083 4329854 4559427 5465290 5383941 4974615 4948710
15900 4948710 4914721 4818717 5098765 5370466 5355251 4870646 5357498 5227167 5048556 5452605
15890 5452605 4884527 4923019 5462095 5563401 5276659 4631201 5418862 4861152 4936214 5073869
15880 5073869 5002044 4632835 4219089 4857212 5394197 5242369 5300855 4942787 4554015 4563509
15870 4563509 5056921 5762705 5847772 4630852 4559476 4443640 4828133 5373653 5295617 5414584
15860 5414584 4709312 4610326 4621865 4941864 4879462 5151006 4888154 4266513 4544086 4586395
15850 4586395 4478188 5545290 5573037 4909136 4815183 4878361 4477135 4906030 4743448 4767510
15840 4767510 4764939 4658668 4722427 4775093 4938740 5366849 5127815 5324833 5823513 5482688
15830 5482688 4828417 4934979 5413780 5507505 5453113 5068350 4954518 5474611 5239734 5111308
15820 5111308 5130522 5362253 4947743 4516082 5403119 5605676 5880714 5880002 5843068 5697606
15810 5697606 4635688 4855286 5514251 5651036 5197160 4686031 4610167 4569044 4796340 5578136
15800 5578136 5467389 5476949 5048023 4759773 5121351 5062460 5393763 5575208 5252501 4934833
15790 4934833 4803808 5001951 5355742 5306824 5296543 5323090 5202172 4846178 4856924 4879378
15780 4879378 5211704 5854054 5318838 4431634 4540772 5263310 6145587 5650091 5019366
15771 5019366 5276489 4977604 4601027 5226687 5831681 5926426 4895645 4974539 5084099 4846274
15761 4846274 4569951 5459073 5863451 5409334 5068994 4775572 5404339 5788230 5343411
15752 5343411 5200799 5148502 5319257 4909070 5136229 4969501 5473172 5356797 5126193 5577684
15742 5577684 5297841 5322810 4824591 4996919 4909154 5004919 4762061 5022104 5231970 4877034
15732 4877034 5125693 4597183 4581780 5102584 5088709 5045922 5541481 5517242 5019132 5550478
15722 5550478 6191466 6226142 6372261 6152677 5396236 4727506 4569781 4760309 5244889 5237896
15712 5237896 4701602 4575845 5109858 5189162 4885811 4980061 5887454 6099592 5280843 5187332
15702 5187332 5718576 5842972 5446061 5135704 5397966 5009958 4273876 4827583 5484988
15693 5484988 5429803 5357033 6046517 5345459 5087018 5214782 5675871 5305767 4449773 4813314
15683 4813314 4744957 5328298 5115227 4830942 5191755 5234560 5782711 5186392 4785113 5254500
15673 5254500 4798143 4479507 4959713 4907589 4931881 5015092 4913149 4820045 4897925 5290105
15663 5290105 5936386 5754452 4962072 5367283 5329767 4290608 4853746 5240043 5075336
15654 5075336 5086548 5282636 4804782 4078364 4481144 5322455 5659558 5774968 6133647 5547935
15644 5547935 5091178 5166571 5513267 5734196 5838158 5942959 5448382 5326422 5561720 5863918
15634 5863918 5839657 5406164 5434839 4918879 4751881 5459548 5093058 5653282 5406506 5454532
15624 5454532 4992532 5037464 5388825 6040881 5580419 4648193 4615672 5075810 5514553 5494952
15614 5494952 5939541 5902102 5722798 5587109 5017158 5081345 5106534 5441243 5400325 5061673
15604 5061673 4618051 3917416 4701061 5494810 5826441 5491327 4986171 5179577 5778261
15595 5778261 4978319 5069308 5089890 4928581 5253433 5293169 5523954 5920959 6032943 5854442
15585 5854442 5059847 5310944 4895921 5066720 5608287 5928936 5997224 5482072 5381256 4960133
15575 4960133 4752728 5242461 5805150 5330398 4591671 4758614 4516720 5109813 5547162
15566 5547162 6440090 6039262 5600798 4081520 4465203 5459847 5685975 6434182 5392930
15557 5392930 5382924 4756550 4312877 4983253 6068818 5855727 5259152 4657733 5145038
15548 5145038 5703416 5839404 6480989 5508064 4993807 5049739 4756094 5277580 5558353 5180357
15538 5180357 5206970 5361566 5372382 5276411 5288536 5283955 6083247 5154450 4658203 5059276
15528 5059276 5053010 4934232 5200385 5929611 6102598 6385915 5986383 5610907 5033048 5289243
15518 5289243 5547038 5088572 4992206 5200455 5506053 5646552 5665703 5984204 5447064 4866524
15508 4866524 4864487 4916937 4499913 5211262 6065032 5650949 5346974 5269308 5830659 6302846
15498 6302846 6002805 5926488 5301589 4848070 4846969 5149500 4879764 5156848 5183586 5750264
15488 5750264 5357241 5609471 5359239 5157849 5476064 4771295 5000250 4346472 4659545
15479 4659545 5192366 4891359 4981728 5012795 4401516 4314257 5003359 5501495 5804845 5793939
15469 5793939 5026030 4738353 4744620 5592279 5737555 5556085 4935631 4703686 5186677 5297287
15459 5297287 6089861 6304665 5999413 5767960 5409181 4850169 4953423 5211211 4967508
15450 4967508 4523224 4681891 5268653 5557708 6010813 6786740 6420227 5276427 5064549
15441 5064549 5680616 5240907 4977319 5253222 5567000 5547336 5606447 5431988 5081518 5067924
15431 5067924 5258408 5427164 5235864 5299964 5467589 5240496 4976564 4965280 5461942 5272942
15421 5272942 5269107 5598929 5936764 5712561 4698239 4540087 4872619 5448277 6026648 5971462
15411 5971462 5758287 5362288 4774707 5131734 5727804 5464347 5154111 5233134 4741159 5264292
15401 5264292 4641176 5527423 5742407 5029004 4776721 5284476 5202212 4589841 4792050 5144413
15391 5144413 4988100 5599994 5407493 5462657 5868172 5153413 5367602 5511615 5336481 5385169
15381 5385169 5249920 4729793 5123067 5611695 5962420 5770863 5289721 4822913 5178546
15372 5178546 5135361 5954280 6321703 5165488 5032864 5141362 4895355 5580998 6409497
15363 6409497 6359181 5552502 4919782 5055680 5818181 5210946 5770608 5812680 5285060 5100822
15353 5100822 4698925 4668413 5397229 5807878 5302399 5166957 5513830 5209754 4860237 5413314
15343 5413314 5983931 5766477 5482085 5434575 5217878 5034399 5693446 5649801 5270878 5234052
15333 5234052 4932623 5396220 5495496 6181980 6199598 5295130 5086367 5488280 5022719 5017180
15323 5017180 5499010 5796866 5461782 4780654 4597652 4961143 5775951 5675856 5380981
15314 5380981 5851418 5807819 5996852 5603499 5267407 5743260 5786422 5625733 5215184 4713097
15304 4713097 4891143 4983042 6090843 6023880 5512890 5399724 5234801 5738267 5620968 5634735
15294 5634735 6032109 5440463 5222923 5420308 5421793 4962356 5148921 5085555 5007557 5024198
15284 5024198 5235898 4985277 5909954 6817632 5542942 5582102 5637537 5369985 5723795 5926979
15274 5926979 5550589 5181400 4614831 5188119 5505198 5917077 5698630 4917530 4877161 5441249
15264 5441249 5605548 5722360 5769744 5745930 5803164 5295297 5251539 5587192 5395072 5570052
15254 5570052 5227307 4836470 4728976 4811493 5932417 6528840 5980653 5499161 5304073
15245 5304073 5206331 5714217 5991984 5915466 5844676 5887100 5518606 4753051 4378723 4962926
15235 4962926 5159173 5151604 5428490 5278490 5404924 5201255 5664868 5850459 5516815 5537997
15225 5537997 5234578 5283074 4942747 4937546 5597994 6028165 5734037 5349514 5499742 5300396
15215 5300396 5205578 5591203 5721614 5077959 3987884 4258878 5022516 5005321 4506225 4078674
15205 4078674 4877533 5031789 5204568 5456071 5735621 5772751 4878842 4916980 5216019 5684714
15195 5684714 5825176 4692304 5119886 4653873 4369410 5299685 6324714 5678559 4796146
15186 4796146 4793149 4840757 4699454 5016399 5146482 5489564 4886772 4787417 4969724 5496648
15176 5496648 6152208 5990203 6123289 5315215 5879838 6076686 5606105 5453645 5758353
15167 5758353 6041024 5209901 4871200 5100641 4756249 5370662 5197226 5264805 5359110 5966408
15157 5966408 5320615 5061911 5319055 5461708 5728279 6037404 5777947 4647872 4084282
15148 4084282 5042748 5820648 6099667 5512387 5838237 5040096 4575965 5595282 6310450
15139 6310450 7047471 5967640 5461011 4819176 5010443 5883271 6405401 6220264 5699082
15130 5699082 4928746 5320762 5583736 6250827 6262560 5891199 5934275 5712127 5723551 5639465
15120 5639465 5806187 5463489 5579086 5720676 5637772 5357820 5201950 5640237 5407670 5049266
15110 5049266 5982049 5891668 5491623 5161273 5534024 5179624 5089931 6107342 5985636 5613780
15100 5613780 5641859 5559809 5531766 5556621 5949152 6535168 6074489 5864131 5848548 5590170
15090 5590170 5540051 6199489 5656005 5536314 5580196 5272528 5298631 5143073 5712901 5374056
15080 5374056 4720292 4673818 5082242 5363985 5459639 5775564 5564692 5058696 4894943 5085981
15070 5085981 5049634 5043002 5581499 5673704 5303357 5706887 5914226 6074125 5637247 5348942
15060 5348942 5315348 5203615 5824881 6092602 5812684 4834842 4927363 5789215 5218459 5913470
15050 5913470 5972139 5356213 5134058 5028997 6033913 5663421 5301364 4689860 5554196
15041 5554196 5793206 5399540 5601527 5425438 5204991 5127491 5310799 5376593 5094607 5292914
15031 5292914 5255462 5195762 5413807 5254792 5283410 5038514 5482245 5410325 5528408 5918671
15021 5918671 5459034 4871293 5218731 6054631 5413083 5225647 5361200 5290358 5848398 5572419
15011 5572419 5499026 5051253 5314032 5237686 5241804 5307719 4995920 4940051 5654444 5954556
15001 5954556 6287902 6278969 6019872 5628876 5451358 4895667 5495910 6336645 5869643 5519750
14991 5519750 5213440 5548059 5316870 5419817 5940327 6056658 5766367 5576430 5753638
14982 5753638 6292602 6022416 5894480 5942480 5343468 4864056 5080453 5937286 6155272 6168957
14972 6168957 5237574 5396001 5682426 5894180 6199901 6211096 5758173 4913050 5433930 5480735
14962 5480735 6646671 6431538 5243341 4891885 4399301 4174664 4694080 5139359 5161855
14953 5161855 5301500 5297470 5118680 5583770 6001163 5543866 5802113 5810640 5630991 6379492
14943 6379492 5861721 5806887 5254842 5074997 5260202 5429343 5878484 5195400 5793024 6151021
14933 6151021 6360607 5570260 5064327 5497345 5159445 4845378 4677609 5391186 5972884
14924 5972884 5240059 5196434 5599859 6054816 5899664 6068140 6293298 5568194 4558792
14915 4558792 4828209 5493698 5046621 5438030 4965799 4520295 4785370 5535869 6184955
14906 6184955 6512189 6401375 6201819 5813030 5599528 5681654 6083940 6127462 6036477 5453014
14896 5453014 5272996 5161528 5061846 5300679 5722346 5793823 5400329 5144591 5588551 5480408
14886 5480408 5170276 5848462 5700851 4896129 4605180 5515893 5790396 5533737 6057458
14877 6057458 5886323 5703238 5825283 5800866 6155577 5683349 5719323 6186366 6515628 5766820
14867 5766820 5063143 6176852 6143277 5762125 5785379 6100020 5788276 5322013 5542647 5880887
14857 5880887 6120196 6580967 5927566 5617176 6315851 6318880 6152982 5468616 5017414 5136597
14847 5136597 6037491 5939033 5313748 5310012 5389255 5257394 4836043 5005791 5590019 5338993
14837 5338993 5556436 5575071 5627733 5334545 5541976 5641027 5459609 5358334 5345846 5985342
14827 5985342 5635375 5722880 6077528 6138531 5787489 5257630 5443208 5290951 5539960 6100318
14817 6100318 6480099 5418450 5110697 5293249 5528344 5808689 5600196 5807170 6122841
14808 6122841 5978848 5798758 5702915 6154602 6328568 6212271 5845896 5348918 5713318 5607724
14798 5607724 5697935 6109584 5867039 5426914 5995418 5786582 5425059 5177847 5442673 6015167
14788 6015167 6019101 6221351 5850474 5926149 6276079 6367072 5650392 5443174 5707462 5669969
14778 5669969 5317201 5351795 6015709 5706705 5253748 5637621 5783869 5681614 5731859 5904450
14768 5904450 6358642 6051453 5609432 5602223 6370457 6216924 5922309 5918679 6019219 6392939
14758 6392939 5951142 5907511 5904045 6333171 5252664 5112259 5819204 5543200 5350590 5574572
14748 5574572 6197680 5721396 5248625 5581061 6234607 5723937 5654470 5554726 4765041 5012022
14738 5012022 4730122 4915676 5130062 4898275 5212466 5282303 5887983 6316462 6325012 5855852
14728 5855852 5841482 5806923 5793478 5356926 5028716 5853243 5490493 5123379 6123439 5814499
14718 5814499 5557959 5410146 5712683 5301527 5297970 6103786 6345248 6087484 6005397 5630692
14708 5630692 5631839 5737770 5486606 5181006 5344597 5972554 5808546 5317734 5730038 6023061
14698 6023061 5598216 5180648 5408518 5392056 5603219 5536947 5464443 5233309 5055471 5733345
14688 5733345 5952509 6074960 5828411 5596579 5270187 5684737 6090876 6210302 5830512
14679 5830512 5759968 6017092 5636491 5699950 6541182 6459559 6338801 5423792 5419632 5659281
14669 5659281 5821924 5999519 6606688 6800807 5841463 5582098 5017221 5259938 5966586
14660 5966586 6125166 5591885 5538167 4966987 4807470 5609979 6060613 6027563 5557227 5861843
14650 5861843 6125830 5546842 5294911 5836066 5281744 5200683 6114361 6527010 6140557 5940981
14640 5940981 6296500 6178294 5504870 6004526 5685594 5128520 4878211 5115282 5896869
14631 5896869 6238230 6100668 5957251 5484729 5396192 6375226 5679702 5588348 5791412 6167280
14621 6167280 6457332 5821990 6102468 5901696 5693378 5547320 5807987 5789481 5265226 5744437
14611 5744437 5304796 5649402 5869471 5713713 5627894 5653492 6624266 5831566 5716790 6020596
14601 6020596 5637670 5557488 5550110 6324703 5618005 5735776 5979082 5970405 6288598 5923465
14591 5923465 5975587 5460657 5374219 6062253 6486470 6086753 6281048 6542964 6079362 5483079
14581 5483079 5603912 5974893 6319015 5922651 5941426 5679982 5595567 6438707 6718199 5884422
14571 5884422 5853116 5236108 4620575 5344637 5462494 5123371 5097278 5628462 5499616 5871801
14561 5871801 6344948 6245907 5482240 5830709 6060790 6080308 6421763 6215571 6098725 6045743
14551 6045743 6197629 6443536 5539757 5670420 6036276 5966024 6099095 6526596 6026325 5756004
14541 5756004 5992781 5718556 5944103 6543180 6849459 6023065 5741358 5683562 5612341 5950118
14531 5950118 5635871 5981791 5717062 5618096 5781246 5447306 6028954 5593720 5242886 5690158
14521 5690158 5780171 6205582 6300539 6118572 5714174 5561059 5860665 5607542 5898552 6206782
14511 6206782 5972769 5447430 5497680 6083670 5827690 5634720 5705596 5590747 6062321 6112702
14501 6112702 5175411 5742241 6208625 6144647 5679104 6067892 6317097 5651807 6096642 5981820
14491 5981820 6145230 5104855 5472091 5939627 5987279 6201399 6214204 6111383 5902866 6260679
14481 6260679 6423473 6305358 6441327 6137266 6042292 5928373 6399426 5843798 5393085 5701717
14471 5701717 5315419 5710765 5985111 5822136 5492340 6075512 6509894 6711077 6660793 6495507
14461 6495507 6132800 5419066 5515801 6325120 6509592 6270747 5923121 5773109 5623971 5749659
14451 5749659 6411796 6384289 6274969 5918385 5856301 6219789 5556023 6882642 7133980 6594074
14441 6594074 6261068 6132565 6327696 5756665 5626141 5875788 5851575 6135050 5925310 6137545
14431 6137545 5776707 5954948 6252920 6164094 6146947 5677625 5887613 5789593 5534086 5977565
14421 5977565 6244732 6211658 6327452 6376818 5761224 5363952 5510240 6104611 6511017 6118222
14411 6118222 6019909 5843443 6227480 6178569 6309220 5831788 5467708 5292758 5534718 6033070
14401 6033070 6211566 6379293 6608976 6073696 5974695 5751747 5983309 6679891 6863836 5564427
14391 5564427 4768221 5026126 5471207 6264717 6711123 6094357 5447262 5063037 6129246
14382 6129246 6594991 6035014 6157514 5587492 5117937 5140344 5682632 6408772 6204538 5805796
14372 5805796 5822484 5852077 6506362 6503821 6411232 6183628 6173665 5981111 5598568 6127631 5991889
14361 5991889 6091740 5490532 5558367 5622080 5816829 5869735 5613089 6102275 6017466 6218219
14351 6218219 5915314 5435893 5279005 5358209 5561907 6242182 6341153 5858384 5387299 6263392
14341 6263392 5965880 5299146 5164574 5476918 5348202 5350075 5684380 5583079 5463666 5844740
14331 5844740 5834396 5925142 5664592 5610146 6050132 5629430 6023915 6311616 6079366 6074827
14321 6074827 5973173 6307792 6621879 6434332 5562802 5361006 5201140 5578474 6297220
14312 6297220 6768316 6263041 5390792 5368619 5788086 6411655 6322776 6334123 6173554 5447200
14302 5447200 5669180 5926686 6824373 6727697 6097399 5961953 5124609 5232177 5843421 6438878
14292 6438878 5988440 6113884 6021266 5852203 5872360 5966184 6169344 6341743 6168368 6105680
14282 6105680 5683069 6395823 6191573 5333042 5626581 5834033 6065802 5984664 6091796 6449564
14272 6449564 5949849 6084919 6208616 5906965 5918696 5690185 6033156 5921356 5605682 5755607
14262 5755607 6146445 6297222 6269086 6419141 6203957 6051712 6061911 6359882 5658862 5205311
14252 5205311 6176159 6658397 6107002 6172530 6370197 6089009 5877630 6734436 6866788 6151632
14242 6151632 6278421 6361121 6181627 6517197 6652959 5892320 6051429 6370477 5851314 5301727
14232 5301727 6395088 7059551 6662928 6543029 6254169 5864659 6210521 6415697 6466279
14223 6466279 5478656 5406602 6078502 5107409 5371436 6191255 6604750 6297325 5530661 5950638
14213 5950638 5961745 5981166 6597001 6584131 5812598 5643020 5554971 5302865 5295896 5824567
14203 5824567 6120183 5480799 5454790 5912920 5606664 6296721 6034827 6602963 7080493 6819029
14193 6819029 6383886 6219583 7010267 7084036 6364257 5667799 5773531 5631151 5614143 6220346
14183 6220346 6634859 6205034 6549897 6663611 6596573 5439362 5330133 5852519 5477898
14174 5477898 5564152 5736305 6004235 6186850 6026260 6125617 5668632 5880332 6726321 5963151
14164 5963151 5049714 5311048 5733759 6149113 6345944 6225951 6093110 6048074 6210911 5806824
14154 5806824 6075724 6364244 5971897 5725891 6006628 6589504 6566449 6126893 6173178 5570354
14144 5570354 5032838 5178932 6233960 6038429 5303669 6142825 6163531 6033269 6428308
14135 6428308 6908104 6818453 6250340 5910547 5873749 5732208 5985858 5983144 6547808 6181768
14125 6181768 5990953 6351720 5955587 5566740 6004708 6228447 6462128 6013519 6259846
14116 6259846 6137007 6433025 6387931 5918262 5938538 6212529 6590121 6404039 6074997 5683334
14106 5683334 6101118 6104216 6377560 6156349 5997467 6343316 6096627 5482553 5669567 6171043
14096 6171043 6391660 6582358 6730085 6797432 6288651 6144095 6331328 6207263 5988377 5761472
14086 5761472 6319718 6645057 6731801 6172578 6322551 5930163 5745978 6427138 6724500 6475076
14076 6475076 5847064 5917694 6109168 6049780 6498874 6342779 5996502 5696487 6123482 6472191
14066 6472191 6365430 6117345 5977665 5776378 5769417 6214887 6884870 6813395 6406966 6828933
14056 6828933 6520646 6082479 5782365 6109715 6649025 6207689 5730291 5399975 5246765
14047 5246765 5806575 6528461 6075524 5842902 5757722 5525367 4802617 5285455 6301221
14038 6301221 6131022 6374219 6718699 6023654 5721640 6393280 7194425 6546469 5559494
14029 5559494 5841613 5354419 5538070 6702003 6557585 6362158 5915942 5760646 6504271
14020 6504271 6522717 6845280 6504535 6348394 6274572 6407691 6294148 6452032 6498951 6300083
14010 6300083 6256926 6422330 6515047 5621502 6007792 6972192 7294113 6914803 6407729 6649921
14000 6649921 6836086 6234719 6357943 6848544 6095944 5819900 6504582 6704891 6253789
13991 6253789 6337225 6128377 6090106 6555107 5956841 5382845 5516431 6057214 6299292 5978621
13981 5978621 6325126 6552031 6085284 5694648 6786631 7334516 6461159 6154098 6130141
13972 6130141 5749513 5873339 6669886 6451308 6611998 5882713 5588735 5505663 5592747 6552250
13962 6552250 6128386 6886522 5832822 5336711 5698964 6381587 6724753 6427426 6249114
13953 6249114 5712231 5539404 6121180 6659221 6704803 6451930 6618649 6230429 5883093 6493873
13943 6493873 6416783 6641874 6427756 6195142 6372738 6255522 5968025 6110312 6001513 5815968
13933 5815968 5740528 6549030 6500461 6061461 6163658 6741067 6987529 6024690 6413082 6262217
13923 6262217 6259914 6539300 6330939 6279249 6287072 5451276 5324943 5913603 6353514 6125601
13913 6125601 6388428 6922875 6346224 5792951 5985712 6333226 6663428 7309697 6885002
13904 6885002 6417213 6217568 6244195 6483856 6368964 6574336 6589805 5937561 6115806 6361052
13894 6361052 7060667 7011968 6370143 6512547 6608530 6401543 6283163 6167144 6447803 6239767
13884 6239767 5854404 6199127 6056145 5030298 5258565 5965928 6708640 6312593 6018699
13875 6018699 6505153 6367865 5984640 5953958 6275020 6396302 6437586 6274279 6291437 6228574
13865 6228574 5720220 6180491 6725976 6513815 6945781 6821218 6068097 5519692 5775653
13856 5775653 6337579 5855494 6378563 6077938 6433695 6291989 6760296 7160303 6814683
13847 6814683 7417156 6827342 6014234 6077653 5418879 6314895 7006246 6548850 6826437 6507863
13837 6507863 6498143 5973358 6178813 6708564 6940026 6670188 6054502 6084272 5945685 6297454
13827 6297454 6509550 6498979 6469979 6114090 5943099 6204568 6509081 6619204 7239150 7057379
13817 7057379 6210852 5879925 5987523 6828381 6386203 6218276 6367820 6312564 6609910 6316946
13807 6316946 6488886 5904113 6404460 6498343 6262126 6719545 7255941 6699285 6100653 6162418
13797 6162418 6174250 5633469 6017473 6178375 6482216 6424493 5625021 5381287 5903856 6225464
13787 6225464 6282509 6408784 6590952 6526022 6413094 5957708 6028345 5485309 5657888 5822828
13777 5822828 5768901 5993695 5595360 5732942 6604736 7069021 7228918 6801289 6177000 5119912
13767 5119912 5398393 6624452 6647218 6749640 6382289 6126923 5697673 5706729 6637826 6893569
13757 6893569 6447292 5778942 6172012 6608522 6943113 7187909 6942238 6881712 6216353 6473735
13747 6473735 6279515 6280158 6778537 6376618 6310170 6034596 6265163 6356851 6463361 6811804
13737 6811804 6388957 6691688 6726209 5962253 5478734 5702524 5929440 6530965 6896359 6948640
13727 6948640 6909359 6733234 6640618 6813083 6397907 6482623 6071289 6504345 6164248 5750255
13717 5750255 6597203 6854045 6828867 7071783 6756504 6193986 6216001 6775932 6604038 6058514
13707 6058514 6816861 6832674 6557717 6723027 6974977 7312507 6178208 5631394 5610187 5839870
13697 5839870 6120330 5986486 6440158 6258804 5716366 5631499 6457684 7124880 7129545 6503779
$$ [...]
##END NTUPLES=NMR SPECTRUM
##END=
