##TITLE=1H_CA-9472-3
 200.13Hz, DMSO-d6+CCl4.
 8 sc
 30.6.2026
##JCAMPDX= 6.0         $$ Bruker NMR JCAMP-DX V2.0
##DATA TYPE= NMR SPECTRUM
##DATA CLASS= NTUPLES
##ORIGIN= UXNMR, Bruker Analytische Messtechnik GmbH
##OWNER= pz
$$ XWIN-NMR		Version 3.5
$$ Tue Jun 30 13:10:46 2026 Russian Standard Time (UT+4h)  she@DPX200
##.OBSERVE FREQUENCY= 200.1313
##.OBSERVE NUCLEUS= ^1H
##.ACQUISITION MODE= SIMULTANEOUS
##.ACQUISITION SCHEME= undefined
##.AVERAGES= 8
##.DIGITISER RES= 18
##SPECTROMETER/DATA SYSTEM= spect
##.PULSE SEQUENCE= zg30
##.SOLVENT NAME= DMSO
##.SHIFT REFERENCE= (INTERNAL, DMSO, 0, 15.4935)
##AUDIT TRAIL= $$ (NUMBER, WHEN, WHO, WHERE, WHAT)
$$ ##TITLE= Audit trail, XWIN-NMR		Version 3.5
$$ ##JCAMPDX= 5.01
$$ ##ORIGIN= Bruker BioSpin GmbH
$$ ##OWNER= she
$$ F:/spectra/data/she/nmr/H-C/1/pdata/1/auditp.txt
$$ ##AUDIT TRAIL=  $$ (NUMBER, WHEN, WHO, WHERE, WHAT)
(   1,<2026-06-30 13:08:59.76 +0400>,<she>,<DPX200>,
      <created by zg, POWCHK disabled, PULCHK disabled
       configuration hash MD5:
       00 E9 B6 7A A2 85 ED C7 34 08 36 98 17 FE 4E 26
       data hash MD5: 16K
       F2 8F A9 EC 60 76 6F CC 7A 1B 0D 4A C5 CE 25 68>)
(   2,<2026-06-30 13:09:50.67 +0400>,<she>,<DPX200>,
      <Start of raw data processing
       efp BC_mod = 2 LB = 0.25 FT_mod = 6 PKNL = 1 PHC0 = -4366.982 PHC1 = -6.007696 SI = 16K 
       data hash MD5: 16K
       07 51 FB A0 14 ED 2D 87 D6 E1 6D 82 1A CC E3 A9>)
$$ ##END=
$$ 
$$ hash MD5
$$ 4A BB D4 67 AC BA E1 DF 08 A4 A8 F9 77 92 71 4D
##$RELAX= 
##$RELAX= 
##$RELAX= 
##$RELAX= 
##$RELAX= 
##$RELAX= 
$$ Bruker specific parameters
$$ --------------------------
##$DU= <F:/spectra>
##$EXPNO= 1
##$NAME= <H-C>
##$PROCNO= 1
##$TYPE= <nmr>
##$USER= <she>
##$AMP= (0..31)
100 100 100 100 100 100 100 100 100 100 100 100 100 100 100 100 100 100 
100 100 100 100 100 100 100 100 100 100 100 100 100 100 
##$AQSEQ= 0
##$AQ_mod= 1
##$AUNM= <au_zg>
##$AUTOPOS= <>
##$BF1= 200.13
##$BF2= 200.13
##$BF3= 200.13
##$BF4= 200.13
##$BF5= 200.13
##$BF6= 200.13
##$BF7= 200.13
##$BF8= 200.13
##$BYTORDA= 1
##$CFDGTYP= 0
##$CFRGTYP= 5
##$CHEMSTR= <none>
##$CNST= (0..31)
1 1 145 1 1 1 1 1 1 1 1 1 1 1 1 1 1 1 1 1 1 1 1 1 1 1 1 1 1 1 1 1 
##$CPDPRG= <>
##$CPDPRG1= <>
##$CPDPRG2= <>
##$CPDPRG3= <>
##$CPDPRG4= <mlev>
##$CPDPRG5= <mlev>
##$CPDPRG6= <mlev>
##$CPDPRG7= <mlev>
##$CPDPRG8= <mlev>
##$CPDPRGB= <>
##$CPDPRGT= <>
##$D= (0..31)
0 0.7 0 0 0 0 0 0 0 0 0 0.03 0 0 0 0 0 0 0 0 0 0 0 0 0 0 0 0 0 0 0 0 
##$DATE= 1782810539
##$DBL= (0..7)
120 120 120 120 120 120 120 120 
##$DBP= (0..7)
150 150 150 150 150 150 150 150 
##$DBP07= 0
##$DBPNAM0= <>
##$DBPNAM1= <>
##$DBPNAM2= <>
##$DBPNAM3= <>
##$DBPNAM4= <>
##$DBPNAM5= <>
##$DBPNAM6= <>
##$DBPNAM7= <>
##$DBPOAL= (0..7)
0.5 0.5 0.5 0.5 0.5 0.5 0.5 0.5 
##$DBPOFFS= (0..7)
0 0 0 0 0 0 0 0 
##$DE= 6
##$DECBNUC= <off>
##$DECIM= 32
##$DECNUC= <off>
##$DECSTAT= 4
##$DIGMOD= 1
##$DIGTYP= 9
##$DL= (0..7)
0 120 120 120 120 120 120 120 
##$DP= (0..7)
150 150 150 150 150 150 150 150 
##$DP07= 0
$$ [...]
##$SUBNAM2= <"">
##$SUBNAM3= <"">
##$SUBNAM4= <"">
##$SUBNAM5= <"">
##$SUBNAM6= <"">
##$SUBNAM7= <"">
##$SUBNAM8= <"">
##$SUBNAM9= <"">
##$SW= 18.0517328524113
##$SWIBOX= (0..15)
0 0 2 0 0 0 0 0 0 0 0 0 0 0 0 0 
##$SW_h= 3612.71676300578
##$TD= 16384
##$TD0= 1
##$TE= 0
##$TE2= 300
##$TE3= 300
##$TEG= 300
##$TL= (0..7)
0 120 120 120 120 120 120 120 
##$TP= (0..7)
150 150 150 150 150 150 150 150 
##$TP07= 0
##$TPNAME0= <>
##$TPNAME1= <>
##$TPNAME2= <>
##$TPNAME3= <>
##$TPNAME4= <>
##$TPNAME5= <>
##$TPNAME6= <>
##$TPNAME7= <>
##$TPOAL= (0..7)
0.5 0.5 0.5 0.5 0.5 0.5 0.5 0.5 
##$TPOFFS= (0..7)
0 0 0 0 0 0 0 0 
##$TUNHIN= 0
##$TUNHOUT= 0
##$TUNXOUT= 0
##$USERA1= <user>
##$USERA2= <user>
##$USERA3= <user>
##$USERA4= <user>
##$USERA5= <user>
##$V9= 5
##$VALIST= <valist>
##$VCLIST= <CCCCCCCCCCCCCCC>
##$VD= 0
##$VDLIST= <DDDDDDDDDDDDDDD>
##$VPLIST= <PPPPPPPPPPPPPPP>
##$VTLIST= <TTTTTTTTTTTTTTT>
##$WBST= 1024
##$WBSW= 4
##$XGAIN= (0..3)
0 0 0 0 
##$XL= 0
##$YL= 0
##$YMAX_a= 230755
##$YMIN_a= -396913
##$ZGOPTNS= <>
##$ZL1= 120
##$ZL2= 120
##$ZL3= 120
##$ZL4= 120
##$ABSF1= 0
##$ABSF2= 0
##$ABSG= 0
##$ABSL= 0
##$ALPHA= 0
##$AQORDER= 0
##$ASSFAC= 0
##$ASSFACI= 0
##$ASSFACX= 0
##$ASSWID= 0
##$AUNMP= <proc_1d>
##$AZFE= 0.1
##$AZFW= 0.1
##$BCFW= 0
##$BC_mod= 2
##$BYTORDP= 0
##$COROFFS= 0
##$CY= -3
##$DATMOD= 1
##$DC= 0
##$DFILT= <>
##$DTYPP= 0
##$F1P= 0
##$F2P= 0
##$FCOR= 1
##$FTSIZE= 16384
##$FT_mod= 6
##$GAMMA= 0
##$GB= 0
##$INTBC= 1
##$INTSCL= 3.241238e-09
##$ISEN= 128
##$LB= 0.25
##$LEV0= 0
##$LPBIN= 0
##$MAXI= 10000
##$MC2= 0
##$MEAN= 0
##$ME_mod= 0
##$MI= 1.114404
##$NCOEF= 0
##$NC_proc= -7
##$NLEV= 6
##$NOISF1= 3.799351
##$NOISF2= 2.8
##$NSP= 0
##$NTH_PI= 0
##$NZP= 0
##$OFFSET= 15.49348
##$PC= 1
##$PHC0= -4366.982
##$PHC1= -6.007696
##$PH_mod= 1
##$PKNL= yes
##$PPARMOD= 0
##$PSCAL= 0
##$PSIGN= 0
##$REVERSE= no
##$SF= 200.130005648249
##$SI= 16384
##$SIGF1= 3
##$SIGF2= 2
##$SINO= 0.751879
##$SIOLD= 32768
##$SREGLST= <19F.Aceton>
##$SSB= 0
##$STSI= 16384
##$STSR= 0
##$SW_p= 3612.71676300578
##$SYMM= 0
##$S_DEV= 0
##$TDeff= 16384
##$TDoff= 0
##$TI= <>
##$TILT= no
##$TM1= 0
##$TM2= 0
##$TOPLEV= 0
##$USERP1= <user>
##$USERP2= <user>
##$USERP3= <user>
##$USERP4= <user>
##$USERP5= <user>
##$WDW= 1
##$XDIM= 16384
##$YMAX_p= 299173516
##$YMIN_p= -1343122
$$ End of Bruker specific parameters
$$ ---------------------------------
##NTUPLES= NMR SPECTRUM
##VAR_NAME=  FREQUENCY,     SPECTRUM/REAL,   SPECTRUM/IMAG
##SYMBOL=    X,             R,               I
##VAR_TYPE=  INDEPENDENT,   DEPENDENT,       DEPENDENT
##VAR_FORM=  AFFN,          ASDF,            ASDF
##VAR_DIM=   16384,         16384,           16384
##UNITS=     HZ,            ARBITRARY UNITS, ARBITRARY UNITS
##FACTOR=    0.220516191357247, 1,           1
##FIRST=     3100.71018561551, 0,            0
##LAST=      -512.006577390272, 0,           0
##MIN=       -512.006577390272, -1343122,    0
##MAX=       3100.71018561551, 299173516,    0
$$ Real data points
##PAGE= N=1
##DATA TABLE= (X++(R..R)), XYDATA
$$ [...]
8611E794541K9998p9890R8944Q680j52263k47248P6835o4761k4504k42070r3497
$$ 5794541 5824539 5744649 5843593 5852273 5700010 5452762 5529597 5464836 5440332 5198262 5104765
8600E104765p7546o6407j4386L8824o8483m2712j28326l4696k6630K3087k0398
$$ 5104765 5027219 4960812 4946426 4985250 4916767 4874055 4745729 4711033 4684403 4707490 4687092
8589D687092M1998j35519o6908j36001m7531l0336J7596n295L38000J38123p79416
$$ 4687092 4729090 4593571 4526663 4390662 4343131 4312795 4330391 4325096 4663096 4801219 4021803
8578D021803n084m9607P4057K8554P9835k14727j2019N7865n9336j59028L8975
$$ 4021803 4016719 3967112 4041169 4069723 4149558 3934831 3922812 3980677 3921341 3762313 3801288
8567C801288J56763J25597Q2360K6054J88988K22218L29106Q51808J239777J620199
$$ 3801288 3958051 4083648 4166008 4192062 4381050 4603268 4932374 5784182 7023959 8644158
8557H644158J169426O55649J32710j42775l98566q38375j091828j083306o81376
$$ 8644158 9813584 10469233 10601943 10459168 10060602 9222227 8130399 7047093 6365717
8548F365717p19235n47417l87461l56467j15216m1597j95420k02355J7947j82742
$$ 6365717 5646482 5099065 4711604 4355137 4239921 4198324 4002904 3800549 3818496 3635754
8538C635754j30194o6670p8570q0366l4967L3056j05260L2792j25000p9351j4252
$$ 3635754 3505560 3438890 3360320 3279954 3244987 3278043 3172783 3205575 3080575 3001224 2986972
8527B986972o7520J5130J10927j49179j3432m0757n143O2958k5715r5488M2262
$$ 2986972 2919452 2934582 3045509 2896330 2882898 2842141 2836998 2899956 2874241 2778753 2821015
8516B821015M9N7117p8895q8659M2003P4319o0183p4360Q0892m4428q5266j95065
$$ 2821015 2821064 2878181 2799286 2710627 2752630 2826949 2766766 2692406 2773298 2728870 2643604 2448539
8504B448539J2276k9327N9073Q4992j14285j9557P5407P9546m8245p4613n5303
$$ 2448539 2460815 2431488 2490561 2575553 2461268 2441711 2517118 2596664 2548419 2473806 2418503
8493B418503P1242k5326l2327l1037o6744L0278j02251N4996L6796r096N4457
$$ 2418503 2489745 2464419 2432092 2401055 2334311 2364589 2262338 2317334 2354130 2345034 2399491
8482B399491j42172n8987m4222J8617j87879l7556J23848K10730j0921k52868
$$ 2399491 2257319 2198332 2154110 2172727 1984848 1947292 2071140 2281870 2270949 2018081
8472B018081m5196K8604l5769j60343k9907l9892J95315P3594j33059n3647J56474
$$ 2018081 1972885 2001489 1965720 1805377 1775470 1735578 1930893 2004487 1871428 1817781 1974255
8461A974255k774N3331r8883r8931K2703N430O4350Q4635p0437j97817J0895q5854
$$ 1974255 1971481 2024812 1925929 1826998 1849701 1855131 1919481 2004116 1933679 1735862 1746757 1660903
8449A660903p81P7057R3917Q2574K3298j25011j74889R270k0202J87497Q5332
$$ 1660903 1660122 1737179 1831096 1913670 1936968 1811957 1637068 1646338 1626136 1813633 1898965
8438A898965j53869L3001M3041N0020m2010K4329N4902k8098R1607k04743o3960
$$ 1898965 1745096 1778097 1821138 1871158 1829148 1853477 1908379 1880281 1971888 1767145 1703185
8427A703185k5751N5282k9454M5493O3915k17057K4954J57239m8190j23274K942
$$ 1703185 1677434 1732716 1703262 1748755 1812670 1595613 1620567 1777806 1729616 1606342 1609284
8416A609284o2714l8199P3788L520J3393L1859m1000o1718P6842O0586j30561
$$ 1609284 1546570 1508371 1582159 1585679 1599072 1630931 1589931 1528213 1605055 1665641 1535080
8405A535080O157j10831R6349K44975j47450m6467K23585j74379j88399L2634
$$ 1535080 1541237 1430406 1526755 1771730 1624280 1577813 1801398 1627019 1438620 1471254
8395A471254J5324L0281n3648q6586R0015M1116P973Q83J76415m8021k18860K7229
$$ 1471254 1486578 1516859 1463211 1376625 1466640 1507756 1515729 1516612 1693027 1645006 1426146 1453375
8383A453375l1292o6885P28k0187p8945N6069K30202k8353j11789M7799k7911
$$ 1453375 1422083 1355198 1355926 1335739 1256794 1312863 1543065 1514712 1402923 1450722 1422811
8372A422811L7206M0244p2189o3452N7331K5268q2677r454J09161J00673m7714
$$ 1422811 1460017 1500261 1428072 1364620 1421951 1447219 1364542 1355088 1464249 1564922 1517208
8361A517208O3276J4551j73115j87858O9918K58379J4589p7551j1687j15175J40398
$$ 1517208 1580484 1595035 1421920 1234062 1303980 1562359 1576948 1499397 1487710 1372535 1512933
8350A512933J09265L352o0663M0984J14941J34520R3873j38990J18903J51386
$$ 1512933 1622198 1625550 1564887 1605871 1720812 1855332 1949205 1810215 1929118 2080504
8340B080504n8098j312J52715o3629r6648J45116O7738k7037R6683N9588n3049
$$ 2080504 2022406 2021094 2173809 2110180 2013532 2158648 2226386 2199349 2296032 2355620 2302571
8329B302571J21841Q9415P7315K55749J24608N8309J41533L00806K31413L09403
$$ 2302571 2424412 2513827 2591142 2846891 2971499 3029808 3171341 3472147 3703560 4012963
8319D012963M7354R1684N1245L3920j07154j16061k68905m01663l44596j93448
$$ 4012963 4060317 4152001 4203246 4237166 4130012 4013951 3745046 3343383 2998787 2805339
8309B805339J4499k39151j38073J21279O2426J3045J34553K13243O6091J64971
$$ 2805339 2819838 2580687 2442614 2563893 2626319 2639364 2773917 2987160 3053251 3218222
8299C218222L28467K64510K03510J81327Q1292j01969j01008j77087j90008j74132
$$ 3218222 3546689 3811199 4014709 4196036 4277328 4175359 4074351 3897264 3707256 3533124
8289C533124m70867k52963r5198k23298j31389j50563j55422J1977R6427j48595
$$ 3533124 3062257 2809294 2714096 2490798 2359409 2208846 2053424 2065401 2161828 2013233
8279B013233j22838j68095L5942k20927L8936K9376M3273J10264j06259k08964
$$ 2013233 1890395 1722300 1758242 1537315 1576251 1605627 1648900 1759164 1652905 1443941
8269A443941K0379N3685J4873J5014p1831j55367k3799Q1778j00353J42987q5376
$$ 1443941 1464320 1518005 1532878 1547892 1476061 1320694 1296895 1378673 1278320 1421307 1335931
8258A335931k3234J10713o4180n7817l7665R9215K4488l1984l3979j8565J29990
$$ 1335931 1312697 1423410 1359230 1301413 1263748 1362963 1387451 1355467 1321488 1302923 1432913
8247A432913J9111R8184L3332R6311m149Q2725m1531M0606p1377j6607J51781
$$ 1432913 1452024 1550208 1583540 1679851 1675702 1758427 1716896 1757502 1686125 1669518 1821299
8236A821299j60899o6513J4953j9915p1591K91137J38747o1695j0397q6230J37767
$$ 1821299 1660400 1593887 1608840 1588925 1517334 1808471 1947218 1885523 1875126 1788896 1926663
8225A926663J89843O8478j7597M0123N1789m8929J3893J0364o7184Q860o4758
$$ 1926663 2116506 2184984 2167387 2207510 2259299 2210370 2224263 2234627 2167443 2176303 2111545
8214B111545l6210j6397R059J16731r0680j07816J49580Q5891Q5178K5863K10938
$$ 2111545 2075335 2058938 2067997 2184728 2094048 1986232 2135812 2221703 2306881 2332744 2543682
8203B543682P4987J65097J68671j0110J88082M18783K30563L1788K58599K51315
$$ 2543682 2618669 2783766 2952437 2942327 3130409 3549192 3779755 3811543 4070142 4321457
8193D321457J12362l72785J50069K92166q2159J4084j04839j19483R11k12619
$$ 4321457 4433819 4061034 4211103 4503269 4421110 4435194 4330355 4210872 4211783 3999164
8183C999164l64536k15922j61298j14088k51488j44841p6094j80118j31483j69877
$$ 3999164 3634628 3418706 3257408 3143320 2891832 2746991 2670897 2490779 2359296 2189419
8173B189419o3352m5858o1174j47272J0618l8309j1224j5558q9517p9166j27319
$$ 2189419 2126067 2080209 2019035 1871763 1882381 1844072 1832848 1817290 1727773 1648607 1521288
8162A521288k0166L2287M4237j38781k1131N6658N3967r5523j29374J53473n4013
$$ 1521288 1501122 1533409 1577646 1438865 1417734 1474392 1528359 1432836 1303462 1456935 1402922
8151A402922K2254M1638J59438n2286j12521K6950J35659J00899j7726N1900k15465
$$ 1402922 1425176 1466814 1626252 1573966 1461445 1488395 1624054 1724953 1707227 1759127 1543662
8140A543662m7569P7902K44366J30958M332R8577P3305O4179n653M2911o1087
$$ 1543662 1496093 1573995 1818361 1949319 1953651 2052228 2125533 2189712 2184059 2226970 2165883
8129B165883o7350J76416K74703N8544J38421J10598j53086N6760J78754K0417
$$ 2165883 2098533 2274949 2549652 2608196 2746617 2857215 2704129 2760889 2939643 2960060
8119B960060m5226j16711n9948k43848j28599p0954j8060l8899j69172q1619N7301
$$ 2960060 2914834 2798123 2738175 2494327 2365728 2294774 2276714 2237815 2068643 1987024 2044325
8108B044325q2843r3691j919j81983j24485j9621Q5085L283j55992K2368m3689
$$ 2044325 1961482 1867791 1865872 1683889 1559404 1539783 1624868 1628151 1472159 1494527 1450838
8097A450838k8671J29386o8151p1459J6705J3025r922R0011p3173p2556m3742
$$ 1450838 1422167 1551553 1483402 1411943 1428648 1441673 1431751 1521762 1448589 1376033 1332291
8086A332291o869q9469J78921J23020R4382p4995l2590Q6718p4152l0061Q3475
$$ 1332291 1325422 1235953 1414874 1537894 1632276 1557281 1524691 1611409 1537257 1507196 1590671
8075A590671j5245J33086J81279J4981J6153L6140O5116J21510r9894l7860O8668
$$ 1590671 1575426 1708512 1889791 1904772 1920925 1957065 2022181 2143691 2043797 2005937 2074605
8064B074605o8159Q584J04318r928Q8322Q1834p4751K8031K1098j17696q9962
$$ 2074605 2006446 2015030 2119348 2109420 2197742 2279576 2204825 2232856 2253954 2136258 2046296
8053B046296P666L2800j6136k9077j02135J25947Q0311l3338O279k7280o2365
$$ 2046296 2053962 2086762 2070626 2041549 1939414 2065361 2145672 2112334 2118613 2091333 2028968
8042B028968j67539Q551j51950l9572j0434j18949j08589l3230N2166P1976j7337
$$ 2028968 1861429 1869980 1718030 1678458 1668024 1549075 1440486 1407256 1459422 1531398 1514061
8031A514061j07324k5199M1505j428k5295o6929j9287K0482M4864j8405N5623
$$ 1514061 1406737 1381538 1423043 1421615 1396320 1329391 1310104 1330586 1375450 1357045 1412668
8020A412668j2618j55816j3394j10216r55O9397R3213P6781l8543J5728j5990
$$ 1412668 1400050 1244234 1230840 1120624 1119669 1189066 1282279 1359060 1320517 1336245 1320255
8009A320255Q2371j01358k4152M4213o833r0007J17139R2453l1858j25080L2537
$$ 1320255 1402626 1301268 1277116 1321329 1314496 1224489 1341628 1434081 1402223 1277143 1309680
7998A309680J50164J07397r9479j15337J69915N9516j4631M8496J2928P8253L2092
$$ 1309680 1459844 1567241 1467762 1352425 1522340 1581856 1567225 1615721 1628649 1706902 1738994
7987A738994O108J3790J37582K1547M3409J76117p6260J10363p1732P1282J61261
$$ 1738994 1745102 1758892 1896474 1918021 1961430 2137547 2061287 2171650 2099918 2171200 2332461
7976B332461R6670P8303J10100K3965J6402J17422R8922J84827K81112R9301j5761
$$ 2332461 2429131 2507434 2617534 2641499 2657901 2775323 2874245 3059072 3340184 3439485 3423724
7965C423724N4917L3594p4819J38730J24754k18332r0610j15076j21914j51555
$$ 3423724 3478641 3512235 3437416 3576146 3700900 3482568 3391958 3276882 3154968 3003413
7955C003413j92863j01099j72623k13157j50190j03354l7915q1693N2104j95641
$$ 3003413 2810550 2709451 2536828 2323671 2173481 2070127 2032212 1950519 2002623 1806982
7945A806982o8018m4790l9777K3393m4539j86925k7202j7737j0309K9845N6573
$$ 1806982 1738964 1694174 1654397 1677790 1633251 1446326 1419124 1401387 1391078 1420923 1477496
7934A477496p2244l1185q3850P2373k1916J7088j07246q2791k0585j03029J44301
$$ 1477496 1405252 1374067 1290217 1362590 1340674 1357762 1250516 1167725 1147140 1044111 1188412
7923A188412n937J3078o341R6899j25051l4976j024r2844o6212o7433Q3863R4944
$$ 1188412 1182475 1195553 1189212 1286111 1161060 1126084 1125060 1032216 966004 898571 982434 1077378
7911A077378J8239P6565M616Q2962j30053p1318Q3729J8067l2513j13658j0513
$$ 1077378 1095617 1172182 1176798 1259760 1129707 1058389 1142118 1160185 1127672 1014014 1003501
7900A003501L1089k5815j3542L7552M8517r7660O1653p0175j4882K3026j6159
$$ 1003501 1034590 1008775 995233 1032785 1081302 983642 1045295 975120 960238 983264 967105
7889I67105J0218O1604m0422n8706q509J3274L8684o6316M5560J0731j24504J52830
$$ 967105 977323 1038927 998505 939799 931290 944564 983248 916932 962492 973223 848719 1001549
7877A001549m9728K6586r0689j63742J02496J97333j35416k048L1620J8707L2291
$$ 1001549 951821 978407 887718 723976 826472 1023805 888389 886341 917961 936668 968959
7866I68959j59295R1726L7416N2350o4969o3322J10585m6689J7660q4567J224
$$ 968959 809664 901390 938806 991156 926187 862865 973450 926761 944421 859854 861078
7855H61078K1754o9804j15413P3542M5279L8088J2980k5945J14397M0658r8772
$$ 861078 882832 813028 697615 771157 816436 854524 867504 841559 955956 996614 897842
7844H97842l0672J40405j1227j00533O083k1990J3229J21788j52687J01348J53225
$$ 897842 867170 1007575 996348 895815 901898 879908 893137 1014925 862238 963586 1116811
7833A116811L4086o3337L3168p3870m7553J1225j29359O0448j08858k9970Q6201
$$ 1116811 1150897 1087560 1120728 1046858 999305 1010530 881171 941619 832761 802791 888992
7822H88992r4J73865l8639l4622j4180k998q9456O4909J07224q219j9233j6720
$$ 888992 888898 1062763 1024124 989502 975322 972324 882868 947777 1055001 1046782 1027549 1010829
7810A010829K1628O4787q1457m8250J13106P2701M460N347j37317j07617K171
$$ 1010829 1032457 1097244 1015787 967537 1080643 1153344 1157804 1163151 1025834 918217 920388
7799I20388n6656k2419J48234o9926Q2639P3457m1929n8348J5841l3857M5017
$$ 920388 863732 841313 989547 919621 1002260 1075717 1033788 975440 991281 957424 1002441
7788A002441M2675N5382J11608l8271J36998O801L3897N5875J1741J85796K2303
$$ 1002441 1045116 1100498 1212106 1173835 1310833 1317634 1351531 1407406 1419147 1604943 1627246
7777A627246k6395M640P5270o0990o5424p8777k23233k8546J17773j9721r0655
$$ 1627246 1600851 1605491 1680761 1619771 1554347 1475570 1252337 1223791 1341564 1321843 1231188
7766A231188M3015j35262j024j42434j0201Q2360K399m0826N7393K799k0321M0840
$$ 1231188 1274203 1138941 1137917 995483 985282 1067642 1070041 1029215 1086608 1089407 1069086 1109926
7754A109926j85512l5674J01653L946J74780R9517M8455K59694J93162N5619J65626
$$ 1109926 924414 888740 990393 994339 1169119 1268636 1317091 1576785 1769947 1825566 1991192
7743A991192N5239M5227m0616j07834m4918J5585Q5092q2291K48455J79962K08905
$$ 1991192 2046431 2091658 2051042 1943208 1898290 1913875 1998967 1916676 2165131 2345093 2553998
7732B553998J9423k8780M6086L01576J73773J16407J1862J0849J8879j64054p7889
$$ 2553998 2573421 2544641 2590727 2892303 3066076 3182483 3194345 3205194 3224073 3060019 2982130
7721B982130j46669k32239j19231K04897J11557j46929p981J02194J6260n623
$$ 2982130 2835461 2603222 2483991 2688888 2800445 2653516 2645535 2747729 2763989 2758366
7711B758366j42132r5324j08712k20961l6459j35855o1381j59122k35960O2220
$$ 2758366 2616234 2520910 2412198 2191237 2154778 2018923 1957542 1798420 1562460 1624680
7701A624680l4763n3702J25388Q1091j28530m5987n2180K00110q7056J4019p9087
$$ 1624680 1589917 1536215 1661603 1742694 1614164 1568177 1515997 1716107 1629051 1643070 1563983
7690A563983m8377l7803j24224j32770j1921R8626O1735Q4224k5016j0772K04273
$$ 1563983 1515606 1477803 1353579 1220809 1208888 1307514 1369249 1453473 1428457 1417685 1621958
7679A621958k8946j8850j7986k17453l537J32744j20638m2592n7027M060P3243
$$ 1621958 1593012 1574162 1556176 1338723 1335186 1467930 1347292 1304700 1247673 1251733 1324976
7668A324976j1968J26211O3039L0165n5754r7978l4780L4446O8705r112j58772
$$ 1324976 1313008 1439219 1502258 1532423 1476669 1378691 1343911 1378357 1447062 1437950 1279178
7657A279178o0592M4357m6179m0790m5029O9211J40681j02687m1885N8348J21462
$$ 1279178 1218586 1262943 1216764 1175974 1130945 1200156 1340837 1238150 1196265 1254613 1376075
7646A376075J1925j06438J46201J10075M1663m9248l5960m1570M418n594j26742
$$ 1376075 1388000 1281562 1427763 1537838 1579501 1530253 1494293 1452723 1457141 1451547 1324805
7635A324805j67718m6210K0841J2516j63608M5291J11L5985J01620k2933q2889
$$ 1324805 1157087 1110877 1131718 1144234 980626 1025917 1026028 1062013 1163633 1140700 1057811
7624A057811r8710J57605k3090m9659J00139n8377K4874K04492k7040m4055n6577
$$ 1057811 959101 1116706 1093616 1043957 1144096 1085719 1110593 1315085 1288045 1243990 1187413
7613A187413J87046J0565j08629j8784P6611K9118J42652J05084l402j89632j52467
$$ 1187413 1374459 1385024 1276395 1257611 1334222 1363340 1505992 1611076 1607674 1418042 1265575
7602A265575k926J10884p4186M9900K9156j00670k08957J8556R5362l7565J28185
$$ 1265575 1262649 1373533 1299347 1349247 1378403 1277733 1068776 1087332 1182694 1145129 1273314
7591A273314o1784j07854n4152J01788J09909m1077p6423n4934O9842j79704j69163
$$ 1273314 1211530 1103676 1049524 1151312 1261221 1220144 1143721 1088787 1158629 978925 809762
7580H09762N2698J60557m7683O4272P6461O7156l2252k57426O7127J44598l7102
$$ 809762 862460 1023017 975334 1039606 1116067 1183223 1150971 893545 960672 1105270 1068168
7569A068168N4167j24897J08543P2554j48347J21953q7793K2888j99025q7854
$$ 1068168 1122335 997438 1105981 1178535 1030188 1152141 1064348 1087236 888211 800357
7559H00357P1433O8843r9991j26624J68865N3921q7724K777o4283m6264Q291R6836
$$ 800357 871790 940633 840642 714018 882883 936804 849080 851857 787574 741310 749601 846437
7547H46437j981L1701l9975k3048J02029q2389p2870Q4887p8633l1675q4613J4576
$$ 846437 844456 876157 836182 813134 915163 832774 759904 844791 766158 734483 649870 664446
7535F64446K1187k9691J07355J052N1635J72486J61341r2659l1134M0093l7265
$$ 664446 685633 655942 763297 764349 815984 988470 1149811 1057152 1026018 1066111 1028846
7524A028846o279J2059M210j56862l196R4565m7242m3088m637J42202P0615Q8492
$$ 1028846 1022567 1034626 1038836 881974 878778 973343 926101 883013 878376 1020578 1091193 1179685
7512A179685J44409n8366n014k5645P3759P4566M1851J16380K98971L68717K98129
$$ 1179685 1324094 1265728 1260714 1235069 1308828 1383394 1425245 1541625 1840596 2209313 2507442
7501B507442K16208K41974J72130k6746n5525r9077k05314l07138k34019k55789
$$ 2507442 2723650 2965624 3137754 3111008 3055483 2956406 2751092 2443954 2209935 1954146
7491A954146k28082r2157q9786j52393K9281m7685o271l5163j33052q7727O020
$$ 1954146 1726064 1633907 1544121 1391728 1421009 1373324 1367053 1331890 1198838 1111111 1117131
7480A117131j3789J61831J20796o5381l2652J28034M0346j03562j7657r3235n6902
$$ 1117131 1103342 1265173 1385969 1320588 1287936 1415970 1456316 1352754 1335097 1241862 1184960
7469A184960L7020n4114p1697q0013Q9950J03620O8345n8450j64633q7197M5936
$$ 1184960 1221980 1167866 1096169 1016156 1106106 1209726 1278071 1219621 1054988 967791 1013727
7458A013727o0383l1288l3721K1539P900J0811p7926J8146J47241Q6638N6242
$$ 1013727 953344 922056 888335 909874 917774 928585 850659 868805 1016046 1102684 1158926
7447A158926j03895J04858j36191l5497Q7973k9463M2177j396J1307q3895K0786
$$ 1158926 1055031 1159889 1023698 988201 1076174 1046711 1088888 1087492 1098799 1014904 1035690
7436A035690L4327N1639m4593n8617J51275m8062j79673K6781Q4606J8427p0022
$$ 1035690 1070017 1121656 1077063 1018446 1169721 1121659 941986 968767 1053373 1071800 1001778
7425A001778L0613K23676o2674j16449j9335J31226q5181K1815K9818m6887J64189
$$ 1001778 1032391 1256067 1193393 1076944 1057609 1188835 1103654 1125469 1155287 1108400 1272589
7414A272589K6042N9538J3684L5230P2361L537n45J80729K2747l7811J37173M696
$$ 1272589 1298631 1358169 1371853 1407083 1479444 1482981 1482436 1663165 1685912 1648101 1785274 1789970
7402A789970P4198M8536K67025J02738J15189K06311J33289l0418J76660o779
$$ 1789970 1864168 1912704 2179729 2282467 2397656 2603967 2737256 2706838 2883498 2876719
7392B876719o9384j56327p9728j19319J8675j46096o9300o594L4228Q758K943
$$ 2876719 2807335 2651008 2571280 2451961 2470636 2324540 2255240 2248646 2282874 2291632 2294575
7381B294575m4732p9368o2642J3064m0245N1908r7791M8991r00j3609J31140j79693
$$ 2294575 2249843 2170475 2107833 2120897 2080652 2132560 2034769 2083760 2082860 2069251 2200391 2020698
7369B020698Q5010R7304n5516P7001J05429j16076l3000l4903J69741N1465j16135
$$ 2020698 2105708 2203012 2147496 2224497 2329926 2213850 2180850 2145947 2315688 2367153 2251018
7358B251018N0856L9852j21597l1221n3919l2030K1112O7013p2845J8076O841
$$ 2251018 2301874 2341726 2220129 2188908 2134989 2102959 2124071 2191084 2118239 2136315 2143156
7347B143156j57367J8348K10794N266J6301r0102R142m1275m732O053L2653q9954
$$ 2143156 1985789 2004137 2214931 2220197 2236498 2146396 2155538 2114263 2109531 2115584 2148237 2058283
7335B058283J20988J4859l8563n1637k0218N6512J10361K4570J04685o7829J9262
$$ 2058283 2179271 2194130 2155567 2103930 2083712 2140224 2250585 2275155 2379840 2312011 2331273
7324B331273L989K10862Q3109K13636M6509K58518N67908O94019O14966P21723
$$ 2331273 2335262 2546124 2629233 2842869 2889378 3147896 3715804 4409823 5024789 5746512
7314E746512R49844J291471K160822L558444N751899Q900951R021579N229257
$$ 5746512 6696356 7987827 10148649 13707093 19458992 28359943 37381522 42610779
7306D2610779J719596J78529j285411l758252n580263o250558n520666m584181
$$ 42610779 44330375 44508904 43223493 39465241 33884978 27634420 22113754 17529573
7298A7529573l194477k509214j639513j109977r32378o46824n34849n87399l77771
$$ 17529573 14335096 11825882 10186369 9076392 8144014 7497190 6962341 6374942 5997171
7289E997171k67490j84907n46183l16968j15140r7601j51858j23143O6426k60110
$$ 5997171 5729681 5544774 4998591 4681623 4566483 4468882 4317024 4193881 4260307 4000197
7279D000197K28334M7457N2217J50869K61116J30498j8727J44755j0180J7744
$$ 4000197 4228531 4275988 4328205 4479074 4740190 4870688 4851961 4996716 4986536 5004280
7269E004280j82156k08288j84085k40091j82558j44663q7342k2237k31471r7228
$$ 5004280 4822124 4613836 4429751 4189660 4007102 3862439 3775097 3752860 3521389 3424161
7259C424161p5674j07016m6726J23479J6207J61464m4476j83775k387k2993j83640
$$ 3424161 3348487 3241471 3194745 3318224 3334431 3495895 3451419 3267644 3265257 3242264 3058624
7248C058624q838k7158j55974k8853K6941j8864M7610P9757l2619p7168p5696
$$ 3058624 3049786 3022628 2866654 2837801 2864742 2845878 2893488 2973245 2940626 2863458 2787762
7237B787762L0908j06290j51690Q58J06033l8615k55236j10133l3279p3975k9431
$$ 2787762 2818670 2712380 2560690 2561548 2667581 2628966 2373730 2263597 2230318 2156343 2126912
7226B126912J35546o9213L1113p138J42183j01752R4770J0885l1046P3307r7811
$$ 2126912 2262458 2193245 2224358 2217220 2359403 2257651 2352421 2363306 2332260 2405567 2307756
7215B307756R3012m2102k38879m1496p72K632K5952K23658L7167K6856J24347
$$ 2307756 2400768 2358666 2119787 2078291 2077519 2080151 2106103 2329761 2366928 2393784 2518131
7204B518131m8311P6593j18865O5047J907k9500J645k842Q154j13400o1569m1750
$$ 2518131 2469820 2546413 2427548 2492595 2494502 2465002 2466647 2463805 2471959 2358559 2296990 2255240
7192B255240L2154j10615M4261O5964j39677k913L2056r5140j08724N2889L3271
$$ 2255240 2287394 2176779 2221040 2287004 2147327 2144414 2176470 2081330 1972606 2025495 2058766
7181B058766j9035l8015J46872K8020K4822O7508K51876J64416L7666J74954K51725
$$ 2058766 2039731 2001716 2148588 2176608 2201430 2268938 2520814 2685230 2722896 2897850 3149575
7170C149575j0960L35444J57734L9483J16780L8065n3389J27861o1260j39184
$$ 3149575 3138615 3474059 3631793 3671276 3788056 3826121 3772732 3900593 3839333 3700149
7160C700149J99154k7406j81613n6863J4810j82368j90229k72196k10678R6555
$$ 3700149 3899303 3871897 3690284 3633421 3648231 3465863 3275634 3003438 2792760 2889315
7150B889315p5157n8112n4137l4952j03692k552o431m042K4175j26570n8295j33547
$$ 2889315 2814158 2756046 2701909 2666957 2563265 2560713 2554282 2550240 2574415 2447845 2389550 2256003
7138B256003j1308J17760o5393j39959m1209M4092j34914L8748M2992j87099q9624
$$ 2256003 2244695 2362455 2297062 2157103 2115894 2159986 2025072 2063820 2106812 1919713 1830089
7127A830089o5422O8004M4608l8183r4286o6420N2117Q7374r2988J1473L3259
$$ 1830089 1764667 1832671 1877279 1839096 1744810 1678390 1730507 1817881 1724893 1736366 1769625
7116A769625L8967o3369N8155L9088N8874K9468L8087J9275p2797O6733L5000
$$ 1769625 1808592 1745223 1803378 1842466 1901340 1930808 1968895 1988170 1915373 1982106 2017106
7105B017106r0441m3281J13259j592O3974r7071m0309R4080O454Q972j41745P8755
$$ 2017106 1926665 1883384 1996643 1995051 2059025 1961954 1921645 2015725 2022179 2031151 1889406 1968161
7093A968161j4970l0287k4991q9027k7589j6707J16092j5372J5634J37843j45721
$$ 1968161 1953191 1922904 1897913 1808886 1781297 1764590 1880682 1865310 1880944 2018787 1873066
7082A873066n8377r6040j0920K2743j64024L584k109P3756K3586Q978N5380J3615
$$ 1873066 1814689 1718649 1707729 1730472 1566448 1570032 1567923 1641679 1665265 1674243 1729623 1743238
7070A743238k8497m3955q075M6769k6000K0599j09233O4667J17265N4027j23411
$$ 1743238 1714741 1670786 1662711 1709480 1683480 1704079 1594846 1659513 1776778 1830805 1707394
7059A707394n58n1578p4772J19618J22972m3408j30059j34014J65301J46502j83381
$$ 1707394 1706836 1655258 1580486 1700104 1823076 1779668 1649609 1515595 1680896 1827398 1644017
7048A644017j15053N6763j78349m0073J56459R081l3376Q8276n4039m2976R0885
$$ 1644017 1528964 1585727 1407378 1367305 1523764 1532845 1499469 1587745 1533706 1490730 1581615
7037A581615j55504j46926K13576M4796j15430K9353K01256k6755j20432R9319
$$ 1581615 1426111 1279185 1492761 1537557 1422127 1451480 1652736 1625981 1505549 1604868
7027A604868J8278k4521k5386k5949j5524j3609Q3586k6452j13792n0963j08499
$$ 1604868 1623146 1598625 1573239 1547290 1531766 1518157 1601743 1575291 1461499 1410536 1302037
7016A302037J74994O3162j2456n1327J7466k6075Q6781l9016K7549q2072j36185
$$ 1302037 1477031 1540193 1527737 1476410 1493876 1467801 1554582 1515566 1543115 1461043 1324858
7005A324858P6386J32375j73680R4078J1925m0546m2085L2598M8512J10999O2705
$$ 1324858 1401244 1533619 1359939 1454017 1465942 1425396 1383311 1415909 1464421 1575420 1638125
6994A638125L1518n6616k4938j13158K15601r0224k85081l2923J5286J2129j6802
$$ 1638125 1669643 1613027 1588089 1474931 1690532 1600308 1315227 1282304 1297590 1309719 1292917
6983A292917j02367j35628J18621K30661M2433m6679l3470O3427J38294K789l8629
$$ 1292917 1190550 1054922 1173543 1404204 1446637 1399958 1366488 1429915 1568209 1570998 1532369
6972A532369K6709J04027J36485J45092J7800J46375P4209J39643P176l333L1795
$$ 1532369 1559078 1663105 1799590 1944682 1962482 2108857 2183066 2322709 2329885 2326552 2358347
6961B358347j22349P708J7851j27555p0596O3031n5035j66163J13373J03057k2116
$$ 2358347 2235998 2243706 2261557 2134002 2063406 2126437 2071402 1905239 2018612 2121669 2099553
6950B099553j05545q935j01533J4837m9218n8830l733J3117J962j32113l758o7807
$$ 2099553 1994008 1985073 1883540 1898377 1849159 1790329 1786596 1799713 1801675 1669562 1665804 1597997
6938A597997r7054P4308p6987J8168M4640j69494J02680J9316j22780R0059j68600
$$ 1597997 1500943 1575251 1498264 1516432 1561072 1391578 1494258 1513574 1390794 1480853 1312253
6927A312253J67078Q9106N92K38175K4739K7999O7100J81340r5665J5831Q3736
$$ 1312253 1479331 1568437 1569029 1807204 1831943 1859942 1927042 2108382 2012717 2028548 2112284
6916B112284m6178j3545q572p5309n9172M4594j98287K3278r4819j02240J02576
$$ 2112284 2066106 2052561 2043989 1968680 1909508 1954102 1755815 1779093 1684274 1582034 1684610
6905A684610J06806K8500l2901L1200L0374L0325K38599p2317K6968P6839n5733
$$ 1684610 1791416 1819916 1787015 1818215 1848589 1878914 2117513 2045196 2072164 2149003 2093270
6894B093270o368j0352Q3513o0498m6868j27864j7235J459r1641R6304n076R40
$$ 2093270 2086902 2076550 2160063 2099565 2052697 1924833 1907598 1909057 1817416 1913720 1908644 1909584
6882A909584l8217P306j30056Q1273m9380l4711M1388p3129n0087o4358j22046
$$ 1909584 1871367 1878673 1748617 1829890 1780510 1745799 1787187 1714058 1663971 1599613 1477567
6871A477567n6343m6407l661n9323N7062k6534j528N1135o5165L8796J9104o134
$$ 1477567 1421224 1374817 1371156 1311833 1368895 1342361 1340833 1391968 1326803 1365599 1384703 1378569
6859A378569r1877q5471J64599J2585j30587Q7898P8371N7340o2508Q1426j1692
$$ 1378569 1286692 1201221 1365820 1378405 1247818 1335716 1414087 1471427 1408919 1490345 1478653
6848A478653N0986j00464q2268m6027J29774m6437J53357K20934N7037l4465j12605
$$ 1478653 1529639 1429175 1346907 1300880 1430654 1384217 1537574 1758508 1815545 1781080 1668475
6837A668475N06P8234L5475j61866J5523q3441j1726R7084q3871j82184R77J48940
$$ 1668475 1668981 1747215 1782690 1620824 1636347 1552906 1541180 1638264 1554393 1372209 1373186 1522126
6825A522126P077K9918r7110k4973M2636N0592n4860r821J05825L2106n1469P9873
$$ 1522126 1529203 1559121 1462011 1437038 1479674 1530266 1475406 1465585 1571410 1603516 1552047 1631920
6813A631920J05806Q0362L9634J01643m174J38440o1843o919N3391o9980j24131
$$ 1631920 1737726 1818088 1857722 1959365 1955191 2093631 2031788 2024869 2078260 2008280 1884149
6802A884149j16647l225o3656k9619L9232m5741j83372l3542K2915J5595r5036
$$ 1884149 1767502 1764277 1700621 1671002 1710234 1664493 1481121 1447579 1470494 1486089 1391053
6791A391053K8413j36278r3955J60229j666m508o8291r1310J3668N1524l7504
$$ 1391053 1419466 1283188 1189233 1349462 1347796 1343288 1274997 1183687 1197355 1248879 1211375
6780A211375j20466J33140j93681k804K35936P4474q7497L730O214j87388m0488
$$ 1211375 1090909 1224049 1030368 1027564 1263500 1337974 1250477 1254207 1260421 1073033 1032545
6769A032545J96430L4187p2104k1641R7324R8703j25903K8825o3463M0841R8844
$$ 1032545 1228975 1263162 1191058 1169417 1266741 1365444 1239541 1268366 1204903 1245744 1344588
6758A344588J8659j16J87617j5471q6703L2675k8187j4436k5383q2558p5388n8937
$$ 1344588 1363247 1363131 1550748 1535277 1448574 1481249 1453062 1438626 1413243 1330685 1255297 1196360
6746A196360K10336j24650k6674J08740K808K6704J7330j00536n1567N8211N9430
$$ 1196360 1406696 1282046 1255372 1364112 1366920 1393624 1410954 1310418 1258851 1317062 1376492
6735A376492p1673O7250J95648j02314k4035k1595L6514L7389M9872l0260j36670
$$ 1376492 1304819 1372069 1567717 1465403 1441368 1419773 1456287 1493676 1543548 1513288 1376618
6724A376618q4937J49968j6654j13575o0181q3511k641n0192M11J17119p0153
$$ 1376618 1291681 1441649 1424995 1311420 1251239 1167728 1165087 1114895 1115306 1232425 1162272
6713A162272j26664K3731J1418R3811M8417j08247q4222P8284L1209j08216r0359
$$ 1162272 1035608 1059339 1070757 1164568 1212985 1104738 1020516 1098800 1130009 1021793 931434
6702I31434O3353J29449k5032N3092J02931n9954j15128Q0380M7167J56587K6378
$$ 931434 994787 1124236 1099204 1152296 1255227 1195273 1080145 1160525 1207692 1364279 1390657
6691A390657r1804M0748J3499r2752q0420N5596O6990p8994J11939j117J25808
$$ 1390657 1298853 1339601 1353100 1260348 1179928 1235524 1302514 1223520 1335459 1334342 1460150
6680A460150J20642J14805j19890k84376M5546P1404m8012M6072l8501J14861
$$ 1460150 1580792 1695597 1575707 1291331 1336877 1408281 1360269 1406341 1367840 1482701
6670A482701J39698o5138j15506L8361J29938J73p3515p5244l4346K9241n1211
$$ 1482701 1622399 1557261 1441755 1480116 1610054 1610227 1536712 1461468 1427122 1456363 1405152
6659A405152j06738j7352J09831J53806P4363Q0401o4018j8824J4796Q8814K7624
$$ 1405152 1298414 1281062 1390893 1544699 1619062 1699463 1635445 1616621 1631417 1720231 1747855
6648A747855k49735M7635J27554k8993j40058m875M1730K2573n2157K1469J70962
$$ 1747855 1498120 1545755 1673309 1644316 1504258 1499383 1541113 1563686 1511529 1532998 1703960
6637A703960l3464j202K9059m9723m7031O1051L4676O0971J4742M7869N7898M1127
$$ 1703960 1670496 1669294 1698353 1648630 1601599 1662650 1697326 1758297 1773039 1820908 1878806 1919933
6625A919933J84480J6034J98324J44013J03458J91745L1881l5416L8535P1113
$$ 1919933 2104413 2120447 2318771 2462784 2566242 2757987 2789868 2754452 2792987 2864100
6615B864100m9662L1400j86659k87021J74373J57787N5704P4522m3393J03156
$$ 2864100 2814438 2845838 2659179 2372158 2546531 2704318 2760022 2834544 2791151 2894307
6605B894307p815k9262r2462k0732k2102L7684K7620r5171k13148j01622j04028
$$ 2894307 2886492 2857230 2764768 2744036 2721934 2759618 2787238 2692067 2478919 2377297 2273269
6594B273269j30982o0444J14335M3060p8665j86953K415n5021n9947n5246P1729
$$ 2273269 2142287 2081843 2196178 2239238 2160573 1973620 1976035 1921014 1861067 1805821 1877550
6583A877550N6260j18051K2321n1732M8866Q576j23038j4373o6285J61709J28146
$$ 1877550 1933810 1815759 1838080 1786348 1835214 1843790 1720752 1706379 1640094 1801803 1929949
6572A929949M4192J0531j7237M2893o8670L8387k00540j20610J29642N9030K5818
$$ 1929949 1974141 1984672 1967435 2010328 1941658 1980045 1779505 1658895 1788537 1847567 1873385
6561A873385M3414j27123J3507K8586J480O6572p802P5697K1289P4568J06929
$$ 1873385 1916799 1789676 1803183 1831769 1833249 1899821 1892019 1967716 1989005 2063573 2170502
6550B170502R9160l9502P0467L2089K65692J07157Q9424N1562K7753J17647k3933
$$ 2170502 2269662 2230160 2300627 2332716 2598408 2705565 2794989 2846551 2874304 2991951 2968018
6539B968018Q6883o4231m3107j25027j12269p3616m0648P8594N3840M9933j7273
$$ 2968018 3054901 2990670 2947563 2822536 2710267 2636651 2596003 2674597 2728437 2778370 2761097
6528B761097O7344r1739m3922q8857j00768o4951r2833j3179j52018k09689n501
$$ 2761097 2828441 2736702 2692780 2603923 2503155 2438204 2345371 2332192 2180174 1970485 1964984
6517A964984O3052j27101m6132O0575q6232o7082j6006O85M5115r9588K1420M8330
$$ 1964984 2028036 1900935 1854803 1915378 1829146 1762064 1746058 1746743 1791858 1692270 1713690 1762020
6505A762020L6910m3957J0069J0303j09123L4395J78629o4708m54q2417m9682
$$ 1762020 1798930 1754973 1765042 1775345 1666222 1700617 1879246 1814538 1814084 1731667 1681985
6494A681985j23349J7985L8105J41269J97848j07012j36933j8095N5327j1630
$$ 1681985 1558636 1576621 1614726 1755995 1953843 1846831 1709898 1691803 1747130 1735500
6484A735500m2140R7065j19384l4012J78091j98298j60185R4233R2054k9058J93189
$$ 1735500 1693360 1790425 1671041 1637029 1815120 1616822 1456637 1550870 1642924 1613866 1807055
6473A807055J48937j17100M8850k06213q1575l5500O046J4980K07341M5592j54008
$$ 1807055 1955992 1838892 1887742 1681529 1599954 1564454 1570500 1585480 1792821 1838413 1684405
6462A684405O181R3618Q1475L1123p6545j25210J56657M232n0749n9037j12272
$$ 1684405 1690586 1784204 1865679 1896802 1820257 1695047 1851704 1855936 1805187 1746150 1633878
6451A633878J08511j5491j02236J11098n9998J01919l753k0218J15689O0710j04683
$$ 1633878 1742389 1726898 1624662 1735760 1675762 1777681 1773928 1753710 1869399 1930109 1825426
6440A825426r610m1595M3330N9430m5810J23410J9826P1536J12576k7753j08344
$$ 1825426 1815816 1774221 1817551 1876981 1831171 1954581 1974407 2045943 2158519 2130766 2022422
6429B022422L9254J59676K27308M9248j2867R4223p7046Q9645J25022q1250o3479
$$ 2022422 2061676 2221352 2448660 2497908 2485041 2579264 2502218 2591863 2716885 2635635 2572156
6418B572156j9479O6964J53284J23072m5618J47926J83785R9925J35012K04709
$$ 2572156 2552677 2619641 2772925 2895997 2850379 2998305 3182090 3282015 3417027 3621736
6408C621736R8329K64612Q2532N8793K27565M3088J65662j02559m5139n2451k23239
$$ 3621736 3720065 3984677 4067209 4126002 4353567 4396655 4562317 4459758 4414619 4362168 4138929
6397D138929p3626j68955j91274j09963j95836j74246k883R6062l7896l0623M4794
$$ 4138929 4065303 3896348 3705074 3595111 3399275 3225029 3222146 3318208 3280312 3249689 3294483
6386C294483J20379J99576J75305Q4998J17301l7354J84994R4374Q0178j140J632
$$ 3294483 3414862 3614438 3789743 3874741 3992042 3954688 4139682 4234056 4314234 4313094 4314726
6375D314726J30348J8099L9813R8630o2095m3874j19620j42407r7782M6126J6448
$$ 4314726 4445074 4463173 4502986 4601616 4539521 4495647 4376027 4233620 4135838 4181964 4198412
6364D198412J15862J90678m1996O2606J83308P2236j34435K6468J56632J83329
$$ 4198412 4314274 4504952 4462956 4525562 4708870 4781106 4646671 4673139 4829771 5013100
6354E013100J61261J66472J56882J85341M8827k6986o670j07293k87428l45847
$$ 5013100 5174361 5340833 5497715 5683056 5731883 5704897 5698227 5590934 5303506 4957659
6344D957659l65809j10870j98947q8979k5585m5076j33097N301J9732J28126N088
$$ 4957659 4591850 4480980 4282033 4193054 4167469 4122393 3989296 3994597 4014329 4142455 4147543
6333D147543j05229M1601k1973R2571J86181J13053P82Q5844O8529j29623j55594
$$ 4147543 4042314 4083915 4061942 4154513 4340694 4453747 4454529 4540373 4608902 4479279 4323685
6322D323685j38165j11444k29546j04260j43186k00793j68666q5481o0276o6988
$$ 4323685 4185520 4074076 3844530 3740270 3597084 3396291 3227625 3142144 3081868 3014880
6312C014880j01672J8340N5295j78811j59924p1358O5919J8984K3985q2946o322
$$ 3014880 2913208 2931548 2986843 2808032 2648108 2576750 2642669 2661653 2685638 2602692 2596370
6301B596370r5136j5998P5796J53393J24204J00761r3076j39046P2494J30799
$$ 2596370 2501234 2485236 2561032 2714425 2838629 2939390 2846314 2707268 2779762 2910561
6291B910561J11142J81146J51192L7498R5988J95293k3855K08861K22332N7854
$$ 2910561 3021703 3202849 3354041 3391539 3487527 3682820 3658965 3867826 4090158 4148012
6281D148012J8289r6194K2787N6976l7387J5619J6224O5004J49457J69667N2060
$$ 4148012 4166301 4070107 4092894 4149870 4112483 4128102 4144326 4209330 4358787 4528454 4580514
6270D580514j9922k26869j07929k65373k22317k5219J00800l1857j9274o6658
$$ 4580514 4560592 4333723 4225794 3960421 3738104 3712885 3813685 3781828 3762554 3695896
6260C695896q3436k3629P9303J79507j6440N1346J16571J19424J61865J09485
$$ 3695896 3612460 3588831 3668134 3847641 3831201 3882547 3999118 4118542 4280407 4389892
6250D389892J85492K06667R9660K8498J37033L11437L92938L32897L36988O46657
$$ 4389892 4575384 4782051 4881711 4910209 5047242 5358679 5751617 6084514 6421502 7068159
6240G068159P81086J054891Q41981Q46426O45473L13914L69389J25008j84352
$$ 7068159 7849245 8904136 9746117 10592543 11238016 11551930 11921319 12046327 11861975
6231A1861975k18625j77119n1725J72892M57987L19520L59976P2087l60978n18268
$$ 11861975 11643350 11466231 11414506 11587398 12045385 12364905 12724881 12796968 12435990 11917722
6221A1917722n69843p98277q05334p44012o49428m53039n91387n01805l33705
$$ 11917722 11347879 10549602 9744268 9000256 8350828 7897789 7306402 6804597 6470892
6212F470892l23075r8608l06909j71427j52330q7616l8622l0229J24114K15885
$$ 6470892 6147817 6049209 5742300 5570873 5418543 5330927 5292305 5262076 5386190 5602075
6202E602075J47290J38024J17361j07389J9213j64372p6357j22937j79011J41681
$$ 5602075 5749365 5887389 6004750 5897361 5916574 5752202 5675845 5552908 5373897 5515578
6192E515578m5115p2621j14152j5672L51r5148j28051m7300m4660k2124J8876
$$ 5515578 5470463 5397842 5283690 5268018 5268369 5173221 5045170 4997870 4953210 4931086 4949962
6181D949962K1076k1851p3209Q9457M0594k00673j7146j1532j85416j48746n1766
$$ 4949962 4971038 4949187 4875978 4965435 5006029 4805356 4788210 4776678 4591262 4442516 4390750
6170D390750j34327r6679N7205q0757k56627j8418M6824M1068K4405L8317l0369
$$ 4390750 4256423 4159744 4216949 4136192 3879565 3861147 3907971 3949039 3973444 4011761 3981392
6159C981392l2434M8990J02043J27108j23952J00865J32917J73061J41110J44481
$$ 3981392 3948958 3997948 4099991 4227099 4103147 4204012 4336929 4509990 4651100 4795581
6149D795581K05992J51684p301p8588Q323j52304o5694j28067o6218O1858r0122
$$ 4795581 5001573 5153257 5145956 5067368 5075691 4923387 4857693 4729626 4663408 4725266 4635144
6138D635144L460O0376P5589J2642L5996J96876R3330j0036K61176N7628j5666
$$ 4635144 4638604 4698980 4774569 4787211 4823207 5020083 5113413 5103377 5364553 5422181 5406515
6127E406515J10731J28070R527l5982K4542P3027l8946O3419p9034m3886M2304
$$ 5406515 5517246 5645316 5654843 5618861 5643403 5716430 5677484 5740903 5661869 5617983 5660287
6116E660287K3231O1293R8704K09937J35118O1547o6802O1835K16585K6461K443
$$ 5660287 5683518 5744811 5843515 6053452 6188570 6250117 6183315 6245150 6461735 6488196 6490639
6105F490639k5452q728J9225J22278R4748j7338o3287J20703K77741L39199K71421
$$ 6490639 6465187 6456459 6475684 6597962 6692710 6675372 6612085 6732788 7010529 7349728 7621149
6094G621149L54683L12053L18882M08128K35710L35360N72551O40558J168504
$$ 7621149 7975832 8287885 8606767 9014895 9250605 9585965 10158516 10799074 11967578
6085A1967578J467179J610800J608352J220759J045915O04942L56022o226j2262
$$ 11967578 13434757 15045557 16653909 17874668 18920583 19525525 19881547 19875321 19863059
6076A9863059K64757K8998N0792j40304l72747o22430p02755r39636q61054q66427
$$ 19863059 20127816 20156814 20207606 20067302 19694555 19072125 18369370 17429734 16568680 15702253
6066A5702253q63500n45955l25930L979K29611L82340Q25954J099305J201352
$$ 15702253 14838753 14292798 13966868 13970847 14200458 14582798 15408752 16508057 17709409
6057A7709409R02363M71031L69567J19270k2639J6420r0606J63151K08155K19304
$$ 17709409 18611772 19082803 19452370 19571640 19549001 19565421 19474815 19637966 19846121 20065425
6047B0065425O1130k37140m51494p63506q89814j068099j131559j331592j182821
$$ 20065425 20126555 19889415 19437921 18674415 17784601 16716502 15584943 14253351 13070530
6038A3070530q60141q14703p36438l17622l04618j97451j00742k32360l19840
$$ 13070530 12210389 11395686 10659248 10341626 10037008 9839557 9738815 9506455 9186615
6029I186615q1725O3894q5261P6319J79637O2270o5117l17007J64014q0883j0761
$$ 9186615 9104890 9168784 9083523 9159842 9339479 9401749 9336632 9019625 9183639 9102756 9091995
6018I091995K1201K9850K39276N54957N36589J62207J31042q1188l07779k59385
$$ 9091995 9113196 9143046 9382322 9937279 10473868 10636075 10767117 10685929 10378150 10118765
6008A0118765k83920j90656l4263J01766M38275O82297N55369M50653K60332K71371
$$ 10118765 9834845 9644189 9609926 9711692 10149967 10832264 11387633 11838286 12098618 12369989
5998A2369989k14209m13385l80349n53467n30010m55064l37876k74951l4141k13952
$$ 12369989 12155780 11742395 11362046 10808579 10278569 9823505 9485629 9210678 9176537 8962585
5988H962585r9274R6745r7299K2860P2431j5407M8525j9065l8102k6596q5680
$$ 8962585 8863311 8960056 8862757 8885617 8958048 8942641 8991166 8972101 8933999 8907403 8821723
5977H821723j00276j25469k7547O3601K19782n1863J08698R5329N4206Q9049J01276
$$ 8821723 8721447 8595978 8568431 8632032 8851814 8799951 8908649 9003978 9058184 9147233 9248509
5966I248509Q4407P7767K76227N8973K98484M10876M18160N00134O81648O82627
$$ 9248509 9332916 9410683 9686910 9745883 10044367 10455243 10873403 11373537 12055185 12737812
5956A2737812P34848N79518L73662J98513Q6325n5946J6086j9229J10897J91414
$$ 12737812 13472660 14052178 14425840 14624353 14710678 14654732 14670818 14651589 14762486 14953900
5946A4953900J02982L16178L05113J325l13069m56564m49346m84348l81744m52610
$$ 14953900 15056882 15373060 15678173 15679498 15366429 14909865 14460519 13976171 13594427 13141817
5936A3141817k62619j54164l1438n2076K95702N12123N10619L42356M09266L41803
$$ 13141817 12879198 12725034 12693596 12641520 12937222 13449345 13959964 14302320 14711586 15053389
5926A5053389K29499L24579K83459M51086M95213Q93815J219967J734467J878555
$$ 15053389 15282888 15607467 15890926 16342012 16837225 17731040 18951007 20685474 22564029
5917B2564029K236690K423520K062020J348269Q17246J13982m38387o41712o47612
$$ 22564029 24800719 27224239 29286259 30634528 31451774 31565756 31127369 30485657 29838045
5908B9838045k33878M68515J033747J302729J268189O14295P0808p98866j419474
$$ 29838045 29604167 30072682 31106429 32409158 33677347 34291642 34362450 33563584 32144110
5899C2144110j932121j863561j938910j893681j246673j009448q52481o97735
$$ 32144110 30211989 28348428 26409518 24515837 23269164 22259716 21407235 20709500
5891B0709500o58451q43160o54771p75235p34559o61655n71060l07361l36947
$$ 20709500 20051049 19207889 18553118 17777883 17043324 16381669 15810609 15503248 15166301
5882A5166301j99845k38357k26528j54717j89794r1827j3081Q0659L5705J7162
$$ 15166301 14966456 14728099 14501571 14346854 14157060 14065233 14052152 14132811 14168516 14185678
5872A4185678R6675K62626L55054J72135R2734j06387m8685k58172k76409l57496
$$ 14185678 14282353 14544979 14900033 15072168 15164902 15058515 15009830 14751658 14475249 14117753
5862A4117753k46207l3591K4090J22676J38400M4915P9650J65161P3601K11683
$$ 14117753 13871546 13837955 13862045 13984721 14123121 14168036 14247686 14412847 14486448 14698131
5852A4698131o6519N5636j05201k1777J73455K2086K9117J49084K28877J89368
$$ 14698131 14631612 14687248 14582047 14560270 14733725 14755811 14784928 14934012 15162889 15352257
5842A5352257L71600M04780K59933L53618L41158K66475M01876L78706M03615
$$ 15352257 15723857 16128637 16388570 16742188 17083346 17349821 17751697 18130403 18534018
5833A8534018M84001O77737O14667Q52586J041768J015682J100863J309679J093388
$$ 18534018 19018019 19695756 20310423 21163009 22204777 23220459 24321322 25631001 26724389
5824B6724389J170485J119383J588738J839519J871120J765203J287519O51156
$$ 26724389 27894874 29014257 30602995 32442514 34313634 36078837 37366356 38017512
5816C8017512J34302n1446m52453o70338r73081p75694o49591k05004J53423N48660
$$ 38017512 38151814 38100368 37647915 36977577 36004496 35228802 34579211 34374207 34527630 35076290
5806C5076290R55663J119575J691421K381028L346244M694386O735586R274566
$$ 35076290 36031953 37151528 38842949 41223977 44570221 49264607 56000193 65274759
5798F5274759J0743744Q860994N532790L027851J126416j364881l626015n324463
$$ 65274759 76018503 84879497 90412287 93440138 94566554 93201673 89575658 84251195
5790H4251195n575611n215281m803280l918416k958302k149934j668317j007257
$$ 84251195 78675584 73460303 68657023 64738607 61780305 59630371 57962054 56954797
5782E6954797k37765M52584J464503L178600M858391N866015N359355M719590
$$ 56954797 56717032 57169616 58634119 61812719 66671110 72537125 77896480 82616070
5774H2616070M505113M814378M325439L006642J073374j121578l397019m580671
$$ 82616070 87121183 91935561 96261000 99267642 100341016 99219438 95822419 91241748
5766I1241748n644021o212735o649598o008570n163815l930246l007845k083543
$$ 91241748 85597727 79384992 72735394 66726824 61563009 57632763 54624918 52541375
5758E2541375j330052m47018M99445J959603L804412O266596P396724M730579
$$ 52541375 51211323 50764305 51263750 53223353 57027765 63294361 70691085 75421664
5750G5421664J886404K66705q87056k357176l652029l617806k136773m06999J874144
$$ 75421664 77308068 77574773 76687717 74330541 70678512 67060706 64923933 64516934 66391078
5741F6391078K120405J470393L35476m49826j050904k105504k655428k715376
$$ 66391078 68511483 69981876 70317352 69867526 68816622 66711118 64055690 61340314
5733F1340314k174170j414746k49421R01837J990495L428069M004217L389207
$$ 61340314 59166144 57751398 57501977 58403814 60394309 63822378 67826595 71215802
5725G1215802J847117M80982n34597j333625j830222j930438j056219K52846K050006
$$ 71215802 73062919 73543901 73009304 71675679 69845457 67915019 66858800 67111646 69161652
5716F9161652L113061K564735J246293M38742k55122j079227j915736k215976
$$ 69161652 72274713 74839448 76085741 76524483 76269361 75190134 73274398 71058422
5708G1058422k391191k276117j858337j202184p49641l17147L4379O22890J318658
$$ 71058422 68667231 66391114 64532777 63330593 62580952 62263805 62298184 62921074 64239732
5699F4239732K086548K863888L909560M565306L788191K212892J201984N12915
$$ 64239732 66326280 69190168 73099728 77665034 81453225 83666117 84868101 85381016
5691H5381016J09887J54647Q31998K083277L146272L528221L586317L945116M393087
$$ 85381016 85490903 85645550 86477548 88560825 91707097 95235318 98821635 102766751 107159838
5682A07159838M552994M966384N346299O816870R780932J5937185K5194224L6096215
$$ 107159838 111712832 116679216 122025515 128842385 138623317 154560502 179754726 215850941
5674B15850941M0227736K9203765J2923938R67136p781599j8507280k7351555
$$ 215850941 256078677 285282442 298206380 299173516 291391917 272884637 245533082
5667B45533082l1908735l0449712k6924088k1176363j5979106j1806797q635747
$$ 245533082 213624347 183174635 156250547 135074184 119095078 107288281 98652534
5660I8652534p006822o189385n536844n083149m736121m128741l746973l037531
$$ 98652534 91645712 85456327 79919483 74836334 70100213 65971472 62224499 59186968
5652E9186968k695070k461290k319302k274522k042988j968205j947926j647019
$$ 59186968 56491898 54030608 51711306 49436784 47393796 45425591 43477665 41830646
5644D1830646j550430j208451j203502j117243q42729q49895o11424p98596p79572
$$ 41830646 40280216 39071765 37868263 36751020 35908291 35058396 34446972 33648376 32868804
5635C2868804m64066m92190k62258m30573m38854j99206k41468j77215j5566j1376
$$ 32868804 32404738 31912548 31650290 31219717 30780863 30581657 30340189 30162974 30147408 30136032
5625C0136032Q1658k7838J81250J88867j9995q5850j00327l21240k65166l08558
$$ 30136032 30217690 30189852 30371102 30559969 30539974 30454124 30353797 30032557 29767391 29458833
5615B9458833l24438k19872j28052p7146j5241J15470K20741Q9038K52328P1628
$$ 29458833 29134395 28914523 28786471 28709325 28694084 28809554 29030295 29119333 29371661 29443289
5605B9443289n0760l43739k07598k35214m10666n41669n15815o49268p38994o75521
$$ 29443289 29392529 29048790 28841192 28605978 28195312 27653643 27137828 26488560 25749566 25074045
5595B5074045o43510p09112q21174q08344n69740n69812n31242m30686l84209
$$ 25074045 24430535 23721423 22900249 22091905 21522165 20952353 20421111 19990425 19606216
5586A9606216l39160m33913l79558l68987k45809k64239l19062l48992k91208
$$ 19606216 19267056 18833143 18453585 18084598 17838789 17574550 17255488 16906496 16615288
5577A6615288m34732k86597j48273l42547l22771l05826j48517j38856p393L0546
$$ 16615288 16180556 15893959 15745686 15403139 15080368 14774542 14626025 14487169 14479776 14510322
5567A4510322K8182Q2900N2795K52995J41455J15455J97359J79113J84225J28985
$$ 14510322 14538504 14621404 14674199 14927194 15068649 15184104 15381463 15560576 15744801 15873786
5557A5873786n3153k24343j79936j81478m0427L4456Q3742J38792J20185J7084
$$ 15873786 15820633 15596290 15416354 15234876 15194449 15228905 15312647 15451439 15571624 15588708
5547A5588708j93560j73583l45790l83806m45653m77386l16465k82706l39648
$$ 15588708 15395148 15221565 14875775 14491969 14046316 13568930 13252465 12969759 12630111
5538A2630111l21318m20846r7059l36259k82770q1755k12733k10303j30503q6425
$$ 12630111 12308793 11887947 11790888 11454629 11171859 11090104 10877371 10667068 10536565 10450140
5528A0450140j39623J872k04318p5725j00195j76031j34220n0845j29688P015
$$ 10450140 10310517 10312389 10108071 10032346 9932151 9756120 9621900 9571055 9441367 9448382
5518I448382l4252N3402k4702j9265P690J8075m777J60163k5953O0295j79050
$$ 9448382 9414130 9467532 9442830 9423565 9431255 9449330 9444553 9604716 9578763 9639058 9460008
5507I460008j31974M5995j12425j6678K1445j0335r9732j69747q82O0766k23922
$$ 9460008 9328034 9374029 9261604 9244926 9266371 9256036 9156304 8986557 8985675 9046441 8822519
5496H822519l9173L1326O5174L8668J10933Q6334J29393K39281R9988N0915N0407
$$ 8822519 8783346 8814672 8879846 8918514 9029447 9115781 9245174 9484455 9584443 9635358 9685765
5485I685765K75522K19586m3706K06752K83803J31747l8004P208j66405j21984
$$ 9685765 9961287 10180873 10137167 10343919 10627722 10759469 10721465 10728673 10562268 10440284
5475A0440284j32587r5449k66315o5587k20830j93831m2741q6824o9551Q1624
$$ 10440284 10307697 10212248 9945933 9880346 9659516 9465685 9422944 9336120 9266569 9348193
5465I348193M983J34060J88184O6114J27631J63714J12185Q6060Q7200K27718
$$ 9348193 9353176 9487236 9675420 9741534 9869165 10032879 10145064 10231124 10318324 10546042
5455A0546042j3562K8763K08576o2727o2552j2491J05444P9372K6634o203k31320
$$ 10546042 10532480 10561243 10769819 10707092 10644540 10632049 10737493 10816865 10843499 10837296 10605976
5444A0605976k7342l1264j1355j68457r9766n5961n6016o5687j33209Q1878J27110
$$ 10605976 10578634 10547370 10536015 10367558 10267792 10211831 10155815 10090128 9956919 10038797 10165907
5433A0165907O1934n6333Q97O996R1627M8574r8175q3739J28009P7915r0749j18237
$$ 10165907 10227841 10171508 10172405 10179401 10271028 10319602 10221427 10137688 10265697 10343612 10252863 10134626
5421A0134626J48684J03255Q5571n3768R8460L04057k0137N6773K57017K19101
$$ 10134626 10283310 10386565 10472136 10418368 10516828 10820885 10800748 10857521 11114538 11333639
5411A1333639L47894L41584M34900N27238L95895K77092J39839k7071k49490k43199
$$ 11333639 11681533 12023117 12458017 12985255 13381150 13658242 13798081 13771010 13521520 13278321
5401A3278321l29508l08351l86955k54929j63501j97588j0389Q6673L21296L01892
$$ 13278321 12948813 12640462 12253507 11998578 11835077 11637489 11627100 11713773 12035069 12336961
5391A2336961L48713K06836L80372N36566N93789N52643O92574Q17701P61257
$$ 12336961 12685674 12892510 13272882 13809448 14403237 14955880 15648454 16466155 17227412
5382A7227412Q29271Q97632O09903J58701m1685o7739j71127l10496l48385m3415
$$ 17227412 18056683 18954315 19564218 19722919 19681234 19613495 19442368 19131872 18783487 18740072
5372A8740072R5635J43072K65312L99553L40473o3536l03516k98430m91104q37535
$$ 18740072 18835707 18978779 19244091 19643644 19984117 19920581 19617065 19318635 18827531 17989996
5362A7989996q38004p58260p30847o36161m75126n54348l15588j54506k16181
$$ 17989996 17151992 16393732 15662885 15026724 14551598 13997250 13681662 13527156 13310975
5353A3310975k46566j89609k11176r0651J45513p8889o5842k6972k1017j5716
$$ 13310975 13064409 12874800 12663624 12572973 12718486 12639597 12573755 12546783 12525766 12510050
5343A2510050O3560P3761l2731J04374j40168k9959j02280l87900l24493k33116
$$ 12510050 12573610 12647371 12614640 12719014 12578846 12548887 12446607 12058707 11734214 11501098
5333A1501098k36834j59899j45072j91930j14853m3003R5559j89130j31577j09087
$$ 11501098 11264264 11104365 10959293 10767363 10652510 10609507 10705066 10515936 10384359 10275272
5323A0275272j5413J15199m3610n4966k218L6104j368j36612J33237m248K8798
$$ 10275272 10259859 10375058 10331448 10276482 10274264 10310368 10309000 10172388 10305625 10301377 10330175
5312A0330175j3888M6727J65376L2773J49693J16423M8865J1668J30123K21978
$$ 10330175 10316287 10363014 10528390 10561163 10710856 10827279 10876144 10887812 11017935 11239913
5302A1239913J5297o4153k2494M574N6180l7880P4418q134J192R1113J4927R864
$$ 11239913 11255210 11191057 11168563 11173137 11229317 11191437 11265855 11257721 11258913 11350026 11364953 11374817
5290A1374817o7739j49894O6724k050j08974j6385q9274Q0948R6718q6921k5834
$$ 11374817 11307078 11157184 11223908 11221858 11112884 11096499 11007225 11088173 11184891 11097970 11072136
5279A1072136Q2702o1002J3172J13901K16827J52014p1659m8925P9228R2379Q8959
$$ 11072136 11154838 11093836 11107008 11220909 11437736 11589750 11518091 11469166 11548394 11640773 11729732
5268A1729732J47416o4679P4081J9111m5916O8290o8664P1525J39513L111J03794
$$ 11729732 11877148 11812469 11886550 11905661 11859745 11928035 11859371 11930896 12070409 12073520 12177314
5257A2177314L3159L821J1749J4440l1263J7853P4521J14930o7582r559J16787
$$ 12177314 12210473 12214294 12226043 12240483 12209220 12227073 12301594 12416524 12348942 12339383 12456170
5246A2456170Q7171J1549L4868J11086O6738O829J37529k9280l4927l8954M8573
$$ 12456170 12543341 12554890 12589758 12700844 12767582 12774411 12911940 12882660 12847733 12808779 12857352
5235A2857352J52109N9816J09028K62989n5719J9874K01098J37846K2949N4117
$$ 12857352 13009461 13069277 13178305 13441294 13385575 13405449 13606547 13744393 13767342 13821459
5225A3821459J03074m0811j14269k27119K00695J99308O4197k3049L8132m6028
$$ 13821459 13924533 13883722 13769453 13542334 13743029 13942337 14006534 13983485 14021617 13975589
5215A3975589j13246Q8567K21423R7850J97228R4912j193Q4397Q4713k3785p1938
$$ 13975589 13862343 13950910 14172333 14270183 14467411 14562323 14561130 14645527 14730240 14706455 14634517
5204A4634517J67033J25751P2414J21068K7065n4525m1364L1900J63722K3113
$$ 14634517 14801550 14927301 14999715 15120783 15147848 15093323 15051959 15083859 15247581 15270694
5194A5270694p6534L7994N2904l9300K3805J23026J16488N4743L091j30469j8097
$$ 15270694 15194160 15232154 15285058 15245758 15269563 15392589 15509077 15563820 15566911 15436442 15418345
5183A5418345N9256j4306n1763M352J45844m044q1025O9297r854J42471J93953
$$ 15418345 15477601 15463295 15411532 15415884 15561728 15557684 15476659 15545956 15536102 15678573 15872526
5172A5872526J228O7413M9640j39303k0220J04662k02446n9795R223J9300Q4106
$$ 15872526 15873754 15941167 15990807 15851504 15831284 15935946 15733500 15673705 15682928 15702228 15786334
5161A5786334l0191l00532N828N6637j47602k14127J7023Q6214J8849r7312r0578
$$ 15786334 15756143 15455611 15461439 15518076 15370474 15156347 15173370 15259584 15278433 15181121 15090543
5150A5090543j9481j36781k6626R2748L0859J40507m5979j19889O8833R344o4096
$$ 15090543 15071062 14934281 14907655 15000403 15031262 15171769 15125790 15005901 15074734 15084078 15019982
5139A5019982M2372q8679j44603J34204o6611j42430L7329j00757j05861K3472
$$ 15019982 15062354 14973675 14829072 14963276 14896665 14754235 14791564 14690807 14584946 14608418
5129A4608418n8892q056o2571o093j3541O3279q490J79867O6550J72325k9973
$$ 14608418 14549526 14541470 14478899 14472806 14459265 14522544 14514054 14693921 14760471 14932796 14902823
5118A4902823J16205J47493Q1784J51520K50770N14205L18272K34530K78426L08899
$$ 14902823 15019028 15166521 15248305 15399825 15650595 16164800 16483072 16717602 16996028 17304927
5108A7304927J61436O6331J38176j4685j05437q6129O102o2510M9185J02881j74320
$$ 17304927 17466363 17532694 17670870 17656185 17550748 17464619 17470721 17408211 17457396 17560277 17385957
5097A7385957j73384k1569L350k22686K3633n4729M298j6523O6187K50449J42921
$$ 17385957 17212573 17191004 17194354 16971668 16995301 16940572 16944870 16928347 16994534 17244983 17387904
5086A7387904K22548L07500L84027P16254P95370J103278J417083J562196K144343
$$ 17387904 17610452 17917952 18301979 19018233 19813603 20916881 22333964 23896160 26040503
5077B6040503L153516L997643M881735M538787L138189J237638q2396j126374
$$ 26040503 29194019 33191662 38073397 42612184 45750373 46988011 46905615 45779241
5069D5779241k562005l348467l697641l730597l320617k595470k118716j594913
$$ 45779241 43217236 39868769 36171128 32440531 29119914 26524444 24405728 22810815
5061B2810815j244968j075450p22932n72589n39675j99156l80554n55596p4480
$$ 22810815 21565847 20490397 19767465 19194876 18655201 18456045 18075491 17519895 17445415
5052A7445415j54120j23217J4906j06028o7788l42967j15873q9493l01093k23736
$$ 17445415 17291295 17168078 17182984 17076956 17009168 16666201 16550328 16460835 16159742 15936006
5042A5936006k80779l02646k00835j61216j0150j95116j99484j34118q0347K241
$$ 15936006 15655227 15352581 15151746 14990530 14980380 14785264 14585780 14451662 14371315 14373556
5032A4373556K8907P9528j8125J26487O951P3411l6012o5520J03131l4875r4043
$$ 14373556 14402463 14481991 14463866 14590353 14597304 14670715 14634703 14569183 14672314 14637439 14543396
5021A4543396n6264J08738p4202n5082Q0228m2196l7636K7631r9870l582N3185
$$ 14543396 14487132 14595870 14521668 14466586 14546814 14504618 14466982 14494613 14394743 14391161 14444346
5010A4444346q8225O3546l2377J98312k9565j1229K06222M5477O9509Q2333P5748
$$ 14444346 14356121 14419667 14387290 14585602 14556037 14544808 14751030 14796507 14866016 14948349 15024097
4999A5024097k8136L8463n2069O452J81780l8188J98011P4746j05246R200Q6799
$$ 15024097 14995961 15034424 14982355 14988807 15170587 15132399 15330410 15405156 15299910 15309110 15395909
4988A5395909P7199N5335K15530k3770J51711P7250n2176j45093O347j76929j24613
$$ 15395909 15473108 15528443 15743973 15720203 15871914 15949164 15896988 15751895 15758242 15581313 15456700
4977A5456700j16745m6479j18143p3451j59234m5996j9016j80888N3138J88578
$$ 15456700 15339955 15293476 15175333 15101882 14942648 14896652 14877636 14696748 14749886 14938464
4967A4938464j47803j12252j8773k2662n3079n5591q2182j45031j2131o327o8695
$$ 14938464 14790661 14678409 14659636 14636974 14583895 14528304 14446122 14301091 14288960 14282633 14213938
4956A4213938L0017J2240n1064p9153Q523K87275l0267P9308k9600j5365k4540
$$ 14213938 14243955 14256195 14205131 14125978 14134501 14421776 14391509 14470817 14441217 14425852 14401312
4945A4401312K547j03735O9593L3085j96273O9139J84343l5948J89792J49064
$$ 14401312 14403859 14300124 14369717 14402802 14206529 14275668 14460011 14424063 14613855 14762919
4935A4762919L1624P8508O4947R6853K62729L12841M63801M03487K11298J80198
$$ 14762919 14794543 14873051 14937998 15034851 15297580 15610421 16074222 16477709 16689007 16869205
4925A6869205J11641J73425J19699K23002p4817O444N9121J9153J22307p2364
$$ 16869205 16980846 17154271 17273970 17496972 17422155 17428599 17487720 17506873 17629180 17556816
4915A7556816J59619j5168L8492J54464N044J65597J74108K48519J60956K20121
$$ 17556816 17716435 17701267 17739759 17894223 17899267 18064864 18238972 18487491 18648447 18868568
4905A8868568J21990K56519L12700J32656L60647M63638K71532K88987K24886
$$ 18868568 18990558 19247077 19559777 19692433 20053080 20516718 20788250 21077237 21302123
4896B1302123j60709K9892J38467k683J5506m3158j32552j37190j48889l3800
$$ 21302123 21141414 21171306 21309773 21307090 21322596 21279438 21146886 21009696 20860807 20827007
4886B0827007m0839J2895j8854k6651M5075q3559J2764K3306J04842J48813J08284
$$ 20827007 20786168 20799063 20780209 20753558 20798633 20715074 20727838 20751144 20855986 21004799 21113083
4875B1113083K92488M7862J55784K51696K43041L19527J79527J89981K44238J2868
$$ 21113083 21405571 21453433 21609217 21860913 22103954 22423481 22603008 22792989 23037227 23050095
4865B3050095Q3600J65878J35054K08075L13188K83607K30958M18981L34454L83110
$$ 23050095 23133695 23299573 23434627 23642702 23955890 24239497 24470455 24889436 25223890 25607000
4855B5607000M11548M35375M39907L59482N80710M59737M02388M38893K22716
$$ 25607000 26018548 26453923 26893830 27253312 27834022 28293759 28696147 29135040 29357756
4846B9357756J08954L94001N42204O98599N57085M82026O64598N88280P70496
$$ 29357756 29466710 29860711 30402915 31101514 31658599 32140625 32805223 33393503 34163999
4837C4163999N72053O12235N96098Q52133P50297P87134P52210Q24143R04247
$$ 34163999 34736052 35348287 35944385 36796518 37546815 38333949 39086159 39910302 40814549
4828D0814549J126081J251655J406295J721685K514124L756200N508488N471020
$$ 40814549 41940630 43192285 44598580 46320265 48834389 52590589 58099077 63570097
4820F3570097L633869J828753J041400M08314p39880j751118k038470j736171
$$ 63570097 67203966 69032719 70074119 70482433 69742553 67991435 65952965 64216794
4812F4216794j249087k41822L56075J098687J532723J973475J875469J687841
$$ 64216794 62967707 62725885 63081960 64180647 65713370 67686845 69562314 71250155
4804G1250155J005428P58391L11903R2588J31831J12231M41337N40110L81024
$$ 71250155 72255583 73013974 73325877 73418465 73550296 73662527 74103864 74643974 75024998
4795G5024998L78106N84500K18553j92638l40769l46311k60532j01120j59269
$$ 75024998 75403104 75987604 76206157 76013519 75672750 75326439 75065907 74964787 74805518
4786G4805518j10583Q1973K2369J50048l3069p1985j2740k53547j06999J3978
$$ 74805518 74694935 74776908 74799277 74949325 74916256 74844271 74831531 74577984 74470985 74484963
4776G4484963K26823J70285M699L1552k5460m4852j24602j93524n7238j10584
$$ 74484963 74711786 74882071 74886770 74918322 74892862 74848010 74723408 74529884 74472646 74362062
4766G4362062m4850L3123J4594k7815j62660O868p1944N85n0202J67332K44494
$$ 74362062 74317212 74350335 74364929 74337114 74174454 74181322 74109378 74109963 74059761 74227093 74471587
4755G4471587K99723L66214J15409J27020N9756N3536j23266j23783J02824K14016
$$ 74471587 74771310 75137524 75252933 75379953 75439709 75493245 75369979 75246196 75349020 75563036
4745G5563036L22056K88378L90904M24226L80721L57410M97975N35647N75722
$$ 75563036 75885092 76173470 76564374 76988600 77369321 77726731 78224706 78760353 79336075
4736G9336075R09261P67560P42496R26559R43605J110579J220879J317693J360023
$$ 79336075 80245336 81012896 81755392 82681951 83625556 84736135 85957014 87274707 88634730
4727H8634730J621424J818759J991118K120981J947503K060242J991619J744671
$$ 88634730 90256154 92074913 94066031 96187012 98134515 100194757 102186376 103931047
4719A03931047J786386J727594J580711J664567J666394J697992J722391J603754
$$ 103931047 105717433 107445027 109025738 110690305 112356699 114054691 115777082 117380836
4711A17380836J660137J557205J535819J381072R10669P35160M08678K59092N9465
$$ 117380836 119040973 120598178 122133997 123515069 124425738 125160898 125569576 125828668 125888133
4702A25888133p8798p7836l1203k8715K06287L49636M74125N98221P58300Q22308
$$ 125888133 125809335 125731499 125700296 125671581 125877868 126227504 126701629 127299850 128058150 128880458
4692A28880458Q46970R93754Q24496R07984P74425M15606K97262J4153M6797k18883
$$ 128880458 129727428 130721182 131545678 132453662 133228087 133643693 133940955 133955108 134001905 133783022
4682A33783022n65601q58477j176827j464944j475066j538159j638849j783252
$$ 133783022 133217421 132358944 131182117 129717173 128242107 126703948 125065099 123281847
4674A23281847k130978k378507k497725k703730k733916k484368k452721k289247
$$ 123281847 121150869 118772362 116274637 113570907 110836991 108352623 105899902 103610655
4666A03610655j610102j294554j281243j256796j339069j259464j274376j520073
$$ 103610655 102000553 100705999 99424756 98167960 96828891 95569427 94295051 92774978
4658I2774978j792158j904485k097286k021252j827438j997313k078707k064373
$$ 92774978 90982820 89078335 86981049 84959797 83132359 81135046 79056339 76991966
4650G6991966k212513k069948j773034j781864j781362j590850j449531j120505
$$ 76991966 74779453 72709505 70936471 69154607 67373245 65782395 64332864 63212359
4642F3212359j200326j059992q27288o36301o00616n28393l90893l49680k46025
$$ 63212359 62012033 60952041 60124753 59488452 58887836 58359443 57968550 57618870 57372845
4633E7372845j14939l3814Q7281K42108K69777R29493J246682J191369P66031
$$ 57372845 57257906 57224092 57311373 57553481 57823258 58752751 59999433 61190802 61956833
4624F1956833M53322K66396j67131l63400o13354n88696m25843k31786j0918J13438
$$ 61956833 62410155 62676551 62509420 62146020 61532666 60943970 60518127 60286341 60275423 60388861
4614F0388861K56784K79262M25571P16731O43222L91778L77656M39961K39507
$$ 60388861 60645645 60924907 61350478 62067209 62710431 63102209 63479865 63919826 64159333
4605F4159333K44139J90401L66640P59058J043862Q38088P32240M66211L93472
$$ 64159333 64403472 64593873 64960513 65719571 66763433 67601521 68333761 68799972 69193444
4596F9193444J81371M18842O56418N86218N11251L31543J02001k45464k85783
$$ 69193444 69374815 69793657 70450075 71036293 71547544 71879087 71981088 71735624 71449841
4587G1449841l34615o33614m01102l60007n69243n18624o20718p63342q86007
$$ 71449841 71115226 70481612 70080510 69720503 69151260 68632636 68011918 67248576 66362569
4578F6362569o47964n28921n46473m40440l46669j37486r7598j36184o0927L5278
$$ 66362569 65714605 65185684 64639211 64198771 63852102 63714616 63617018 63480834 63419907 63455185
4568F3455185J39138L64218N44633Q13321P39059P67688R15160Q36914Q93914
$$ 63455185 63594323 63958541 64503174 65316495 66055554 66823242 67738402 68575316 69469230
4559F9469230Q11116N83040N70861M53577J88039M49343L26024K36569M27747
$$ 69469230 70280346 70863386 71434247 71887824 72075863 72525206 72851230 73087799 73515546
4550G3515546O10216Q87185J059695J007800J115222J348988J156043P96868O80476
$$ 73515546 74125762 75012947 76072642 77080442 78195664 79544652 80700695 81497563 82178039
4541H2178039L44518M96918M29712O01674M96029K11854o3902k46836o42402p39268
$$ 82178039 82522557 83019475 83449187 84050861 84546890 84758744 84694842 84448006 83805604 83066336
4531H3066336q79770j109735j128264j319370j558567j702600j797976j942826
$$ 83066336 82186566 81076831 79948567 78629197 77070630 75368030 73570054 71627228
4523G1627228k016541j953820j654125j578541j344181j184728q48923o48167
$$ 71627228 69610687 67656867 66002742 64424201 63080020 61895292 61046369 60398202
4515F0398202m10477l06672m99549l13728m45200n56433m93743o79209q68556
$$ 60398202 59987725 59681053 59181504 58867776 58422576 57866143 57372400 56693191 55824635
4506E5824635q61738j037992r95287j004381j106827j230087j286461j464187
$$ 55824635 54962897 53924905 52929618 51925237 50818410 49588323 48301862 46837675
4498D6837675j447954j473498j514906j464010j514761j372455j183327j156643
$$ 46837675 45389721 43916223 42401317 40937307 39422546 38050091 36866764 35710121
4490C5710121r86014o63443o75665q05892o93322n50435n71316m14288m24883
$$ 35710121 34724107 34060664 33384999 32579107 31885785 31335350 30764034 30349746 29924863
4481B9924863l91061m40499l84559k45531l71310k18255K6670j31991j33075r3365
$$ 29924863 29533802 29093303 28708744 28463213 28091903 27873648 27900318 27768327 27635252 27541887
4471B7541887k97223p6607j02455k26841j84180j21790k7514k02644k70508k00393
$$ 27541887 27244664 27168057 27065602 26838761 26654581 26532791 26505277 26302633 26032125 25831732
4461B5831732k86297l38528j89349l38929l58905m06124j91801j61085j67682
$$ 25831732 25545435 25206907 25017558 24678629 24319724 23913600 23721799 23560714 23393032
4452B3393032l25888j65721j91321p8317L0554n1086r3634n4778j06936l0237
$$ 23393032 23067144 22901423 22710102 22631785 22662339 22611253 22517619 22462841 22355905 22325668
4442B2325668l6665k2095M864l7944j09360r3137j0997J0236m7221Q1795J64126
$$ 22325668 22289003 22266908 22271772 22233828 22124468 22031331 22020334 22030570 21983349 22065144 22229270
4431B2229270K44939K53385J20561P1952q7048J365o2736k0896Q6054J73378K94180
$$ 22229270 22474209 22727594 22848155 22920107 22833059 22834424 22771688 22750792 22836846 23010224 23304404
4420B3304404M47448M35569K08131K1344l5187j43605j05067k40622k21562k33991
$$ 23304404 23751852 24187421 24395552 24416896 24381709 24238104 24133037 23892415 23670853 23436862
4410B3436862k90744K6215K4380L312R6003j8717j92815j62760j96759j83671
$$ 23436862 23146118 23172333 23196713 23200025 23296028 23277311 23084496 22921736 22724977 22541306
4400B2541306j2117q144J56418k6184l23o829j3817k42104k30013l12607k75142
$$ 22541306 22529189 22521045 22677463 22651279 22650956 22644127 22630310 22388206 22158193 21845586 21570444
4389B1570444k39542n7840J389k9807J3173q0626k82917k71406q6330n4987j30721
$$ 21570444 21330902 21273062 21274451 21244644 21257817 21177191 20894274 20622868 20536538 20481551 20350830
4378B0350830k30124l57407l84421r4368j00915o7575k02637j48089o8831r7282
$$ 20350830 20120706 19763299 19378878 19284510 19183595 19116020 18913383 18765294 18696463 18599181
4368A8599181k05036j74033r0822j01052m0755l5628J19987k4091N2890J09470
$$ 18599181 18394145 18220112 18129290 18028238 17987483 17951855 18071842 18047751 18100641 18210111
4358A8210111R2985M8641J96937J70084K42305M55915L10772M21261K56252L02526
$$ 18210111 18303096 18351737 18548674 18718758 18961063 19416978 19727750 20149011 20405263 20707789
4348B0707789K07593R4489J49935Q7544K7712K30945L76050O48868N93685L74896
$$ 20707789 20915382 21009871 21159806 21247350 21275062 21506007 21882057 22530925 23124610 23499506
4338B3499506J70142J02434k32724l42532m67677n60041l70516m27229m04442
$$ 23499506 23669648 23772082 23539358 23196826 22729149 22169108 21798592 21371363 20966921
4329B0966921j98189q7471j54202p0498l3314j31768l2465j6087p6784m7439P093
$$ 20966921 20768732 20681261 20527059 20456561 20423247 20291479 20259014 20242927 20166143 20118704 20125797
4318B0125797j11199j09820P497O356j14555j4573o0508O4988J0970M7198K8205
$$ 20125797 20014598 19904778 19912275 19918631 19804076 19789503 19728995 19793983 19804953 19852151 19880356
4307A9880356J06876P5122j96407n5639N5323J46129K83039J74640M17425L46181
$$ 19880356 19987232 20062354 19865947 19810308 19865631 20011760 20294799 20469439 20886864 21233045
4297B1233045J82996J77699R1790k751j41862j03089j85147m7267o2904j9601
$$ 21233045 21416041 21593740 21685530 21682779 21540917 21437828 21252681 21205414 21142510 21122909
4287B1122909l2601l3628j49637m3344q2905Q4800O4573K9287q71L52839M30173
$$ 21122909 21090308 21056680 20907043 20863699 20780794 20865594 20930167 20959454 20958583 21311422 21741595
4276B1741595L51179N28946Q10674J120294R67179O32297M92729M15101M50110
$$ 21741595 22092774 22621720 23432394 24552688 25519867 26152164 26644893 27059994 27510104
4267B7510104M19757J07400k43895k74665o33014p35129p19900q47808p37547
$$ 27510104 27929861 28037261 27793366 27518701 26885687 26150558 25430658 24582850 23845303
4258B3845303o38528n69199n72890l78017l69710l34270j71309k36829N4127j66509
$$ 23845303 23206775 22637576 22064686 21686669 21316959 20982689 20811380 20574551 20628678 20462169
4248B0462169k5070N282R6241n9390l3218N5649M5216M2677J09984j18688n1407
$$ 20462169 20437099 20442381 20538622 20479232 20446014 20501663 20546879 20589556 20699540 20580852 20529445
4237B0529445J71643m8476j02110Q6795J9306q8971M1677j59472L2993J69100
$$ 20529445 20701088 20652612 20550502 20637297 20656603 20567632 20609309 20449837 20482830 20651930
4227B0651930P4416J79238M11646J25315M12795O16692O82872Q34203R60200J009803
$$ 20651930 20726346 20905584 21317230 21442545 21855340 22472032 23154904 23989107 24949307 25959110
4217B5959110Q99665Q97462P76255O35454O30664L96839N16698J75159o3527k85858
$$ 25959110 26858775 27756237 28532492 29167946 29798610 30195449 30712147 30887306 30823779 30537921
4207C0537921l90478n23425o16802o54415n03061k11315q4585J41217K90801K33472
$$ 30537921 30147443 29624018 29007216 28352801 27849740 27638425 27553840 27695057 27985858 28219330
4197B8219330j02551k28643l06703m02472n07481m69895k87408j43272j06821
$$ 28219330 28116779 27888136 27581433 27178961 26671480 26201585 25914177 25770905 25664084
4188B5664084j06058L4636j0909J9531M5992K7748Q5068R0090P8425K66322J97269
$$ 25664084 25558026 25592662 25581753 25601284 25647276 25675024 25760092 25850182 25928607 26194929 26392198
4177B6392198L09392K68633L74070O36481R68706J321644J771221K302409K332710
$$ 26392198 26701590 26970223 27344293 27980774 28949480 30271124 32042345 34344754 36677464
4168C6677464J515682J200801J236657J412364Q88233j24623q86765j216965j540719
$$ 36677464 38193146 39393947 40630604 42042968 42931201 42806578 41919813 40702848 39162129
4159C9162129j700145j856998j915638j610164j526666j065070r95330q31454
$$ 39162129 37461984 35604986 33689348 32079184 30552518 29487448 28492118 27660664
4151B7660664o11534m64591l96754m13689l69406j26484j32735j68191j17599
$$ 27660664 27049130 26584539 26187785 25774096 25404690 25278206 25145471 24977280 24859681
4142B4859681k38867k11393k7401k29921o0273p5882j30290Q1962K9430p3705
$$ 24859681 24620814 24409421 24382020 24152099 24091826 24015944 23885654 23967616 23997046 23923341
4132B3923341j12972J57344J28625l7033J9774J1530K23650J70168N1001J78954
$$ 23923341 23810369 23967713 24096338 24059305 24079079 24090609 24314259 24484427 24535428 24714382
4122B4714382J08701J78683J41858J92532J45556J34346K72204j42332J06583
$$ 24714382 24823083 25001766 25143624 25336156 25481712 25616058 25888262 25745930 25852513
4113B5852513J96576K0857o9474K1775L3966N6132O7242J7248J48913R7655J23574
$$ 25852513 26049089 26069946 26000472 26022247 26056213 26112345 26179587 26196835 26345748 26443403 26566977
4102B6566977R4499p0076O4816J54366J41545Q3537J88862K30775J98817L13322
$$ 26566977 26661476 26591400 26656216 26810582 26952127 27035664 27224526 27455301 27654118 27967440
4092B7967440L08650J50957K53634K69256M05899M07127K96080L96691K72013
$$ 27967440 28276090 28427047 28680681 28949937 29355836 29762963 30059043 30455734 30727747
4083C0727747M22885M28922K70678L23262K42392L85568L69232K97845J383R2245
$$ 30727747 31150632 31579554 31850232 32173494 32415886 32801454 33170686 33468531 33469914 33562159
4073C3562159K54231J43886K46879J79009J23373j9514J63251K49045J79204k3026
$$ 33562159 33816390 33960276 34207155 34386164 34509537 34490023 34653274 34902319 35081523 35058497
4063C5058497J08282K66180L33157K40376K75850M34978M44369O59069N27696
$$ 35058497 35166779 35432959 35766116 36006492 36282342 36717320 37161689 37820758 38348454
4054C8348454L25570K06304p5416J19335M9788k60135k8101M6387j047O7477K23048
$$ 38348454 38674024 38880328 38804912 38924247 38974035 38713900 38685799 38732186 38731139 38798616 39021664
4043C9021664K81070K80351L60502M16850M82041N08494M41413L39407L10928
$$ 39021664 39302734 39583085 39943587 40360437 40842478 41350972 41792385 42131792 42442720
4034D2442720L19940L26321K93761M67117M46693L10563L15272N73347M99866
$$ 42442720 42762660 43088981 43382742 43849859 44296552 44607115 44922387 45495734 45995600
4025D5995600M85406O72851M96039O53165O72055O73569P33774P08456R55176
$$ 45995600 46481006 47153857 47649896 48303061 48975116 49648685 50382459 51090915 52046091
4016E2046091P88878P56750Q03705Q55384Q16179P89113R87226Q02462Q64400
$$ 52046091 52834969 53591719 54395424 55250808 56066987 56856100 57843326 58645788 59510188
4007E9510188P65317R19861O75602P43992R21732Q01753P93561O84885Q08126
$$ 59510188 60275505 61195366 61870968 62614960 63536692 64338445 65132006 65816891 66625017
3998F6625017O79676P49818P98988Q96702J045842J048433R28071J064261J142074
$$ 66625017 67304693 68054511 68853499 69750201 70796043 71844476 72772547 73836808 74978882
3989G4978882J016435J214590J467512J173753J145339J175330J072154J048961
$$ 74978882 75995317 77209907 78677419 79851172 80996511 82171841 83243995 84292956
3981H4292956J154589J273391J165558J257839J341048J417481J613501J591890
$$ 84292956 85447545 86720936 87886494 89144333 90485381 91902862 93516363 95108253
3973I5108253J358843J292758J328845J331034J348925J527151J664465J663692
$$ 95108253 96467096 97759854 99088699 100419733 101768658 103295809 104960274 106623966
3965A06623966J708729J854775K023086K337853K220989K204636J985429J915424
$$ 106623966 108332695 110187470 112210556 114548409 116769398 118974034 120959463 122874887
3957A22874887J783379J419383J409751J190760J165356J293831J392855J456571
$$ 122874887 124658266 126077649 127487400 128678160 129843516 131137347 132530202 133986773
3949A33986773J704336K174405K653562L086690L066399K538311K245452J954579
$$ 133986773 135691109 137865514 140519076 143605766 146672165 149210476 151455928 153410507
3941A53410507J510604J081980Q66148N68033P89729O93314J107176J363304J726489
$$ 153410507 154921111 156003091 156869239 157437272 158227001 158920315 160027491 161390795 163117284
3932A63117284J781061J870075J974980J584170J290116J005300P61414M06339
$$ 163117284 164898345 166768420 168743400 170327570 171617686 172622986 173384400 173790739
3924A73790739J83078J90460O5359j57762j51489j42865K9406J12334L34151N25958
$$ 173790739 173973817 174164277 174229636 174071874 173920385 173777520 173806926 173919260 174253411 174779369
3914A74779369M83004K49057l30151m20930n08369q35631q80627r49359n00804
$$ 174779369 175262373 175511430 175181279 174760349 174251980 173416349 172535722 171586363 171085559
3905A71085559o2310M40517Q62848J689049J745285J840161K240627K311497K174397
$$ 171085559 171023249 171463766 172326614 174015663 175760948 177601109 179841736 182153233 184327630
3896A84327630J793051J186259L69159k93384j138966j742317j808446k224444
$$ 184327630 186120681 187306940 187676099 187382715 186243749 184501432 182692986 180468542
3888A80468542k284799j913469j603772j546095j369617j308513j470011j455123
$$ 180468542 178183743 176270274 174666502 173120407 171750790 170442277 168972266 167517143
3880A67517143j460730j447217j478891j601255j570399j502147j156818j154864
$$ 167517143 166056413 164609196 163130305 161529050 159958651 158456504 157299686 156144822
3872A56144822q13692q67742j190381j307313j815563k331398k943243l377855
$$ 156144822 155331130 154463388 153273007 151965694 150150131 147818733 144875490 141497635
3864A41497635l786209m099838m222496m165389l999816l837915l611104l225554
$$ 141497635 137711426 133611588 129389092 125223703 121223887 117385972 113774868 110549314
3856A10549314k900402k624875k391855k191652k055132k047561j794291j669404
$$ 110549314 107648912 105024037 102632182 100440530 98385398 96337837 94543546 92874142
3848I2874142j662204j347192j249825j294765j413316j495192j390724j432173
$$ 92874142 91211938 89864746 88614921 87320156 85906840 84411648 83020924 81588751
3840H1588751j687480j700685j715190j756154j638629j803907j616336j449565
$$ 81588751 79901271 78200586 76485396 74729242 73090613 71286706 69670370 68220805
3832F8220805j476955j470273j543486j239539j299764j255064j073688r29425
$$ 68220805 66743850 65273577 63730091 62490552 61190788 59935724 58862036 57932611
3824E7932611r81486j110328p26657n97123n10802m27205n05667m40575m93587
$$ 57932611 56951125 55840797 55114140 54517017 54006215 53579010 53073343 52632768 52139181
3815E2139181m54989o04975n37039p84546r33789r25852q74244q01113r15333
$$ 52139181 51684192 51079217 50542178 49757632 48823843 47897991 47023747 46222634 45307301
3806D5307301p77888r07659q48487n26613o77787o03440n32345l53547m89752
$$ 45307301 44529413 43621754 42773267 42246654 41568867 40965427 40433082 40079535 39589783
3797C9589783n11262l58291l50205l61301n05505m70691m01557m25605n76771
$$ 39589783 39078521 38720230 38370025 38008724 37503219 37032528 36630971 36205366 35628595
3788C5628595l22750k78346l40921l47457l98455m60551o29229p11096m46154
$$ 35628595 35305845 35027499 34686578 34339121 33940666 33480115 32850886 32139790 31693636
3779C1693636m65561n38551m59555p56126m32385l45603m65259m59488m44950
$$ 31693636 31228075 30689524 30229969 29473843 29041458 28695855 28230596 27771108 27326158
3770B7326158k42830l13541l67219m32954m11165l11766k60107l59611l40735
$$ 27326158 27083328 26769787 26402568 25969614 25558449 25246683 24986576 24626965 24286230
3761B4286230l87337m98334l12176k80660k86714n49947m06170k79297j71710
$$ 24286230 23898893 23400559 23088383 22807723 22521009 21971062 21564892 21285595 21113885
3752B1113885m17617m02466k69760k33395l29609l89066l09028j48485k02892
$$ 21113885 20696268 20293802 20024042 19790647 19461038 19071972 18762944 18614459 18411567
3743A8411567k84661j52121k73093k67777k46276n0587j59745k46698j33821j17233
$$ 18411567 18126906 17974785 17701692 17433915 17187639 17137052 16977307 16730609 16596788 16479555
3733A6479555k36359j64987k37160r7937j63783j02220j43532L6704j00640l8279
$$ 16479555 16243196 16078209 15841049 15743112 15579329 15477109 15333577 15370281 15269641 15231362
3723A5231362N8234r4158j43323j13548k3505j34854j46388j86266k32995m5963
$$ 15231362 15289596 15195438 15052115 14938567 14915062 14780208 14633820 14447554 14214559 14168596
3713A4168596j84732j47737p4250j62890j04006n1287k60474l513k14530j85206
$$ 14168596 13983864 13836127 13761877 13598987 13494981 13443694 13183220 13179707 12965177 12779971
3703A2779971r8356j27795j01883j85565J28785p8976j87352K1631l2885j69481
$$ 12779971 12681615 12553820 12451937 12266372 12395157 12316181 12128829 12150460 12117575 11948094
3693A1948094L0853j24726k1310N264o2158k16478k2679M190k8606j06926O276
$$ 11948094 11978947 11854221 11832911 11838175 11776017 11559539 11536860 11541050 11512444 11405518 11411794
3682A1411794R0177r0342M4490n960K0763n1304o1524J05679r915q2276R5631
$$ 11411794 11501971 11411629 11456119 11450159 11470922 11419618 11358094 11463773 11453858 11371582 11467213
3671A1467213P1990Q6437O9455P3292K83905N5295O4158J76117J18363K09181
$$ 11467213 11539203 11625640 11695095 11768387 12052292 12107587 12171745 12347862 12466225 12675406
3661A2675406N3598R1756l5272Q2053N9505J40249Q3584r357k3330m8734r793
$$ 12675406 12729004 12820760 12785488 12867541 12927046 13067295 13150879 13141522 13118192 13069458 13059665
3650A3059665l9925o7365k14928Q3520O2206j84829l8886L1128n4882J42636J49828
$$ 13059665 13019740 12952375 12737447 12820967 12883173 12698344 12659458 12690586 12635704 12778340 12928168
3639A2928168J25477R1538L62975K68939J42276K40400L08839L45768L72583M71081
$$ 12928168 13053645 13145183 13508158 13777097 13919373 14159773 14468612 14814380 15186963 15658044
3629A5658044M85846L12834N51999N46342L29552K08660K68343q3171j34051j87663
$$ 15658044 16143890 16456724 17008723 17555065 17884617 18093277 18361620 18278449 18144398 17956735
3619A7956735k79322l69873l92688m50090o74353k59568l02290k00501j95479
$$ 17956735 17677413 17307540 16914852 16464762 15790409 15530841 15228551 15028050 14832571
3610A4832571j18593j7756p8000J74992J82871K86631K83086L89515N19952M64459
$$ 14832571 14713978 14696222 14618222 14793214 14976085 15262716 15545802 15935317 16455269 16919728
3600A6919728O26179N26700M19635O85464P23717N64309P24089R04614Q09862
$$ 16919728 17545907 18072607 18492242 19177706 19901423 20465732 21189821 22094435 22904297
3591B2904297O52406L77918J78915p7534l55725n70768p59184o99701p71238p89623
$$ 22904297 23556703 23934621 24113536 24036002 23680277 23109509 22350325 21650624 20879386 20089763
3581B0089763p95508n73828n39341m11211j87083j27581r1829J21658J61333K49609
$$ 20089763 19294255 18720427 18181086 17769875 17582792 17455211 17363382 17485040 17646373 17895982
3571A7895982M07322M78606M45977O30175O50438P51827P02723Q71938R07775
$$ 17895982 18303304 18781910 19227887 19858062 20508500 21260327 21963050 22834988 23742763
3562B3742763P47934Q14115O95950N91960N60819M01994J32480L7265n8804j94032
$$ 23742763 24490697 25304812 26000762 26592722 27153541 27555535 27688015 27725280 27666476 27472444
3552B7472444j10822j08514j39788O1318K00500K25760M69022M20522O07738P76674
$$ 27472444 27361622 27253108 27113320 27174638 27375138 27600898 28069920 28490442 29098180 29874854
3542B9874854Q35190J273927J268137J465882J445680J540667J408662J564256
$$ 29874854 30710044 31983971 33252108 34717990 36163670 37704337 39112999 40677255
3534D0677255J573901J410755J412530J485573J601753J579505J712985J947606
$$ 40677255 42251156 43661911 45074441 46560014 48161767 49741272 51454257 53401863
3526E3401863J876616J613101J262882Q89469P46249K13402L5453j27603m06292
$$ 53401863 55278479 56891580 58154462 59043931 59790180 60003582 60039035 59911432 59505140
3517E9505140l39196l12444l32619m09963o92721p87177q02958j122430j469326
$$ 59505140 59165944 58853500 58520881 58110918 57418197 56631020 55828062 54705632 53236306
3508E3236306j554389j723564j861963j969951k099648k249800k221012j905266
$$ 53236306 51681917 49958353 48096390 46126439 44026791 41776991 39555979 37650713
3500C7650713j936777j790179j570512j329439j104908j104401q63916p64990
$$ 37650713 35713936 33923757 32353245 31023806 29918898 28814497 27950581 27185591
3492B7185591p38397n57692l90398l79532m48184k46857j41015j58070j08312
$$ 27185591 26447194 25889502 25499104 25119572 24671388 24424531 24283516 24125446 24017134
3483B4017134j93222j07941J98258K7503j36686J63862J1613K09049J55980J78453
$$ 24017134 23823912 23715971 23914229 23941732 23805046 23968908 23980521 24189570 24345550 24524003
3473B4524003M17226L83996N09225M43848M32973M76610O58420Q16151R41010
$$ 24524003 24941229 25325225 25834450 26278298 26711271 27187881 27846301 28662452 29603462
3464B9603462R32382J065255J342467J488287J464701J551331J712807J986954
$$ 29603462 30535844 31601099 32943566 34431853 35896554 37447885 39160692 41147646
3456D1147646K149821K177839K188251K358714K259048J669959J062635K78117
$$ 41147646 43297467 45475306 47663557 50022271 52281319 53951278 55013913 55292030
3448E5292030o28546j429078k040572k582218k909645l190116l091411k703015
$$ 55292030 54663484 53234406 51193834 48611616 45701971 42511855 39420444 36717429
3440C6717429k548823k240006j804721j596129j510698j314266j240961r85005
$$ 36717429 34168606 31928600 30123879 28527750 27017052 25702786 24461825 23476820
3432B3476820q08520p12421r01564q88542m14746m62853n24333n38998n09014
$$ 23476820 22668300 21955879 21054315 20165773 19751027 19288174 18763841 18224843 17715829
3423A7715829l84237l98821j94398m12379l83941l36209l07558q5216m54450l32845
$$ 17715829 17331592 16932771 16738373 16325994 15942053 15605844 15298286 15213070 14758620 14425775
3413A4425775k35378k40913k55572k09916j92074k00726k19235m30228l9598j46546
$$ 14425775 14190397 13949484 13693912 13483996 13291922 13091196 12871961 12441733 12402135 12255589
3403A2255589j90072j85576k37445k88309l11388r508j23564j72333l38784k54117
$$ 12255589 12065517 11879941 11642496 11354187 11042799 11033291 10909727 10737394 10398610 10144493
3393A0144493j14366k02180k59744k43053j58668M4350j70215j98773r935m9257
$$ 10144493 10030127 9827947 9568203 9325150 9166482 9210832 9040617 8841844 8831909 8782652
3383H782652N8655l26611j59770k02919n1915m6822j46191j03560m7950l0180
$$ 8782652 8841307 8514696 8354926 8152007 8100092 8053270 7907079 7803519 7755569 7725389
3373G725389k77682m4035j73977k0680j06203k5403J42201o7355j08665l2197
$$ 7725389 7447707 7403672 7229695 7209015 7102812 7077409 7219610 7152255 7043590 7011393
3363G011393o5145j69554l767j3949l1909p2804j02213J39973r1532K9863o0790
$$ 7011393 6946248 6776694 6772927 6758978 6727069 6654265 6552052 6692025 6600493 6630356 6569566
3352F569566k9017J12238M9935N9721j2423p8186j8198N9110j91702m7696K4173
$$ 6569566 6540549 6652787 6702722 6762443 6750020 6671834 6653636 6712746 6521044 6473348 6497521
3341F497521j70013j35791j53085m9763j5143j36079k00912k3675r8434q5491
$$ 6497521 6327508 6191717 6038632 5988869 5973726 5837647 5636735 5613060 5514626 5429135
3331E429135J17190R3308j52463q67M3569j27784M2664j08116N9803J46583q178
$$ 5429135 5546325 5639633 5487170 5486303 5529872 5402088 5444752 5336636 5396439 5543022 5534844
3320E534844m6496k099P7326R5629l9028N9069j0353K59932k5878r7496o6122
$$ 5534844 5488348 5486249 5563575 5659204 5620176 5679245 5668892 5928824 5902946 5805450 5739328
3309E739328j79119j78408j78372j11393r3545p5999r2470r960n3022l5588M6740
$$ 5739328 5560209 5381801 5203429 5092036 4998491 4922492 4830022 4820062 4767040 4731452 4778192
3298D778192j9761j55158m4822o0899K7986M7808P772k9429m0305q0025k0672
$$ 4778192 4758431 4603273 4558451 4497552 4525538 4573346 4581118 4551689 4511384 4431359 4410687
3287D410687k2604J04606N3726p9385Q9677P8263L2369R2376J6434m3674r5718
$$ 4410687 4388083 4492689 4546415 4467030 4556707 4634970 4667339 4759715 4776149 4732475 4636757
3276D636757n5168L3349k00006q2912J7921J0698n2774K1155o2322k18017j08080
$$ 4636757 4581589 4614938 4414932 4332020 4349941 4360639 4307865 4329020 4266698 4048681 3940601
3265C940601J04214Q9003j90290N8213J2944N9303j14372r1045L8836O0498M8149
$$ 3940601 4044815 4133818 3943528 4001741 4014685 4073988 3959616 3868571 3907407 3967905 4016054
3254D016054O2651j7502p7556o1532O8203k4376o8361J16985j0865q0362J37463
$$ 4016054 4078705 4061203 3983647 3922115 3990318 3965942 3897581 4014566 4003701 3923339 4060802
3243D060802q9758J04651P4127J16049J22728N3755J48362j9590K1275O6567O1607
$$ 4060802 3971044 4075695 4149822 4265871 4388599 4442354 4590716 4571126 4592401 4658968 4720575
3232D720575J6667N2394m0826P4065P6150o8858p104O1259J43340J83925Q1877
$$ 4720575 4737242 4789636 4748810 4822875 4899025 4830167 4823063 4884322 5027662 5211587 5293464
3221E293464Q8735Q6153K56820J84139K46053K18936J80618K09400L30602K87106
$$ 5293464 5382199 5468352 5725172 5909311 6155364 6374300 6554918 6764318 7094920 7382026
3211G382026M34573M46712M71031M75437O33923N75787O37611Q33124J008604
$$ 7382026 7816599 8263311 8734342 9209779 9843702 10419489 11057100 11890224 12898828
3202A2898828J195211J467729J793782K060281K142290J853726J479508R00268
$$ 12898828 14094039 15561768 17355550 19415831 21558121 23411847 24891355 25791623
3194B5791623J12612l27039r76504j192038j441449j515467j160648j095937p72627
$$ 25791623 25904235 25577196 24600692 23408654 21967205 20451738 19291090 18195153 17422526
3185A7422526m20757k27457P4284L19136L60131O85678Q62171J044117J074869
$$ 17422526 17001769 16774312 16848596 17167732 17527863 18213541 19075712 20119829 21194698
3176B1194698J153691J232465J213550J197223R78388J020047J186583J465501
$$ 21194698 22348389 23580854 24794404 25991627 26970015 27990062 29176645 30642146
3168C0642146K213605L084967L908462M359370L832168K665861J706743L69342
$$ 30642146 32855751 35940718 39849180 44208550 48040718 50706579 52413322 52782664
3160E2782664j146482k233570k915133l169683l109294k689926k000374j503444
$$ 52782664 51636182 49402612 46487479 43317796 40208502 37518576 35518202 34014758
3152C4014758q15649o5125M51272J183597J687995J604190J244397O08233r2216
$$ 34014758 33199109 33133984 33585256 34768853 36456848 38061038 39305435 39913668 39821452
3143C9821452n21394r49650j369205j676367j427820j325591r24525n65235k40459
$$ 39821452 39300058 38350408 36981203 35304836 33877016 32551425 31626900 31061665 30821206
3134C0821206L19029L82116P83902R71854Q14547M91308K49145j22432n37258
$$ 30821206 31140235 31522351 32306253 33278107 34092654 34583962 34833107 34710675 34173417
3125C4173417p32757r13146j166409j244227j272148j166861r77903q78492p32889
$$ 34173417 33440660 32527514 31361105 30116878 28844730 27677869 26699966 25821474 25088585
3116B5088585p34455q87271r59807q35944q45652q76142p62576o80598o44867
$$ 25088585 24354130 23466859 22507052 21671108 20825456 19949314 19186738 18506140 17861273
3107A7861273p67327n01831o21146n03506l85253j00180j41891j00722l0449J11177
$$ 17861273 17093946 16592115 15970969 15467463 15082210 14982030 14840139 14739417 14708968 14820145
3097A4820145K04680J71138R7753k5282k0332j80359j54573k24670k91058k40155
$$ 14820145 15024825 15195963 15293716 15268434 15248102 15067743 14913170 14688500 14397442 14157287
3087A4157287m43797n34372n92762n65211n65063l25144m80592m56283l05705
$$ 14157287 13713490 13179118 12586356 12021145 11456082 11130938 10650346 10194063 9888358
3078I888358k74938j03291k57981m9850r4848n5304m5490k3632n7095J0309p2219
$$ 9888358 9613420 9510129 9252148 9202298 9107450 9052146 9006656 8983024 8925929 8936238 8864019
3067H864019j8727K5721p4237k92255r5351k4424j40841l83518l54382l16618
$$ 8864019 8845292 8871013 8796776 8504521 8409170 8384746 8243905 7860387 7506005 7189387
3057G189387k18945l51503l12947l56796l07644j80154j76446l29098k70153j11628
$$ 7189387 6970442 6618939 6305992 5949196 5641552 5461398 5284952 4955854 4685701 4574073
3047D574073j81401j17595r9463j81431j23957j11812l471j94090j56995K8387
$$ 4574073 4392672 4275077 4175614 3994183 3870226 3758414 3754943 3560853 3403858 3432245
3037C432245j78370j40748j20902n1449j49035j15905p0451j58494m402N220m9196
$$ 3432245 3253875 3113127 2992225 2940776 2791741 2675836 2605385 2446891 2442489 2447709 2398513
3026B398513j74381j87298M7863r4256j52184p450j27509o8137M1636o8757M3552
$$ 2398513 2224132 2036834 2084697 1990441 1838257 1830807 1703298 1635161 1676797 1608040 1651592
3015A651592l3776j09000j68576K5833j01907q4339k3440m5471j10810n021L2600
$$ 1651592 1617816 1508816 1340240 1366073 1264166 1179827 1156387 1110916 1000106 995085 1027685
3004A027685R8825O492j03184j02010K5824J07177J42724j61336q6152q2426j88711
$$ 1027685 1126510 1133002 1029818 927808 953632 1060809 1203533 1042197 956045 873619 684908
2993F84908J11124j12944j21138k31J1207j51473J53184L2691j91121o8259L2270
$$ 684908 796032 683088 561950 561719 572926 421453 574637 607328 416207 347948 380218
2982C80218N6408K3155j2374j51368N687l1398P5106J9328l8059l095j73940o3154
$$ 380218 436626 459781 447407 296039 301726 270328 345434 364762 326703 323608 149668 86514
$$ [...]
##END NTUPLES=NMR SPECTRUM
##END=
